##TITLE=1H_CG-1188-E1
 200.13MHz, CDCl3,
 8 sc
 
 3.2.2025
##JCAMPDX= 6.0         $$ Bruker NMR JCAMP-DX V2.0
##DATA TYPE= NMR SPECTRUM
##DATA CLASS= NTUPLES
##ORIGIN= UXNMR, Bruker Analytische Messtechnik GmbH
##OWNER= pz
$$ XWIN-NMR		Version 3.5
$$ Mon Feb  3 14:05:02 2025 Russian Standard Time (UT+4h)  she@DPX200
##.OBSERVE FREQUENCY= 200.1313
##.OBSERVE NUCLEUS= ^1H
##.ACQUISITION MODE= SIMULTANEOUS
##.ACQUISITION SCHEME= undefined
##.AVERAGES= 8
##.DIGITISER RES= 18
##SPECTROMETER/DATA SYSTEM= spect
##.PULSE SEQUENCE= zg30
##.SOLVENT NAME= CDCl3
##.SHIFT REFERENCE= (INTERNAL, CDCl3, 0, 15.4803)
##AUDIT TRAIL= $$ (NUMBER, WHEN, WHO, WHERE, WHAT)
$$ ##TITLE= Audit trail, XWIN-NMR		Version 3.5
$$ ##JCAMPDX= 5.01
$$ ##ORIGIN= Bruker BioSpin GmbH
$$ ##OWNER= she
$$ F:/spectra/data/she/nmr/H-C/1/pdata/1/auditp.txt
$$ ##AUDIT TRAIL=  $$ (NUMBER, WHEN, WHO, WHERE, WHAT)
(   1,<2025-02-03 14:02:25.06 +0400>,<she>,<DPX200>,
      <created by zg, POWCHK disabled, PULCHK disabled
       configuration hash MD5:
       00 E9 B6 7A A2 85 ED C7 34 08 36 98 17 FE 4E 26
       data hash MD5: 16K
       3C 16 4A 0D 68 F0 C0 07 4D 1D 04 28 2C BF 93 4F>)
(   2,<2025-02-03 14:02:27.50 +0400>,<she>,<DPX200>,
      <Start of raw data processing
       efp BC_mod = 2 LB = 0.25 FT_mod = 6 PKNL = 1 PHC0 = 247.5724 PHC1 = 17.99223 SI = 16K 
       data hash MD5: 16K
       03 B0 9D 4E E5 34 83 F7 2A 25 2C 2B EA D6 BB BF>)
(   3,<2025-02-03 14:02:59.40 +0400>,<she>,<DPX200>,
      <pk PHC0 = 1.306837 PHC1 = -2.600001 
       data hash MD5: 16K
       24 AA 5A 51 FD 75 31 31 63 BC EA F0 55 24 AF D5>)
(   4,<2025-02-03 14:03:39.71 +0400>,<she>,<DPX200>,
      <pk PHC0 = -0.1999966 PHC1 = 0 
       data hash MD5: 16K
       31 A5 AF A2 FA 74 41 2C 11 1A 03 58 28 22 97 61>)
(   5,<2025-02-03 14:04:25.67 +0400>,<she>,<DPX200>,
      <pk PHC0 = 3.812838 PHC1 = -5.600009 
       data hash MD5: 16K
       EA 68 C7 A0 C7 AA 53 04 56 BC 10 F1 8C A0 7F DD>)
(   6,<2025-02-03 14:04:29.60 +0400>,<she>,<DPX200>,
      <abs ABSG = 5 
       data hash MD5: 16K
       B2 7B 83 12 9B 76 F5 CF 4B EE BC 74 07 C4 7F 10>)
$$ ##END=
$$ 
$$ hash MD5
$$ FB 87 D4 96 5E AB 79 AD A8 54 A8 A9 F8 0E AC CC
##$RELAX= 
##$RELAX= 
##$RELAX= 
##$RELAX= 
##$RELAX= 
##$RELAX= 
$$ Bruker specific parameters
$$ --------------------------
##$DU= <F:/spectra>
##$EXPNO= 1
##$NAME= <H-C>
##$PROCNO= 1
##$TYPE= <nmr>
##$USER= <she>
##$AMP= (0..31)
100 100 100 100 100 100 100 100 100 100 100 100 100 100 100 100 100 100 
100 100 100 100 100 100 100 100 100 100 100 100 100 100 
##$AQSEQ= 0
##$AQ_mod= 1
##$AUNM= <au_zg>
##$AUTOPOS= <>
##$BF1= 200.13
##$BF2= 200.13
##$BF3= 200.13
##$BF4= 200.13
##$BF5= 200.13
##$BF6= 200.13
##$BF7= 200.13
##$BF8= 200.13
##$BYTORDA= 1
##$CFDGTYP= 0
##$CFRGTYP= 5
##$CHEMSTR= <none>
##$CNST= (0..31)
1 1 145 1 1 1 1 1 1 1 1 1 1 1 1 1 1 1 1 1 1 1 1 1 1 1 1 1 1 1 1 1 
##$CPDPRG= <>
##$CPDPRG1= <>
##$CPDPRG2= <>
##$CPDPRG3= <>
##$CPDPRG4= <mlev>
##$CPDPRG5= <mlev>
##$CPDPRG6= <mlev>
$$ [...]
##$SUBNAM3= <"">
##$SUBNAM4= <"">
##$SUBNAM5= <"">
##$SUBNAM6= <"">
##$SUBNAM7= <"">
##$SUBNAM8= <"">
##$SUBNAM9= <"">
##$SW= 18.0517328524113
##$SWIBOX= (0..15)
0 0 2 0 0 0 0 0 0 0 0 0 0 0 0 0 
##$SW_h= 3612.71676300578
##$TD= 16384
##$TD0= 1
##$TE= 0
##$TE2= 300
##$TE3= 300
##$TEG= 300
##$TL= (0..7)
0 120 120 120 120 120 120 120 
##$TP= (0..7)
150 150 150 150 150 150 150 150 
##$TP07= 0
##$TPNAME0= <>
##$TPNAME1= <>
##$TPNAME2= <>
##$TPNAME3= <>
##$TPNAME4= <>
##$TPNAME5= <>
##$TPNAME6= <>
##$TPNAME7= <>
##$TPOAL= (0..7)
0.5 0.5 0.5 0.5 0.5 0.5 0.5 0.5 
##$TPOFFS= (0..7)
0 0 0 0 0 0 0 0 
##$TUNHIN= 0
##$TUNHOUT= 0
##$TUNXOUT= 0
##$USERA1= <user>
##$USERA2= <user>
##$USERA3= <user>
##$USERA4= <user>
##$USERA5= <user>
##$V9= 5
##$VALIST= <valist>
##$VCLIST= <CCCCCCCCCCCCCCC>
##$VD= 0
##$VDLIST= <DDDDDDDDDDDDDDD>
##$VPLIST= <PPPPPPPPPPPPPPP>
##$VTLIST= <TTTTTTTTTTTTTTT>
##$WBST= 1024
##$WBSW= 4
##$XGAIN= (0..3)
0 0 0 0 
##$XL= 0
##$YL= 0
##$YMAX_a= 39184
##$YMIN_a= -36534
##$ZGOPTNS= <>
##$ZL1= 120
##$ZL2= 120
##$ZL3= 120
##$ZL4= 120
##$ABSF1= 15.48026
##$ABSF2= -2.571589
##$ABSG= 5
##$ABSL= 3
##$ALPHA= 0
##$AQORDER= 0
##$ASSFAC= 0
##$ASSFACI= 0
##$ASSFACX= 0
##$ASSWID= 0
##$AUNMP= <proc_1d>
##$AZFE= 0.1
##$AZFW= 0.1
##$BCFW= 0
##$BC_mod= 2
##$BYTORDP= 0
##$COROFFS= 0
##$CY= -3
##$DATMOD= 1
##$DC= 0
##$DFILT= <>
##$DTYPP= 0
##$F1P= 0
##$F2P= 0
##$FCOR= 1
##$FTSIZE= 16384
##$FT_mod= 6
##$GAMMA= 0
##$GB= 0
##$INTBC= 1
##$INTSCL= 3.241238e-09
##$ISEN= 128
##$LB= 0.25
##$LEV0= 0
##$LPBIN= 0
##$MAXI= 10000
##$MC2= 0
##$MEAN= 0
##$ME_mod= 0
##$MI= 1.114404
##$NCOEF= 0
##$NC_proc= -10
##$NLEV= 6
##$NOISF1= 3.799351
##$NOISF2= 2.8
##$NSP= 0
##$NTH_PI= 0
##$NZP= 0
##$OFFSET= 15.48026
##$PC= 1
##$PHC0= 252.492
##$PHC1= 9.792221
##$PH_mod= 1
##$PKNL= yes
##$PPARMOD= 0
##$PSCAL= 0
##$PSIGN= 0
##$REVERSE= no
##$SF= 200.130008294216
##$SI= 16384
##$SIGF1= 3
##$SIGF2= 2
##$SINO= 0.751879
##$SIOLD= 32768
##$SREGLST= <19F.Aceton>
##$SSB= 0
##$STSI= 16384
##$STSR= 0
##$SW_p= 3612.71676300578
##$SYMM= 0
##$S_DEV= 0
##$TDeff= 16384
##$TDoff= 0
##$TI= <>
##$TILT= no
##$TM1= 0
##$TM2= 0
##$TOPLEV= 0
##$USERP1= <user>
##$USERP2= <user>
##$USERP3= <user>
##$USERP4= <user>
##$USERP5= <user>
##$WDW= 1
##$XDIM= 16384
##$YMAX_p= 367028036
##$YMIN_p= -9448616
$$ End of Bruker specific parameters
$$ ---------------------------------
##NTUPLES= NMR SPECTRUM
##VAR_NAME=  FREQUENCY,     SPECTRUM/REAL,   SPECTRUM/IMAG
##SYMBOL=    X,             R,               I
##VAR_TYPE=  INDEPENDENT,   DEPENDENT,       DEPENDENT
##VAR_FORM=  AFFN,          ASDF,            ASDF
##VAR_DIM=   16384,         16384,           16384
##UNITS=     HZ,            ARBITRARY UNITS, ARBITRARY UNITS
##FACTOR=    0.220516191357247, 1,           1
##FIRST=     3098.06454124795, 0,            0
##LAST=      -514.652221757827, 0,           0
##MIN=       -514.652221757827, -9448616,    0
##MAX=       3098.06454124795, 367028036,    0
$$ Real data points
##PAGE= N=1
##DATA TABLE= (X++(R..R)), XYDATA
$$ [...]
$$ plain form
11591 5906183 5586432 7219779 7196015 6254472 5290661 3423674 6281111 7319981 7405739
11582 7405739 6743670 5855091 4578885 6636213 5001943 4823285 4471977 4641397 3764234
11573 3764234 5122330 5889530 4974022 5668438 4199658 3425661 1748035 3153309 5361114
11564 5361114 5385583 6377952 4978683 4715724 4807247 3107557 4112146 4489082 5721052
11555 5721052 5572748 3584612 1850685 2336027 1704936 4930031 4054327 6620670 7498594
11546 7498594 5455437 4202273 3853249 5284858 5905222 5003474 6120476 5476955 6251320
11537 6251320 6595303 5745511 6439678 8408247 8773955 5767767 5882765 6363561 6053565
11528 6053565 8914106 8588971 6078413 4007700 6443783 7955764 6896277 4581548
$$ packed form
11591E906183l19751J633347k3764r41543r63811j866987K857437J038870Q5758
11582G405739o62069q88579j276206K057328j634270j78658l51308J69420q77163
11573C764234J358096P67200r15508O94416j468780p73997j677626J405274K207805
11564E361114K4469R92369j399269k62959R1523j699690J004589L76936J231970
11555E721052j48304j988136j733927M85342o31091L225095q75704K566343Q77924
11546G498594k043157j253164l49024J431609O20364r01748J117002o43521P74365
11537F251320L43983q49792O94167J968569L65708l006188J14998M80796l09996
11528F053565K860541l25135k510558k070713K436083J511981j059487k314729
$$ plain form
11520 4581548 3483571 5474128 6039854 4232188 5709119 6978369 6246614 6789088 7601699
11511 7601699 7794948 8848099 6955938 6959972 6235276 5816604 8086450 7906802 7612094
11502 7612094 7080865 7708851 6616186 5277892 6748829 5629169 5734299 8139016 6035636
11493 6035636 6237028 6434010 4556255 4221753 4748875 5614708 6203989 6438021 4156630
11484 4156630 4755274 5722263 4927601 5749982 5845667 5273337 5886764 6844665 6409912 5443701
11474 5443701 2755897 2895045 3625177 4101058 6517090 6284995 3966704 3924892 2885729
11465 2885729 3657490 4312311 7475865 7553944 6774023 6104327 5533309 4366044 4475934
11456 4475934 2114722 4284951 5831534 5954831 7850119 8298778 8225264 7720257 5194005
$$ packed form
11520D581548j097977J990557N65726j807666J476931J269250p31755N42474Q12611
11511G601699J93249J053151j892161M034p24696m18672K269846j79648k94708
11502G612094n31229O27986j092665j338294J470937j119660J05130K404717k103380
11493F035636K01392J96982j877755l34502N27122Q65833N89281K34032k281391
11484D156630N98644R66989p94662Q22381R5685n72330O13427R57901m34753r66211
11474E443701k687804J39148P30132M75881K416032k32095k318291m1812j039163
11465B885729P71761O54821L163554P8079p79921o69696n71018j167265J09890
11456D475934k361212K170229J546583J23297J895288M48659p3514n05007k526252
$$ plain form
11447 5194005 6495010 7656133 6450526 5662742 5315541 5841761 4372562 5057913 4082084
11438 4082084 4613092 7161763 6262690 5716775 4851409 2780250 4629916 5313422 5236234
11429 5236234 2094482 2026492 4027192 3917516 5107483 5417140 4292902 3184310 4348325
11420 4348325 4774406 5554731 4953522 6125694 5433965 4893388 6171476 5287247 4232711
11411 4232711 4075717 5309258 4331123 4042138 3535398 2076905 2647056 3924030 3789389
11402 3789389 3446538 6576570 6957450 6106599 5437024 4296828 7404150 6609939 4377490
11393 4377490 4718201 3809982 2689130 1826456 3001505 5457859 6624889 5923438 5505329
11384 5505329 4824219 4867056 4090527 3279730 3883274 2885937 3959794 5593864 6996505
$$ packed form
11447E194005J301005J161123j205607p87784l47201N26220j469199O85351r75829
11438D082084N31008K548671q99073n45915q65366k071159J849666O83506p7188
11429E236234l141752o7990K000700j09676J189967L09657j124238j108592J164015
11420D348325M26081P80325o01209J172172o91729n40577J278088q84229j054536
11411D232711j56994J233541r78135k88985n06740j458493N70151J276974j34641
11402C789389l42851L130032L80880q50851o69575j140196L107322p94211k232449
11393D377490L40711r08219j120852q62674J175049K456354J167030p01451m18109
11384E505329o81110M2837p76529q10797O03544r97337J073857J634070J402641
$$ plain form
11375 6996505 6603945 5009810 5557901 5631238 5568397 5812809 4401368 5377198 5354348 5314042
11365 5314042 6438349 5191565 7744941 8799648 5543060 3613095 4803734 5248001
11357 5248001 3487391 4883808 4383464 4895238 4294847 4986538 6240342 6311103 4452522
11348 4452522 4334120 3836948 3760828 5135166 4136908 3502880 4385383 4986643 4648506
11339 4648506 6748551 6290777 5229068 4181977 3917493 5810955 5895692 6716606 3846735
11330 3846735 5075544 5471964 4044668 3533626 2898344 2134836 3308906 3611200 3796483
11321 3796483 3988765 2323250 2890649 3490544 3699955 2442279 4021397 3633462 2680382
11312 2680382 1964009 2630979 2071091 1578676 494333 2033997 2461164 4127361 4282444
$$ packed form
11375F996505l92560j594135N48091P3337o2841K44412j411441R75830k2850m0306
11365E314042J124307j246784K553376J054707l256588j929965J190639M44267
11357E248001j760610J396417n00344N11774o00391O91691J253804P0761j858581
11348D452522j18402m97172p6120J374338r98258o34028Q82503O01260l38137
11339D648506K100045m57774j061709j047091k64484J893462Q4737Q20914k869871
11330C846735J228809L96420j427296n11042o35282p63508J174070L02294J85283
11321C796483J92282j665515N67399N99895K09411j257676J579118l87935r53080
11312B680382p16373O66970n59888m92415j084343J539664M27167J666197J55083
$$ plain form
11303 4282444 3935346 4786350 5434700 4819666 2876246 4021261 5542349 7390685 4817461
11294 4817461 4057519 4817842 5148379 4223847 5431520 5620499 4538105 3084980 1040878
11285 1040878 2281801 4576847 6696415 3767310 3845401 2929561 3426688 3951121 4342766
11276 4342766 3784419 3482028 2724855 2097693 2966058 3157688 4149098 3590538 6592808
11267 6592808 5941946 4099466 3487373 3887264 2582746 3103241 4130708 3165168 4445440
11258 4445440 4897361 4541248 4461433 3973093 3915306 3688110 3062230 4566497 5371983 3646678
11248 3646678 3151821 3252195 3965049 1829323 3335465 2525803 3014108 4988394 4091432
11239 4091432 3688437 4625994 5257471 4519401 3469679 3076525 3345280 3278273 4109115
$$ packed form
11303D282444l47098Q51004O48350o15034j943420J145015J521088J848336k573224
11294D817461p59942P60323L30537r24532J207673J88979j082394j453125k044102
11285A040878J240923K295046K119568k929105P8091r15840M97127N24433L91645
11276D342766n58347l02391p57173o27162Q68365J91630R91410n58560L002270
11267F592808o50862j842480o12093L99891j304518N20495J027467r65540J280272
11258D445440M51921l56113p9815m88340n7787k27196o25880J504267Q05486j725305
11248C646678m94857J00374P12854k135726J506142q09662M88305J974286q96962
11239D091432m02995R37557O31477p38070j049722l93154K68755o7007Q30842
$$ plain form
11230 4109115 4383598 6094075 5537450 4266883 4740992 6388305 5069985 4197989 3173243
11221 3173243 3932825 4262462 5338921 3990359 4269673 4383786 3014262 3889737 3124999
11212 3124999 3219195 3506230 2899801 1881044 4365155 5245598 4638258 4442071 4492065
11203 4492065 4441130 3945001 2629125 1310619 2112923 3352116 3373282 4284667 3681353
11194 3681353 2053222 929114 3392010 2720490 2503381 1645235 1784254 3713884 5121309
11185 5121309 4913502 2894805 3219181 1624883 1901251 1705970 3540893 1494959 2501012
11176 2501012 3551519 3741140 2299113 2863137 3582743 3803078 4069142 4298315 5401940
11167 5401940 6379287 6504356 4725303 2615158 1210491 1666603 104309 1543351 3421384
$$ packed form
11230D109115K74483J710477n56625j270567M74109J647313j318320q71996j024746
11221C173243P59582L29637J076459j348562K79314J14113j369524Q75475p64738
11212C124999R4196K87035o06429j018757K484111Q80443o07340j96187M9994
11203D492065n0935m96129j315876j318506Q02304J239193K1166R11385o03314
11194C681353j628131j124108K462896o71520k17109q58146J39019J929630J407425
11185E121309k07807k018697L24376j594298K76368j95281J834923k045934J006053
11176B501012J050507J89621j442027N64024P19606K20335K66064K29173J103625
11167E401940R77347J25069j779053k110145j404667M56112j562294J439042J878033
$$ plain form
11158 3421384 2940448 4203531 4567084 3818240 2633097 2870115 1907790 839270 2298932
11149 2298932 2532368 1976275 606030 3386020 5260462 4320695 3671866 4693334 5265887
11140 5265887 3505365 1916839 3275759 2742674 2195519 3765060 3316561 2458883 2916512
11131 2916512 2781349 3776219 3818553 3506873 4134369 3821762 3699940 6194063 3361338
11122 3361338 2409070 2827452 1876125 3085047 1377434 2677304 3620883 2188896 1962110
11113 1962110 4996363 4131482 5167178 2861291 2052981 4002876 5108500 3827157
11105 3827157 2468256 4548196 4778146 4486524 2928487 2949274 2303386 3617329 3691780
11096 3691780 2387093 1577237 1571953 1353338 2220567 4937349 3310682 1708743 2648854
$$ packed form
11158C421384m80936J263083L63553p48844j185143K37018r62325j068520J459662
11149B298932K33436n56093j370245K779990J874442r39767o48829J021468N72553
11140E265887j760522j588526J358920n33085n47155J569541m48499q57678M57629
11131B916512j35163R94870M2334l11680O27496l12607j21822K494123k832725
11122C361338r52268M18382r51327J208922j707613J299870R43579j431987k26786
11113A962110L034253q64881J035696k305887q08310J949895J105624j281343
11105C827157j358901K079940K29950k91622j558037K0787o45888J313943P4451
11096C691780j304687q09856n284k18615Q67229K716782j626667j601939R40111
$$ plain form
11087 2648854 2781626 3765973 5616675 4152442 3179526 4259234 2199636 5265450 4737996
11078 4737996 642627 2655750 2682031 3141138 2458706 1097274 2567246 1407409 2073065
11069 2073065 1272360 385236 2125723 1249756 1279118 2485368 2026630 2830612 2335613
11060 2335613 772378 756226 2484640 2735116 4298126 2200949 1113990 4014423 4636028
11051 4636028 2984340 1507061 3696635 3747575 2925395 2222858 2999340 2773678 2252334
11042 2252334 2418923 1190688 -413124 1974035 1893833 2600695 -247222 -1642683 1416422
11033 1416422 1422422 931797 1558249 2624472 2512058 4777907 3957495 2263710 2237620
11024 2237620 242280 -580118 1508692 2477321 2454807 2909813 4451308 4464693 2265172
$$ packed form
11087B648854J32772R84347J850702j464233r72916J079708k059598L065814n27454
11078D737996m095369K013123K6281M59107o82432j361432J469972j159837O65656
11069B073065q00705q87124J740487q75967K9362J206250m58738Q03982m94999
11060B335613j563235j6152J728414K50476J563010k097177j086959K900433O21605
11051D636028j651688j477279K189574N0940q22180p02537P76482k25662n21344
11042B252334J66589j228235j603812K387159q0202P06862k847917j395461L059105
11033A416422O000m90625O26452J066223j12414K265849q20412j693785k6090
11024B237620j995340q22398K088810R68629k2514M55006J541495J3385k199521
$$ plain form
11015 2265172 2104813 4653409 2115162 1822858 1598617 2405865 2423318 4103006 4598341
11006 4598341 3657641 3276095 1932169 195025 887809 636048 216841 1352855 858692
10997 858692 -1229464 110373 649545 3279224 4153584 1977596 1480397 2023991 1466538
10988 1466538 1384017 2233736 635487 981216 1539595 3517489 2425839 2785960 2410566
10979 2410566 2391425 2372771 4531551 3045364 2707804 2618188 2882542 2722893 3185333 2539775
10969 2539775 1366398 717358 866619 -707269 1134777 2081891 1112733 2805252 3287605
10960 3287605 1933904 1111530 2328804 1380850 1112627 1851654 2891034 1501150 810561
10951 810561 2078275 2613600 3557511 4150579 2715855 1987004 3578450 3077578 2144610
$$ packed form
11015B265172j60359K548596k538247k92304k24241Q07248J7453J679688M95335
11006D598341r40700l81546j343926j737144O92784k51761m19207J136014m94163
10997H58692k088156J339837N39172K629679Q74360k175988m97199N43594n57453
10988A466538q2521Q49719j598249L45729N58379J977894j091650L60121l75394
10979B410566j9141j8654K158780j486187l37560q9616K64354j59649M62440o45558
10969B539775j173377o49040J49261j573888J842046R47114r69158J692519M82353
10960C287605j353701q22374J217274r47954k68223P39027J039380j389884o90589
10951H10561J267714N35325R43911N93068j434724p28851J591446n00872r32968
$$ plain form
10942 2144610 2347453 1938144 1667223 1123273 544382 1228256 1377129 2637343 2442171
10933 2442171 1194168 638588 1657910 1512590 2431925 2142640 2543346 3469081 2302605
10924 2302605 2187741 719350 -140678 1213493 2892900 2339149 3525023 3184236 1541447
10915 1541447 2861145 4770783 2876294 2471974 3829255 4672318 3079791 2917982 2473404
10906 2473404 1339856 1665224 2620572 1309653 1875941 3797989 2000916 1878100 1625057
10897 1625057 1547689 1187771 2600381 3663174 3453636 3752886 3193729 2629368 4440837
10888 4440837 4218392 4915095 4365266 4498434 4619680 5121140 4969864 4470214 1559922
10879 1559922 1186331 213629 -713952 1392557 2647725 3929080 2371200 1594055 1271755
$$ packed form
10942B144610K02843m09309k70921n43950n78891O83874J48873J260214j95172
10933B442171j248003n55580J019322j45320R19335k89285M00706R25735j166476
10924B302605j14864j468391q60028J354171J679407n53751J185874l40787j642789
10915A541447J319698J909638j894489m04320J357281Q43063j592527j61809m44578
10906B473404j133548L25368R55348j310919N66288J922048j797073j22816k53043
10897A625057p7368l59918J412610J062793k09538K99250n59157n64361J811469
10888D440837k22445O96703n49829J33168J21246N01460j51276m99650k910292
10879A559922l73591r72702r27581K106509J255168J281355j557880p77145l22300
$$ plain form
10870 1271755 -1007889 -987547 166492 1707253 1667831 1484687 2493272 3235570 4505493
10861 4505493 1887181 1544640 80643 1594957 1480913 1906839 2029821 2314657 3585441
10852 3585441 4111800 4177096 2316382 990021 1844501 1739713 1760708 2134159 2648123
10843 2648123 1031153 1881314 3115643 2216378 104334 851718 2192783 556593 124610
10834 124610 947586 1860222 1632735 380837 452574 763557 4229036 3311211 1063311
10825 1063311 1173289 1274017 1057922 3425455 2727591 2431983 3768142 5041199 6152368
10816 6152368 3622326 1188262 1415025 -444973 -27060 2686588 4599533 4323875 2312209
10807 2312209 3337115 3140599 1688541 2113513 1723646 3974159 3414511 2479712 3283183
$$ packed form
10870A271755k279644K0342J154039J540761l9422j83144J008585P42298J269923
10861D505493k618312l42541j463997J514314j14044M25926J22982K84836J270784
10852C585441N26359O5296j860714j326361Q54480j04788K0995L73451N13964
10843B648123j616970Q50161J234329q99265k112044P47384J341065j636190m31983
10834A24610Q22976R12636k27487j251898P1737L10983L465479r17825k247900
10825A063311J09978J00728k16095K367533o97864k95608J336159J273057J111169
10816F152368k530042k434064K26763j859998M17913K713648J912945k75658k011666
10807B312209J024906j96516j452058M24972l89867K250513n59648r34799Q03471
$$ plain form
10798 3283183 2767213 2517984 1458517 1087929 2424806 3236547 1775860 2028001 1711009
10789 1711009 2571106 2235708 1467447 1655029 2760827 739054 788881 1482118 1795182
10780 1795182 2921312 3980553 2355605 2572275 2492048 3898758 2186613 2158380 2819953
10771 2819953 1427474 1417391 550463 36040 191836 339374 1037557 2648492 2506691
10762 2506691 1596850 1067454 507571 438499 840495 2433828 3495198 2944295 1234804
10753 1234804 1915744 1663038 -33779 -282881 -20190 2071323 3238817 1555072 2085502
10744 2085502 778656 -35427 371189 1284302 2271470 2528546 3491814 803049 298729
10735 298729 1568478 557166 1250440 1409504 2709844 4936356 5387748 2368278 1395634
$$ packed form
10798C283183n15970k49229j059467l70588J336877Q11741j460687K52141l16992
10789A711009Q60097l35398p68261J87582J105798k021773M9827O93237L13064
10780A795182J126130J059241j624948K16670q0227J406710j712145k8233O61573
10771B819953j392479j0083q66928n14423J55796J47538O98183J610935j41801
10762B506691r09841n29396n59883o9072M01996J593333J061370n50903j709491
10753A234804O80940k52706j696817k49102K62691K091513J167494j683745N30430
10744B085502j306846q14083M06616R13113R87168K57076R63268k688765n04320
10735B98729J269749j011312O93274J59064J300340K226512M51392l019470r72644
$$ plain form
10726 1395634 938847 1394950 1164943 174551 599234 782076 1416258 1856794 2199626
10717 2199626 546162 -4205 1488118 1740178 2572747 1025776 96895 878337 963530
10708 963530 2725025 2843545 1500910 2942457 2211512 2019298 1445074 1885054 1992064
10699 1992064 3281129 2982358 2600395 2106647 1295913 1343396 1989473 1309339 -922130
10690 -922130 86832 2507760 2969278 3056838 3460532 1231987 2488365 3021077 2810108
10681 2810108 1635048 2016752 1513306 1474685 543779 -917186 -718810 240231 -1027879
10672 -1027879 -898624 967980 333191 -63019 2504913 1846898 1724487 1398595 2874059
10663 2874059 1308138 2260 294416 110577 931686 -1063660 -501765 -491781 679160
$$ packed form
10726A395634m56787M56103k30007r90392M24683J82842O34182M40536L42832
10717B199626j653464n50367J492323K52060Q32569j546971r28881P81442Q5193
10708I63530J761495J18520j342635J441547p30945j92214n74224M39980J07010
10699A992064J289065k98771l81963m93748q10734M7483O46077o80134k231469
10690i22130J008962K420928M61518Q7560M03694k228545J256378N32712k10969
10681B810108j175060L81704n03446l8621r30906j460965J98376R59041j268110
10672a027879J29255J866604o34789l96210K567932o58015j22411l25892J475464
10663B874059j565921j305878K92156j83839Q21109j995346N61895R984J170941
$$ plain form
10654 679160 2315158 1540026 2477085 2423600 1853764 1216783 776114 -50431 2191668
10645 2191668 2210437 3318987 2362268 2675008 3599033 3061989 2918352 3398745 3741192
10636 3741192 2525545 2505046 943035 310067 1890471 2470002 3534839 1640878 731688
10627 731688 1675819 3221029 3372624 2124371 1471479 -2359 366979 998908 2218755
10618 2218755 2336744 -475993 1770237 2760985 3449714 3884258 3014930 2905880 3024504
10609 3024504 2933724 591469 881466 777148 163491 -1063705 -639862 2158389 3375681
10600 3375681 2528759 2282410 346562 223809 1307437 1634327 2773207 2524663 950842
10591 950842 567259 964351 2239319 2174702 -459360 -2683329 -1162914 66418 920053
$$ packed form
10654F79160J635998p75132R37059n3485n69836o36981m40669q26545K242099
10645B191668J8769J108550r56719L12740R24025n37044j43637M80393L42447
10636C741192j215647k0499j562011o32968J580404N79531J064837j893961r09190
10627G31688R44131J545210J51595j248253o52892j473838L69338O31929J219847
10618B218755J17989k812737K246230R90748O88729M34544q69328j09050J18624
10609C024504r0780k342255K89997j04318o13657j227196M23843K798251J217292
10600C375681q46922k46349j935848j22753J083628L26890J138880k48544j573821
10591I50842l83583L97092J274968o4617k634062k223969J520415J229332Q53635
$$ plain form
10582 920053 -10432 1463146 2816069 2781836 826185 273741 328932 715022 720565 1330127
10572 1330127 420685 64465 1574907 2704914 2870254 803166 568514 913062 1378397
10563 1378397 1400254 1051735 2874913 1844437 1568534 441866 -262347 623748 988208
10554 988208 1233337 197341 836629 1664042 235105 1885402 3239439 1872930 718443
10545 718443 712335 -515687 1562588 2678259 2271264 2064806 2499364 2029786 624362
10536 624362 2119652 1577624 2012842 1914353 1716336 372731 780336 525714 799078
10527 799078 1767876 2186163 2325955 3984893 -20795 -1435266 -1152868 -776941 -623607
10518 -623607 -347542 1943644 4619451 2249154 984059 -1041068 -1117416 652300 274902
$$ packed form
10582I20053r30485J473578J352923l4233j955651n52444N5191L86090N543O09562
10572A330127r09442l56220J510442J130007J65340k067088k34652L44548M65335
10563A378397K1857l48519J823178j030476k75903j126668p04213Q86095L64460
10554I88208K45129j035996O39288Q27413j428937J650297J354037j366509j154487
10545G18443o108j228022K078275J115671m06995k06458M34558m69578j405424
10536F24362J495290n42028M35218r8489j98017j343605M07605k54622K73364
10527G99078R68798M18287J39792J658938m005688j414471K82398L75927J53334
10518f23607K76065K291186K675807k370297j265095k025127p6348J769716l77398
$$ plain form
10509 274902 -243663 1071200 1878373 1861205 2028443 -1062899 -44343 478075 2536740
10500 2536740 1988258 857300 3443934 4291343 772975 276294 620281 433828 173276
10491 173276 208821 1622435 1953902 727332 740426 -337880 1318195 2804659 1375156
10482 1375156 2695170 2719435 850860 502368 474824 1374078 1487471 1207476 1451643
10473 1451643 1142746 -465605 -568342 896194 2918580 -722684 -410347 -631172 1570085
10464 1570085 -208579 -322946 1729784 1063091 -213178 -120386 255865 -680222 1225935
10455 1225935 1670257 -16837 -243537 157797 372027 223314 -88490 -92404 -103711 -490017
10445 -490017 1051637 1745622 290461 1130739 -1033262 -555901 -314310 -127051 154360
$$ packed form
10509B74902n18565J314863Q07173j7168J67238l091342J018556N22418K058665
10500B536740n48482j130958K586634Q47409l518368m96681L43987j86453k60552
10491A73276L5545J413614L31467j226570J3094j078306J656075J486464j429503
10482A375156J320014K4265j868575l48492k7544Q99254J13393k79995K44167
10473A451643l08897j608351j02737J464536K022386l641264L12337k20825K201257
10464A570085j778664j14367K052730o66693j276269R2792L76251r36087J906157
10455A225935M44322j687094k26700M01334K14230j48713l11804l914j1307l86306
10445d90017J541654O93985j455161Q40278k164001M77361K41591J87259K81411
$$ plain form
10436 154360 1338542 -1472173 187884 996495 346607 1332046 463570 245506 1572772
10427 1572772 715180 1701178 1476246 953835 -473083 -1600342 348750 -626914 -887457
10418 -887457 1502343 1493211 816820 -850420 2084043 1111620 411585 164814 232853 1270216
10408 1270216 594315 600094 2283171 2127397 2485349 2454151 237231 266989 914461 930325
10398 930325 -656115 387736 1057307 1410087 105394 168946 1235071 852105 1007578
10389 1007578 1481607 308214 -90619 2380099 3005487 2949342 3276945 4022741 2255093
10380 2255093 1026534 1031248 3140907 2537895 2309506 3019504 100811 404987 981827
10371 981827 559362 2276 2164250 3439454 1447416 1236851 1646660 1993312 2570464
$$ packed form
10436A54360J184182k810715J660057Q08611o49888R85439q68476k18064J327266
10427A572772q57592R85998k24932n22411j426918j127259J949092r75664k60543
10418h87457K389800r132o76391j667240K934463r72423p00035k46771O8039J037363
10408A270216o75901N779J683077j55774L57952l1198k216920K9758O47472J5864
10398I30325j586440J043851O69571L52780j304693O3552J066125l82966J55473
10389A007578M74029j173393l98833K470718O25388n6145L27603P45796j767648
10380B255093j228559M714K109659o03012k28389P09998k918693L04176N76840
10371I81827m22465n57086K161974J275204j992038k10565M09809L46652N77152
$$ plain form
10362 2570464 835956 2889814 3146651 -22587 -14641 -2066647 -1162235 224989 -1202931
10353 -1202931 -353092 599655 2750829 3305291 2511902 3356507 2992096 2138664 2799820
10344 2799820 1297620 2680343 1373163 774754 1054265 118397 1525425 1774748 1083403
10335 1083403 -235329 865486 1150376 1448125 2836659 4201501 3224936 1674880 589750
10326 589750 173573 -1269047 861762 2387048 414056 1877747 540542 -2132232
10318 -2132232 -1226280 1804 86121 679055 1588912 3477248 1516485 -963863 -323364
10309 -323364 1271592 584236 1015433 2397193 2625265 846334 1209083 1204236 2807440
10300 2807440 3084754 1826622 5011211 3931374 1757404 2317684 800086 1623978 1475182
$$ packed form
10362B570464j734508K053858K56837l169238P946k052006R04412J387224j427920
10353a202931Q49839R52747K151174N54462p93389Q44605l64411q53432O61156
10344B799820j502200J382723j307180n98409K79511r35868J407028K49323o91345
10335A083403j318732J100815K84890K97749J388534J364842r76565j550056j085130
10326E89750m16177j442620K130809J525286j972992J463691j337205k672774
10318b132232R05952J228084Q4317N92934R09857J888336j960763k480348O40499
10309c23364J594956o87356M31197J381760K28072j778931L62749m847J603204
10300B807440K77314j258132L184589j079837k173970N60280j517598Q23892j48796
$$ plain form
10291 1475182 4027534 3587416 3287023 3360915 5821732 3736677 1996345 2651472 2528795
10282 2528795 2768020 2476426 2657292 3295505 1495510 1014326 2601370 1871131 2962027
10273 2962027 2738504 3601979 3196695 1170030 1434769 3563395 2173845 1853428 -664568
10264 -664568 2113482 2934098 2919506 2862454 2991788 2116995 2741926 3339035 3249453 4668676
10254 4668676 3430102 3478305 1842751 1975553 1652871 2318083 864320 1183231 1492023
10245 1492023 3964422 3599031 1456370 1216779 915764 2664004 2958685 1726220 2600990
10236 2600990 3451398 4841940 3798249 3172228 3133786 4720098 6200826 5421942 5292587
10227 5292587 5222559 6221733 4395511 4323367 5196206 6623423 5614036 5105252 3207970
$$ packed form
10291A475182K552352m40118l00393P3892K460817k085055j740332O55127j22677
10282B528795K39225k91594J80866O38213j799995m81184J587044p30239J090896
10273B962027k23523Q63475m05284k026665K64739K128626j389550l20417k517996
10264f64568K778050Q20616j4592n7052J29334q74793O24931N97109q9582J419223
10254D668676j238574M8203j635554J32802l22682O65212j453763L18911L08792
10245A492023K472399l65391k142661k39591l01015J748240K94681j232465Q74770
10236B600990Q50408J390542j043691o26021l8442J586312J480728p78884j29355
10227E292587p0028R99174j826222p2144Q72839J427217j009387n08784j897282
$$ plain form
10218 3207970 3778240 4480637 2352608 3733311 4601457 3721358 4592826 4434194 3761893
10209 3761893 2832237 4090730 3900059 4111109 3624776 3543718 2811272 3770083 3623004
10200 3623004 3967542 4450979 2992383 1251465 1642199 688582 1383144 44219 -1004490
10191 -1004490 982056 2106061 1546744 1074490 1355812 1709967 3208340 3823001 2142190
10182 2142190 1949365 2317693 2753262 2374272 1908294 1726239 2196567 3729794 3217841
10173 3217841 3648028 1089085 734063 1468487 1058235 1697699 569891 -2839 322641
10164 322641 174047 85344 1962390 877836 662271 1301811 1225495 99895 74239 3822391
10154 3822391 3104449 1752102 2371355 1593536 105500 257747 1702714 1091244 391896
$$ packed form
10218C207970N70270P02397k128029J380703Q68146q80099Q71468j58632o72301
10209C761893r29656J258493j90671K11050m86333q1058p32446R58811j47079
10200C623004L44538M83437j458596j740918L90734r53617O94562j338925j048709
10191a004490J986546J124005n59317m72254K81322L54155J498373O14661j680811
10182B142190j92825L68328M35569l78990m65978j82055M70328J533227n11953
10173C217841M30187k558943l55022P34424m10252O39464j127808n72730L25480
10164C22641j48594q8703J877046j084554k15565O39540p6316j125600k5656L748152
10154C822391p17942j352347O19253p77819j488036J52247J444967o11470o99348
$$ plain form
10145 391896 1147318 748688 1457211 1819569 -5974 -172461 -901861 -55429 1681654
10136 1681654 647338 820290 1356000 1824154 1089163 1142473 1362915 2026369 2016881 4926071
10126 4926071 4200304 1601440 699849 -455818 -338181 -422291 -1744599 127627 343465
10117 343465 -1190386 -1298763 -1358089 -1230575 -425949 2439140 3265048 1602479 1269213
10108 1269213 -1351509 -986603 597195 1692246 1744966 2628510 1481410 1732916 933495
10099 933495 285406 -598238 -1664634 -385303 251039 -701504 -1658495 -1021804 -1314204
10090 -1314204 117639 1630153 3080190 1801667 1016461 1248080 849825 842072 -254929
10081 -254929 -496014 270842 -718407 -532334 327304 1738759 904836 -1140880 -1156571
$$ packed form
10145C91896P55422l98630P08523L62358j825543j66487p29400Q46432J737083
10136A681654j034316J72952N35710M68154p34991N3310K20442O63454r488K909190
10126D926071p25767k598864r01591j155667J17637q4110j322308J872226K15838
10117C43465j533851j08377n9326J27514Q04626K865089Q25908j662569l33266
10108A269213k620722L64906J583798J095051N2720Q83544j147100K51506p99421
10099I33495o48089q83644j066396J279331O36342r52543r56991O36691k92400
10090a314204J431843J512514J450037j278523p85206K31619l98255p753j097001
10081b54929k41085P66856r89249J86073Q59638J411455q33923k045716j5691
$$ plain form
10072 -1156571 -2039803 -449621 1125088 1418571 -181005 -614285 -1056415 -998107 19783
10063 19783 -1322236 -1760450 -973364 -405109 -312723 542282 501962 -1302342 -165213 379531
10053 379531 -416068 420501 -399502 -737304 -870606 496584 -180882 279677 1806480
10044 1806480 817576 -1732163 -4140763 42297 252652 -2993859 -2792929 -1441434 -594538
10035 -594538 -241629 -102988 -858158 529251 -764117 -1093001 -860196 -1650281 -1493902
10026 -1493902 -1254416 506643 472527 1405273 470105 -899587 -2241404 -3281047 -1617480
10017 -1617480 362392 1538642 1389403 916229 392897 773373 -303520 -1983929 -641020
10008 -641020 228964 -446746 -1062224 -286399 1979195 1394471 1523049 -859260 -720348
$$ packed form
10072a156571q83232J590182J574709K93483j599576m33280m42130N8308J017890
10063A9783j342019m38214P87086N68255R2386Q55005m0320j804304J137129N44744
10053C79531p95599Q36569q20003l37802j33302J367190o77466M60559J526803
10044A806480r88904k549739k408600M183060K10355l246511K00930J351495Q46896
10035e94538L52909J38641p55170J387409j293368l28884K32805p90085J56379
10026a493902K39486J761059l4116R32746r35168j369692j341817j039643J663567
10017a617480J979872J176250j49239m73174n23332L80476j076893j680409J342909
10008f41020Q69984o75710o15478P75825K265594n84724J28578k382309J38912
$$ plain form
9999 -720348 -353188 793816 -200904 -1183214 -1383407 357930 163060 -1069617 -3439562
9990 -3439562 -3582353 -3361081 -2959924 -513592 1609174 1377933 1455979 3116432 507873
9981 507873 467293 1319927 2013888 994395 797610 551224 422222 491166 683219 -226303
9971 -226303 -2298 2879072 4688453 2808567 -502308 872759 1613467 475950 128844
9962 128844 -277466 -867082 -49527 325663 2815031 1560636 1255803 1532522 184497
9953 184497 516886 -693031 -517289 1746345 2060078 1201207 473862 532431 2187361
9944 2187361 2056927 1847713 -42749 -937480 -1058514 -612558 -723915 259938 -58180
9935 -58180 -616244 396312 1003518 1043833 2881634 1611402 362598 -524664 -645806
$$ packed form
9999g20348L67160J147004r94720r82310k00193J741337j94870j232677k369945
9990c439562j42791K21272M01157K446332K122766k31241P8046J660453k608559
9981E07873m0580Q52634O93961j019493j96785k46386j29002O8944J92053r09522
9971b26303K24005K881370J809381j879886l310875J375067P40708j137517l47106
9962A28844m06310n89616Q17555L75190K489368j254395l04833K76719j348025
9953A84497L32389j209917J75742K263634L13733q58871p27345N8569J654930
9944B187361j30434k09214j890462q94731j21034M45956j11357R83853l18118
9935e8180n58064J012556O07206M0315J837801j270232j248804q87262j21142
$$ plain form
9926 -645806 -436364 241827 -1602984 -3092638 -2283372 -1310234 158355 409453 1344736
9917 1344736 1904019 2211751 1862839 278638 -1210915 -834156 -1126431 -1146456 303799
9908 303799 1321206 1266814 2047597 1640692 3559635 2923121 842471 1294388 1130286
9899 1130286 -112532 -701356 1015335 1562370 1751086 822106 1605952 1373394 1608681
9890 1608681 1575559 -88624 483959 282591 -383458 44873 1331260 939890 856793 918278
9880 918278 1880676 1013327 -204133 742495 -232670 52837 748883 1540059 1106709 114690
9870 114690 963746 797781 467535 1583498 2587276 2276162 767538 -2124074 668819
9861 668819 532937 -2171701 -379068 1091743 1033322 -231714 559444 -904929 -523872
$$ packed form
9926f45806K09442O78191j844811j489654Q09266R73138J468589K51098R35283
9917A344736N59283L07732l48912j584201j489553L76759k92275k0025J450255
9908C03799J017407n4392P80783m06905J918943o36514k080650M51917j64102
9899A130286j242818n88824J716691N47035J88716r28980P83846k32558K35287
9890A608681l3122j664183N72583k01368o66049M28331J286387l91370q3097O1485
9880I18278R62398q67349j217460R46628r75165K85507O96046P91176m33350r92019
9870A14690Q49056j65965l30246J115963J003778l11114j508624k891612K792893
9861F68819j35882k704638J792633J470811n8421j265036P91158j464373L81057
$$ plain form
9852 -523872 956932 1319904 1198190 2682768 1010737 -933875 471669 2814658 1506479
9843 1506479 -1785930 1822455 1254370 -1096093 797957 1733337 3558659 4094096 3139171
9834 3139171 2542117 1530438 1879875 1292393 675954 -854942 -1959111 488015 -211591
9825 -211591 -295950 -219376 89623 -498037 244527 -400409 -770260 -1183146 280340 1763315
9815 1763315 -636324 -1867416 -85939 878338 287910 1292877 -1071292 533944 -444153
9806 -444153 8831 -36210 -955879 1085588 2572833 3939355 2632908 1637700 2110744
9797 2110744 1462435 457392 1364890 2663745 1903664 1828183 1899122 -102973 845082
9788 845082 1383949 562465 222038 -1113112 -276463 936995 430283 1414975 -230736
$$ packed form
9852e23872J480804L62972j21714J484578j672031j944612J405544K342989j308179
9843A506479l292409L608385n68085k350463J894050R35380J825322N35437r54925
9834C139171n97054j011679L49437n87482o16439j530896j104169K447126o99606
9825b11591q4359P6574L08999n87660P42564o44936l69851m12886J463486J482975
9815A763315k399639j231092J781477R64277n90428J004967k364169J605236r78097
9806d44153M52984m5041r19669K041467J487245J366522j306447r95208M73044
9797B110744o48309j005043R07498J298855p60081p5481P0939k002095R48055
9788H45082N38867q21484l40427j335150Q36649J213458n06712R84692j645711
$$ plain form
9779 -230736 251455 -640818 -299522 1938171 233555 -495612 -1918663 -1742475 42925
9770 42925 1240129 2462578 1592197 -665076 -1213399 -1153775 -564624 -473844 -1867415 -2550323
9760 -2550323 -272244 2641502 5394184 2147879 1991439 2770564 706863 -719344 -17665
9751 -17665 1970017 2137387 1258354 2390085 1135224 889735 2275166 502637 510408
9742 510408 2517982 1907504 -338574 -561946 669873 1642069 95323 579763 1531210
9733 1531210 216746 1437956 586403 -51864 2187559 2519901 1684609 2837254 3760463
9724 3760463 2927335 3463398 322004 -1286632 1742970 4469007 4042496 3110294 4179470
9715 4179470 1930974 548892 2234791 3532316 1747695 411637 1505771 1676004
$$ packed form
9779b30736M82191q92273L41296K237693j704616p29167j423051J76188J785400
9770D2925J197204J222449q70381k257273n48323N9624N89151R0780j393571o82908
9760b550323K278079K913746K752682l246305j56440P79125k063701j426207P01679
9751a7665J987682J67370q79033J131731j254861k45489J385431j772529P771
9742E10408K007574o10478k246078k23372J231819R72196j546746M84440R51447
9733A531210j314464J221210q51553o38267K239423L32342q35292J152645R23209
9724C760463q33128N36063l141394j608636L029602K726037m26511r32202J069176
9715D179470k248496j382082J685899J297525j784621j336058J094134J70233
$$ plain form
9707 1676004 992774 -65882 885600 1968869 882266 2921244 3546945 3324722 5268208
9698 5268208 7893024 8559075 5799831 5603202 5388200 6445713 8256330 7698090 5246977
9689 5246977 6248373 7827358 5576441 4480586 5373904 5968307 6151679 6649450 6990322
9680 6990322 8070751 9990349 10039215 10276361 9049041 10231022 10028807 9407475 9244621
9671 9244621 10600721 12585756 13590100 14554961 13079186 13374664 13812537 12811341 15820142
9662 15820142 19127862 19793308 21953650 23227176 24229797 23001563 23946165 25278829
9654 25278829 24973628 24919479 25599419 25779372 26774480 27505630 29498366 32392108 31834494
9645 31834494 32923383 34810544 36408399 37102513 39929958 41032209 39916930 41260660
$$ packed form
9707A676004o83230j058656R51482J083269j086603K038978O25701k22223J943486
9698E268208K624816O66051k759244j96629k15002J057513J810617n58240k451113
9689E246977J001396J578985k250917j095855Q93318N94403J83372M97771L40872
9680F990322J080429J919598M8866K37146j227320J181981k02215o21332j62854
9671I244621J356100J985035J004344R64861j475775K95478M37873j001196L008801
9662A5820142L307720O65446K160342J273526J002621j228234R44602J332664
9654B5278829l05201n4149O79940J79953R95108P31150J992736K893742n57614
9645C1834494J088889J887161J597855O94114K827445J102251j115279J343730
$$ plain form
9637 41260660 43307623 44262723 42904955 46106294 48059969 45914802 46157670 47125944 48420969
9628 48420969 48266617 46484130 47692590 49714479 50989981 52937367 54657885 56480947
9620 56480947 55944295 59463802 60128205 60759035 64151639 65861796 65832683 67669104 72091073
9611 72091073 74238333 77554520 78841040 80572501 82716833 84661184 87701565 89906891
9603 89906891 92552109 94309804 95767646 98207292 97644602 97827400 98637111 99244549 101557618
9594 101557618 102996273 104329365 106391149 107531444 105930552 106917013 105222384 101091405
9586 101091405 100254348 100886900 100836244 102099114 102374868 102158210 102729966 102417366 101384426
9577 101384426 101431502 100783341 97859335 96114808 94786522 94783784 95410187 95673659 96266410
$$ packed form
9637D1260660K046963R55100j357768L201339J953675k145167K42868R68274J295025
9628D8420969j54352j782487J208460K021889J275502J947386J720518J823062
9620E6480947n36652L519507O64403O30830L392604J710157k9113J836421M421969
9611G2091073K147260L316187J286520J731461K144332J944351L040381K205326
9603H9906891K645218J757695J457842K439646n62690J82798Q09711O07438K313069
9594A01557618J438655J333092K061784J140295j600892R86461j694629m130979
9586A01091405q37057O32552n0656J262870K75754k16658N71756l12600j032940
9577A01384426M7076o48161k924006j744527j328286k738O26403K63472N92751
$$ plain form
9568 96266410 95750966 94802859 93558361 94420819 96319682 98899190 101090176 99885155 100721822
9559 100721822 99908102 98604675 97197376 98147483 98260198 99450568 102600182 98874497
9551 98874497 96203099 96344251 94206893 92928932 93089531 91068420 90760879 90586055 89383452
9542 89383452 88356268 88532848 89960423 88715201 88310361 88122631 85311728 85143569 84856976
9533 84856976 83126999 82637261 83055072 82909212 81249549 81711906 81552851 81496277 79937221
9524 79937221 78346838 77621052 75518830 72185512 71118449 68759462 68403902 67372985
9516 67372985 65000428 61419960 60327561 59550246 57140856 57830256 56449916 54900965
9508 54900965 52283264 52006939 52516969 51261007 49570779 50843452 50961965 48925965 49461106
$$ packed form
9568I6266410n15444r48107j244498Q62458J898863K579508K190986j205021Q36667
9559A00721822q13720j303427j407299R50107J12715J190370L149614l725685
9551I8874497k671398J41152k137358j277961J60599k021111l07541j74824j202603
9542H9383452j027184J76580J427575j245222m04840j87730k810903j68159k86593
9533H4856976j729977m89738M17811j45860j659663M62357j59055n6574j559056
9524G9937221j590383p25786k102222l333318j067063k358987l55560j030917
9516F7372985k372557l580468j092399p77315k409390O89400j380340j548951
9508E4900965k617701k76325N10030j255962j690228J272673J18513k036000N35141
$$ plain form
9499 49461106 48946521 47492345 47280183 46808018 44239421 43130106 42662154 42130616 40073235
9490 40073235 38679023 37990667 36393983 33529014 32152830 30888402 31252980 32527963
9482 32527963 31910080 31649940 29567795 28996932 29069433 27155204 25337553 25180051 24863673
9473 24863673 26092145 26149103 26125459 24133669 21266296 22478209 22034502 21211927 21480970
9464 21480970 21938798 24135711 24039771 23800259 23136787 22418198 22209315 22103610 21466029
9455 21466029 22056530 22322002 20799441 18839558 16222277 15666513 16067658 15429098 15765382
9446 15765382 17467882 14777978 14941993 14716155 13329394 12484254 14483552 15420955 11767801
9437 11767801 9587964 9299542 9051943 9975555 10059715 9806754 7435541 8673955 11914403
$$ packed form
9499D9461106n14585j454176k12162m72165k568597j109315m67952n31538k057381
9490D0073235j394212o88356j596684k864969j376184j264428L64578J274983
9482C2527963o17883k60140k082145n70863P2501j914229j817651j57502l16378
9473B4863673J228472N6958k3644j991790k867373J211913m43707q22575K69043
9464B1480970M57828K196913r5940k39512o63472p18589k08883j05705o37581
9455B1466029N90501K65472j522561j959883k617281n55764M01145o38560L36284
9446A5765382J702500k689904J64015k25838j386761q45140J999298R37403l653154
9437A1767801k179837k88422k47599R23612Q4160k52961k371213J238414L240448
$$ plain form
9428 11914403 10730794 9622816 7943273 8977442 8992887 8965261 9646333 9570824 7275560
9419 7275560 8258470 7292633 8067323 9983408 8523420 7303581 7214248 6550889 7558814
9410 7558814 8590922 5627986 6398839 7452791 6711155 7832280 6777530 7520650 7403017
9401 7403017 8388084 10216031 8890419 6747463 6164390 5497141 6502589 7158419 6427307
9392 6427307 7391004 8089544 7009065 8487249 9796048 6749214 6285154 6757412 5595516
9383 5595516 5405846 4903469 5722048 7026107 4276442 3882503 5329845 6575829 6824678
9374 6824678 4897881 4914755 4241762 4487349 3922169 2886655 3685919 5006884 5839938
9365 5839938 4749921 6289719 5690924 4734202 5379353 4641501 4629825 4664176 4548366 4528258
$$ packed form
9428A1914403j183609j107978j679543J034169J5445k7626O81072p5509k295264
9419G275560R82910r65837P74690J916085j459988j219839q9333o63359J007925
9410G558814J032108k962936P70853J053952p41636J121125j054750P43120j17633
9401G403017R85067J827947j325612k142956n83073o67249J005448O55830p31112
9392F427307R63697O98540j080479J478184J308799l046834m64060M72258j161896
9383E595516j89670n02377Q18579J304059k749665l93939J447342J245984K48849
9374F824678j926797J6874o72993K45587n65180j035514P99264J320965Q33054
9365E839938j090017J539798n98795r56722O45151p37852j1676L4351j15810k0108
$$ plain form
9355 4528258 4792324 4431168 3429734 5471778 4734952 4327109 3921774 2811422 5109541
9346 5109541 4817804 6173080 8853204 7119321 7298571 8395414 8301682 6568423 8133718
9337 8133718 7748778 7717820 8167563 8534018 10733908 7923150 6378962 6779035 8428857
9328 8428857 11464180 10749407 11118410 9028255 7227394 9079455 10501174 12169189 10699794
9319 10699794 10768430 11126217 10812955 9487628 11446460 9968296 8501378 12184169 13806317
9310 13806317 15044640 17137185 17515527 14837883 14643267 13631707 14537618 15342516 16828203
9301 16828203 18316659 16077184 15318786 15348955 15716801 16528949 16104288 15122561 17146702
9292 17146702 18759340 19588798 17453559 16989781 16431963 19063761 20952613 20683628 19192695
$$ packed form
9355D528258K64066l61156j001434K042044p36826m07843m05335j110352K298119
9346E109541k91737J355276K680124j733883J79250J096843r3732j733259J565295
9337H133718l84940l0958M49743L66455K199890k810758j544188M00073J649822
9328H428857L035323p14773L69003k090155j800861J852061J421719J668015j469395
9319A0699794O8636L57787l13262j325327J958832j478164j466918L682791J622148
9310A3806317J238323K092545L78342k677644j94616j011560R05911Q04898J485687
9301A6828203J488456k239475p58398L0169L67846Q12148m24661r81727K024141
9292A7146702J612638Q29458k135239m63778n57818K631798J888852k68985j490933
$$ plain form
9283 19192695 20030397 21355379 20098931 20802294 21383302 20545518 19749615 22165650 25438954
9274 25438954 25771052 26015083 26000979 25521487 27270672 27103534 26377943 26425552 26683032 24968936
9264 24968936 26288092 26698978 25090876 25137907 24655287 22809542 22341509 21716856 21425014
9255 21425014 22200904 23150371 20392591 19477250 19854920 18462798 18654684 18963422 17441402
9246 17441402 15959075 14745168 15378094 14024435 13484354 16108483 16072739 15588398 13857672
9237 13857672 13136589 14071691 15176382 14491809 12539975 13543325 13398463 12894818 12200970
9228 12200970 14238628 14148837 13004577 13933859 13961969 14799553 14575130 12317307 11548093
9219 11548093 13216990 11760817 9677782 11041165 11409819 11588427 13049775 13309211 12630428
$$ packed form
9283A9192695Q37702J324982j256448P03363N81008q37784p95903K416035L273304
9274B5438954L32098K44031j4104m79492J749185j67138p25591M7609K57480j714096
9264B4968936J319156M10886j608102M7031m82620j845745m68033o24653k91842
9255B1425014P75890R49467k757780r15341L77670j392122J91886L08738j522020
9246A7441402j482327j213907O32926j353659n40081K624129l5744m84341j730726
9237A3857672p21083R35102J104691o84573j951834J003350j44862n03645o93848
9228A2200970K037658q9791j144260R29282K8110Q37584k24423k257823p69214
9219A1548093J668897j456173k083035J363383L68654J78608J461348K59436o78783
$$ plain form
9210 12630428 13165383 12265088 13537046 15126017 15543652 15924338 15899077 15838978 15514722
9201 15514722 14229317 15496350 16615699 17277539 18408572 16255441 16891943 14816561
9193 14816561 14299833 14570979 14515137 13333587 10786084 11454901 13439442 12508915 12104730
9184 12104730 11535484 10779335 11799300 11730626 10154198 8578139 7866191 8623800 8798612
9175 8798612 10344498 12189691 9848297 10711961 9659446 9865145 8708865 6926799 7054004
9166 7054004 6247019 6475935 7337402 8817708 6211079 5067085 6834719 9224036 6648008
9157 6648008 7528609 7436911 7986682 8409912 8038744 9285503 10367041 10412736 8890690
9148 8890690 7514366 7549146 7802052 5892920 5969011 8863209 9020817 8994934 7670270
$$ packed form
9210A2630428N34955r00295J271958J588971M17635L80686k5261o0099l24256
9201A5514722j285405J267033J119349O61840J131033k153131O36502k075382
9193A4816561n16728K71146n5842j181550k547503O68817J984541r30527m04185
9184A2104730n69246p56149J019965o8674j576428j576059p11948P57609J74812
9175H798612J545886J845193k341394Q63664j052515K05699j156280j782066J27205
9166G054004q06985K28916Q61467J480306k606629j143994J767634K389317k576028
9157F648008Q80601r1698N49771M23230l71168J246759J081538M5695j522046
9148H890690j376324L4780K52906j909132P6091K894198J57608k5883j324664
$$ plain form
9139 7670270 6897915 6735916 6555407 6991539 8177047 8316527 8037748 9360455 9472879
9130 9472879 10026806 10051432 9465730 11755075 12011783 11382901 10914836 12565817 14836913
9121 14836913 13910480 11484178 12696747 13966840 14462237 14072458 15362869 15876308 13200770
9112 13200770 11952947 11371119 13769769 15421492 14161256 15295234 17879631 18411025
9104 18411025 18316990 17195494 17420039 16361131 17748750 20935118 21547261 21809418 23803383
9095 23803383 23905378 23889256 23913727 25146364 23989163 24473785 23970280 26537629 27627763
9086 27627763 29379727 29186806 29366007 31073673 30253098 30736026 32299226 34418071 35209395
9077 35209395 35556222 34962301 36621172 38820311 39293441 39885868 41860993 43302690 45435440
$$ packed form
9139G670270p72355j61999j80509M36132J185508J39480k78779J322707J12424
9130I472879N53927K4626n85702K289345K56708o28882m68065J650981K271096
9121A4836913r26433k426302J212569J270093M95397l89779J290411N13439k675538
9112A3200770j247823n81828K398650J651723j260236J133978K584397N31394
9104A8411025r4035j121496K24545j058908J387619L186368O12143K62157J993965
9095B3803383J01995j6122K4471J232637j157201M84622n03505K567349J090134
9086B7627763J751964j92921J79201J707666q20575M82928J563200K118845P91324
9077C5209395L46827n93921J658871K199139M73130N92427J975125J441697K132750
$$ plain form
9068 45435440 46631792 48202676 46228482 48616110 50552571 52867957 55897389 59339421
9060 59339421 62335775 64463027 65770005 67099533 68555297 70036781 70281601 69260594
9052 69260594 73274985 74315320 76734415 78235862 79541314 81282311 84699638 85327029
9044 85327029 85475487 86163575 89886348 91452624 91375908 89632263 88924076 91510743 94013497
9035 94013497 93616319 93775150 93213218 95030990 97443087 97363897 100010383 100517144 98055487
9026 98055487 99428712 100897234 102642139 102638877 104605385 108107327 108149646 108003608 112244920
9017 112244920 114926147 114795471 115295836 116884727 118294746 118834836 121653688 124054766
9009 124054766 127899014 127594125 129286771 131075785 132427799 133568690 130954810 131266352
$$ packed form
9068D5435440J196352J570884j974194K387628J936461K315386L029432L442032
9060E9339421K996354K127252J306978J329528J455764J481484K44820j021007
9052F9260594M014391J040335K419095J501447J305452J740997L417327O27391
9044H5327029J48458O88088L722773J566276p6716j743645p08187K586667K502754
9035I4013497l97178J58831n61932J817772K412097p9190K646486N06761k461657
9026I8055487J373225J468522J744905l262J966508L501942M2319j46038M241312
9017A12244920K681227j30676N00365J588891J410019N40090K818852K401078
9009A24054766L844248l04889J692646J789014J352014J140891k613880L11542
$$ plain form
9001 131266352 130345004 127659201 126758683 127309640 126750980 125198386 126045549 125003996 122796665
8992 122796665 122134973 121355446 119917109 119623078 117700986 116528928 116695220 119036407 118411660
8983 118411660 115372025 113357508 113261875 115507952 114492891 113975243 115162227 117320387
8975 117320387 118601932 117548772 115029679 115137141 115370043 113511204 113537863 113055212 114405377
8966 114405377 116584924 119177714 117656537 117087022 116911002 119338439 120000039 122140130
8958 122140130 124281007 126543083 128720698 128881968 128676668 129895094 131182744 131947932
8950 131947932 134066549 135038136 136513946 139486968 140251697 145326395 148345139 153004358
8942 153004358 156112168 160864373 163986916 170071822 175827599 180153211 187146448 193319355
$$ packed form
9001A31266352r21348k685803r00518N50957n58660j552594Q47163j041553k207331
8992A22796665o61692p79527j438337k94031j922092j172058J66292K341187o24747
8983A18411660l039635k014517r5633K246077j015061n17648J186984K158160
8975A17320387J281545j053160k519093J07462K32902j858839K6659m82651J350165
8966A14405377K179547K592790j521177n69515j76020K427437O61600K140091
8958A22140130K140877K262076K177615J61270k05300J218426J287650P65188
8950A31947932K118617R71587J475810K973022P64729N074698L018744M659219
8942A53004358L107810M752205L122543O084906N755777M325612O993237O172907
$$ plain form
8934 193319355 200701422 205800693 214039525 224177271 238136738 257432085 276304179
8927 276304179 294564564 314214896 336945812 360898176 367028036 352137373 325782645
8920 325782645 295569114 267887846 243253463 224411860 207356275 193748707 179417635
8913 179417635 164972491 155525435 144424371 138183274 130346376 127250167 123429832 119019019
8905 119019019 116377840 114553564 113360365 110017953 108651898 107614440 105245393 104540110
8897 104540110 104242343 102638871 102923975 103827312 102710954 99908282 101161468 102946386
8889 102946386 100781199 99282248 96862393 97333815 94857507 92794280 90691231 90252655
8881 90252655 89422927 89205420 88518279 86660693 85582114 84581020 83256090 81803375 81378332
$$ packed form
8934A93319355P382067N099271Q238832J0137746J3959467J9295347J8872094
8927B76304179J8260385J9650332K2730916K3952364O129860j4890663k6354728
8920C25782645l0213531k7681268k4634383j8841603j7055585j3607568j4331072
8913A79417635j4445144r447056j1101064o241097p836898l096209l820335m410813
8905A19019019k641179j824276j193199l342412j366055j037458k369047p05283
8897A04540110k97767j603472K85104R03337j116358k802672J253186J784918
8889A02946386k165187j498951k419855M71422k476308k063227k103049m38576
8881I0252655q29728k17507o87141j857586j078579j001094j324930j452715m25043
$$ plain form
8872 81378332 81419914 80195091 78320010 77621820 77018773 75125540 73397372 70358245 68589013
8863 68589013 67004138 66422440 62989199 60671449 58131513 57478716 56699399 53533327 54127886
8854 54127886 52184986 50183963 48830707 46584425 47319237 46825394 44587592 45423492 46525196
8845 46525196 45213852 43610228 42562476 42069284 42618150 42920555 42928831 42712702 43916818
8836 43916818 43424011 42856476 42391891 42206973 41606732 44086077 43997329 42112293 41547480
8827 41547480 42209942 42818741 42218663 41949396 41216632 40059513 39468984 40381369 39022350
8818 39022350 37242839 36429339 36080932 37630054 37227096 37682743 39557529 39116190 39774717
8809 39774717 39632502 39507901 38549958 36492533 38462909 38339516 37267181 36004440 35206863
$$ packed form
8872H1378332M1582j224823j875081o98190o03047j893233j728168l039127j769232
8863F8589013j584875n81698l433241k317750k539936o52797p79317l166072N94559
8854E4127886j942900k001023j353256k246282P34812m93843k237802Q35900J101704
8845D6525196j311344j603624j047752m93192N48866L02405Q276k16129J204116
8836D3916818m92807n67535m64585j84918o00241K479345q8748j885036n64813
8827D1547480O62462O08799o00078k69267p32764j157119n90529R12385j359019
8818C9022350j779511q13500l48407J549122m02958M55647J874786m41339O58527
8809C9774717j42215j24601r57943k057425J970376j23393j072335j262741p97577
$$ plain form
8800 35206863 35858561 36267024 34491776 34849477 34834682 34587164 36603155 36694432 34851970
8791 34851970 34080057 36202210 34556674 37053130 36481008 34613862 35568119 33831756 34375564
8782 34375564 35070954 35528498 34885665 36427001 35535043 35217553 34558856 36706253 37305403
8773 37305403 36480932 37778228 38119189 37398581 36369598 37321923 37041664 35097486 36366653
8764 36366653 36225058 35867018 35039110 35431854 37492229 37240772 35719952 34401950 34466852
8755 34466852 33901297 34766776 34282899 32603401 30722142 30084091 29569031 30266276 28485863
8746 28485863 27643843 29493634 30250748 30117091 29591783 28703982 27420030 26811624 27434171
8737 27434171 27821472 29750553 29726699 30550261 30770059 28159560 27545244 26124967 26202815
$$ packed form
8800C5206863O51698M08463j775248L57701j4795k47518K015991R1277j842462
8791C4851970p71913K122153j645536K496456n72122j867146R54257j736363N43808
8782C4375564O95390M57544o42833J541336q91958l17490o58697K147397N99150
8773C7305403q24471J297296L40961p20608j028983R52325k80259j944178J269167
8764C6366653j41595l58040q27908L92744K060375k51457j520820j318002O4902
8755C4466852n65555Q65479m83877j679498j881259o38051n15060O97245j780413
8746B8485863q42020J849791P57114j33657n25308q87801j283952o08406O22547
8737B7434171L87301J929081k3854Q23562K19798k610499o14316j420277P7848
$$ plain form
8728 26202815 26675722 26070240 25763828 26991483 25790460 25717739 26967357 26652241 24414861
8719 24414861 24617087 25099779 26342954 23218945 20888585 20690591 20517479 23272947 20395204
8710 20395204 19019337 20728089 18860449 18951071 19200374 19481428 17054607 16100632 18069596
8701 18069596 16225621 18822038 18365750 17502254 18963007 20780144 20195968 21956510 21906084
8692 21906084 19388847 17390795 19125413 18212055 17865940 20432542 21519729 21144373 21067389
8683 21067389 19244459 18729790 17803714 17229961 16935880 14365925 14989591 16123214 16053532
8674 16053532 13881871 14402063 14149205 13476743 13468166 12593297 12515393 14853491 12675310
8665 12675310 10308003 10382334 11151707 12494182 13595972 11434835 9765891 8817607 9747287
$$ packed form
8728B6202815M72907o05482l06412J227655j201023p2721J249618l15116k237380
8719B4414861K02226M82692J243175l124009k330360j97994j73112K755468k877743
8710B0395204j375867J708752j867640R0622K49303K81054k426821r53975J968964
8701A8069596j843975K596417m56288q63496J460753J817137n84176J760542n0426
8692B1906084k517237j998052J734618r13358l46115K566602J087187l75356p6984
8683B1067389j822930n14669r26076n73753k94081k569955O23666J133623o9682
8674A6053532k171661N20192k52858o72462q577q74869p7904K338098k178181
8665A2675310k367307P4331P69373J342475J101790k161137j668944r48284R29680
$$ plain form
8656 9747287 8078656 9107821 11459772 9990728 10117838 10207952 11344827 10187262 7633765
8647 7633765 7324735 8901997 8149670 7871822 8735663 9505003 8579461 6740722 6524588
8638 6524588 5181851 6346104 5387375 5364930 5931681 5701790 5791541 3822446 4205393
8629 4205393 6305662 5038031 4085059 5868032 5923938 5343066 6241700 4272598 3344798
8620 3344798 4459371 2712206 4452813 3546573 2345781 3108158 1850636 4021019 3285432
8611 3285432 1656212 2672081 1374622 640708 898645 1368434 678833 715330 1297309
8602 1297309 2875550 3508972 2838806 300916 476208 1044093 3467793 3140368 2516866
8593 2516866 2664289 1063226 -151132 -1121544 616597 859304 -338983 -41660 1030996
$$ packed form
8656I747287j668631J029165K351951j469044J27110R0114J136875j157565k553497
8647G633765l09030J577262p52327k77848Q63841P69340r25542j838739k16134
8638F524588j342737J164253r58729k2445N66751k29891Q9751j969095L82947
8629D205393K100269j267631r52972J782973N5906n80872Q98634j969102r27800
8620C344798J114573j747165J740607r06240j200792P62377j257522K170383p35587
8611C285432j629220J015869j297459p33914K57937M69789o89601L6497N81979
8602A297309J578241O33422o70166k537890J75292N67885K423700l27425o23502
8593B516866J47423j601063j214358r70412J738141K42707j198287K97323J072656
$$ plain form
8584 1030996 2854884 2021811 2180022 240593 723885 3424276 2369669 -138609 933579
8575 933579 2816629 2238750 4006546 3523806 2023079 1651104 982946 -1371357 -1997206
8566 -1997206 138448 78428 -1316627 761773 3037402 2848192 2196233 1444755 101035
8557 101035 1348471 -1205981 -718654 453448 -10316 1900096 1651473 463830 1437820
8548 1437820 843110 628423 1860132 2412891 1490374 950385 1650732 2786666 3021758
8539 3021758 2624439 2041693 -918557 -2726791 -1677974 737513 267871 1986795 1832144
8530 1832144 2657178 678063 -737242 -1030551 -518395 -699903 -2210962 -2864364 -1857362
8521 -1857362 -1217495 -1726833 -154047 -432056 773425 -171369 -23018 764252 1057879
$$ packed form
8584A030996J823888q33073J58211j939429M83292K700391j054607k508278J072188
8575I33579J883050n77879J767796m82740j500727l71975o68158k354303o25849
8566a997206K135654o0020j395055K078400K275629j89210o51959p51478j343720
8557A01035J247436k554452M87327J172102m63764J910412k48623j187643R73990
8548A437820n94710k14687J231709N52759r22517n39989P00347J135934K35092
8539C021758l97319n82746k960250j808234J048817K415487m69642J718924j54651
8530A832144Q25034j979115j415305k93309N12156j81508j511059o53402J007002
8521a857362O39867n09338J572786k78009J205481r44794J48351P87270K93627
$$ plain form
8512 1057879 783607 1379122 -652759 -1068270 -1247617 -1005332 -15393 -1831396 -3249307
8503 -3249307 -563006 506680 -571023 718839 1649286 -549267 1150828 1335987 467849
8494 467849 430474 -396939 -510058 -1426052 -1617274 -3165411 -1133149 -569151 -222649 624511
8484 624511 -1284533 -3513767 -3312929 803467 -354267 -2322917 -696078 -1865011 -2665489
8475 -2665489 -2799695 -2756449 -2118936 -2970012 -2899143 -1191785 545941 -660891 -1683549
8466 -1683549 -3064080 -2867663 -1805802 -1627570 -2120457 -1323610 -1760941 -367918 447018
8457 447018 2172974 1776365 468069 1150582 502600 1057245 1813886 885379 -1670175
8448 -1670175 1607351 1435365 1492033 1981856 762762 1032060 1321492 216717 -892894
$$ packed form
8512A057879k74272N95515k031881m15511j79347K42285R89939j816003j417911
8503c249307K686301J069686j077703J289862R30447k198553J700095J85159q68138
8494D67849l7375q27413j13119r15994j91222j548137K032262N63998L46502Q47160
8484F24511j909044k229234K00838M116396j157734j968650J626839j168933q00478
8475b665489j34206M3246O37513q51076P0869J707358J737726j206832j022658
8466a683549j380531J96417J061861J78232m92887P96847m37331J393023Q14936
8457D47018J725956l96609j308296O82513o47982N54645P56641r28507k555554
8448a670175L277526j71986N6668M89823j219094K69298K89432j104775j109611
$$ plain form
8439 -892894 -1389624 -183839 2428357 -147767 474036 1269717 -77728 -1618576 -1018725
8430 -1018725 359317 -2504456 111168 1390855 928452 109538 -283643 986659 1881509
8421 1881509 893780 -993986 -1597215 -1455315 -1344959 -518096 -790793 -687471 -1901431
8412 -1901431 -3733959 -4209649 -1935053 -1242889 -1222115 -2557941 -318819 -829286 -561080
8403 -561080 1126406 392841 603673 -528878 634358 1411483 803297 -143836 -1498976
8394 -1498976 -3395510 -2640717 -2225363 -2496483 -662644 -341478 -602633 -502544 57951
8385 57951 -1705095 -540860 136987 65570 -280311 -483267 392547 -976755 -1686779 -2644118
8375 -2644118 -2996950 -1626678 -239754 -39283 -1216537 -1252575 -703555 -1910251 -1398816
$$ packed form
8439h92894m96730J205785K612196k576124O21803P95681j347445j540848N99851
8430a018725J378042k863773K615624J279687m62403q18914l93181J270302Q94850
8421A881509r87729j887766o03229J41900J10356Q26863k72697J03322j213960
8412a901431j832528m75690K274596O92164K0774j335826K239122n10467K68206
8403e61080J687486p33565K10832j132551J163236P77125o08186r47133j355140
8394a498976j896534P54793M15354k71120J833839L21166k61155J00089N60495
8385E7951j763046J164235O77847p1417l45881k02956Q75814j369302p10024r57339
8375b644118l52832J370272J386924K00471j177254l6038N49020j206696N11435
$$ plain form
8366 -1398816 -1918360 -561560 -362644 -1788175 -1951666 440743 1801075 1384667 641172
8357 641172 434017 84091 -258469 -1076947 -484659 -246430 -2565837 -2688995 -645264
8348 -645264 -2598576 -2234784 -3156388 -1091779 -309816 110901 714972 -1182633 90727
8339 90727 714126 -524337 -1564092 -1988542 -892566 -256955 -922556 598066 -1997829
8330 -1997829 -2444605 -307692 16056 -2460827 -2373246 -168010 -2005600 -4199831 -1954884
8321 -1954884 413565 -354874 -1369024 -1733165 -2747238 -4052768 -2802553 -975295 -2169767
8312 -2169767 -2924973 -2310266 -2842115 -739344 -415806 -2337398 -1396984 -1509506 855500
8303 855500 744355 -979816 -360429 -2033640 -2356444 -2211900 -2687057 -2195140 64181
$$ packed form
8366a398816n19544J356800J98916j425531j63491K392409J360332m16408p43495
8357F41172k07155l49926l42560q18478N92288K38229k319407j23158K043731
8348f45264j953312L63792r21604K064609P81963M20717O04071j897605J273360
8339I0727O23399j238463j039755m24450J095976O35611o65601J520622k595895
8330a997829m46776K136913L23748k476883Q7581K205236j837590k194231K244947
8321a954884K368449p68439j014150l64141j014073j305530J250215J827258j194472
8312b169767p55206O14707n31849K102771L23538j921592R40414j12522K365006
8303H55500j11145j724171O19387j673211l22804J44544m75157M91917K259321
$$ plain form
8294 64181 171893 -614314 -317106 -2437866 -1245943 -2364419 -3283918 5602 703476
8285 703476 1950491 2625863 3019649 2004008 431525 -491100 -1266006 -1313280 -1846353
8276 -1846353 -2103745 -2686521 -2818654 -2406510 -3590291 -5164219 -3646554 -1725749 -3724532
8267 -3724532 -1924691 -7452 -2182199 -369257 678933 1122248 1637116 188580 331446
8258 331446 579839 -201705 -591270 -1769758 -3296931 -1684600 -632476 283904 509304
8249 509304 -1417365 -1384789 -1299031 -1378106 438261 -90938 -3174964 -2118089 -1559807 -2032954
8239 -2032954 -1278293 -153388 -98754 -2159668 -3439101 -1602824 -1481684 -2133822 -1153575
8230 -1153575 -3762182 -4079643 -2165172 272405 -208046 389575 -1466802 -2018764 -1436551
$$ packed form
8294F4181J07712p86207K97208k120760J191923j118476r19499L289520O97874
8285G03476J247015O75372L93786j015641j572483r22625p74906m7274n33073
8276a846353k57392n82776j32133M12144j183781j573928J517665J920805j998783
8267c724532J799841J917239k174747J812942J048190M43315N14868j448536J42866
8258C31446K48393p81544l89565j178488j527173J612331J052124R16380K25400
8249E09304j926669L2576Q5758p9075J816367n29199l084026J056875N58282m73147
8239b032954P54661J124905N4634k060914j279433J836277J21140o52138R80247
8230a153575k608607l17461J914471K437577m80451N97621j856377n51962N82213
$$ plain form
8221 -1436551 -756253 -2052177 542043 -1419381 -1437705 -2224096 -3633238 -1121969 -2146140
8212 -2146140 -1545953 -2222543 -2143652 -772880 -1811098 -2626905 -2644900 -2311015 -1259322
8203 -1259322 -3180176 -3147517 -3328815 -3041058 -2069585 -1992838 -4829287 -4512435 -6191413
8194 -6191413 -4398393 -4791194 20900969 18412100 4929608 4784012 1285803 1999477
8186 1999477 391504 2455143 1712952 2334130 51995 415039 -780489 -893846 -1670384
8177 -1670384 -1487191 553283 -649318 -1859902 -1814886 -2847134 -1834896 -1796098 -1223265
8168 -1223265 -2225646 -2124766 -1109564 -1254781 -2730639 -1892988 -2492892 -2898316 -1947582
8159 -1947582 796291 -715250 -1229842 -3771577 -2262786 -825556 -564588 -1301252 -1703478
$$ packed form
8221a436551O80298j295924K594220j961424j8324p86391j409142K511269j024171
8212b146140O00187o76590P8891J370772j038218q15807j7995L33885J051693
8203a259322j920854L2659j81298K87757R71473P6747k836449L16852j678978
8194f191413J793020l92801K5692163k488869j3482492j45596l498209P13674
8186A999477j607973K063639p42191O21178k282135L63044j195528j13357p76538
8177a670384J83193K040474j202601j210584M5016j032248J012238L8798N72833
8168a223265j002381J00880J015202j45217j475858Q37651n99904m05424R50734
8159a947582K743873j511541n14592k541735J508791J437230K60968p36664m02226
$$ plain form
8150 -1703478 -2126385 -1502968 -568653 -2243600 -3105972 -1631021 -1381030 -1619846 -223747
8141 -223747 -254714 -2994026 -2923024 -2058256 -3331961 -2015548 -2642584 -2991780 -2107348 -1455448
8131 -1455448 -1042310 584414 -359015 -1794274 -2741165 -2758718 -120572 2232555 -1242844
8122 -1242844 -1391281 -82925 1620018 128179 -39028 -599511 -2155658 35680 1103030
8113 1103030 1029495 -410179 99301 -107780 -799876 -1482787 -3394813 -1306944 78670
8104 78670 20170 -1158907 49748 1227578 -1147573 -2127588 -530059 97442 1829306
8095 1829306 1254152 -1097407 -1238696 -1115066 -1421091 -1308730 -432920 -1045426 -1070049 -1438218
8085 -1438218 -2264188 -665889 -1556853 -872468 926937 238729 428841 1898915 1721956
$$ packed form
8150a703478m22907O23417R34315j674947q62372J474951K49991k38816J396099
8141b23747l0967k739312P1002Q64768j273705J316413o27036l49196Q84432O51900
8131a455448M13138J626724r43429j435259r46891j7553K638146K353127l475399
8122a242844j48437J308356J702943j491839j67207n60483j556147K191338J067350
8113A103030p3535j439674N09480k07081o92096o82911j912026K087869J385614
8104G8670n8500j179077J208655J177830k375151r80015J597529O27501J731864
8095A829306n75154k351559j41289J23630l06025J12361Q75810o12506k4623l68169
8085a438218q25970J598299q90964O84385J799405o88208J90112J470074j76959
$$ plain form
8076 1721956 117347 186241 -1270018 -1799478 -298553 -1002713 -784075 293548 -903518
8067 -903518 -1949331 532528 1564274 1039561 8481 -2581865 -1529825 -523850 -1088234
8058 -1088234 -250641 2349532 938982 1136945 312769 766921 2291940 2238059 730678
8049 730678 -534647 -11284 -945116 -1972249 112402 461809 1513017 1580321 -1432310
8040 -1432310 -1909453 -2974410 -674188 -1098446 409429 253769 -3081787 -752164 41739
8031 41739 1274540 2349990 -962533 -1763094 -388689 -71499 -650164 -2304358 -1748102
8022 -1748102 -1436254 -2052689 -3357988 -789802 -829557 -1562743 -486399 1102999 809873
8013 809873 -314839 -1396958 -2052488 -1562802 -915252 -1435382 251885 -1194262 -3388855
$$ packed form
8076A721956j604609O8894j456259n29460J500925p04160K18638J077623j197066
8067i03518j045813K481859J031746n24713j031080k590346J052040J005975n64384
8058a088234Q37593K600173j410550J97963q24176M54152J525019n3881j507381
8049G30678j265325N23363r33832j027133K084651L49407J051208O7304l012631
8040a432310m77143j064957K300222m24258J507875j55660l335556K329623P93903
8031D1739J232801J075450l312523q00561J374405L17190n78665j654194N56256
8022a748102L11848o16435j305299K568186l9755p33186J076344J589398k93126
8013H09873j124712j082119o55530M89686O47550n20130J687267j446147k194593
$$ plain form
8004 -3388855 -2413153 -2161993 -236878 -1224180 -323268 809014 1083257 1203125 807404
7995 807404 -797003 -372226 1463646 1885955 665299 3095752 160493 -1087270 338292
7986 338292 -1037008 -1584193 -1954228 -314182 -1727982 -1261194 -3816761 -2952580 594923
7977 594923 174434 -1359426 -2573510 -3168517 -920284 -2160918 -2172939 80540 -1257787
7968 -1257787 -836552 -2023644 -1318594 -1615642 -1944735 -1922302 -774789 226700 -1658841
7959 -1658841 -2184491 -1337260 -972254 -308525 750484 1013546 490900 -1283936 -1033383
7950 -1033383 -2126686 -2794822 -2242905 -1584855 348943 875426 132025 -1305153 -2049545
7941 -2049545 -1434348 -98536 489373 1255737 107984 -1330357 -362950 -979915 -875447
$$ packed form
8004c388855R75702K51160J925115r87302R00912J132282K74243J19868l95721
7995H07404j604407M24777J835872M22309j220656K430453k935259j247763J425562
7986C38292j375300n47185l70035J640046j413800M66788k555567Q64181L547503
7977E94923m20489j533860j214084n95007K248233j240634j2021K253479j338327
7968a257787M21235j187092P05050k97048l29093K2433J147513J001489j885541
7959a658841n25650Q47231L65006O63729J059009K63062n22646j774836K50553
7950a033383j093303o68136N51917O58050J933798N26483p43401j437178p44392
7941b049545O15197J335812N87909P66364j147753j438341R67407o16965J04468
$$ plain form
7932 -875447 -4400 -865794 -303350 612115 -341488 -1443822 -100062 -547262 -632956 1625291
7922 1625291 1650216 -2317358 -1374832 -610658 -1213000 -1429955 236944 749975 -1552821
7913 -1552821 -1497941 -193525 -181845 -746084 624938 398999 1013489 305424 205869 -1184736
7903 -1184736 -1089441 -774860 -1145274 -132943 -811446 -951387 -1099096 -1246427 -2427273
7894 -2427273 -744290 -731681 -2331634 -2041681 798473 -454909 -2717349 -1181437 -260206
7885 -260206 -1029139 -1637966 -2085129 -2984713 -2849076 -2792775 -1905462 -1145141 -1577922 -1638048
7875 -1638048 -2271102 -1126508 522086 -1381795 -3114076 -2250455 -1525672 -2998019 -4227903
7866 -4227903 -2026288 -20100 1106986 702019 919651 938263 1174797 439492 -352795
$$ packed form
7932h75447Q71047q61394N62444R15465r53603j102334J343760m47200q5694K258247
7922A625291K4925l967574R42526P64174o02342k16955J666899N13031k302796
7913a552821N4880J304416J1680n64239J371022k25939O14490p08065r9555j390605
7903a184736R5295L14581l70414J012331o78503j39941j47709j47331j180846
7894b427273J682983J2609j599953K89953K840154j253382k262440J535912R21231
7885b60206p68933o08827m47163q99584J35637N6301Q87313P60321m32781o0126
7875a638048o33054J144594J648594j903881j732281Q63621P24783j472347j229884
7866d227903K201615K006188J127086m04967K17632J8612K36534p35305p92287
$$ plain form
7857 -352795 662412 -50572 -359548 -1090229 102599 1413107 2269390 495081 1102289
7848 1102289 1126424 -906213 -637129 784419 83817 -755335 1772397 2231057 922984
7839 922984 838107 576301 70534 723719 -189539 420574 -160478 -1754366 1176284 561610
7829 561610 -717984 -2291325 -894485 -854550 -1169190 8362 1061825 -681482 -3704822
7820 -3704822 -3361309 -988810 40770 1001254 2490039 158268 -222718 -1737907 -2876480
7811 -2876480 -2379998 -2678829 -2251972 -1023224 -1349573 -3416580 -5709621 -9448616 -7228321
7802 -7228321 -3910987 -2863237 -3956228 -2721482 -2913212 -2407233 53315 -1271259 -2846436
7793 -2846436 -2766180 -1545709 -272401 693220 585650 58818 -1999698 -1364572 -549288
$$ packed form
7857c52795J015207p12984l08976p30681J192828J310508Q56283j774309O07208
7848A102289K4135k032637K69084J421548p00602q39152K527732M58660j308073
7839I22984q4877k61806n05767O53185r13258O10113n81052j593888K930650o14674
7829E61610j279594j573341J396840L9935l14640J177552J053463j743307l023340
7820c704822L43513K372499J029580R60484J488785k331771l80986j515189j138573
7811b876480M96482k98831M26857J228748l26349k067007k293041l738995K220295
7802g228321L317334J047750j092991J234746j91730N05979K460548j324574j575177
7793b846436Q0256J220471J273308R65621j07570n26832k058516O35126Q15284
$$ plain form
7784 -549288 667017 15232 488277 652043 237929 747794 1293403 749364 -1227082
7775 -1227082 -2793357 -2426178 -2351674 -2260423 -1373391 -652158 -470861 -1115403 -58455 429976
7765 429976 1676300 1805771 -1382677 -1098889 -611876 -623255 -823195 -1832550 -987980
7756 -987980 682934 767111 798286 686750 -2273198 -1983013 -474661 -3185791 -3435527
7747 -3435527 -1611346 -1264954 334883 650487 23084 260315 164118 -450066 -925219
7738 -925219 -1668882 -673970 -1316128 -1001801 -1296847 -1241646 -2183983 -1272486 -1312898 -191714
7728 -191714 -1118698 -2686344 -2019753 -404280 654738 785900 529006 1344131 -554098
7719 -554098 -2368759 -1403057 -2389134 -1632884 -2987974 -1969521 -705275 -217976 -386824
$$ packed form
7784e49288J216305o51785M73045J63766m14114N09865N45609n44039j976446
7775a227082j566275L67179P4504R1251Q87032P21233J81297o44542J056948M88431
7765D29976J246324J29471l188448K83788M87013j1379j99940j009355Q44570
7756i87980J670914Q4177L1175j11536k959948K90185J508352k711130k49736
7747c435527J824181L46392J599837L15604o27403K37231r6197o14184m75153
7738i25219p43663R94912o42158L14327k95046N5201r42337R11497m0412J121184
7728a91714r26984j567646O66591J615473J059018J31162k56894Q15125j898229
7719e54098j814661R65702r86077P56250j355090J018453J264246M87299j68848
$$ plain form
7710 -386824 -325016 -2708690 -1866391 -639087 385372 -345242 -880336 -457746 -2220431
7701 -2220431 -1335598 -2041261 -2014436 7718 -1105925 -1235971 -1782564 -3332459 -2662201
7692 -2662201 -784440 -2007318 -3113577 -2114375 -455987 -1312012 -36387 53568 -1188474
7683 -1188474 -1139872 -1728625 -2753535 -1118315 -2581876 -293774 1867962 -311078 -519505
7674 -519505 -440979 -2619906 -831791 -334937 -2027342 45089 -210499 -707641 -1767209
7665 -1767209 -1480555 -2007151 -573229 -76335 -613018 -1261645 -2122200 -124504 -665022
7656 -665022 -150274 -893456 -571815 -1158733 -869397 -1676378 -2883331 -2648347 -2852202 -1941501
7646 -1941501 -1378174 189422 232061 184029 953919 1382711 -744354 283340 900985
$$ packed form
7710c86824O1808k383674Q42299J227304J024459p30614n35094M22590j762685
7701b220431Q84833p05663K6825K022154j113643j30046n46593j549895O70258
7692b662201J877761j222878j106259R99202J658388q56025J275625Q9955j242042
7683a188474M8602n88753j024910J635220j463561K288102K161736k179040k08427
7674e19505P8526k178927J788115M96854j692405K072431k55588m97142j059568
7665a767209K86654n26596J433922M96894n36683o48627q60555J997696n40518
7656f65022N14748p43182L21641n86918K89336q06981j206953K34984k03855R10701
7646a941501N63327J567596M2639m8032P69890M28792k127065J027694O17645
$$ plain form
7637 900985 897157 -531320 149069 -272383 -983612 -791693 -1434407 -1529613 -2481215 -386812
7627 -386812 340247 -556346 1262878 1572946 1816494 840652 257234 -1128442 -1853523
7618 -1853523 -624927 -19829 -1665293 -1321391 318274 -30183 -2232794 -1717013 -1829264
7609 -1829264 -1807234 -1594547 561491 -1934309 -1852875 681199 -1666976 40250 298276
7600 298276 -1445620 -1541921 -1021968 -2106021 -1337076 -2425971 -1750909 1651892 1020600
7591 1020600 834368 549122 -2099812 -2970902 -1765316 59013 -418335 -2118251 -2011383
7582 -2011383 -2353791 -1402501 -1750045 -706517 -580938 424629 -1064423 -2461719 -1946887
7573 -1946887 226261 -1486659 -3764924 -1776427 288508 1234501 -372539 -226625 -855438
$$ packed form
7637I00985l828j428477O80389m21452p11229J91919o42714r5206r51602K094403
7627c86812P27059q96593J819224L10068K43548r75842n83418j385676p25081
7618a853523J228596O05098j645464L43902J639665l48457k202611N15781j12251
7609a829264K2030K12687K156038k495800Q1434K534074k348175J707226K58026
7600B98276j743896r6301N19953j084053P68945j088895O75062L402801o31292
7591A020600j86232k85246k648934q71090J205586J824329m77348j699916J06868
7582b011383l42408R51290l47544J043528J25579J005567j489052j397296N14832
7573a946887K173148j712920k278265J988497K064935R45993j607040J45914o28813
$$ plain form
7564 -855438 -864857 -634636 -1697702 -2225548 -2563813 -4329374 -2885060 1047642 110209
7555 110209 -1414800 -1335591 -1134094 -2041387 -611715 -227449 -79619 -394961 -2343503
7546 -2343503 -1672403 -2202362 -3493424 -4109638 -3702276 -1923210 -164150 -254491 172891
7537 172891 -930565 217490 -907870 -2979966 -2456984 -971516 -1713119 9627 -1204614
7528 -1204614 -2236276 -1569519 -798901 -854578 -1130501 -970573 -624411 -531507 102194 76495
7518 76495 -2844209 -77949 1410333 -262207 -366677 -715484 -1403389 -743744 -21189
7509 -21189 -3618579 -4803127 -2186323 -2302433 -2544469 -2530919 -1370539 497491 -799899
7500 -799899 1970337 2087657 2484763 -1304176 -2208770 -895906 390490 -1127653 -1004322
$$ packed form
7564h55438r419K30221j063066n27846l38265j765561J444314L932702r37433
7555A10209j525009P9209K01497r07293J429672L84266J47830l15342j948542
7546b343503O71100n29959j291062o16214M07362J779066J759060r0341M27382
7537A72891j103456J148055j125360k072096N22982J485468p41603J722746j214241
7528a204614j031662O66757P70618n5677k75923J59928L46162R2904O33701k5699
7518G6495k920704K766260J488282j672540j04470l48807o87905O59645P22555
7509b1189l597390j184548K616804j16110k42036J3550J160380J868030j297390
7500g99899K770236J17320L97106l788939r04594J312864J286396j518143J23331
$$ plain form
7491 -1004322 -440730 561221 786725 -2052718 -2571154 -937323 -2566229 -2379190 -1308735
7482 -1308735 -2453124 -3780627 -1076742 -429267 -1947708 -706117 -2763681 -2569574 -1599470
7473 -1599470 -1778269 836834 3182379 460054 547735 -44912 1578860 1963922 786756
7464 786756 -781231 1231278 1421760 1576256 -397128 -1697216 34439 606556 -1112151
7455 -1112151 -1091791 -209300 1505604 1923232 2055448 -877676 -956257 461502 684901
7446 684901 906731 1955157 481803 43784 -250437 -70368 -681066 -828806 210320
7437 210320 963764 2031373 150868 -814515 -1496513 -835723 -1654065 -783157 -2339753
7428 -2339753 -1423092 -646407 -4009090 -2554997 -2780549 -2808381 -1439334 -820005 -1614264
$$ packed form
7491a004322N63592J001951K25504k839443n18436J633831j628906J87039J070455
7482a308735j144389j327503K703885O47475j518441J241591k057564J94107R70104
7473a599470j78799K615103K345545k722325Q7681n92647J623772L85062j177166
7464G86756j567987K012509J90482J54496j973384j300088J731655N72117j718707
7455a112151K0360Q82491J714904M17628J32216k933124p8581J417759K23399
7446F84901K21830J048426j473354m38019k94221J80069o10698j47740J039126
7437B10320P53444J067609j880505r65383o81998O60790q18342Q70908j556596
7428b339753R16661P76685l362683J454093k25552k7832J369047O19329p94259
$$ plain form
7419 -1614264 -1574536 -911919 239725 656852 2391943 -213564 -810773 -915508 165238
7410 165238 250845 490513 2519031 470736 1702893 -241166 -902532 -275215 -1068085
7401 -1068085 -735115 -2858520 -3156983 -1070594 -2071011 -1666706 -370185 -454903 -1104868
7392 -1104868 -426683 -1670332 -1059591 595850 474489 -799476 34636 -582430 -370218
7383 -370218 308815 -1697227 -1686351 -1147346 -1642391 -3619142 -3825464 -1276089 -1424015
7374 -1424015 26521 -508458 -205892 651169 -163609 -3586658 -4152644 -1791119 -1345344
7365 -1345344 -327642 616137 491733 32779 -1875933 -1922850 -1732954 -755283 -26848
7356 -26848 -459112 -613211 -2185117 -4005359 -2921007 -3620603 -1079919 -1319570 -82062
$$ packed form
7419a614264L9728O62617J151644M17127J735091k605507n97209j04735J080746
7410A65238Q5607K39668K028518k048295J232157j944059o61366O27317p92870
7401a068085L32970k123405k98463K086389j000417M04305J296521q4718o49965
7392a104868O78185j243649O10741J655441j21361j273965Q34112o17066K12212
7383c70218O79033k006042J0876N39005m95045j976751k06322K549375j47926
7374a424015J450536n34979L02566Q57061q14778l423049n65986K361525M45775
7365a345344J017702R43779j24404m58954j908712m6917J89896R77671P28435
7356b6848m32264j54099j571906j820242J084352o99596K540684k39651J237508
$$ plain form
7347 -82062 661528 -519555 -62401 -2033794 -3409012 -1761518 -104049 -388030 -371669
7338 -371669 -1528365 -406607 281198 -725312 -2640581 -2896297 -2284447 -2193846 -2982621
7329 -2982621 -2150955 -2677347 -1570945 -575176 -688689 -2205861 -2688098 156020 -1000464
7320 -1000464 -2383130 -375504 -1235655 812671 1162526 36783 298979 -74050 -918465
7311 -918465 -1082468 -2485147 -2168934 -86536 535307 -2450665 -2681283 -799177 -382472
7302 -382472 -3194401 -2263042 -1998934 331646 1007760 -766137 709367 -41192 -1839340
7293 -1839340 -2124088 -2114000 -2729361 -2676578 -1955545 -3722669 -4596360 -3444544 -844331
7284 -844331 -1739411 -854766 545893 -140969 370445 -1713613 -1534248 -1329764 -1405611 7710
$$ packed form
7347h2062P43590j181083M57154j971393j375218J647494J657469k83981J6361
7338c71669j156696J121758O87805j006510j915269k55716O11850R0601p88775
7329b982621Q31666n26392J106402R95769j13513j517172m82237K844118j156484
7320a000464j382666K007626q60151K048326L49855j125743K62196l73029q44415
7311i18465j64003j402679L16213K082398O21843k985972k30618J882106M16705
7302c82472k811929R31359K64108K330580O76114j773897J475504p50559j798148
7293a839340k84748J0088o15361N2783P21033j767124q73691J151816K600213
7284h44331q95080Q84645J400659o86862N11414k084058J79365K04484p5847J413321
$$ plain form
7274 7710 583330 -682309 -1857023 -1920980 -1255216 -1277691 -1063262 -1707013 164697 -780373
7264 -780373 887129 -1283211 -2950841 -2227357 -1939357 -1988982 -2345812 -1774510 -1156450
7255 -1156450 -1337610 -553249 -625667 564474 -71338 138957 -8692 332982 757312 1474854
7245 1474854 -63625 154861 -382670 261658 -225265 -2662310 -3154054 -4882912 -2301696
7236 -2301696 -1735467 -503888 -247426 -1410232 -2596419 -1959758 -2651955 -3722325 -1559063
7227 -1559063 323047 228261 -351879 -2145685 -1428907 -690096 1159878 751092 669883
7218 669883 -2079009 -428780 809944 274267 502916 -972500 332281 -602226 -452309
7209 -452309 -428495 -709781 -714298 -182489 -3639 -180894 -160540 -745154 -622767 900377
$$ packed form
7274G710N75620j265639j174714o3957O65764k2475K14429o43751J871710r45070
7264g80373J667502k170340j667630P23484K88000m9625l56830N71302O18060
7255a156450j81160P84361p2418J190141o35812K10295j47649L41674M24330P17542
7245A474854j538479K18486n37531O44328m86923k437045m91744j728858K581216
7236b301696N66229J231579K56462j162806j186187O36661o92197j070370K163262
7227a559063J882110r4786n80140j793806P16778P38811J849974m08786q1209
7218F69883k748892J650229J238724n35677K28649j475416J304781r34507J49917
7209d52309K3814k81286m517N31809J78850j77255K0354n84614J22387J523144
$$ plain form
7199 900377 -1745128 -2460489 -1564910 435323 -876048 -1912296 -148470 981729 1548328
7190 1548328 -531773 -840580 -1316927 -281607 -145829 -112162 -1976314 -2633179 -2160294
7181 -2160294 -1336311 1637934 57602 693838 985980 -1645139 -2186502 -2016618 -1392194
7172 -1392194 -1866452 -2259098 -904803 911007 -2807 570430 664480 1383841 -1373021
7163 -1373021 -3294128 -3053361 -1938868 -1219220 -1300672 -1898081 -2520326 -2621231 -2394266
7154 -2394266 -208900 -1028428 -3323390 -2784656 560971 1359672 -1306270 -3470221 -63801
7145 -63801 -135235 72737 157297 -1533994 -2903110 -510432 569751 -38454 -3696019
7136 -3696019 -2853798 -2322685 -1227417 -351192 -1075140 -1994112 -2417725 -500674 -1328578
$$ packed form
7199I00377k645505p15361Q95579K000233j311371j036248J763826J130199N66599
7190A548328k080101l08807m76347J035320J35778L3667j864152o56865M72885
7181b160294Q23983K974245j580332O36236K92142k631119n41363J69884O24424
7172a392194m74258l92646J354295J815810r13814N73237R4050P19361k756862
7163a373021j921107K40767J114493P19648q1452n97409o22245j00905K26965
7154b394266K185366q19528k294962N38734L345627P98701k665942k163951L406420
7145f3801p1434K07972Q4560j691291j369116K392678J080183o08205l657565
7136c696019Q42221N31113J095268Q76225p23948r18972m23613J917051q27904
$$ plain form
7127 -1328578 -2572951 -2412906 -367218 40172 -209700 821750 2934808 208136 -408499
7118 -408499 -161748 -257765 282695 -759561 -887184 -2248424 -2504992 -2570010 -1435288 345848
7108 345848 -1040446 -1837821 -2869943 -1935598 -914859 -136922 -345407 -440286 -284665
7099 -284665 -544679 -1108692 416002 -1832080 -603883 -447274 -641276 -2434269 -2848520
7090 -2848520 -2469581 -3244205 -2622035 -617918 -1436160 -680387 100092 -1422426 -2825246
7081 -2825246 -2708299 -2452125 -1660478 177041 -783004 174515 -572076 -1107865 -2018341
7072 -2018341 -2969143 416345 292837 -1236508 -1464830 -3169381 -3406744 -1381946 -1933487
7063 -1933487 -1883795 -266167 -449627 -936033 -2733301 -1262103 323805 247636 -2265984
$$ packed form
7127a328578j244373J60045K045688M07390k49872J031450K113058k726672o16635
7118d08499K46751r6017N40460j042256j27623j361240k56568o5018J134722J781136
7108C45848j386294p97375j032122R34345J020739P77937k08485r4879J55621
7099b84665k60014n64013J524694k248082J228197J56609j94002j792993m14251
7090b848520L78939p74624O22170K004117q18242P55773P80479j522518j402820
7081b825246J16947K56174P91647J837519r60045R57519p46591n35789r10476
7072b018341r50802L385488j23508j529345k28322j704551k37363K024798n51541
7063a933487M9692J617628j83460m86406j797268J471198J585908p6169k513620
$$ plain form
7054 -2265984 -892636 -1124815 -1912335 1155634 1609978 568562 591844 -37925 434678
7045 434678 109053 439844 266926 725109 -632131 -375199 -605062 1635443 1567588 1290213
7035 1290213 708857 750812 -507518 -2088880 -1954808 -3644826 -1602817 -150299 1036872
7026 1036872 538174 -753522 -830872 -753119 -1025515 -770200 -563321 -738290 835853 47748
7016 47748 117590 83059 -480628 -1022520 -2708071 -1131600 -1272569 -1173081 -1252399 -2679917
7006 -2679917 -1244891 -1582631 -1106632 -1246581 -958476 303091 213222 537899 -235989
6997 -235989 -1569429 -1623757 -717518 309832 -35924 327686 385690 -207403 225412 -992911
6987 -992911 -178508 -706841 604827 1069588 762715 183870 -681528 47350 101804 -1063483
$$ packed form
7054b265984J373348k32179p87520L067969M54344j041416K3282o29769M72603
7045D34678l25625L30791j72918M58183j357240K56932k29863K240505o7855k77375
7035A290213n81356M1955j258330j581362J34072j690018K042009J452518J187171
7026A036872m98698j291696p7350P7753k72396K55315K06879j74969J574143p88105
7016D7748O9842l4531n63687n41892j685551J576471j40969R9488p9318j427518
7006b679917J435026l37740M75999j39949K88105J261567q9869L24677p73888
6997b35989j333440n4328R06239J027350l45756L63610N8004n93093M32815j218323
6987i92911Q14403n28333J311668M64761l06873n78845q65398P28878N4454j165287
$$ plain form
6977 -1063483 -1133652 -749847 -1741559 -813006 -2619024 -1541992 743476 -1111858 -1634034
6968 -1634034 -429570 485568 -163561 -292577 -450594 174966 729464 1494660 1150479
6959 1150479 1574251 -1385817 -789782 -289941 -2766677 -1932838 -1147254 -1371690 -934636
6950 -934636 764891 -1387890 -152680 746449 463452 -747182 224048 -668530 -581089
6941 -581089 -922751 -570108 874364 -533117 1072574 -1082543 -1899564 -130028 1051436
6932 1051436 -641623 -727730 -1709201 -1188277 -1632854 -797223 -1099456 -501208 -237427 -298281
6922 -298281 751302 -474284 -1317471 -1504085 -1331081 142994 -998603 -283821 -137824
6913 -137824 -2333 1140846 469678 701410 1363405 1579479 -1323220 -1304973 419217
$$ packed form
6977a063483p0169L83805r91712R28553j806018J077032K285468j855334n22176
6968a634034J204464R15138o49129j29016j58017O25560N54498P65196l44181
6959A150479M23772k960068N96035M99841k476736Q33839P85584k24436M37054
6950i34636J699527k152781J235210Q99129k82997j210634R71230q92578Q7441
6941e81089l41662L52643J444472j407481J605691k155117q17021J769536J181464
6932A051436j693059q6107r81471N20924m44577Q35631l02233N98248K63781o0854
6922b98281J049583j225586q43187j86614J73004J474075j141597P14782J45997
6913a37824J35491J143179o71168K31732O61995K16074k902699J8247J724190
$$ plain form
6904 419217 2930998 1517442 -1846444 -3286537 -2117266 -1354018 -1639138 -576164 -1062261
6895 -1062261 -3860887 -1761256 578937 413033 1185993 706818 95873 -506015 -289260
6886 -289260 711410 91333 366822 -754356 -731933 -627274 -1362523 -1408201 725642 2234050
6876 2234050 1042213 314155 126635 -1449967 -1365087 -315347 -491979 806198 -312356
6867 -312356 -620440 2229677 3350700 1598766 -272348 -2117355 1078848 1022762 688817
6858 688817 390762 -1022844 409278 -1076218 -4711494 -4388952 -2628000 -1269564 6292
6849 6292 805459 -472720 -342777 536994 -1504253 -749243 582825 2493353 1200266
6840 1200266 49483 -957885 113716 -121116 -1269746 -819666 215952 1176725 1199906
$$ packed form
6904D19217K511781j413556l363886j440093J169271P63248k85120J062974m86097
6895a062261k798626K099631K340193j65904P72960m79175o10945o01888K16755
6886b89260J000670o20077K75489j121178K2423J04659p35249m5678K133843J508408
6876B234050j191837p28058j87520j576602Q4880J049740j76632J298177j118554
6867c12356l08084K850117J121023j751934j871114j845007L196203n6086l33945
6858F88817k98055j413606J432122j485496l635276L22542J760952J358436J275856
6849F292P99167j278179J29943Q79771k041247P55010J332068J910528j293087
6840A200266j150783j007368J071601k34832j148630M50080J035618R60773K3181
$$ plain form
6831 1199906 996623 754075 -1162291 -2115915 -157842 -1222522 -2294084 -1026293 -2081728
6822 -2081728 -2141476 230390 1272404 -464490 -2413842 -445780 360978 577450 972456
6813 972456 -1369686 -1615674 -685951 -2118557 344892 1007024 -1060925 -548385 226934
6804 226934 21977 -1264076 -1700611 -510246 -402960 -629037 804313 2030697 2208105
6795 2208105 1423117 -327928 -1660589 1802536 1167793 -798050 -1672902 -157744 2353324
6786 2353324 914387 1020826 924698 -1814962 -961556 -1607289 13043 2107509 2008851
6777 2008851 -2241195 -1271324 232267 -49686 1298985 886028 1378466 1063447 -123065
6768 -123065 497671 125474 -1719726 -303663 316236 212929 -793100 -296277 -159020
$$ packed form
6831A199906k03283k42548j916366r53624J958073j064680j071562J267791j055435
6822b081728n9748K371866J042014j736894j949352J968062Q06758K16472L95006
6813I72456k342142k45988R29723j432606K463449O62132k067949N12540P75319
6804B26934k04957j286053m36535J190365J07286k26077J433350J226384J77408
6795B208105p84988j751045j332661L463125o34743j965843q74852J515158K511068
6786B353324j438937J06439r6128k739660Q53406o45733J620332K094466r8658
6777B008851m250046R69871J503591k81953J348671m12957M92438l15019j186512
6768a23065O20736l72197j845200J416063O19899j03307j006029M96823J37257
$$ plain form
6759 -159020 223270 -417357 882260 -1223105 329498 1012620 -524370 -1062692 -644350
6750 -644350 -1926529 -3497018 -2819293 -596488 2496134 1741515 -1382082 -1416984 -2175144
6741 -2175144 556621 655604 713994 97635 -1318267 -1192487 -41348 -1339320 -234038
6732 -234038 665714 2000798 2119974 444415 2047651 665548 -237859 -1190912 -352914
6723 -352914 -518032 -683502 -2938613 -2068991 -627519 -2059909 -2246073 -2559830 -1712145
6714 -1712145 -1163448 -909339 510394 -220526 1151682 1850081 573200 -1518008 -2024999
6705 -2024999 -1763020 -1209059 -3090345 -1332098 -884348 -953628 -963519 -976404 -2459441 -1869935
6695 -1869935 -2434613 -3971478 -1432617 -2171354 -1510080 -3175 -99821 -582984 -1885843
$$ packed form
6759a59020L82290o40627J299617k105365J552603O83122j536990n38322M18342
6750f44350j282179j570489O77725K222805L092622p54619l123597l4902p58160
6741b175144K731765R8983N8390o16359j415902J25780J151139j297972J105282
6732b34038Q99752J335084J19176j675559J603236j382103r03407r53053Q37998
6723c52914j65118j65470k255111Q69622J441472j432390j86164l13757Q47685
6714a712145N48697K54109J419733p30920J372208O98399j276881k091208n06991
6705b024999K61979N53961j881286J758247M47750o9280r891j2885j483037N89506
6695a869935n64678j536865K538861p38737O61274J506905r6646m83163j302859
$$ plain form
6686 -1885843 -1297944 771276 -1226210 -2332271 -3585916 -1646518 -1480435 -1665710 -816323
6677 -816323 315983 1928271 122051 32695 -620659 -356652 -1170058 -710002 1502448
6668 1502448 125983 -1420176 -2542445 -1693780 -970521 142195 978129 -1442062 -208575
6659 -208575 -1445676 -2820862 -1831753 824005 3174295 2734390 800379 -1375514 -1993015
6650 -1993015 -38295 -464082 -905733 -511741 -715672 -862278 -1653075 -457816 480637
6641 480637 -2093817 -3228592 -799560 -106889 45028 1083135 2486248 3927132 3189265
6632 3189265 418750 1709934 3655859 1061904 2590293 2260556 728939 1718544 1648860
6623 1648860 1364381 -600987 1073438 704200 1005970 -546700 -689641 -275133 -1901130
$$ packed form
6686a885843N87899K069220j997486j106061j253645J939398J66083j85275Q49387
6677h16323J132306J612288j806220q9356o53354K64007q13406M60056K212450
6668A502448j376465j546159j122269Q48665P23259J112716Q35934k420191J233487
6659b08575j237101j375186R89109K655758K350290m39905j934011k175893o17501
6650a993015J954720m25787m41651L93992k03931j46606p90797J195259R38453
6641D80637k574454j134775K429032O92671J51917J038107J403113J440884p37867
6632C189265k770515J291184J945925k593955J528389l29737j531617R89605o9684
6623A648860k84479j965368J674425l69238L01770j552670j42941M14508j625997
$$ plain form
6614 -1901130 -2692688 -832064 383927 1873681 66943 -1252355 -1884596 -2041532 -1091914
6605 -1091914 202518 -510131 -16246 1440179 2137173 339979 1718150 898986 -951131
6596 -951131 -1756797 -1884030 -173407 -662743 -384775 -1489965 -2001898 -1040377 -1614603
6587 -1614603 -1434548 1892774 3216919 1612410 -511021 340170 -409246 -45244 1411945
6578 1411945 2536813 2618065 1232226 1797511 1407773 1449863 1533296 1143774 1784545 -311732
6568 -311732 313238 -1249172 -694004 -715490 -1384439 464981 925861 1607176 1943673 1596399
6558 1596399 1556631 -1458361 -610414 1275915 1282175 1035388 427253 -607894 -1348974 -355387
6548 -355387 -905140 258618 -1529159 -1242965 208622 -859728 -9194 -247717 -1241127
$$ packed form
6614a901130p91558J860624J215991J489754j806738j319298o32241j56936R49618
6605a091914J294432p12649M93885J456425O96994j797194J378171q19164j850117
6596i51131q05666j27233J710623m89336K77968j105190n11933R61521n74226
6587a614603J80055L327322J324145j604509k123431Q51191p49416L64002J457189
6578A411945J124868Q1252j385839N65285l89738M2090Q3433l89522O40771k096277
6568c11732O24970j562410N55168k1486o68949J849420M60880O81315L36497l47274
6558A596399l9768l014992Q47947J886329O260k46787o08135j035147p41080R93587
6548c55387n49753J163758j787777K86194J451587j068350Q50534k38523r93410
$$ plain form
6539 -1241127 -520997 1674924 -1558006 -1765019 -3770355 -3855003 -1846105 -966008 -908719
6530 -908719 -1927048 -2465930 -1724558 -1468703 -1429201 -270971 -115981 -1647053 -472681
6521 -472681 -488651 -1372310 -840047 -285180 -41412 -1403393 -2714764 -2870925 -835742
6512 -835742 -501812 -1747381 -2147929 -2663660 -2319028 -2166306 -858916 -1084445 -1337312
6503 -1337312 45756 -555681 1038933 1090414 325048 -177550 -812507 -841477 -1189554 -964412
6493 -964412 239367 522451 559232 310170 -1256720 -1855337 -220818 202801 898160
6484 898160 -462706 -1029600 -1568498 927588 874533 -1790552 -2675618 -1520660 -2054607
6475 -2054607 -1524477 -901605 799284 309721 -2036808 -455022 -569841 -1467233 -1700109
$$ packed form
6539a241127P20130K195921l232930k07013k005336q4648K008898Q80097N7289
6530i08719j018329n38882P41372K55855L9502J158230J54990j531072J174372
6521d72681j5970q83659N32263N54867K43768j361981j311371j56161K035183
6512h35742L33930j245569m00548n15731L44632J52722J307390k25529k52867
6503a337312J383068o01437J594614N1481p65366n02598o34957k8970l48077K25142
6493i64412J203779K83084L6781k49062j566890n98617J634519M23619O95359
6484H98160j360866n66894n38898K496086n3055k665085q85066J154958n33947
6475b054607N30130O22872J700889m89563k346529J581786j14819q97392k32876
$$ plain form
6466 -1700109 -1418384 -2128431 -3702531 -2028041 -1265445 246948 -477111 -1897608 -2775946
6457 -2775946 -3175492 -3198167 -1700777 -199173 -1015515 747684 49768 -1229027 -1937101
6448 -1937101 533287 -255510 -849610 170892 -1221083 -1353513 49931 1264799 338156
6439 338156 -2114050 -2039856 1011400 627821 -777080 -457475 -1126997 -1668700 976653
6430 976653 323513 650118 596920 302896 -640504 -612625 -1408810 -1431448 -601625 -28946
6420 -28946 -267745 1211093 699635 -1537975 -2862937 -1666170 963564 -992570 550514
6411 550514 411416 -970571 -1613465 -1596322 -1423937 -1780488 -2161846 -545469 -680847 -1425238
6401 -1425238 -2221688 -839370 -161097 -71861 -76045 -2725132 -3320229 -2155808 -104693
$$ packed form
6466a700109K81725p10047j574100J674490P62596J512393p24059j420497q78338
6457b775946l99546k2675J497390J501604q16342J763199o97916j278795p08074
6448a937101K470388p88797n94100J020502j391975j32430J403444J214868r26643
6439C38156k452206P4194L051256l83579j404901L19605o69522n41703K645353
6430I76653o53140L26605n3198k94024r43400K7879p96185k2638Q29823N72679
6420b8946k38799J478838n11458k237610j324962J196767K629734j956134J543084
6411E50514j39098j381987o42894J7143J72385l56551l81358J616377j35378p44391
6401a425238p96450J382318O78273Q9236m184k649087n95097J164421K051115
$$ plain form
6392 -104693 -717083 -135495 -506775 479823 -690489 -771374 -349616 956354 46289 -1479972
6382 -1479972 -1282201 -1312376 595966 -1034627 -1377805 -2041268 -1661324 -1114176 2676068
6373 2676068 1686681 -231984 -971996 -861078 -1121627 -2137201 -2947428 -19667 307892
6364 307892 -899637 -1467657 199405 -568025 -1534208 370719 -6304 -109954 431877
6355 431877 -1003876 -2477422 -1132013 -217782 -982434 -1254912 -1801879 -1130808 -1763565
6346 -1763565 -1762980 -1711245 -1187693 -691297 -83402 1137899 1283983 1336946 1985877 -382405
6336 -382405 -1738417 -1419687 426350 171279 -601508 99422 -1075354 -1566329 -3321215
6327 -3321215 -2179193 -1393687 -1785931 -391345 398881 297410 755508 -239940 893020
$$ packed form
6392a04693o12390N81588l71280R86598j170312q0885M21758J305970r10065j526261
6382a479972J97771l0175J908342j630593l43178o63463L79944N47148L790244
6373B676068r89387j918665p40012J10918k60549j015574q10227K927761L27559
6364C07892j207529n68020J667062p67430r66183J904927l77023j03650N41831
6355D31877j435753j473546J345409R14231p64652k72478n46967O71071o32757
6346a763565N85N1735N23552M96396O07895J221301J46084N2963O48931k368282
6336c82405j356012L18730J846037k55071p72787P00930j174776m90975j754886
6327c321215J142022P85506l92244J394586P90226j01471M58098r95448J132960
$$ plain form
6318 893020 184969 420082 1940433 472038 691078 743669 1104176 1488660 491635 -797526
6308 -797526 284459 4223607 2222447 1849508 42327 1422069 308441 216932 250859
6299 250859 1349261 3222372 1580438 1067945 -355460 -127698 62128 -296405 -663584
6290 -663584 -899039 -647025 -848780 -92473 52729 -2297643 -1668063 2290958 2454717
6281 2454717 2140146 1909084 1117415 1344201 640361 384060 391257 -559670 -1696736 355214
6271 355214 1537590 438717 -101049 989772 695671 -1267355 -130129 199427 -3053282
6262 -3053282 -1431909 -689058 -1219741 -1825444 -1795708 -421207 119875 -982650 -357918
6253 -357918 849856 -360959 765542 1698947 650365 -732737 -735888 -986969 -26024
$$ packed form
6318H93020p08051K35113J520351j468395K19040N2591L60507L84484r97025j289161
6308g97526J081985L939148k001160l72939j807181J379742j113628r1509L3927
6299B50859J098402J873111j641934n12493j423405K27762J89826l58533l67179
6290f63584k35455K52014k01755P56307J45202k350372O29580L959021J63759
6281B454717l14571k31062p91669K26786p03840k56301P197r50927j137066K051950
6271C55214J182376j098873n39766J090821k94101j963026J137226L29556l252709
6262c053282J621373P42851n30683o05703K9736J374501N41082j102525O24732
6253c57918J207774j210815J126501R33405j048582j383102l151k51081R60945
$$ plain form
6244 -26024 26392 905308 2035849 1275124 512832 264035 -894380 991060 161474 311109
6234 311109 2014806 3438791 113446 -1676966 -578022 -1253445 -259038 1112794 1997721
6225 1997721 2129603 -16572 -662751 72015 -1342019 -1565742 -1624023 -18581 -191868
6216 -191868 -451262 -1028810 -2177965 -2763440 1057662 1060410 776773 1908222 2851652 2415571
6206 2415571 1751449 1402903 746578 905860 1513032 -486085 -1325054 -1402878 -615688 -741979
6196 -741979 -65722 380852 587258 2184291 3263303 1582004 -634229 -450831 -960920
$$ packed form
6244b6024N2416Q78916J130541p60725p62292k48797j158415J885440q29586J49635
6234C11109J703697J423985l325345j790412J098944o75423R94407J371832Q84927
6225A997721J31882k146175o46179P34766j414034k23723n8281J605442j73287
6216a91868k59394n77548j149155n85475L821102K748k83637J131449R43430m36081
6206B415571o64122l48546o56325J59282O07172j999117q38969p7824P87190j26291
6196g41979O76257M46574K06406J597033J079012j681299k216233J83398n10089
$$ [...]
##END NTUPLES=NMR SPECTRUM
##END=
