##TITLE=1H_CG-1188-E
 200.13MHz, CDCl3+DMSO,
 8 sc
 
 30.1.2025
##JCAMPDX= 6.0         $$ Bruker NMR JCAMP-DX V2.0
##DATA TYPE= NMR SPECTRUM
##DATA CLASS= NTUPLES
##ORIGIN= UXNMR, Bruker Analytische Messtechnik GmbH
##OWNER= pz
$$ XWIN-NMR		Version 3.5
$$ Thu Jan 30 14:32:18 2025 Russian Standard Time (UT+4h)  she@DPX200
##.OBSERVE FREQUENCY= 200.1313
##.OBSERVE NUCLEUS= ^1H
##.ACQUISITION MODE= SIMULTANEOUS
##.ACQUISITION SCHEME= undefined
##.AVERAGES= 8
##.DIGITISER RES= 18
##SPECTROMETER/DATA SYSTEM= spect
##.PULSE SEQUENCE= zg30
##.SOLVENT NAME= CDCl3
##.SHIFT REFERENCE= (INTERNAL, CDCl3, 0, 15.6081)
##AUDIT TRAIL= $$ (NUMBER, WHEN, WHO, WHERE, WHAT)
$$ ##TITLE= Audit trail, XWIN-NMR		Version 3.5
$$ ##JCAMPDX= 5.01
$$ ##ORIGIN= Bruker BioSpin GmbH
$$ ##OWNER= she
$$ F:/spectra/data/she/nmr/H-C/1/pdata/1/auditp.txt
$$ ##AUDIT TRAIL=  $$ (NUMBER, WHEN, WHO, WHERE, WHAT)
(   1,<2025-01-30 14:31:02.21 +0400>,<she>,<DPX200>,
      <created by zg, POWCHK disabled, PULCHK disabled
       configuration hash MD5:
       00 E9 B6 7A A2 85 ED C7 34 08 36 98 17 FE 4E 26
       data hash MD5: 16K
       9A 8B B0 4B 46 58 FD DD AB 67 8D EC 6D 3F 6E 60>)
(   2,<2025-01-30 14:31:04.31 +0400>,<she>,<DPX200>,
      <Start of raw data processing
       efp BC_mod = 2 LB = 0.25 FT_mod = 6 PKNL = 1 PHC0 = 252.133 PHC1 = 9.792221 SI = 16K 
       data hash MD5: 16K
       7B 26 84 36 AA E4 B3 A2 DD 69 4B 08 D8 02 CD 07>)
(   3,<2025-01-30 14:31:24.17 +0400>,<she>,<DPX200>,
      <pk PHC0 = -0.1796336 PHC1 = -0.8 
       data hash MD5: 16K
       77 80 A8 DE A2 02 14 A1 54 B0 EB 0D DB 48 5D CA>)
(   4,<2025-01-30 14:31:27.32 +0400>,<she>,<DPX200>,
      <abs ABSG = 5 
       data hash MD5: 16K
       13 91 53 FA 6E 26 4B A2 28 73 EF 94 00 1F D7 B6>)
$$ ##END=
$$ 
$$ hash MD5
$$ 53 E5 6C E3 83 AB CA E0 C2 CC 24 86 7C B8 46 75
##$RELAX= 
##$RELAX= 
##$RELAX= 
##$RELAX= 
##$RELAX= 
##$RELAX= 
$$ Bruker specific parameters
$$ --------------------------
##$DU= <F:/spectra>
##$EXPNO= 1
##$NAME= <H-C>
##$PROCNO= 1
##$TYPE= <nmr>
##$USER= <she>
##$AMP= (0..31)
100 100 100 100 100 100 100 100 100 100 100 100 100 100 100 100 100 100 
100 100 100 100 100 100 100 100 100 100 100 100 100 100 
##$AQSEQ= 0
##$AQ_mod= 1
##$AUNM= <au_zg>
##$AUTOPOS= <>
##$BF1= 200.13
##$BF2= 200.13
##$BF3= 200.13
##$BF4= 200.13
##$BF5= 200.13
##$BF6= 200.13
##$BF7= 200.13
##$BF8= 200.13
##$BYTORDA= 1
##$CFDGTYP= 0
##$CFRGTYP= 5
##$CHEMSTR= <none>
##$CNST= (0..31)
1 1 145 1 1 1 1 1 1 1 1 1 1 1 1 1 1 1 1 1 1 1 1 1 1 1 1 1 1 1 1 1 
##$CPDPRG= <>
##$CPDPRG1= <>
##$CPDPRG2= <>
##$CPDPRG3= <>
##$CPDPRG4= <mlev>
##$CPDPRG5= <mlev>
##$CPDPRG6= <mlev>
##$CPDPRG7= <mlev>
##$CPDPRG8= <mlev>
##$CPDPRGB= <>
##$CPDPRGT= <>
##$D= (0..31)
0 0.7 0 0 0 0 0 0 0 0 0 0.03 0 0 0 0 0 0 0 0 0 0 0 0 0 0 0 0 0 0 0 0 
##$DATE= 1738233061
##$DBL= (0..7)
120 120 120 120 120 120 120 120 
##$DBP= (0..7)
150 150 150 150 150 150 150 150 
##$DBP07= 0
##$DBPNAM0= <>
##$DBPNAM1= <>
##$DBPNAM2= <>
##$DBPNAM3= <>
##$DBPNAM4= <>
$$ [...]
##$SUBNAM3= <"">
##$SUBNAM4= <"">
##$SUBNAM5= <"">
##$SUBNAM6= <"">
##$SUBNAM7= <"">
##$SUBNAM8= <"">
##$SUBNAM9= <"">
##$SW= 18.0517328524113
##$SWIBOX= (0..15)
0 0 2 0 0 0 0 0 0 0 0 0 0 0 0 0 
##$SW_h= 3612.71676300578
##$TD= 16384
##$TD0= 1
##$TE= 0
##$TE2= 300
##$TE3= 300
##$TEG= 300
##$TL= (0..7)
0 120 120 120 120 120 120 120 
##$TP= (0..7)
150 150 150 150 150 150 150 150 
##$TP07= 0
##$TPNAME0= <>
##$TPNAME1= <>
##$TPNAME2= <>
##$TPNAME3= <>
##$TPNAME4= <>
##$TPNAME5= <>
##$TPNAME6= <>
##$TPNAME7= <>
##$TPOAL= (0..7)
0.5 0.5 0.5 0.5 0.5 0.5 0.5 0.5 
##$TPOFFS= (0..7)
0 0 0 0 0 0 0 0 
##$TUNHIN= 0
##$TUNHOUT= 0
##$TUNXOUT= 0
##$USERA1= <user>
##$USERA2= <user>
##$USERA3= <user>
##$USERA4= <user>
##$USERA5= <user>
##$V9= 5
##$VALIST= <valist>
##$VCLIST= <CCCCCCCCCCCCCCC>
##$VD= 0
##$VDLIST= <DDDDDDDDDDDDDDD>
##$VPLIST= <PPPPPPPPPPPPPPP>
##$VTLIST= <TTTTTTTTTTTTTTT>
##$WBST= 1024
##$WBSW= 4
##$XGAIN= (0..3)
0 0 0 0 
##$XL= 0
##$YL= 0
##$YMAX_a= 96897
##$YMIN_a= -124003
##$ZGOPTNS= <>
##$ZL1= 120
##$ZL2= 120
##$ZL3= 120
##$ZL4= 120
##$ABSF1= 15.6312
##$ABSF2= -2.420651
##$ABSG= 5
##$ABSL= 3
##$ALPHA= 0
##$AQORDER= 0
##$ASSFAC= 0
##$ASSFACI= 0
##$ASSFACX= 0
##$ASSWID= 0
##$AUNMP= <proc_1d>
##$AZFE= 0.1
##$AZFW= 0.1
##$BCFW= 0
##$BC_mod= 2
##$BYTORDP= 0
##$COROFFS= 0
##$CY= -3
##$DATMOD= 1
##$DC= 0
##$DFILT= <>
##$DTYPP= 0
##$F1P= 0
##$F2P= 0
##$FCOR= 1
##$FTSIZE= 16384
##$FT_mod= 6
##$GAMMA= 0
##$GB= 0
##$INTBC= 1
##$INTSCL= 3.241238e-09
##$ISEN= 128
##$LB= 0.25
##$LEV0= 0
##$LPBIN= 0
##$MAXI= 10000
##$MC2= 0
##$MEAN= 0
##$ME_mod= 0
##$MI= 1.114404
##$NCOEF= 0
##$NC_proc= -8
##$NLEV= 6
##$NOISF1= 3.799351
##$NOISF2= 2.8
##$NSP= 0
##$NTH_PI= 0
##$NZP= 0
##$OFFSET= 15.60806
##$PC= 1
##$PHC0= 251.9534
##$PHC1= 8.992221
##$PH_mod= 1
##$PKNL= yes
##$PPARMOD= 0
##$PSCAL= 0
##$PSIGN= 0
##$REVERSE= no
##$SF= 200.129982716844
##$SI= 16384
##$SIGF1= 3
##$SIGF2= 2
##$SINO= 0.751879
##$SIOLD= 32768
##$SREGLST= <19F.Aceton>
##$SSB= 0
##$STSI= 16384
##$STSR= 0
##$SW_p= 3612.71676300578
##$SYMM= 0
##$S_DEV= 0
##$TDeff= 16384
##$TDoff= 0
##$TI= <>
##$TILT= no
##$TM1= 0
##$TM2= 0
##$TOPLEV= 0
##$USERP1= <user>
##$USERP2= <user>
##$USERP3= <user>
##$USERP4= <user>
##$USERP5= <user>
##$WDW= 1
##$XDIM= 16384
##$YMAX_p= 469818841
##$YMIN_p= -5117043
$$ End of Bruker specific parameters
$$ ---------------------------------
##NTUPLES= NMR SPECTRUM
##VAR_NAME=  FREQUENCY,     SPECTRUM/REAL,   SPECTRUM/IMAG
##SYMBOL=    X,             R,               I
##VAR_TYPE=  INDEPENDENT,   DEPENDENT,       DEPENDENT
##VAR_FORM=  AFFN,          ASDF,            ASDF
##VAR_DIM=   16384,         16384,           16384
##UNITS=     HZ,            ARBITRARY UNITS, ARBITRARY UNITS
##FACTOR=    0.220516191357247, 1,           1
##FIRST=     3123.64075465181, 0,            0
##LAST=      -489.076008353974, 0,           0
##MIN=       -489.076008353974, -5117043,    0
##MAX=       3123.64075465181, 469818841,    0
$$ Real data points
##PAGE= N=1
##DATA TABLE= (X++(R..R)), XYDATA
$$ [...]
$$ plain form
7713 -236836 -445015 -228987 -711266 -1044226 -541178 -308081 127884 -7366 -418959 59943
7703 59943 571382 -29314 261984 -218040 -855719 -374995 -277772 -350504 133544 184329
7693 184329 -39581 -285156 -205230 -144339 225572 203199 112103 -487690 -701807 -479582
7683 -479582 211067 274419 -315045 -317017 -313314 -753800 -499288 -543736 -401356 -347517 -741351
7672 -741351 -622969 -634518 -503114 85579 467542 120608 -779771 -1670498 -1195677 -573598
7662 -573598 -272307 -72857 -692889 -1421085 -1102551 -947448 -1198888 -1131192 -996504 -550428
7652 -550428 -222320 -257267 -173707 -680880 -392766 -511841 -18945 -1307331 -1215420 -724870
7642 -724870 -823585 -559094 -727467 -549730 -439728 -311566 -484857 -156778 -152353 101849
$$ packed form
7713b36836k08179K16028m82279l32960N03048K33097M35965j35250m11593M78902
7703E9943N11439o00696K91298m80024o37679M80724R7223p2732M84048N0785
7693A84329k23910k45575P9926O0891L69911k2373r1096n99793k14117K22225
7683d79582O90649O3352n89464j972L703m40486K54512m4448J42380N3839l93834
7672g41351J18382j1549J31404N88693L81963l46934r00379q90727M74821O22079
7662e73598L01291J99450o20032p28196L18534J55103k51440O7696J34688M46076
7652e50428L28108l4947Q3560n07173K88114j19075M92896j288386R1911M90550
7642g24870r8715K64491j68373J77737J10002J28162j73291L28079M425K54202
$$ plain form
7632 101849 -59924 -158840 -288003 -946757 -818562 -210401 -429977 -378255 -101961 128389
7622 128389 -377428 -774207 -585707 121335 462597 539405 67541 95214 294239 440594
7612 440594 -66026 -655032 -382304 -186789 -460529 -785336 -1210552 -360494 -287003 23984
7602 23984 -356820 -158101 -398169 -488022 380833 335783 485316 -130411 -119809 48447
7592 48447 163523 296554 802146 633948 391132 458571 -209161 -342279 95782 378402
7582 378402 -99614 -740713 -529708 -150950 -478377 -482969 -172986 -650790 -477034 -261695
7572 -261695 -114219 -381213 -152807 -144661 -602059 -794961 -590308 -338994 -391946 -215091
7562 -215091 335330 356918 98338 71578 -847565 -167374 603168 501992 535378 339133
$$ packed form
7632A01849j61773r8916j29163o58754J28195O08161k19576N1722K76294K30350
7622A28389n05817l96779J88500P07042L41262P6808m71864K7673J99025J46355
7612D40594n06620n89006K72728J95515k73740l24807m25216Q50058P3491L10987
7602B3984l80804J98719k40068q9853Q68855m5050J49533o15727J0602J68256
7592D8447J15076J33031N05592j68198k42816O7439o67732j33118M38061K82620
7582C78402m78016o41099K11005L78758l27427m592L09983m77804J73756K15339
7572b61695J47476k66994K28406Q146m57398j92902K04653K51314n2952J76855
7562b15091N50421K1588k58580k6760r19143O80191P70542j01176L3386j96245
$$ plain form
7552 339133 421233 -16409 -157968 179795 302652 185003 816057 428664 54255 42626
7542 42626 -42247 -252803 -443336 -720425 -311359 287249 -32392 -119520 -329317 -363023
7532 -363023 139387 211058 287727 269079 36174 264307 112633 -682952 -785083 -20531
7522 -20531 470929 775291 158243 -286926 646828 592484 380777 -524812 -1021224 -416432
7512 -416432 -330848 -564740 250418 346363 381555 -724580 -944831 -698381 -1122694 -400054
7502 -400054 129153 -80417 -264084 -276009 -726139 -346574 -152053 -198734 -260655 -83363
7492 -83363 -249699 -1246 -779307 -1066604 -949807 -254177 -95443 -138795 -38825 -279862
7482 -279862 -186631 -259405 287798 159570 600534 110117 -46977 617636 342213 173559
$$ packed form
7552C39133Q2100m37642j41559L37763J22857j17649O31054l87393l74409j1629
7542D2626q4873k10556j90533k77089M09066N98608l19641q7128k09797l3706
7532c63023N02410P1671P6669j8648k32905K28133j51674p95585j02131P64552
7522b0531M91460L04362o17048m45169R33754n4344k11707r05589m96412O04792
7512d16432Q5584k33892Q15158R5945L5192j106135k20251K46450m24313P22640
7502d00054N29207k09570j83667j1925m50130L79565J94521m6681o1921J77292
7492h3363j66336K48453p78061k87297J16797O95630J58734m3352R9970k41037
7482b79862R3231p2774N47203j28228M40964m90417j57094O64613k75423j68654
$$ plain form
7472 173559 -243695 -407177 -601699 -566115 -381509 -260662 -418421 -220497 -801806 -870229
7462 -870229 -452927 -1387901 -532395 62985 -312179 -356405 -114034 258354 -47351 -248988
7452 -248988 -367316 -423911 174431 680832 39306 -643294 -910419 -536173 -860514 -332866
7442 -332866 694397 -124591 -652464 -318335 -236729 -612213 -785936 -540944 -383435 -398931
7432 -398931 -236024 41509 -481128 -743122 -996910 -920227 -890862 -1084098 -897682 -990668
7422 -990668 -395146 253853 405224 -286092 3874 -98035 -577646 -49468 -618840 -543895
7412 -543895 -591388 -551388 -469392 -527695 -378546 -557690 -59267 159770 -173522 83251
7402 83251 81759 239290 -255099 -247639 29723 354854 702155 235502 21346 -214798 127716
$$ packed form
7472A73559m17254j63482j94522L5584J84606J20847j57759J97924n81309o8423
7462h70229M17302r34974Q55506N95380l75164m4226K42371L72388l05705k01637
7452b48988j18328n6595N98342N06401o41526o82600k67125L74246l24341N27648
7442c32866J027263q18988n27873L34129Q1606l75484j73723K44992J57509j5496
7432c98931J62907K77533n22637k61994k53788P6683K9365j93236J86416r2986
7422i90668N95522O48999J51371o91316K89966j01909m79611N28178n69372P4945
7412e43895m7493M0000Q1996n8303J49149j79144M98423K19037l33292K56773
7402H3251j492J57531m94389P460K77362L25131L47301m66653k14156k36144L42514
$$ plain form
7391 127716 144871 -73926 81324 -95963 136272 -373687 -602010 -379292 66663 27387
7381 27387 327687 693374 122134 -65243 191679 524800 325781 35375 -169911 -68401
7371 -68401 -323661 -742314 -564651 -528775 -158200 -632425 -914012 -129696 -15937 128866
7361 128866 323327 265477 -134993 -365060 -368190 357170 228968 -427098 14456 722948
7351 722948 113567 120699 181843 -135185 -836874 -27009 193656 175749 -171244 -682621
7341 -682621 -754476 -92043 501347 683798 -163382 -713373 -786238 -673608 -58525 43941
7331 43941 -204103 -517933 -273456 301764 577761 19259 298364 -276452 7841 270838
7321 270838 422412 438770 -445506 -798213 -524062 -472794 -465804 -340368 279733 55131
$$ packed form
7391A27716J7155k18797J55250j77287K32235n09959k28323K22718M45955l9276
7381B7387L00300L65687n71240j87377K56922L33121j99019k90406k05286J01510
7371f8401k55260m18653J77663L5876L70575m74225k81587P84316J13759J44803
7361A28866J94461n7850m00470k30067l130P25360j28202o56066M41554P08492
7351G22948o09381P132O1144l17028p01689Q09865K20665j7907l46993n11377
7341f82621p1855O62433N93390J82451q47180n49991p2865J12630O15083J02466
7331D3941k48044l13830K44477N75220K75997n58502K79105n74816K84293K62997
7321B70838J51574J6358q84276l52707K74151N1268O990J25436O20101k24602
$$ plain form
7311 55131 -167827 -452522 -807050 -372584 -860944 -566634 -494175 -402868 -239618 -671943
7301 -671943 -516641 -426618 -622264 -403206 8988 -221021 -136313 -108893 -160770 -245518 238087
7290 238087 -125525 -309255 -180621 -286754 -404130 -791831 -598655 -345091 -419724 -370731
7280 -370731 -163218 86776 -69912 15180 168151 239646 118320 382149 -146616 -565693
7270 -565693 -506351 -392669 -20746 800602 304019 -543881 -62970 -514162 341954 229981
7260 229981 -134198 -59052 -51508 -258991 -20401 372435 931819 -194682 -368958 50606
7250 50606 -202512 -154358 -401761 -529146 -654794 -731745 -320032 -275037 -80216 -99998 -399397
7239 -399397 -387351 -444530 -294308 -282993 -825606 -620883 -375047 232881 7374 -244192
$$ packed form
7311E5131k22958k84695l54528M34466m88360K94310P2459R1307J63250m32325
7301f71943J55302R0023j95646K19058M12194k30009Q4708K7420n1877q4748M83605
7290B38087l63612j83730J28634j06133j17376l87701J93176K53564p4633M8993
7280c70731K07513K49994j56688Q5092J52971P1495j21326K63829n28765m19077
7270e65693N9342J13682L71923Q21348m96583q47900M80911m51192Q56116j11973
7260B29981l64179P5146P544k07483K38590L92836N59384j126501j74276M19564
7250E0606k53118M8154k47403j27385j25648p6951M11713M4995J94821j9782k99399
7239c99397J2046n7179J50222J1315n42613K04723K45836O07928k25507k51566
$$ plain form
7229 -244192 -562734 -681720 -520480 -879985 -694626 -425135 -429461 -501220 67238 143322
7219 143322 -122197 253497 273935 125405 81919 167970 -272677 -801803 104555 53144
7209 53144 -125234 -344827 -456564 -700803 -763784 -1085576 -898991 -781570 -43537 -341743
7199 -341743 -419167 -400942 -250017 362498 282844 -468937 -168032 -248429 -625699 -1256273
7189 -1256273 -756538 -242610 294196 156186 784640 181684 -45075 272333 -281358 -310070
7179 -310070 -829899 -862761 -944756 -984064 -830446 -595490 66767 421735 156526 133863
7169 133863 -448456 -363931 155844 14007 -126563 -576210 -572055 -540713 -1028899 -593318
7159 -593318 -658471 -357517 -501837 -89505 -388476 -356521 -153926 -27680 69199 -21142
$$ packed form
7229b44192l18542j18986J61240l59505J85359K69491m326p1759N68458P6084
7219A43322k65519L75694K0438j48530m3486Q6051m40647n29126R06358n1411
7209E3144j78378k19593j11737k44239o2981l21792J86585J17421P38033k98206
7199c41743p7424J8225J50925O12515p9654p51781L00905q0397l77270o30574
7189a256273M99735N13928N36806j38010O28454o02956k26759L17408n53691k8712
7179c10070n19829l2862q1995l9308J53618K34956O62257L54968k65209k2663
7169A33863n82319Q4525N19775j41837j40570m49647M155L1342m88186M35581
7159e93318o5153L00954j44320M12332k98971L1955K02595J26246R6879r0341
$$ plain form
7149 -21142 272375 -408423 -236520 202024 -578415 -773398 -624086 -17232 214143 -487411
7139 -487411 -997198 -604510 -139543 18477 -256434 -663797 -275704 69234 -785 -194458
7129 -194458 -66157 -31585 52361 -65814 -396440 -571142 -802283 -410753 -764819 -622329
7119 -622329 -150665 -675097 -1092875 -833191 -799122 -838284 -972226 -403324 -806254 -689303
7109 -689303 -56610 483024 301048 -366990 23989 174550 345850 20586 -586845 -718423
7099 -718423 -304640 205181 167384 408761 455975 516316 100194 214047 185997 75438
7089 75438 -196045 -954128 -912326 -814067 -703999 119978 -108737 293616 556934 420433
7079 420433 645197 253008 4913 -119587 467159 126698 -536613 -612976 -217126 -615546
$$ packed form
7149b1142K93517o80798J71903M38544p80439j94983J49312O06854K31375p01554
7139d87411n09787L92688M64967J58020k74911m07363L88093L44938p0019j93673
7129a94458J28301L4572Q3946j18175l30626j74702k31141L91530l54066J42490
7119f22329M71664n24432m17778K59684L4069l9162j33942N68902m02930J16951
7109f89303O32693N39634j81976o68038L90979J50561J71300l25264o07431j31578
7099g18423M13783N09821l7797K41377M7214O0341m16122J13853k8050j10559
7089G5438k71483p58083M1802R8259J10068Q23977k28715M02353K63318j36501
7079D20433K24764l92189k48095j24500N86746l40461o63311p6363L95850l98420
$$ plain form
7069 -615546 -706784 -822097 -533305 257259 -195614 52679 -128355 -739443 -556320 -699224
7059 -699224 -564348 -196793 93274 277382 275202 111726 224728 141227 -626258 -807810
7049 -807810 -626957 -536245 -328494 -286161 -44610 -503561 -854991 -892410 -1062341 -777828
7039 -777828 -955075 -432483 211645 -46228 146268 -25351 273397 424399 228074 -165186
7029 -165186 -391700 -468924 -961293 -189701 217569 -1010967 -1139540 -251196 -86535 -176433
7019 -176433 -425545 -76278 446798 98977 -69424 -202736 7082 150112 302901 -217422
7009 -217422 -450313 -441280 -258830 -169905 24015 -262435 74883 214218 168135 -209354
6999 -209354 -559148 171160 -94459 -504486 -935519 -928277 -612709 -631089 -481422 -437371
$$ packed form
7069f15546r1238j15313K88792P90564m52873K48293j81034o11088J83123j42904
7059f99224J34876L67555K90067J84108k180j63476J13002q3501p67485j81552
7049h07810J80853R0712K07751M2333K41551m58951l51430l7419j69931K84513
7039g77828j77247N22592O44128k57873J92496j71619K98748J51002j96325l93260
7029a65186k26514p7224m92369P71592M07270j228536j28573Q88344J64661q9898
7019a76433k49112L49267N23076l47821j68401j33312K09818J43030J52789n20323
7009b17422k32891R033J82450Q8925J93920k86450L37318J39335m6083l77489
6999b09354l49794P30308k65619m10027m31033P242L15568j8380J49667M4051
$$ plain form
6989 -437371 -324400 -750843 -612524 -1021548 -140364 161428 466848 -115119 -575866 -340008
6979 -340008 -764134 -718737 -371646 -168290 -216272 -758535 -927523 -168398 -194659 -244243
6969 -244243 -340957 -101808 -12067 145761 -262054 -530077 465432 303860 -96986 -429248
6959 -429248 -479996 -348689 23913 496160 331082 97694 -432158 -106545 -684228 -158839
6949 -158839 -141471 223930 146363 169685 -197858 -434048 -601191 -36800 -173630 -297735
6939 -297735 125155 -182059 -227719 -63497 -384164 86794 307618 -789414 -441576 -490796
6929 -490796 -1189339 -103527 -125837 -267825 -248933 -361638 573830 946810 448792 6683
6919 6683 92668 -24439 -710534 -719424 -725224 -703502 126815 12945 48414 -217705 -124723
$$ packed form
6989d37371J12971m26443J38319m09024Q81184L01792L05420n81967m60747K35858
6979c40008m24126M5397L47091K03356m7982n42263j68988P59125k6261m9584
6969b44243r6714K39149Q9741J57828m07815k68023R95509j61572m00846l32262
6959d29248n0748J31307L72602M72247j65078k33388n29852L25613n77683N25389
6949a58839J7368L65401p7567K3322l67543k36190j67143N64391j36830j24105
6939b97735M22890l07214m5660J64222l20667M70958K20824j097032L47838m9220
6929d90796o98543J085812k2310j41988J8892j12705R35468L72980m98018m42109
6919F683Q5985j17107o86095q890n800K1722Q30317j13870L5469k66119R2982
$$ plain form
6908 -124723 -461995 -717549 -770072 -464327 110054 -303228 -105670 390570 180496 61789
6898 61789 508705 364212 268200 -267168 1269 -315834 -1078805 -515001 -241317 420510
6888 420510 195132 846274 467706 -740337 -754217 96641 121431 -170721 -89835 488759
6878 488759 -235472 -129988 -267633 -364893 250315 -297963 -284196 -403337 -344355 -518336
6868 -518336 -280140 -676607 64944 -138912 -421599 -1009580 -454071 -384585 -285652 -502431
6858 -502431 18127 256518 -193194 -135666 310931 153445 -134222 860939 332022 -269171
6848 -269171 -300657 -120015 -678409 -682425 -828181 -823223 -510067 -271453 -1144586 -958910 -765222
6837 -765222 -527308 -200055 -28243 184633 177578 -343445 157788 330185 -131474 -79946
$$ packed form
6908a24723l37272k55554n2523L05745N74381m13282J97558M96240k10074j18707
6898F1789M46916j44493r6012n35368K68437l17103p62971N63804K73684O61827
6888D20510k25378O51142l78568j208043j3880Q50858K4790k92152Q0886N78594
6878D88759p24231J05484j37645r7260O15208n48278J3767j19141N8982j73981
6868e18336K38196l96467P41551k03856k82687n87981N55509O9486R8933k16779
6858e02431N20558K38391m49712N7528M46597j57486k87667R95161n28917o01193
6848b69171l1486J80642n58394m016j45756M958L13156K38614q73133J85676J93688
6837g65222K37914L27253J71812K12876p055n21023N01233J72397m61659N1528
$$ plain form
6827 -79946 -457957 -651820 -229605 51021 16027 471134 228577 14715 497063 572326
6817 572326 386836 86559 142585 -108015 -98664 -283814 -104346 -415021 -856680 -670425
6807 -670425 -93172 -269863 -613605 -1189547 -821428 43635 -101606 502579 132427 -699667
6797 -699667 -775442 -238414 -44130 -504801 -528759 -375141 -359470 -124641 -299607 -92020
6787 -92020 -642192 -516752 -456419 -502660 -212892 94026 -647957 -715182 -423117 -977802
6777 -977802 -603412 -520668 -802915 -1148652 -481220 107689 87977 -447439 -202483 228741
6767 228741 334082 496627 509912 704250 1019127 862871 771709 154527 141714 -10388
6757 -10388 -182294 285103 168095 -76896 -286108 -185085 -165131 -340108 148057 -27256
$$ packed form
6827g9946l78011j93863M22215K80626l4994M55107k42557k13862M82348P5263
6817E72326j85490l00277N6026k50600R351j85150J79468l10675m41659J86255
6807f70425N77253j76691l43742n75942L68119Q65063j45241O04185l70152q32094
6797f99667p5775N37028J94284m60671k3958J53618J5671K34829j74966K07587
6787i2020n50172J25440O0333m6241K89768L06918p41983o7225K92065n54685
6777i77802L74390Q2744k82247l45737O67432N88909j9712n35416K44956M31224
6767B28741J05341J62545J3285J94338L14877j56256r1162o17182j2813j52102
6757a0388j71906M67397j17008k44991k09212J01023J9954j74977M88165j75313
$$ plain form
6747 -27256 -6068 -398098 -910317 -309999 -407104 -554630 2957 607141 383967 112402
6737 112402 -444100 -689240 -745327 -149270 43784 -109662 -424097 -343375 -411 -428063
6727 -428063 -652776 -162930 -164783 -468108 428693 252705 -15495 -246064 -750001 -447505
6717 -447505 -429092 -286560 -330054 -299471 286268 -175257 -960726 -14034 413724 72945
6707 72945 -93329 -172586 -251461 248233 667293 682885 252744 400985 -391867 -110115
6697 -110115 528786 170241 -228440 -514262 -356449 -13870 -5958 -221856 -560076 -556835
6687 -556835 -930072 -933769 -644297 -523448 -595833 -153208 -286463 -361924 95172 178549 418803
6676 418803 -383694 -75860 267845 -1023585 -1333754 -450000 274514 -300535 -571410 -537522
$$ packed form
6747b7256K1188l92030n12219O00318r7105j47526N57587O04184k23174k71565
6737A12402n56502k45140n6087N96057J93054j53446l14435Q0722L42964m27652
6727d28063k24713M89846j853l03325Q96801j75988k68200k30569n03937L02496
6717d47505J8413J42532m3494L0583N85739m61525p85469R46692M27758l40779
6707G2945j66274p9257p8875M99694M19060J5592m30141J48241p92852K81752
6697a10115O38901l58545l98681k85822J57813L42579P912k15898l38220L241
6687e56835l73237l697K89472J20849p2385M42625j33255p5461M57096Q3377K40254
6676D18803q02497L07834L43705j291430l10169Q83754P24514n75049k70875L3888
$$ plain form
6666 -537522 -304222 -356797 -154442 298979 -75123 283006 257376 -86250 -575116 -77137
6656 -77137 145042 -28294 202735 1000134 48541 -217434 -81816 -135451 249051 501117
6646 501117 658909 201625 -174656 -266423 134492 1203443 784018 256071 649606 412437
6636 412437 -215548 -628304 -333902 -21396 -100603 -46685 -326146 114732 -146165 -203292
6626 -203292 -440997 -1021023 -638495 -1034761 -65992 -221516 -945101 -466763 -474984 -289077
6616 -289077 -224690 -265598 -276585 -219733 -258415 -624817 -299801 114104 -370380 -27337 -10740
6605 -10740 -35105 -119254 -1133 -92255 119498 -96473 -1179364 -430461 -110479 -590574
6595 -590574 322546 145416 40833 43833 -488509 -97145 -458857 -126422 -151043 242064
$$ packed form
6666e37522K33300n2575K02355M53421l74102L58129k5630l43626m88866M97979
6656g7137K22179j73336K31029P97399r51593k65975J35618n3635L84502K52066
6646E01117J57792m57284l76281r1767M00915J068951m19425n27947L93535k37169
6636D12437o27985m12756K94402L12506p9207N3918k79461M40878k60897n7127
6626b03292k37705n80026L82528l96266R68769j55524p23585M78338q221J85907
6616b89077O4387m0908j0987N6852l8682l66402L25016M13905m84484L43043J6597
6605a0740k4365q4149J18121r1122K11753k15971j082891P48903L19982m80095
6595e90574R13120j77130j04583L000n32342L91364l61712L32435k4621L93107
$$ plain form
6585 242064 497768 253912 -457562 -321785 -112716 -281123 96911 6598 284643 388629
6575 388629 559427 316945 197423 194918 -332429 -587621 -457308 -800077 -927658 -678540
6565 -678540 -15150 13223 622516 608480 -163873 643873 -115177 -126780 -918612 -960699
6555 -960699 -220634 -645891 -997446 -463835 -112108 -109074 12364 -218816 -485413 -913848
6545 -913848 -325096 48722 -445719 -527888 -78204 -94739 -215944 -516191 -580703 -99905
6535 -99905 277856 -282101 56257 -99058 -170623 -129597 -117429 -479994 -642444 -438947
6525 -438947 -935309 -534086 20189 462002 220362 113599 231049 -65963 -273511 -472533
6515 -472533 -183833 -683131 -72749 -44841 173151 -35027 -383648 296594 -191324 -103886
$$ packed form
6585B42064K55704k43856p11474J35777K09069j68407L78034r0313K78045J03986
6575C88629J70798k42482j19522k505n27347k55192J30313l42769j27581K49118
6565f78540O63390K8373O09293j4036p72353Q07746p59050j1603p91832m2087
6555i60699P40065m25257l51555N33611L51727L034J21438k31180k66597m28435
6545i13848N88752L73818m94441q2169M49684j6535j21205l00247o4512M80798
6535i9905L77761n59957L38358j55315p1565M1026J2168l62565j62450K03497
6525d38947m96362M01223N54275M41813k41640j06763J17450k97012k07548j99022
6515d72533K88700m99298O10382K7908K17992k08178l48621O80242m87918Q7438
$$ plain form
6505 -103886 30398 344303 318586 -210535 -633197 -479300 -912995 -297053 515628 -434173
6495 -434173 -295096 743393 771454 642046 365955 -158593 -227105 81783 205735 299927
6485 299927 326080 -92496 -478568 499194 611781 177435 -136086 -684814 -589125 -24899
6475 -24899 -90290 -560721 -570152 72398 -545092 -287145 -74467 50962 -191877 -156701 -40425
6464 -40425 230431 -153159 -513493 191814 470643 669826 693115 -245594 -499482 7444
6454 7444 53260 373587 770036 489656 161799 -130581 -193463 -476041 -756848 -804331 -433959
6443 -433959 -15688 -471940 -138222 -454790 202404 35622 162915 574143 600546 98906
6433 98906 -30923 66950 403784 -84118 243816 5676 -86509 339414 130265 260782
$$ packed form
6505a03886J34284L13905k5717n29121m22662J53897m33695O15942Q12681r49801
6495d34173J39077J038489K8061j29408k76091n24548o8512L08888J23952R4192
6485B99927K6153m18576l86072R77762J12587m34346l13521n48728R5689N64226
6475b4899o5391m70431r431O42550o17490K57947K12678J25429k42839L5176J16276
6464d0425K70856l83590l60334P05307K78829J99183K3289r38709k53888N06926
6454G444M5816L20327L96449k80380l27857k92380o2882k82578k80807m7483L70372
6443d33959M18271m56252L33718l16568O57194j66782J27293M11228K6403n01640
6433I8906j29829R7873L36834m87902L27934k38140r2185M25923k09149J30517
$$ plain form
6423 260782 504867 399757 403258 -98670 144289 156930 332468 117096 -253883 -115165
6413 -115165 453343 689334 619794 353098 89813 129672 -71567 -259600 -373632 -68484
6403 -68484 -113562 50803 -733180 -208205 63308 -35583 -46897 -316506 -524447 -243441
6393 -243441 149112 381808 -76050 328949 -702629 -684222 -276782 12341 147654 -79604
6383 -79604 -11994 -428265 -900591 -652861 -647866 -646607 -168643 -282673 218836 113622 333619
6372 333619 334935 -49074 -118397 -438388 173521 -27416 -427981 332665 3335 -390123
6362 -390123 -201573 125207 -447788 20696 391093 23278 154699 794207 213842 -260172
6352 -260172 -396339 -727587 -561781 -862875 -1094023 -516797 -283150 -144699 56088 -312499
$$ packed form
6423B60782K44085j05110L501n01928K42959J2641J75538k15372l70979J38718
6413a15165N68508K35991o9540k66696k63285L9859k01239j88033j14032L05148
6403f8484m5078J64365p83983N24975K71513r8891j1314k69609k07941K81006
6393b43441L92553K32696m57858M04999j031578J8407M07440K89123J35313k27258
6383g9604O7610m16271m72326K47730M995J259M77964j14030N01509j05214K19997
6372C33619J316l84009o9323l19991O11909k00937m00565P60646l29330l93458
6362c90123J88550L26780n72995M68484L70397l67815J31421O39508n80365m74014
6352b60172j36167l31248J65806l01094k31148N77226K33647J38451K00787l68587
$$ plain form
6342 -312499 -1097787 -467799 20027 -7597 240269 42244 27953 -434768 -375862 -466137
6332 -466137 -207987 -350808 -564674 -140579 69464 -387333 -73653 851089 983322 861960
6322 861960 415205 -81999 -58689 -222655 -416583 -711515 -781797 -225938 -424900 -225680
6312 -225680 612681 38989 134129 551988 671098 741490 -211570 -62456 -470504 -644644
6302 -644644 -116070 -225776 72286 28955 -746985 -131799 556458 267754 -305951 -351615
6292 -351615 -349739 -32965 -306004 20580 450155 150485 -247097 -425012 -356157 -426258
6282 -426258 -398863 -493159 -373793 -64956 -126522 -361948 63621 -69806 -287379 -536834
6272 -536834 -23514 -744337 -366782 178438 209271 422963 -558885 -246818 79255 -596994
$$ packed form
6342c12499p85288O29988M87826k7624K47866j98025j4291m62721N8906r0275
6332d66137K58150j42821k13866M24095K10043m56797L13680R24742J32233j21362
6322H61960m46755m97204K3310j63966j93928k94932p0282N55859j98962J99220
6312b25680Q38361n73692R5140M17859J19110P0392r53060J49114m08048j74140
6302f44644N28574j09706K98062m3331p75940O15186O88257k88704n73705m5664
6292c51615J876L16774k73039L26584M29575k99670l97582j77915O8855p0101
6282d26258K7395r4296J19366L08837o1566k35426M25569j33427k17573k49455
6272e36834N13320p20823L77555N45220L0833K13692r81848L12067L26073o76249
$$ plain form
6262 -596994 -118202 -419 -566006 -550729 197857 188250 157219 -269222 -359500 -341346 -277264
6251 -277264 -404358 -244597 -152488 -671194 22257 201801 50432 -276849 -336012 -213292
6241 -213292 500106 100775 -420116 543652 143122 -126156 313451 308816 27340 -977033
6231 -977033 -550574 -707515 -375917 -188096 -381413 333684 25870 -49773 -265830 -464286
6221 -464286 -437439 -504406 -22350 305218 -749314 -539062 -421872 -615485 -131158 341637
6211 341637 196853 152924 674224 143879 -180490 400917 329892 -224888 -687474 -260573
6201 -260573 -441873 -533610 -556414 -866563 -583163 -739564 -424852 -307525 -231030 -989463
6191 -989463 -516485 -69570 -603526 -53700 -57560 -433952 -224731 113142 -84736 -206091
$$ packed form
6262e96994M78792J17783n65587J5277P48586r607l1031m26441r0278J8154O4082
6251b77264j27094J59761R2109n18706O93451J79544j51369l27281n9163J22720
6241b13292P13398l99331n20891R63768m00530k69278M39607m635k81476j004373
6231i77033M26459j56941L31598J87821j93317P15097l07814p5643k16057j98456
6221d64286K6847o6967M82056L27568j054532K10252J17190j93613M84327M72795
6211C41637j44784m3929N21300n30345l24369N81407p1025n54780m62586M26901
6201b60573j81300r1737k2804l10149K83400j56401L14712J17327P6495p58433
6191i89463M72978M46915n33956N49826l860l76392K09221L37873j97878j21355
$$ plain form
6181 -206091 300293 296405 -330227 -484419 -285696 -247109 -401399 -405347 -254268 -216306 127360
6170 127360 250631 391840 -113426 -638508 -603786 -684600 -41314 198349 185813 271938
6160 271938 -167852 -1324406 -1251586 -900675 -399773 -665539 -841214 -56840 111711 318450
6150 318450 -449261 -406265 -276045 332444 294486 -121203 -534784 -854602 -163798 -49951
6140 -49951 -165979 -379865 -361711 -558772 -348693 -138705 -182574 62377 41239 75074 -47302
6129 -47302 -284194 -191324 31965 192646 190737 -198536 302711 89343 -166017 -259828 -311676
6118 -311676 -233329 -511676 -334141 -301057 -565031 404127 622518 352757 125176 -2762
6108 -2762 -45722 -264341 -80894 312919 -118398 -456978 144362 118561 -247663 251568
$$ packed form
6181b06091N06384l888o26632j54192J98723L8587j54290l948J51079L7962L43666
6170A27360J23271J41209n05266n25082L4722q0814O43286K39663j2536Q6125
6160B71938m39790j156554P2820L50911N00902k65766j75675P84374J68551K06739
6150C18450p67711M2996J30220O08489l7958m15689m13581l19818O90804J13847
6140d9951j16028k13886J8154j97061K10079K09988m3869K44951k1138L3835j22376
6129d7302k36892R2870K23289J60681j909l89273N01247k13368k55360r3811n1848
6118c11676P8347k78347J77535L3084k63974R69158K18391k69761k27581j27938
6108b762m2960k18619J83447L93813m31317l38580O01340k5801l66224M99231
$$ plain form
6098 251568 402674 187779 -1100 106935 -106552 7775 255217 227047 418550 -147252
6088 -147252 -345572 -136396 230513 -78721 -611058 -632310 -359588 32055 -250932 264694
6078 264694 966108 1031656 593048 -64600 431158 251012 6294 219972 332740 -92925
6068 -92925 -317879 -192927 -237790 74551 108547 250702 362229 218181 -46441 -224723
6058 -224723 -445440 -813319 136802 -62158 -362272 -435535 -176924 -190 345163 381563
6048 381563 250987 54650 -118581 -778717 -8440 512710 4868 -131197 79103 -150853
6038 -150853 -64952 -15454 -32666 -531105 -209452 550563 479427 76061 -183009 88405
6028 88405 -378393 133493 115119 481411 260338 -611693 -664398 -443601 -203127 -272810
$$ packed form
6098B51568J51106k14895j88879J08035k13487J14327K47442k8170J91503n65802
6088a47252j98320K09176L66909l09234n32337k1252K72722L91643k82987N15626
6078B64694P01414O5548m38608o57648M95758j80146k44718K13678J12768m25665
6068i2925k24954J24952m4863L12341L3996J42155J11527j44048k64622j78282
6058b24723k20717l67879R50121j98960l00114p3263K58611J76734L45353L6400
6048C81563j30576j96337j73231o60136P70277N21150n07842j36065K10300k29956
6038a50853Q5901M9498j7212m98439L21653P60015p1136m03366k59070K71414
6028H8405m66798N11886j8374L66292k21073q72031n2705K20797K40474o9683
$$ plain form
6018 -272810 -114369 -176544 -161733 278739 -120150 228910 110087 -112952 -124166 -149997
6008 -149997 -592706 -407840 -1859 424256 656665 556584 210573 -311450 314195 579555
5998 579555 157072 191234 821513 543682 597176 -188229 -182818 -23684 -78543 646377 805576
5987 805576 1139728 761964 140871 196606 -3018 537320 -154610 -485259 -1001303 -609333
5977 -609333 445691 930376 695039 615519 981989 713014 157559 -31202 517957 372306
5967 372306 -86764 -542516 -508728 -322014 486242 370181 748226 641465 48228 -211686
5957 -211686 -500135 -386681 -169771 740083 642330 49757 92077 185052 -464355 -528032
5947 -528032 -625819 -371075 49165 107169 -163090 62691 -60010 -297996 110352 -457892
$$ packed form
6018b72810J58441o2175J4811M40472l98889L49060j18823k23039j1214k5831
6008a49997m42709J84866M05981M26115K32409j00081l46011n22023O25645K65360
5998E79555m22483L4162O30279k77831N3494p85405N411J59134n4859P24920J59199
5987H05576L34152l77764o21093N5735j99624N40338o91930l30649n16044L91970
5977f09333J055024M84685k35337p9520L66470k68975n55455j88761N49159j45651
5967C72306m59070m55752L3788J86714Q08256j16061L78045j06761n93237k59914
5957b11686k88449J13454K16910R09854r7753n92573M2320R2975o49407o3677
5947e28032r7787K54744M20240N8004k70259K25781j22701k37986M08348n68244
$$ plain form
5937 -457892 122202 -107706 -147638 -308879 594 -492776 -500151 -593472 -143259 -353968
5927 -353968 -569513 -1156864 -524066 -46942 -97348 -338845 500557 700808 807168 1285012
5917 1285012 802348 235389 -253639 387808 137106 -527042 442668 -89567 -442139 175957
5907 175957 290060 -169104 469663 583746 372164 -173234 -275724 -61984 -635196 -334202
5897 -334202 -124694 -129819 -153183 486660 -40426 456585 503906 -198238 86555 355590
5887 355590 -137004 288376 714825 676391 598530 590712 314223 474168 761794 890078
5877 890078 616145 384989 596201 263610 -367146 -11904 -109490 -105089 -140947 494228
5867 494228 304893 307339 -35415 629628 919634 727516 165064 -179864 95670 -48198
$$ packed form
5937d57892N80094k29908l9932j61241L09473m93370p375r3321M50213k10709
5927c53968k15545n87351O32798M77124n0406k41497Q39402K00251J06360M77844
5917A285012m82664n66959m89028O41447k50702o64148R69710n32235l52572O18096
5907A75957J14103m59164O38767J14083k11582n45398j02490K13740n73212L00994
5897c34202K09508n125k3364O39843n27086M97011M7321p02144K84793K69035
5887C55590m92594M25380M26449l8434p7861p818k76489J59945K87626J28284
5877H90078k73933k31156K11212l32591o30756L55242r7586M401l5858O35175
5867D94228j89335K446l42754O65043K90006j92118n62452l44928K75534j43868
$$ plain form
5857 -48198 127497 -266803 -328108 97980 -140702 -225412 -216462 -378241 -551314 -199182 -3432
5846 -3432 366400 583806 1014435 651952 350976 -368016 -649379 121369 -77504 -485292
5836 -485292 -183339 -346971 -160766 595297 454086 -152797 -26889 -210602 -510 674068
5826 674068 847824 360534 457067 -50690 -1001627 -281283 319542 642982 157490 -24283
5816 -24283 -52558 -548967 -250960 631113 255429 -14495 399338 148647 98698 322553
5806 322553 50373 -287510 -121189 -316164 -283049 -442834 -740629 221197 98193 -273213
5796 -273213 -152230 445180 83999 -455365 146719 -366347 -534022 -480283 -547399 -947471
5786 -947471 -526357 -403567 -404663 523128 380146 470386 135915 -269718 -175453 -497472
$$ packed form
5857d8198J75695l94300o1305M26088k38682q4710Q950j61779j73073L52132J95750
5846c432L69832K17406M30629l62483l00976p18992k81363P70748j98873m07788
5836d85292L01953j63632J86205P56063j41211o06883J25908j83713K10092O74578
5826F74068J73756m87290R6533n07757r50937P20344O00825L23440m85492j81773
5816b4283k8275m96409K98007Q82073l75684k69924M13833k50691m9949K23855
5806C22553k72180l37883J66321j94975L3115j59785k97795R61826j23004l71406
5796b73213J20983N97410l61181n39364O02084n13066j67675N3739o7116m00072
5786i47471M21114J22790j096R27791j42982R0240l34471m05633R4265l22019
$$ plain form
5776 -497472 15591 909200 714306 824017 833418 692938 778643 1032859 167883 698346
5766 698346 508896 696182 823369 -58278 528958 873711 317312 504642 212297 825073
5756 825073 554132 480174 1167436 1202326 1189400 452973 -154939 321632 311560 461859
5746 461859 1001834 279690 525425 817375 961414 1076714 -48707 509364 453335 -83233
5736 -83233 -129572 448323 434377 125272 306719 239117 92293 49235 -163415 -455882 196036
5725 196036 -56698 -274979 -855778 -995954 -362988 252966 -179848 -59803 538810 311118
5715 311118 142872 346183 610942 398021 765526 1061135 763232 217726 180977 316541
5705 316541 123361 278497 1307833 863433 199467 691123 514439 617906 986099 1483458
$$ packed form
5776d97472N13063Q93609j94894J09711R401j40480Q5705K54216q64976N30463
5766F98346j89450J87286J27187q81647N87236L44753n56399J87330k92345O12776
5756H25073k70941p3958O87262L4890j2926p36427o07912M76571j0072J50299
5746D61859N39975p22144K45735K91950J44039J15300j125421N58071n6029n36568
5736h3233m6339N77895j3946l09105J81447o7602j46824m3058k12650k92467O51918
5725A96036k52734k18281n80799j40176O32966O15954m32814J20045N98613k27692
5715C11118j68246K03311K64759k12921L67505K95609k97903n45506l6749J35564
5705C16541j93180J55136J029336m44400o63966M91656j76684J03467L68193M97359
$$ plain form
5695 1483458 1056769 1043927 923623 92442 38616 -49888 -114249 -90743 238270 7470
5685 7470 158029 469318 337079 370028 465426 745091 592679 818837 841497 -483358
5675 -483358 -201592 302551 88379 422260 870174 991489 459026 541975 258310 141678
5665 141678 -286218 -541819 149611 174892 -174065 -191914 -560466 9915 327075 91519
5655 91519 571 386809 567001 907470 1319648 1143065 936534 851941 314893 389398
5645 389398 345658 232094 77265 235277 817435 968077 346630 109203 336829 248754
5635 248754 79645 -60353 52737 98250 -501405 -211209 -42549 151886 141909 122646
5625 122646 408276 532328 114793 339287 177026 -349387 291623 199761 103723 686350
$$ packed form
5695A483458m26689j2842j20304q31181n3826q8504o4361K3506L29013k30800
5685G470J50559L11289j32239L2949R5398K79665j52412K26158K2660j324855
5675d83358K81766N04143k14172L33881M47914J21315n32463Q2949k83665j16632
5665A41678m27896k55601O91430K5281l48957j7849l68552N70381L17160k35556
5655I1519r0948L86238J80192L40469M12178j76583k06531q4593n37048P4505
5645C89398m3740j13564j54829J58012N82158J50642o21447k37427K27626q8075
5635B48754j69109j39998J13090M5513n99655K90196J68660J94435r977j9263
5625A22646K85630J24052m17535K24494j62261n26413O41010r1862r6038N82627
$$ plain form
5615 686350 774605 348574 659067 656240 309605 955446 562474 926752 895095 -15906
5605 -15906 68345 289830 701146 719415 597584 1221690 988928 973082 1202182 825145
5595 825145 920495 544701 596215 1151678 948362 394437 40595 727901 1101814 1204705
5585 1204705 817170 236610 383265 1318785 896238 -3262 5437 684249 994105 1591550
5575 1591550 1779844 1022013 687068 1347847 2257062 2028188 2089946 1495657 1044076 1038084
5565 1038084 1456172 1928597 1960363 1351080 1337342 1115639 1203737 601741 1185696 1011509
5555 1011509 892741 703350 958346 871185 649887 299156 266970 611205 1038905 727162
5545 727162 801159 1733275 1818126 1563528 1547363 924177 750460 1118424 2003803 2075552
$$ packed form
5615F86350Q8255m26031L10493k827l46635O45841l92972L64278l1657r11001
5605a5906Q4251K21485M11316J8269j21831O24106k32762j5846K29100l77037
5595H25145R5350l75794N1514N55463k03316n53925l53842O87306L73913J02891
5585A204705l87535n80560J46655R35520m22547q99500Q699O78812L09856N97445
5575A591550J88294p57831l34945O60779R09215k28874O1758n94289m51581n992
5565A038084M18088M72425L1766o09283j3738k21703Q8098o01996N83955j74187
5555A011509j18768j89391K54996q7161k21298l50731l2186L44235M27700l11743
5545G27162P3997R32116Q4851k54598j6165o23186j73717L67964Q85379P1749
$$ plain form
5535 2075552 2036176 1717514 1191740 1632424 1409309 1151266 1532479 1399603 1061046 571789
5525 571789 596425 248315 523982 595160 550868 848293 697024 1077921 1465639 1667691
5515 1667691 1137923 515814 522615 1124708 1018608 715629 828868 1334894 1418383 1072671
5505 1072671 501902 798032 1269772 1264449 1728087 1709326 1176536 995758 233792 508957
5495 508957 489421 449643 946505 940183 1125086 623191 116698 -191283 -191760 880673 1745068
5484 1745068 1416873 1108224 556086 881348 479360 -75336 280347 102612 -23008 260193
5474 260193 32358 185458 89327 -289216 931368 1475172 1449686 1020481 885577 -205079
5464 -205079 -363841 432821 390165 -508253 145885 346138 283123 761280 1168142 320711
$$ packed form
5535B075552l9376l18662n25774M40684k23115k58043L81213j32876l38557m89257
5525E71789K4636l48110K75667P1178m4292K97425j51269L80897L87718K02052
5515A667691n29768o22109O801O02093j06100l02979J13239N06026Q3489l45712
5505A072671n70769K96130M71740n323M63638j8761n32790j80778p61966K75165
5495E08957j9536l9778M96862o322J84903n01895n06493l07981m77J072433Q64395
5484A745068l28195l08649n52138L25262m01988n54696L55683j77735j25620K83201
5474B60193k27835J53100r6131l78543J220584N43804k5486m29205j34904j090656
5464b05079j58762P96662m2656q98418O54138K00253o3015M78157M06862q47431
$$ plain form
5454 320711 -41453 344320 371669 195053 582856 811423 596990 587921 968289 1373826
5444 1373826 975622 340192 460512 409433 504591 1162162 566860 -86905 -358308 -206334
5434 -206334 -134098 395074 751446 684094 558757 528900 1332532 895251 816932 743135 51810
5423 51810 -28898 436293 359025 1085648 1524191 1678085 1348316 925117 762627 819792
5413 819792 1271439 725915 173145 -276920 -67825 -332971 -102293 1010139 756667 341391
5403 341391 586578 249780 211362 1485871 1441380 1346554 1009573 1004107 641167 888520
5393 888520 951061 762755 811521 325751 486689 734991 1053727 528876 160014 470878
5383 470878 908572 654095 769573 1045708 915737 989490 829742 786178 735585 183202
$$ packed form
5454C20711l62164L85773K7349j76616L87803K28567k14433r069L80368M05537
5444A373826l98204o35430J20320n1079R5158O57571n95302o53765k71403J51974
5434b06334P2236N29172L56372o7352j25337k9857Q03632m37281p8319p3797o91325
5423E1810q0708M65191p7268P26623M38543J53894l29769m23199j62490N7165
5413H19792M51647n45524n52770m50065K09095k65146K30678J112432k53472m15276
5403C41391K45187l36798l8418J274509m4491r4826l36981n466l62940K47353
5393H88520O2541j88306M8766m85770J60938K48302L18736n24851l68862L10864
5383D70878M37694k54477J15478K76135j29971P3753j59748m3564n0593n52383
$$ plain form
5373 183202 541297 255870 902964 469350 135878 717824 537915 454564 477635 483103
5363 483103 142160 194984 444752 341365 818091 1580671 1891376 170006 452929 986862
5353 986862 964401 571190 -27921 384284 695227 863535 545924 383815 979305 645181
5343 645181 996121 1466128 948725 187945 565797 425888 325854 692439 835572 1190415
5333 1190415 1388938 1141080 426878 137481 908111 747540 28644 272210 559751 347256
5323 347256 604620 685997 447946 898835 902678 466383 689723 373641 768619 917916
5313 917916 1028133 1533728 1627679 1226885 1345848 1045201 185354 436947 231776 102040
5303 102040 224243 1061707 851599 446876 536293 435245 -177816 39501 462461 426302
$$ packed form
5373A83202L58095k85427O47094m33614l33472N81946j79909q3351K3071N468
5363D83103l40943N2824K49768j03387M76726P62580L10705j721370K82923N33933
5353I86862k2461l93211n99111M12205L10943J68308l17611j62109N95490l34124
5343F45181L50940M70007n17403p60780L77852j39909j00034L66585J43133L54843
5333A190415J98523k47858p14202k89397P70630j60571p18896K43566K87541k12495
5323C47256K57364Q1377k38051M50889L843m36295K23340l16082L94978J49297
5313I17916J10217N05595R3951m00794J18963l00647q59847K51593k05171j29736
5303A02040J22203Q37464k10108m04723Q9417j01048o13061K17317M22960l6159
$$ plain form
5293 426302 71016 505476 564433 1134749 699047 742280 678333 646912 439097 -154681
5283 -154681 7511 801969 897358 366730 601614 560325 879009 1176440 694737 366177
5273 366177 509528 644070 777650 227697 483859 324396 438172 782821 224614 29636
5263 29636 215614 265686 376173 555872 1108903 1200998 558711 802340 692063 678274
5253 678274 513856 270759 168374 436083 709396 532609 9346 460171 491135 148195
5243 148195 440267 872675 781594 442695 488400 857328 1017322 1163663 1192600 582578
5233 582578 693159 1265336 921947 774770 608236 1248463 836070 792152 416745 545794
5223 545794 722517 851977 539865 175939 503247 525918 8126 -87667 507039 241906
$$ packed form
5293D26302l55286M34460N8957N70316m35702M3233o3947l1421k07815n93778
5283a54681J62192P94458R5389n30628K34884m1289L18684K97431m81703l28560
5273C66177J43351J34542J33580n49953K56162j59463J13776L44649n58207j94978
5263B9636J85978N0072J10487J79699N53031R2095o42287K43629j10277j3789
5253F78274j64418k43097j02385K67709K73313j76787n23263M50825L0964l42940
5243A48195K92072M32408r1081l38899M5705L68928J59994J46341K8937o10022
5233E82578J10581N72177l43389j47177j66534O40227m12393m3918l75407J29049
5223E45794J76723J29460l12112l63926L27308K2671n17792r5793N94706k65133
$$ plain form
5213 241906 -230736 -174866 645341 154427 512281 -186726 -421932 537579 699321 1135976
5203 1135976 715191 826110 1063790 993195 1370548 1101661 742920 1072117 990789 -472102
5193 -472102 -182345 6306 331280 258361 407375 290393 692555 606568 409087 888677
5183 888677 420730 616189 825528 1046811 1196238 566164 243773 -248085 546686 931890
5173 931890 459693 471484 920304 392585 679625 889076 918181 431340 -542255 18593
5163 18593 788543 705217 642494 599464 1163225 1484870 1771542 1049886 961555 805595 139558
5152 139558 -126068 14391 797269 637715 618749 877946 1365419 1084431 1160216 316820
5142 316820 -314657 52296 689435 725140 875103 748213 633916 233951 -35281 315026
$$ packed form
5213B41906m72642N5870Q20207m90914L57854o99007k35206R59511J61742M36655
5203A135976m20785J10919K37680p0595L77353k68887l58741L29197q1328j462891
5193d72102K89757J88651L24974p2919J49014j16982M02162q5987j97481M79590
5183H88677m67947J95459K09339K21283J49427o30074l22391m91858P94771L85204
5173I31890m72197J1791M48820n27719K87040K09451K9105m86841r73595N60848
5163A8593P69950q3326o2723m3030N63761L21645K86672p21656q8331j55960o66037
5152A39558k65626J40459P82878j59554j8966K59197M87473k80988P5785q43396
5142C16820o31477L66953O37139L5705J49963j26890j14297l99965k69232L50307
$$ plain form
5132 315026 514494 290176 449943 540317 487092 237552 566132 470019 390164 322810 524863
5121 524863 341638 491051 932950 1157102 969568 658704 575660 804351 637684 191949
5111 191949 939575 1051585 249305 25086 -13663 113235 -457964 -168128 699405 928787
5101 928787 998679 770070 739476 858338 868722 761555 710813 64965 -293258 -121402
5091 -121402 -261571 -633880 -44121 518222 110943 648806 1113242 1235036 1548888 1465411
5081 1465411 646693 238946 161391 549433 977729 780552 920075 486141 390549 376987
5071 376987 858957 274734 271833 338629 677692 269372 651488 1114688 715069 976805
5061 976805 1205420 1441958 1167987 754739 -144043 -5985 493473 475363 948599 1115810
$$ packed form
5132C15026J99468k24318J59767R0374n3225k49540L28580r6113p9855o7354K02053
5121E24863j83225J49413M41899K24152j87534l10864q3044K28691j66667m45735
5111A91949P47626J12010q02280k24219l8749J26898n71199K89836Q67533K29382
5101I28787O9892k28609l0594J18862J0384j07167n0742o45848l58223J71856
5091a21402j40169l72309N89759N62343m07279N37863M64436J21794L13852q3477
5081A465411q18718m07747p7555L88042M28296j97177J39523m33934r5592j3562
5071C76987M81970n84223k901O6796L39063m08320L82116M63200l99619K61736
5061I76805K28615K36538k73971m13248q98782J38058M99458j8110M73236J67211
$$ plain form
5051 1115810 444341 252044 157407 500586 1236389 689152 187473 591289 940435 1125658
5041 1125658 1193570 1080024 1083969 1547413 2274114 2028967 1002188 755531 980287 784171
5031 784171 791224 701524 903513 1009363 1252817 1043956 356687 546237 708736 418517
5021 418517 -68228 752844 1258788 996766 528700 706513 788676 694923 570758 815907
5011 815907 1335143 816940 994024 1162144 1430745 792784 386051 857543 1022060 1297103
5001 1297103 1302593 1270257 1176120 1560203 2165329 1515913 1382225 1541453 1483907 1682593
4991 1682593 1492950 361424 982543 1129184 1229761 1658182 939338 1288699 1464161
4982 1464161 1007809 920529 1656804 1881784 1449630 1407694 1326534 931223 1009095 1390620
$$ packed form
5051A115810o71469j92297r4637L43179P35803n47237n01679M03816L49146J85223
5041A125658O7912j13546L945M63444P26701k45147j026779k46657K24756j96116
5031G84171P053q9700K01989J05850K43454k08861o87269J89550J62499k90219
5021D18517m86745Q21072N05944k62022m68066J77813Q2163r3753j24165K45149
5011H15907N19236n18203J77084J68120K68601o37961m06733M71492J64517K75043
5001A297103N490l2336r4137L84083O05126o49416j33688J59228n7546J98686
4991A682593j89643j131526O21119J46641J00577M28421p18844L49361J75462
4982A464161m56352q7280P36275K24980m32154m1936q1160l95311P7872L81525
$$ plain form
4972 1390620 1613277 1492427 2084472 1247141 902085 1385702 1418607 1290814 1405317 1695961
4962 1695961 1513850 1299510 1643983 1681335 1038271 894471 1566382 1303900 1214977 894479
4952 894479 1306129 2020738 2266014 1929056 1079097 1168383 1822028 2035597 2400682 2009086
4942 2009086 1627396 1551377 1294568 1046633 911212 1085249 2035965 2326840 2563671 1988535
4932 1988535 1701297 1830899 2080353 2014132 1846496 1848757 1730051 2438443 2170605 2655477
4922 2655477 3001483 3239061 2299105 2149026 2644386 1963123 1985649 2295562 2407763 2202319
4912 2202319 1550240 1995495 1606821 1373846 2119843 2374784 2262989 2293036 2513035 1629819
4902 1629819 1719091 2481758 2037870 1452369 1725350 2780576 2483749 2376335 2626676 2979021
$$ packed form
4972A390620K22657j20850N92045q37331l45056M83617L2905j27793J14503K90644
4962A695961j82111k14340L44473L7352o43064j43800O71911k62482q8923l20498
4952H94479M11650P14609K45276l36958q49959Q9286O53645K13569L65085l91596
4942B009086l81690p6019k56809k47935j35421J74037R50716K90875K36831n75136
4932A988535k87238J29602K49454o6221j67636K261j18706P08392k67838M84872
4922B655477L46006K37578r39956j50079M95360o81263K2526L09913J12201k05444
4912B202319o52079M45255l88674k32975P45997K54941j11795L0047K19999q83216
4902A629819Q9272P62667m43888n85501K72981J055226k96827j07414K50341L52345
$$ plain form
4892 2979021 3051325 2403805 2331942 2283417 2223087 2768383 2659975 2528936 3056467 2948306
4882 2948306 2465017 2719871 2693064 2806646 2620047 2686804 2586276 2703696 2219515 1918066
4872 1918066 1865067 2437837 2871855 2777340 2736100 3508795 3405030 2920707 3445937 3450455
4862 3450455 3708058 3533315 3389245 4026489 4003318 3455818 3481150 4255995 4570420 3647421
4852 3647421 4208765 3776240 3432185 3486355 3840774 4022296 4277731 4136988 3935042 4505117
4842 4505117 4270682 4550716 6000448 5932496 5931358 6281347 5437470 5269208 5375956 6012041
4832 6012041 5933072 6382324 6212851 5865422 5767822 5892005 5885211 6029641 6175082 6861027
4822 6861027 7047836 6844746 7320494 7478038 7056159 7661027 7763463 7506641 8141189 8387778
$$ packed form
4892B979021P2304o47520p1863m8525o0330N45296j08408j31039N27531j08161
4882B948306m83289K54854k6807J13582j86599O6757j00528J17420m84181l01449
4872A918066n2999N72770M34018r4515m1240P72695j03765m84323N25230M518
4862C450455K57603j74743j44070O37244k3171n47500K5332P74845L14425r22999
4852C647421N61344m32525l44055N4170L54419J81522K55435j40743k01946N70075
4842D505117k34435K80034J449732o7952j138L49989q43877j68262J06748O36085
4832F012041p8969M49252j69473l47429r7600J24183o794J44430J45441O85945
4822F861027J86809k03090M75748J57544m21879O04868J02436k56822O34548K46589
$$ plain form
4812 8387778 7949573 7971977 8269564 8257092 8981536 8701996 8707615 9114369 9516255 9431091
4802 9431091 9756560 10215581 10942432 11123165 11290795 11485803 11787728 11343437 11693460 11664417
4792 11664417 12575022 13054143 13529357 13815517 14250222 14620440 14779643 14872127 15789916 16295251
4782 16295251 16746339 16917063 16979005 17465454 18374302 19201644 19809961 20634935 21565215 22712742
4772 22712742 23569649 24117793 24821575 26912199 28502653 29192834 30107515 31821650 33479829
4763 33479829 34871679 35846627 38580674 40639085 42935036 44953263 47489305 51186159
4755 51186159 54290113 58101800 62460994 66435294 70254549 75336349 80169277 84749297
4747 84749297 90102136 95146920 100454287 106262280 112128921 118333830 125916422 133726985
$$ packed form
4812H387778m38205K2404K97587j2472P24444k79540N619M06754M01886q5164
4802I431091L25469M59021P26851J80733J67630J95008L01925m44291L50023k9043
4792A1664417R10605M79121M75214K86160M34705L70218J59203R2484R17789N05335
4782A6295251M51088J70724O1942M86449R08848Q27342O08317Q24974R30280J147527
4772B2712742Q56907N48144P03782K090624J590454O90181R14681J714135J658179
4763C3479829J391850R74948K734047K058411K295951K018227K536042L696854
4755E1186159L103954L811687M359194L974300L819255N081800M832928M580020
4747H4749297N352839N044784N307367N807993N866641O204909P582592P810563
$$ plain form
4739 133726985 142368596 150708658 161033730 171037391 182023131 194745202 208243850
4732 208243850 224320682 242414885 261394777 283056083 306880990 332234331 357992558
4725 357992558 385139158 411476885 434168035 453107066 465045397 469818841 467198295
4718 467198295 457664540 443289399 425070612 403714936 379937666 354105183 326439376
4711 326439376 299070537 272818569 248009227 224812454 204081446 185607092 169792266
4704 169792266 155380582 142411786 131378498 120398401 111147744 103181117 96338802
4697 96338802 89094596 82902768 78013965 73822880 69733150 65961377 62601683 59413767
4689 59413767 56115807 53687269 51226790 48111716 45398962 43943161 42315458 40908842
$$ packed form
4739A33726985Q641611Q340062J0325072J0003661J0985740J2722071J3498648
4732B08243850J6076832J8094203J8979892K1661306K3824907K5353341K5758227
4725C57992558K7146600K6337727K2691150J8939031J1938331M773444k620546
4718D67198295r533755j4375141j8218787k1355676k3777270k5832483k7665807
4711C26439376k7368839k6251968k4809342k3196773k0731008j8474354j5814826
4704A69792266j4411684j2968796j1033288j0980097r250657p966627o842315
4697I6338802p244206o191828m888803m191085m089730l771773l359694l187916
4689E9413767l297960k428538k460479l115074k712754j455801j627703j406616
$$ plain form
4681 40908842 38893927 37420198 36019165 35045800 33714449 32629853 31152589 29383487
4673 29383487 27882773 27018571 26109749 25367832 24972464 24077680 23351468 22261410 21202592
4664 21202592 20168766 19540766 19560762 19167249 18518833 18475036 17481658 16854163 16034842 16198204
4654 16198204 15217120 14596761 14956183 14251463 13367959 13285759 13167081 12949114 12749275 12397832
4644 12397832 11688369 10913660 11162868 11094293 11198642 10852887 10715621 10723057 11092954 10791714
4634 10791714 10350549 10369597 9592048 9142003 9126229 8681186 8606304 8642591 8971004 8957722
4624 8957722 8424471 8415116 8328167 8138802 8213596 7431775 7688381 8624742 8592002 9069313
4614 9069313 8067190 7929346 8625380 8574960 8134623 8158834 8049463 8438693 8665684 8908560
$$ packed form
4681D0908842k014915j473729j401033r73365j331351j084596j477264j769102
4673B9383487j500714q64202r08822p41917l95368q94784p26212j090058j058818
4664B1202592j033826o28000J9996l93513o48416m3797r93378o27495q19321J63362
4654A6198204r81084o20359L59422p04720q83504q2200j18678k17967j99839l51443
4644A2397832p09463p74709K49208o8575J04349l45755j37266P436L69897l01240
4634A0791714m41165J9048p77549m50045j5774m45043p4882L6287L28413j3282
4624H957722n33251r355q6949j89365P4794p81821K56606R36361l2740M77311
4614I069313j002123j37844O96034n0420m40337K4211j09371L89230K26991K42876
$$ plain form
4604 8908560 8698703 8924570 8777925 8946835 10205006 10518349 10862018 11472818 11742537
4595 11742537 11902286 12112077 12444434 13365925 13853573 14301554 14435603 15239453 16395895
4586 16395895 17129246 18387985 19526541 20364094 20755787 21401585 22362975 23016173 24502493
4577 24502493 25390885 26016720 27607204 27934880 28354795 29235222 29342974 29063712 30411927
4568 30411927 31375553 31403043 31734366 31714916 31407335 29964814 28894720 27906213 27185498
4559 27185498 27083501 26674773 25064337 23539895 22534919 21042183 19612684 18551727
4551 18551727 17129352 15967016 15166230 14347339 13395908 12074113 10970641 9847409 9262435
4542 9262435 8880889 8316950 7632246 7223094 7277093 6264133 6315690 5988288 5310633 4839392
$$ packed form
4604H908560k09857K25867j46645J68910J258171L13343L43669O10800K69719
4595A1742537J59749K09791L32357R21491M87648M47981J34049Q03850J156442
4586A6395895P33351J258739J138556Q37553L91693O45798R61390O53198J486320
4577B4502493Q88392O25835J590484L27676M19915Q80427J07752k79262J348215
4568C0411927R63626K7490L31323j9450l07581j442521j070094r88507p20715
4559B7185498j01997m08728j610436j524442j004976j492736j429499j060957
4551A8551727j422375j162336q00786q18891r51431j321795j103472j123232n84974
4542I262435l81546n63939o84704m09152N3999j012960N1557l27402o77655m71241
$$ plain form
4532 4839392 4788194 4922462 4981623 5027053 4940489 4606517 3834952 3766377 4104933 4100481 3920027
4521 3920027 3789834 4222140 4187774 3290826 3012297 3019757 3111006 2574691 2947962 2979267
4511 2979267 2643201 2829865 3375631 2281350 2151274 2495515 2015376 2314117 2746993
4502 2746993 2333054 2447828 3103366 2692871 2461740 2980713 2487665 1836600 1598694 1843311
4492 1843311 2052522 1568574 1722046 1177970 1089779 1019815 1733055 1612278 1506486 1832622
4482 1832622 1319072 1096927 979214 963533 1165198 1066030 1284117 1322903 701506 835300
4472 835300 644606 116679 479807 985261 768130 878165 1003906 386913 714891 1106485
4462 1106485 1614600 1793441 1976014 1483498 1341931 1053484 1072165 748970 827686 726852
$$ packed form
4532D839392n1198J34268N9161M5430q6564l33972p71565o8575L38556m452j80454
4521C920027j30193M32306l4366q96948k78529P460R1249n36315L73271L1305
4511B979267l36066J86664N45766j094281j30076L44241m80139K98741M32876
4502B746993m13939J14774O55538m10495k31131N18973m93048o51065k37906K44617
4492A843311K09211m83948J53472n44076q8191o9964P13240j20777j05792L26136
4482A832622n13550k22145j17713j5681K01665r9168K18087L8786o21397J33794
4472H35300j90694n27927L63128N05454k17131J10035J25741o16993L27978L91594
4462A106485N08115J78841J82573m92516j41567k88447J8681l23195P8716j00834
$$ plain form
4452 726852 363288 752407 592526 1299586 898683 380229 213798 612059 398889 303896
4442 303896 192420 -126323 82058 451203 238976 937354 1648388 1369180 594315 321185
4432 321185 60660 -158761 327451 933196 427755 255435 832836 1171775 1422200 1241677
4422 1241677 1577040 824521 813326 833467 1062823 974415 382664 276918 600495 557625
4412 557625 671441 732680 -107906 -533465 301620 803606 294328 286966 372969 -60202
4402 -60202 -122086 -237613 312966 557622 706433 1122023 696122 723177 646082 144950
4392 144950 -30364 7039 370534 1045083 884176 332901 62222 -26286 360958 147420
4382 147420 548405 1059521 831921 619943 550034 1358828 670404 720609 680850 767659
$$ packed form
4452G26852l63564L89119j59881P07060m00903n18454j66431L98261k13170r4993
4442C03896j11476l18743K08381L69145k12227O98378P11034k79208p74865k73130
4432C21185k60525k19421M86212O05745n05441j72320N77401L38939K50425j80523
4422A241677L35363p52519j1195K0141K29356q8408n91751j05746L23577m2870
4412E57625J13816O1239q40586m25559Q35085N01986n09278p362Q6003m33171
4402f0202o1884j15527N50579K44656J48811M15590m25901K7055p7095n01132
4392A44950j75314L7403L63495O74549j60907n51275k70679q8508L87244k13538
4382A47420M00985N11116k27600k11978o9909Q08794o88424N0205l9759Q6809
$$ plain form
4372 767659 929171 414727 -111036 41287 -280470 318882 352352 -200444 147083 344933
4362 344933 274441 -169493 242942 537916 622772 383949 55042 -173256 77366 107563
4352 107563 -354307 -781303 -493970 -146718 -851458 -473279 -322731 -94076 445062 624451
4342 624451 522738 677740 734030 650029 1266559 1296566 1174816 1050511 884168 692323
4332 692323 742389 909704 979166 865422 761247 759474 318755 52362 -321829 215145
4322 215145 306484 -245193 1778 298397 545588 124292 84971 209815 90315 286188
4312 286188 291563 192541 454306 254478 6590 323785 290999 357822 46736 -241757 371175
4301 371175 -19093 -360204 199676 -221211 -192714 121105 189515 72659 282532 398112
$$ packed form
4372G67659J61512n14444n25763J52323l21757N99352L3470n52796L47527J97850
4362C44933p0492m43934M12435K94974Q4856k38823l28907k28298K50622L0197
4352A07563m61870m26996K87333L47252p04740L78179J50548K28655N39138J79389
4342F24451j01713J55002N6290q4001O16530L0007j21750j24305j66343j91845
4332F92323N0066J67315O9462j13744j04175j773m40719k66393l74191N36974
4322B15145R1339n51677K46971K96619K47191m21296l9321J24844j19500J95873
4312B86188N375r9022K61765j99828k47888L17195l2786O6823l11086k88493O12932
4301C71175l90268l41111N59880m20887K8497L13819O8410j16856K09873J15580
$$ plain form
4291 398112 47644 560164 354912 208518 43174 -82996 -242373 -336667 -107292 91785
4281 91785 315425 388355 117300 -360928 -611209 -319261 128397 466703 -66302 182536
4271 182536 -294335 -766481 -292677 -371576 -330456 306283 449579 379347 85412 77330 -113204
4260 -113204 222849 589432 660256 -69505 -279030 220687 738109 953235 588080 537744
4250 537744 264617 -20709 516894 961328 637799 567563 -442723 -335163 612826 533667
4240 533667 882872 917654 -14034 437821 311741 31546 181752 235984 925896 355383
4230 355383 243684 1257839 927977 401672 -50035 -271700 -467090 -433014 -267123 -717471
4220 -717471 -134929 163220 -198329 -858689 -830971 -260670 467470 514792 310634 272104
$$ packed form
4291C98112l50468N12520k05252j46394j65344j26170j59377r4294K29375J99077
4281I1785K23640P2930k71055m78228k50281K91948M47658L38306n33005K48838
4271A82536m76871m72146M73804p8899M1120O36739J43296p0232k93935q082j90534
4260a13204L36053L66583P0824p29761k09525M99717N17422K15126l65155n0336
4250E37744k73127k85326N37603M44434l23529p0236j010286J07560R47989p9159
4240E33667L49205L4782r31688M51855j26080k80195J50206N4232O89912n70513
4230C55383j11699J014155l29862n26305m51707k21665j95390L4076J65891m50348
4220g17471N82542K98149l61549o60360K7718N70301P28140M7322k04158l8530
$$ plain form
4210 272104 -271943 -379448 -93965 247399 -517680 -358300 68133 524027 278530 -409787
4200 -409787 156575 -141052 -335842 -205247 494560 322601 -232520 -344100 -290070 903167
4190 903167 762338 269680 188850 53000 -7014 -361413 -501137 -168323 -501300 360066
4180 360066 280853 321049 305545 121329 86013 -453750 -512354 -71259 -260438 -598000 -141352
4169 -141352 490790 -78986 -423749 -214333 -659681 -360002 150043 341614 -315149 -279356
4159 -279356 -1473 620141 316824 -16045 -111073 106128 289191 109607 145493 -92423
4149 -92423 -84276 190911 547875 433111 850778 468704 166922 -128676 -148325 271093
4139 271093 372716 365846 205839 489830 195501 141552 558348 329040 108033 329376
$$ packed form
4210B72104n44047j07505K85483L41364p65079J59380M26433M55894k45497o88317
4200d09787N66362k97627j94790J30595O99807j71959n55121j11580N4030J193237
4190I03167j40829m92658q0830j35850o0014l54399j39724L32814l32977Q61366
4180C60066p9213M0196j5504j84216l5316n39763n8604M41095j89179l37562M56648
4169a41352O32142n69776l44763K09416m45348K99679N10045J91571o56763L5793
4159b79356K77883O21614l03317l32869r5028K17201J83063j79584L5886k37916
4149i2423Q147K75187L56964j14764M17667l82074l01782k95598j9649M19418
4139B71093J01623o870j60007K83991k94329n3949M16796k29308k21007K21343
$$ plain form
4129 329376 698631 -122169 34782 577877 563482 863260 172629 585529 478668 -321025
4119 -321025 -543235 -646729 -662027 -833423 -653290 96627 371418 364190 -550241 -505659
4109 -505659 -118603 -312644 -478377 -559384 -431538 -384684 327913 707717 676656 -385527
4099 -385527 -628099 235600 368476 417158 -114636 -545724 -409063 -444932 -41501 337055
4089 337055 828310 11486 47744 75276 -389714 -444339 -269288 72678 29973 538439
4079 538439 626952 -137171 265437 275767 -5017 -84454 -99537 280476 434344 840267
4069 840267 605039 -47921 -13356 169975 -5117 8427 292309 -41141 -1152588 -689256
4059 -689256 -630660 -882451 -236903 133000 -462480 342065 1075129 157854 -211941 -105061
$$ packed form
4129C29376L69255q20800J56951N43095j4395K99778o90631M12900j06861p99693
4119c21025k22210j03494j5298j71396J80133P49917K74791p228r14431M4582
4109e05659L87056j94041j65733q1007J27846M6854P12597L79804l1061j062183
4099c85527k42572Q63699J32876M8682n31794m31088J36661l5869M03431L78556
4089C37055M91255q16824L6258K7532m64990n4625J75051L41966m2705N08466
4079E38439Q8513p64123M02608J0330k80784p9437j5083L80013J53868M05923
4069H40267k35228o52960L4565J83331j75092J3544K83882l33450j111447M63332
4059f89256N8596k51791O45548L69903n95480Q04545P33064r17275l69795J06880
$$ plain form
4049 -105061 -435851 -399947 -536983 -825599 -470195 -275564 140750 8902 -541362 -321688
4039 -321688 -157060 -142112 -53737 -9118 -323962 -121092 538985 421911 443183 154246
4029 154246 1916 197822 -259811 107968 691820 600701 648309 315567 -394148 -953275
4019 -953275 -1025509 -322775 -679857 -166778 340980 -357153 -556580 -410247 -847757 -48690
4009 -48690 284428 360252 7364 -428986 -221919 -502380 -554394 -675458 -473158 -140473
3999 -140473 -488877 -51765 72395 384244 250168 -315941 349758 565540 922099 316474
3989 316474 -275976 -374622 -534029 -574841 -431158 -7553 598267 681057 -71746 373113
3979 373113 86137 -32236 -206835 -204004 -603146 -877133 -612713 -81688 30865 -715174
$$ packed form
4049a05061l30790L5904j37036k88616L55404J94631M16314j31848n50264K19674
4039c21688J64628J4948Q8375M4619l14844K02870O60077j17074K1272k88937
4029A54246j52330J95906m57633L67779N83852r1119M7608l32742p09715n59127
4019i53275p2234P02734l57082N13079N07758o98133j99427J46333m37510P99067
4009d8690L33118P5824l52888m36350K07067k80461n2014j21064K02300L32685
3999a40473l48404M37112J24160L11849j34076n66109O65699K15782L56559o05625
3989C16474n92450r8646j59407m0812J43683M23605O05820Q2790p52803M44859
3979C73113k86976j18373j74599K831l99142k73987K64420N31025J12553p46039
$$ plain form
3969 -715174 -41211 176946 -118506 53390 -425749 -845559 -424914 14126 -243936 112103
3959 112103 470934 -580981 265977 569699 81231 -441314 66735 486457 177824 -318954
3949 -318954 -312088 -169747 129319 -403434 8699 -303092 -498880 -415385 -238336 -283451
3939 -283451 -456936 -218380 -435161 -222850 -308555 -844185 -427102 -338801 -273432 -89793
3929 -89793 -281881 -352372 294713 -36027 -688324 -403768 -409830 -593037 -235297 -197954 -603695
3918 -603695 -863493 -86043 609013 603437 388067 368701 594885 -175156 -108061 -123429 280714
3907 280714 237776 499951 812795 48132 -552098 -510381 -612586 23658 667060 160135
3897 160135 -242383 -1155869 -941340 -534662 29928 167021 -163213 -165784 205672 776782
$$ packed form
3969g15174O73963K18157k95452J71896m79139m19810M20645M39040k58062L56039
3959A12103L58831j051915Q46958L03722m88468n22545N08049M19722l08633m96778
3949c18954O866J42341K99066n32753M12133l11791j95788Q3495J77049m5115
3939b83451j73485K38556k16781K12311q5705n35630M17083Q8301O5369J83639
3929h9793j92088p0491O47085l30740o52297K84556o062j83207L57740L7343m05741
3918f03695k59798P77450O95056n576k15370j9366K26184p70041O7095j5368M04143
3907B80714m2938K62175L12844p64663o00230M1717j02205O36244O43402n06925
3897A60135m02518r13486K14529M06678N64590J37093l30234k571L71456N71110
$$ plain form
3887 776782 -238511 -285865 -1209 -145371 -9065 94750 -83159 -422146 -270990 -281499
3877 -281499 308158 518063 175576 -263447 -433667 132123 393635 -7961 -713601 -397022
3867 -397022 -48402 -235961 -1159480 -1165828 -951454 -776530 -642297 -1027577 -375811 -249070
3857 -249070 163619 368352 233491 324018 -67145 -392895 -551737 -362978 -688216 -903961
3847 -903961 -959550 -330196 -423353 -291198 219439 -96235 -478198 -1022469 -1102027 -908038
3837 -908038 -452139 -416301 -468682 -259 -203216 141340 152333 -605110 -359607 651075
3827 651075 249951 86942 -31754 -133868 -283995 -170258 -471229 -789880 -771429 -614807
3817 -614807 -682944 -99915 -229481 -257055 271381 23692 -685355 -464092 -14906 -172080
$$ packed form
3887G76782j015293m7354K84656j44162J36306J03815j77909l38987J51156j0509
3877b81499N89657K09905l42487m39023j70220N65790K61512m01596p05640L16579
3867c97022L48620j87559r23519o348K14374J74924J34233l85280O51766J26741
3857b49070M12689K04733j34861R0527l91163l25750j58842J88759l25238k15745
3847i03961n5589O29354r3157J32155N10637l15674l81963n44271p9558J93989
3837i08038M55899L5838n2381M68423k02957L44556J0993p57443K45503J010682
3827F51075m01124j63009j18696j02114j50127J13737l00971l18651J8451J56622
3817f14807o8137N83029j29566k7574N28436k47689p09047K21263M49186j57174
$$ plain form
3807 -172080 -428976 -157471 55684 -2257 146062 146226 -69450 -603332 -885812 -600761
3797 -600761 -439998 -337001 56703 180787 -40566 117135 450152 75851 -390802 -568377
3787 -568377 -12466 -105037 -464177 -493724 -659041 -338957 108652 -168501 -169046 -30036 34346
3776 34346 -205613 -198448 -124567 -492556 -298204 417659 479269 530300 -193171 -881388 -850619
3765 -850619 -676438 214567 201020 -591892 -805976 -20016 570092 77201 -281393 -593224
3755 -593224 -78456 365651 397426 36925 -161781 -471056 -601896 -371940 18589 235722
3745 235722 268955 -413728 -293827 -300227 -298723 63361 -13440 -53206 -103504 -314650 -231334
3734 -231334 -692622 -216977 -158807 -319029 458116 -531137 -49752 28467 -261442 426431
$$ packed form
3807a72080k56896K71505K13155n7941J48319J64k15676n33882k82480K85051
3797f00761J60763J02997L93704J24084k21353J57701L33017l74301m66653j77575
3787e68377N55911r2571l59140k9547j65317L20084M47609k77153n45J39010O4382
3776C4346k39959P165P3881l67989J94352P15863O1610N1031p23471o88217L0769
3765h50619J74181Q91005j3547p92912k14084P85960N90108m92891l58594l11831
3755e93224N14768M44107L1775l60501j98706l09275j30840K29956L90529K17133
3745B35722L3233o82683J19901o400J504L62084p6801l9766n0298k11146Q3316
3734b31334m61288M75645N8170j60222P77145r89253M81385P8219k89909O87873
$$ plain form
3724 426431 611883 242469 -144725 -492015 -1267425 -674295 181952 162804 189420 861521
3714 861521 830223 -412812 -342602 274407 -739142 -785829 -950120 -979244 -907455 -614104
3704 -614104 -650020 -154881 -462657 -681120 -475403 34346 439098 37706 -12308 24861
3694 24861 255777 -60717 -277579 -219569 -283907 59818 84796 197346 607448 -312521
3684 -312521 -387718 256853 174703 17761 484965 -249245 -460802 423807 219150 -690047
3674 -690047 45666 -364515 107988 604002 -25527 -54758 201089 26284 85028 281453
3664 281453 -290681 -80332 -365850 -290667 -504322 -296816 3683 33439 717738 1070078
3654 1070078 630974 279726 238713 83666 323496 492229 240242 -92961 72831 318816
$$ packed form
3724D26431J85452l69414l87194l47290p75410N93130Q56247j9148K6616O72101
3714H61521l1298j243035P0210O17009j013549m6687j64291k9124P1789K93351
3704f14104l5916M95139l07776k18463K05717N09749M04752m01392n0014L7169
3694B4861K30916l16494k16862N8010o4338L43725K4978J12550M10102r19969
3684c12521p5197O44571q2150j56942M67204p34210k11557Q84609k04657r09197
3674f90047P35713m10181M72503M96014o29529k9231K55847j74805N8744J96425
3664B81453n72134K10349k85518P5183k13655K07506L00499K9756O84299L52340
3654A070078m39104l51248m1013j55047K39830J68733k51987l33203J65792K45985
$$ plain form
3644 318816 46126 -7648 107035 801733 39319 -185925 275551 63674 -81591 -640957
3634 -640957 -338216 -581253 297630 726655 -587660 -304850 41318 408607 254915 -775935
3624 -775935 -470291 -279998 -13601 36381 422801 -54755 -435035 -526808 -676387 -615693
3614 -615693 -345409 207525 417663 58384 -65648 44863 -299067 -867333 -160028 328808
3604 328808 -194434 -152358 -236346 87312 150529 -85244 -114798 -551525 -282029 342704
3594 342704 448012 -22762 -233975 -176271 271055 -325868 -330184 -248383 -168037 112890 -155004
3583 -155004 -956760 -777394 -551788 -278088 -119791 -349646 -343982 156065 337297 66629
3573 66629 -202735 -48539 458093 406580 -275308 -430790 297559 -68621 -262386 -389985
$$ packed form
3644C18816k72690n3774J14683O94698p62414k25244M61476k11877j45265n59366
3634f40957L02741k43037Q78883M29025j314315K82810L46168L67289j53692j030850
3624g75935L05644J90293K66397M9982L86420m77556l80280r1773j49579O0694
3614f15693K70284N52934K10138l59279j24032J10511l43930n68266P07305M88836
3604C28808n23242M2076q3988L23658O3217k35773k9554m36727K69496O24733
3594C42704J05308m70774k11213N7704M47326n96923m316Q1801Q0346K80927k67894
3583a55004q01756J79366K25606K73700J58297k29855N664N00047J81232k70668
3573F6629k69364J54196N06632n1513o81888j55482P28349l66180j93765j27599
$$ plain form
3563 -389985 157501 -67460 -619211 -218717 53889 -139506 -90427 472038 443145 110547
3553 110547 -236154 68 -48262 2821 437292 345029 -17880 -777239 -899748 -1077518
3543 -1077518 -827864 -99443 -1067186 -676789 -112691 -632912 -142875 125998 142967 369123
3533 369123 350552 776771 742743 -426412 -482903 -344730 -163291 110037 471028 -177946
3523 -177946 -491910 -726442 -288343 -488990 -485310 -688348 136632 832665 398130 108940
3513 108940 449722 373926 633658 292222 -214371 -221148 -98899 -91227 -273145 -914984 -918493
3502 -918493 319187 -13956 -955524 -297912 385184 514949 219029 -146977 107798 108680
3492 108680 -21690 144381 23457 -655370 386411 139995 -783230 126161 16472 263751
$$ packed form
3563c89985N47486k24961n51751M00494K72606j93395M9079N62465k8893l32598
3553A10547l46701K36222m8330N1083M34471r2263l62909p59359j22509j77770
3543a077518K49654P28421r67743L90397N64098n20221M90037K68873J6969K26156
3533C69123j8571M26219l4028j169155n6491J38173J81439K73328L60991o48974
3523a77946l13964k34532M38099k00647L680k03038Q24980O96033m34535k89190
3513A08940L40782p5796K59732l41436n06593o777J22249P672j81918o41839l509
3502i18493J237680l33143r41568O57612O83096J29765k95920l66006K54775Q82
3492A08680j30370J66071j20924o78827J041781k46416r23225R09391j09689K47279
$$ plain form
3482 263751 -69947 -525358 -402969 -71016 -312558 -457307 -206041 -340778 79918 303002
3472 303002 113659 -260123 -453254 -475139 -102386 357210 420196 265348 -42585 -317948
3462 -317948 -308040 -490085 -689152 -54388 196237 -376783 -327127 361338 -66557 -65800 182918
3451 182918 -254096 148406 683553 553632 19347 354776 -39571 32186 255770 559004
3441 559004 659834 1013254 924096 1009184 1290002 1024208 1165829 443045 696656 1075827
3431 1075827 1018145 577181 490031 169796 -733099 -26098 438915 520409 372725 284829
3421 284829 1112117 1455061 605859 107799 -195403 423954 1144218 613536 143462 1128470
3411 1128470 795172 841979 793576 923377 416672 190236 233912 -419012 -614223 -1313715
$$ packed form
3482B63751l33698m55411J22389L31953k41542j44749K51266j34737M20696K23084
3472C03002j89343l73782j93131k1885L72753M59596O2986j54848l07933k75363
3462c17948R908j82045j99067O34764K50625n73020M9656O88465m27895P57K48718
3451A82918m37014M02502N35147j29921n34285L35429l94347P1757K23584L03234
3441E59004J00830L53420q9158Q5088K80818k65794J41621p22784K53611L79171
3431A075827n7682m40964q7150l20235r02895P07001M65013Q1494j47684q7896
3421B84829Q27288L42944q49202m98060l03202O19357P20264n30682m70074R85008
3411A128470l33298M6807m8403J29801n06705k26436M3676o52924j95211o99492
$$ plain form
3401 -1313715 -636220 190187 50041 279705 -40919 317672 483139 631779 868555 446728
3391 446728 235933 678777 763303 870521 934848 534236 518093 587922 713922 1729970
3381 1729970 1467281 997733 1041379 664707 705965 412212 461527 1047717 1250452 1634867
3371 1634867 1568918 1478957 1281939 1242015 1216882 1603729 1991492 1821566 1940187 1785314
3361 1785314 1796111 1672584 1738714 2124729 3036763 3335446 3684476 3561195 2819025 2664884
3351 2664884 2778706 3032124 2788145 2965417 2500131 2308441 1983360 1942543 2126164 1378327
3341 1378327 1130793 1328927 1600940 1150272 1189855 960891 1089303 1201788 968386 1316061
3331 1316061 2338084 2725598 2821785 2166288 2177876 2802718 2755643 2350611 2246047 2517190
$$ packed form
3401a313715O77495Q26407j40146K29664l20624L58591J65467J48640K36776m21827
3391D46728k10795M42844Q4526J07218O4327m00612j6143O9829J26000J016048
3381A729970k62689m69548M3646l76672M1258k93753M9315N86190K02735L84415
3371A634867o5949q9961j97018l9924k5133L86847L87763j69926J18621j54873
3361A785314J0797j23527O6130L86015R12034K98683L49030j23281p42170j54141
3351B664884J13822K53418k43979J77272m65286j91690l25081m0817J83621p47837
3341A378327k47534J98134K72013m50668L9583k28964J28412J12485k33402L47675
3331A316061J022023L87514R6187o55497J1588O24842m7075m05032j04564K71143
$$ plain form
3321 2517190 2877356 2559526 2816537 2229776 2496630 2145848 1910941 1598269 1063072 1618283
3311 1618283 1548243 1155648 826430 1151575 890899 478101 595358 880070 1514971 1336061
3301 1336061 696757 646198 985368 441387 1124491 775072 1526246 1674679 1184340 1927278
3291 1927278 2189842 1690418 841166 917411 856136 934350 1016215 1273413 1101786 1369081
3281 1369081 1090976 606281 276985 228766 310469 279332 252164 -123690 -604905 73109
3271 73109 4028 -479902 43337 -400224 -271407 -496797 -734636 211132 404192 305698
3261 305698 88905 -1217129 -1016805 -513502 -319408 -264980 -713074 -866132 -461290 -305673
3251 -305673 -574957 -223460 98046 349622 -168511 -469335 -372063 -446184 -176562 -574660
$$ packed form
3321B517190L60166l17830K57011n86761K66854l50782k34907l12672n35197N55211
3311A618283p0040l92595l29218L25145k60676m12798J17257K84712O34901j78910
3301A336061o39304n0559L39170n43981O83104l49419P51174J48433m90339P42938
3291A927278K62564m99424q49252P6245o1275P8214Q1865K57198j71627K67295
3281A369081k78105m84695l29296m8219Q1703l1137k7168l75854m81215O78014
3271G3109o9081m83930N23239m43561J28817k25390k37839R45768J93060r8494
3261C05698k16793j306034K00324N03303J94094N4428m48094j53058M04842J55617
3251c05673k69284L51497L21506K51576n18133l00824R7272p4121K69622l98098
$$ plain form
3241 -574660 -524767 -29251 -78233 169110 42555 -368705 -823199 -993077 -961200 -288751
3231 -288751 -1281872 -414215 -369982 -107459 -217490 -441963 -78080 359666 167597 -692344
3221 -692344 -694658 68405 38450 16849 193316 174244 -109162 -476303 -14116 491975 862584
3210 862584 217487 8004 604939 879652 438396 421418 122223 -235830 -299763 -449277
3200 -449277 -39497 -224769 -379268 -345700 -338206 -1526 -582718 -404009 -351978 -307743 -244006
3189 -244006 -244303 -802882 -604909 -151433 -735129 -800439 -588473 -65995 -548290 -398536
3179 -398536 -103534 -375933 -805043 -324943 443494 435500 106102 -281077 202488 81224
3169 81224 -320330 -257625 -37968 624010 -224712 -252976 561878 132538 441810 -161594
$$ packed form
3241e74660M9893M95516m8982K47343j26555m11260m54494j69878L1877O72449
3231b88751r93121Q67657M4233K62523j10031k24473L63883M37746j92069q59941
3221f92344k314P63063k9955k1601J76467j9072k83406l67141M62187N06091L70609
3210H62584o45097k09483N96935K74713m41256j6978k99195l58053o3933j49514
3200d49277M09780j85272j54499L3568P494L36680n81192J78709N2031M4235O3737
3189b44006k97n58579J97973M53476n83696o5310K11966N22478m82295J49754
3179c98536K95002k72399m29110M80100P68437p994l29398l87179M83565j21264
3169H1224m01554O2705K19657O61978q48722k8264Q14854m29340L09272o03404
$$ plain form
3159 -161594 -71313 484065 265109 -77152 -45533 -210105 -141810 165680 276582 -175791
3149 -175791 -95053 -238810 -314916 -273708 -52053 365248 -217919 -505281 -638774 -332956
3139 -332956 -625892 -761234 -291299 -284080 -678462 -338590 -299174 -677062 -453015 -640773
3129 -640773 -388031 -357127 8100 58044 -153371 -49086 -222868 -14773 469951 101552
3119 101552 -632033 -207010 -139633 -290303 -270694 -918085 -1319975 -306814 271207 -173116
3109 -173116 -59616 169604 -408719 -28159 -231722 -848469 -364818 -504050 607018 672148
3099 672148 367991 160995 245285 541163 188143 13413 521785 140986 -454870 -563902
3089 -563902 -391295 -122600 -257128 371111 -207274 -712566 -580042 -80754 -196134 -73663
$$ packed form
3159a61594R0281N55378k18956l42261L1619j64572O8295L07490J10902m52373
3149a75791Q0738j43757p6106M1208K21655M17301n83167k87362j33493L05818
3139c32956k92936j35342M69935P219l94382L39872L9416l77888K24047j87758
3129f40773K52742L0904L65227M9944k11415J04285j73782K08095M84724l68399
3119A01552p33585M25023O7377j50670J9609o47391m01890J013161N78021m44323
3109a73116J13500K29220n78323L80560k03563o16747M83651j39232J111068O5130
3099F72148l04157k06996Q4290K95878l53020j74730N08372l80799n95856j09032
3089e63902J72607K68695j34528O28239n78385n05292J32524M99288j15380J22471
$$ plain form
3079 -73663 -613384 -366859 -468339 -517237 -767128 -667892 -73921 89592 9134 -1030987
3069 -1030987 -971035 -1058067 -535252 -215519 15769 409614 328288 233193 95729 -389207
3059 -389207 294384 757051 260885 1449 251174 834569 715329 470866 1061099 336317
3049 336317 99682 258265 -32102 706762 818303 290884 29084 -282063 13751 79331
3039 79331 294246 266508 -64178 -352967 -337884 -253831 -105019 444555 111445 229905
3029 229905 -427725 161662 620502 203783 -249454 330284 495104 135157 475105 452559
3019 452559 548138 426186 929702 1044321 537788 377211 637789 334024 403496 310192
3009 310192 133082 352266 354076 -721691 -346866 -174488 343700 452297 267310 768089
$$ packed form
3079g3663n39721K46525j01480m8898k49891R9236N93971J63513q0458j040121
3069a030987N9952q7032N22815L19733K31288L93845q1326r5095j37464m84936
3059c89207O83591M62667m96166k59436K49725N83395j19240k44463N90233p24782
3049C36317k36635J58583k90367P38864J11541n27419k61800l11147K95814O5580
3039G9331K14915k7738l30686k88789J5083Q4053J48812N49574l33110J18460
3029B29905o57630N89387M58840m16719m53237N79738J64820l59947L39948k2546
3019D52559R5579j21952N03516J14619n06533j60577K60578l03765O9472r3304
3009C10192j77110K19184J810j075767L74825J72378N18188J08597j84987N00779
$$ plain form
2999 768089 726527 841321 667808 1610549 1697653 1407090 860663 818778 1004975 739137
2989 739137 694343 435064 431559 397442 96361 -8401 -96832 -318470 381674 -296581 -455661
2978 -455661 -632135 -968285 -371058 -716390 -196545 11361 -322008 -1057914 -907354 138265
2968 138265 -394087 -589432 -592749 -894838 102624 -196001 -481498 -14621 360420 259230
2958 259230 87186 490527 311916 16945 201283 359343 187500 -74158 -489379 -500748
2948 -500748 -142824 -350305 216075 64215 292572 -9713 255177 524055 -425069 -365226
2938 -365226 -137157 -341975 -543160 19652 -284515 -438597 54654 346898 110522 30441
2928 30441 -505574 -550666 -48679 210493 712802 446153 239130 60724 -419119 17484
$$ packed form
2999G68089m1562J14794j73513R42741Q7104k90563n46427m1885J86197k65838
2989G39137m4794k59279l505l4117l01081j04762q8431k21638P00144o78255j59080
2978d55661j76474l36150N97227l45332N19845K07906l33369p35906J50560J045619
2968A38265n32352j95345l317l02089R97462k98625k85497M66877L75041j01190
2958B59230j72044M03341j78611k94971J84338J58060j71843k61658m15221j1369
2948e00748L57924k07481N66380j51860K28357l02285K64890K68878r49124N9843
2938c65226K28069k04818k01185N62812l04167j54082M93251K92244k36376q0081
2928C0441n36015m5092N01987K59172N02309k66649k07023j78406m79843M36603
$$ plain form
2918 17484 67991 19807 269123 158372 -179254 -1124919 -852351 -1381033 -915184 -931465
2908 -931465 -887161 -71084 290321 166797 18233 221635 323521 -153867 -533899 -580479
2898 -580479 56387 25651 -106333 -147099 -210804 -114770 -475160 -431359 -452893 -768778 -1088993
2887 -1088993 -797048 -800324 -367671 -105400 -34095 -843793 -1092101 -698729 -170413 -201507
2877 -201507 -24665 -152542 -235034 427531 -62656 -554844 -172822 -365324 109157 -14851
2867 -14851 -52939 366493 316312 139288 230398 120207 -550591 -466382 219643 683485 20173
2856 20173 -84696 -396414 -500816 -200358 -279490 -413265 -334296 81738 458 613309
2846 613309 -330632 -78184 -591256 -1072131 -676916 -144510 451228 411534 251306 -149178
$$ packed form
2918A7484N0507m8184K49316j10751l37626r45665K72568n28682M65849j6281
2908i31465M4304Q16077L61405j23524j48564K03402J01886m77388l80032m6580
2898e80479O36866l0736j31984m0766o3705R6034l60390M3801k1534l15885l20215
2887a088993K91945l276M32653K62271P1305q09698k48308L93372N28316l1094
2877b01507J76842j27877q2492O62565m90187m92188L82022j92502M74481j24008
2867a4851l8088M19432n0181j77024R1110j10191o70798Q4209O86025M63842o63312
2856B0173j04869l11718j04402L00458p9132j33775P8969M16034q1280O12851
2846F13309r43941K52448n13072m80875L95215N32406N95738l9694j60228m00484
$$ plain form
2836 -149178 -147474 -267468 -48208 -103465 37779 -125052 -372635 -350866 260584 97925
2826 97925 -350298 -364545 -395267 -32103 -1064783 -497126 260504 -376564 -94986 156622
2816 156622 177821 48511 -616409 -258166 73790 501333 -59455 -459332 169354 489056
2806 489056 243977 125102 -150361 -763687 -513797 -201925 -571561 -904034 115351 26229
2796 26229 139142 134765 -556287 -1077057 -781255 -604046 159333 183930 -219480 -9896
2786 -9896 -657136 -1224321 -32543 51573 -738625 -260874 -209533 -126028 -633413 -700159 -417221
2775 -417221 73156 204662 169428 57573 321427 -30918 -601646 -723156 -541646 -347810
2765 -347810 -357678 -27921 -20461 233464 197274 77293 -502756 -320163 -691993 -338726 -296570
$$ packed form
2836a49178J704j19994K19260n5257J41244j62831k47583K1769O11450j62659
2826I7925m48223j4247l0722L63164j032680N67657P57630o37068K81578K51608
2816A56622K1199j29310o64920L58243L31956M27543n60788l99877O28686L19702
2806D89056k45079j18875k75463o13326K49890L11872l69636l32473J019385q9122
2796B6229J12913m377o91052n20770K95802J77209P63379K4597m03410K09584
2786i896o47240n67185J191778Q4116p90198M77751N1341Q3505n07385o6746K82938
2775d17221M90377J31506l5234j11855K63854l52345n70728j21510J81510J93836
2765c47810r868L29757P460K53925l6190j19981n80049J82593l71830L53267M2156
$$ plain form
2754 -296570 -723655 -707130 -595679 -531881 -282198 -16861 -49368 -305948 683309 780649
2744 780649 271389 67884 17763 -102057 -6572 174088 374241 501372 418140 46211
2734 46211 -361439 -259655 -684968 -1610265 -1209080 -1017008 -1194140 -1035333 -1113075 -869365
2724 -869365 -491779 -768095 -828848 413951 37583 82638 -142064 -579057 -94276 -23339
2714 -23339 -362939 133386 -5084 19800 -289114 -711106 -945136 -1253261 -1033679 -606809
2704 -606809 -175529 -125802 174755 194144 3389 -290589 -260193 343532 380757 431881 -370498
2693 -370498 -712376 257904 257833 -318335 -118549 493373 342781 -211160 -251988 160116 -199508
2682 -199508 -33784 -552003 -307493 446002 -210681 -268380 -435824 -830828 -511561 -420319
$$ packed form
2754b96570m27085J6525J11451O3798K49683K65337l2507k56580R89257R7340
2744G80649n09260k03505n0121j19820R5485J80660K00153J27131q3232l71929
2734D6211m07650J01784m25313r25297M01185J92072j77132J58807p7742K43710
2724h69365L77586k76316o0753J242799l76368M5055k24702m36993M84781P0937
2714b3339l39600M96325j38470K4884l08914m21992k34030l08125K19582M26870
2704f06809M31280M9727L00557J9389j90755k93978L0396O03725L7225N1124q02379
2693c70498l41878R70280p1n76168J99786O11922j50592n53941m0828M12104l59624
2682a99508J65724n18219K44510P53495o56683n7699j67444l95004L19267R1242
$$ plain form
2672 -420319 -529408 -303888 -366454 -237291 -927662 -1122086 -348545 -134678 -893061 -470365
2662 -470365 -1051847 -859674 -475892 -690189 -722454 -461178 -234706 -655708 -84018 -358047
2652 -358047 -667764 -938655 -834831 -144064 -20209 65387 -208164 -432840 66131 -52206
2642 -52206 -387356 -400996 2716 -665244 -533789 -261483 -106225 -266572 -429071 384879
2632 384879 199701 -178554 429200 287237 117977 322814 612137 390643 -139363 -901341
2622 -901341 -398950 -39114 -98332 387092 504335 14228 456130 59199 -591983 -60763
2612 -60763 230865 938177 -94454 -142016 480111 288264 -27165 62220 323167 586667
2602 586667 -4326 -167799 -477959 -1022206 -344641 -863454 -424196 -130320 -366076 290095
$$ packed form
2672d20319j09089K25520o2566J29163o90371j94424P73541K13867p58383M22696
2662d70365n81482J92173L83782k14297l2265K61276K26472m21002N71690k74029
2652c58047l09717k70891J03824O90767J23855Q5596k73551k24676M98971j18337
2642e2206l35150j3640M03712o67960J31455K72306J55258j60347j62499Q13950
2632C84879j85178l78255O07754j41963j69260K04837K89323k21494n30006p61978
2622i01341N02391L59836n9218M85424J17243m90107M41902l96931o51182N31220
2612f0763K91628P07312j032631m7562O22127j91847l15429Q9385K60947K63500
2602E86667n90993j63473l10160n44247O77565n18813M39258K93876k35756O56171
$$ plain form
2592 290095 -464788 -599649 -729292 -721831 -389048 -231052 -387980 -416710 -695030 -521107
2582 -521107 -340229 -157589 44854 69090 -160547 -296759 -728601 -564114 -492319 81042
2572 81042 41712 -177946 367796 578272 145917 -125060 -279829 -1224840 -576523 -79865
2562 -79865 -144764 53436 -373823 -399211 135869 180978 207718 -114394 -155638 41776 -327205
2551 -327205 -1123431 -902097 -628550 -869876 -667144 -297620 -352300 -805608 -325444 753089
2541 753089 316849 -472089 -59650 -527235 108684 427629 99576 -171648 -721536 -776798
2531 -776798 -496975 146319 701771 538533 546951 343184 459590 484525 183940 -162775
2521 -162775 -115579 -120630 -565376 -195833 194721 206360 -82355 446731 -69480 -816746
$$ packed form
2592B90095p54883j34861j29643P461L32783J57996j56928k8730k78320J73923
2582e21107J80878J82640K02443K4236k29637j36212m31842J64487P1795N73361
2572H1042l9330k19658N45742K10476m32355k70977j54769r45011O48317M96658
2562g9865o4899J98200m27259k5388N35080M5109K6740l22112m1244J97414l68981
2551c27205p96226K21334K73547k41326K02732L69524n4680m53308M80164J078533
2541G53089m36240p88938M12439m67585O35919L18945l28053k71224n49888n5262
2531g76798K79823O43294N55452j63238Q418k03767J16406K4935l00585l46715
2521a62775M7196n051m44746L69543L90554J1639k88715N29086n16211p47266
$$ plain form
2511 -816746 -948345 -198524 260936 527336 -141915 -72674 717832 846225 325608 514832
2501 514832 339362 240907 332212 -435253 -195255 580707 450352 956678 158137 63857
2491 63857 455994 332857 277621 684236 774151 591931 187145 423682 -235496 -491469
2481 -491469 187708 226948 532476 353249 137158 365763 554017 686188 562662 93884
2471 93884 -475526 -957796 -373302 51889 902422 773664 575910 214620 200339 134592
2461 134592 -107453 177058 129955 -124912 -178525 224554 117940 117031 290977 474308 454750
2450 454750 452128 630224 428730 94102 134079 9278 -11443 -464159 -682999 -229681
2440 -229681 139751 -38214 206084 -73893 -34095 282576 608140 144120 -490318 -247549
$$ packed form
2511h16746j31599P49821M59460K66400o69251O9241P90506J28393n20617J89224
2501E14832j75470r8455R1305p67465K39998P75962j30355N06326p98541r4280
2491F3857L92137j23137n5236M06615Q9915j82220m04786K36537o59178k55973
2481d91469O79177L9240L05528j79227k16091K28605J88254J32171j23526m68778
2471I3884n69410m82270N84494M25191Q50533j28758j97754l61290j4281o5747
2461A34592k42045K84511m7103k54867n3613M03079j06614r09J73946J83331j9558
2450D54750k622J78096k01494l34628L9977j24801k0721m52716k18840M53318
2440b29681L69432j77965K44298k79977L9798L16671L25564m64020o34438K42769
$$ plain form
2430 -247549 -336217 -315157 -11664 344548 478946 689845 265098 456436 -101672 -364914
2420 -364914 -114589 186522 -624683 -464755 78391 -373130 -405045 194138 374041 662636
2410 662636 120238 64404 -30116 112461 343430 301024 -196737 -512977 -404740 -502889
2400 -502889 -546883 -312833 372376 170875 69183 27337 -683720 -530648 -793514 -107837
2390 -107837 270616 149226 -347486 -577266 -319231 90290 -286701 -279811 -643499 -69578
2380 -69578 192869 -4704 275736 -477871 -572321 125022 212867 178709 228547 146908 334052
2369 334052 -48762 42937 -5610 443061 353070 471797 536551 466345 236640 322694 391129
2358 391129 738315 171336 277576 283183 289531 408000 -33616 -242163 -47125 108530
$$ packed form
2430b47549q8668K1060L03493L56212J34398K10899m24747J91338n58108k63242
2420c64914K50325L01111q11205J59928N43146m51521l1915N99183J79903K88595
2410F62636n42398n5834r4520J42577K30969m2406m97761l16240J08237r8149
2400e02889m3994K34050O85209k01501j01692m1846p11057J53072k62866O85677
2390a07837L78453j21390m96712k29780K58035M09521l76991O890l63688N73921
2380f9578K62447j97573K80440p53607r4450O97343Q7845l4158M9838q1639J87144
2369C34052l82814R1699m8547M48671q9991J18727O4754p0206k29705Q6054O8435
2358C91129L47186n66979J06240N607O348J18469m41616k08547J95038J55655
$$ plain form
2348 108530 -336654 208187 309728 1021780 492674 407330 445340 214622 605237 46818
2338 46818 728310 977561 777618 -2142 120968 92152 -448960 -267035 121433 617101
2328 617101 38539 38649 569114 394993 567508 592921 865900 696801 658985 803043 1108034
2317 1108034 1064762 1289590 368804 1004286 1046180 777845 1340954 940498 884587 627057
2307 627057 684443 1212228 1479901 1397740 1420324 1886934 1806289 1475619 1338323 1485367
2297 1485367 1752334 1248118 1257377 1746612 2048252 2774409 2043019 1563834 1828893 1909146
2287 1909146 1716950 1876508 2455683 2469808 2223870 1849610 2118588 2323839 2585004 2937232
2277 2937232 2284947 2393477 2425848 2665129 3073586 3014993 3587619 4002241 4478006 3951132
$$ packed form
2348A08530m45184N44841J01541P12052n29106q5344L8010k30718L90615n58419
2338D6818O81492K49251j99943p79760J23110k8816n41112J81925L88468M95668
2328F17101n78562J10N30465j74121J72515K5413K72979j69099l7816J44058L04991
2317A108034m3272K24828r20786O35482M1894k68335N63109m00456n5911k57530
2307F27057N7386N27785K67673q2161K2584M66610q0645l30670j37296J47044
2297A485367K66967n04216R259M89235L01640P26157p31390m79185K65059Q0253
2287A909146j92196J59558N79175J4125k45938l74260K68978K05251K61165L52228
2277B937232o52285J08530L2371K39281M08457n8593N72626M14622M75765n26874
$$ plain form
2267 3951132 4616012 5078834 4706143 4984450 5679476 5399201 5449515 6135597 6491584 7009078
2257 7009078 6904600 6881189 7832275 8298502 8917031 9628814 10722507 11869867 12823439
2248 12823439 13479189 14899558 15985358 17421672 18871916 19885618 20569727 20760649 21957957
2239 21957957 23719362 25735736 27535306 29775536 31496606 33718920 35669364 37727305
2231 37727305 40929047 44578143 47442618 51056796 56132454 62346548 70037075 79646820
2223 79646820 90008291 101751762 116927805 127985628 127254751 119973774 109671709 93536516
2215 93536516 77775471 65473308 55325056 46516557 40006371 34981172 30234211 27580523
2207 27580523 25583906 23112023 21462740 19682676 18218509 16552291 15154829 14146234
$$ packed form
2267C951132O64880M62822l72691K78307O95026k80275N0314O86082L55987N17494
2257G009078j04478k3411R51086M66227O18529P11783J093693J147360R53572
2248A2823439O55750J420369J085800J436314J450244J013702O84109J90922J197308
2239B1957957J761405K016374J799570K240230J721070K222314J950444K057941
2231C7727305L201742L649096K864475L614178N075658O214094P690527R609745
2223G9646820J0361471J1743471J5176043J1057823p30877p280977j0302065j6135193
2215I3536516j5761045j2302163j0148252q808499o510186n025199m746961k653688
2207B7580523j996617k471883j649283j780064j464167j666218j397462j008595
$$ plain form
2199 14146234 12840405 11717362 11273331 10872614 9749239 9784281 8880212 7957267 8285675
2190 8285675 8059497 7336643 6854444 6256435 5788212 5796546 5143010 4925599 5069723 4911740
2180 4911740 4116973 4172122 4290479 3935966 3556859 3897198 3981854 3423789 2666326 2609816
2170 2609816 2366113 2265177 1844331 1815813 2672330 2985521 2719367 3319137 3021811 2357366
2160 2357366 2160032 1635890 1666411 1806934 2091525 1997542 1609827 1538325 1223459 767225
2150 767225 958229 750907 256943 245440 1160209 1330645 735743 1645063 1543956 1230462
2140 1230462 1312139 1316548 1702626 497440 953344 1686787 1841547 1084101 943930 645965
2130 645965 1107524 899676 1178197 962602 1214755 1660003 1668584 1229712 1020888 1169318
$$ packed form
2199A4146234j305829j123043m44031m00717j123375L5042r04069r22945L28408
2190H285675k26178p22854m82199n98009m68223Q334o53536k17411J44124j57983
2180D911740p94767N5149J18357l54513l79107L40339Q4656n58065p57463n6510
2170B609816k43703j00936m20846k8518Q56517L13191k66154N99770k97326o64445
2160B357366j97334n24142L0521J40523K84591r3983l87715p1502l14866m56234
2150G67225J91004k07322m93964j1503R14769J70436n94902R09320j01107l13494
2140A230462Q1677M409L86078j205186M55904P33443J54760p57446j40171k97965
2130F45965M61559k07848K78521k15595K52153M45248Q581m38872k08824J48430
$$ plain form
2120 1169318 832296 785225 1127458 1137539 1093278 1185798 702612 446426 321989 385820
2110 385820 638637 576215 -77129 618448 -226891 -209767 173419 108303 127393 165583 554958
2099 554958 59525 633782 714457 333351 795366 396221 616580 459703 178117 544264
2089 544264 799575 806201 922345 296857 251902 647895 241619 419640 161973 404434
2079 404434 576628 401969 184156 98877 -48708 217565 461045 602348 164666 -316968
2069 -316968 -59517 -256632 -702272 -640197 -323506 161707 -9584 147104 -146681 -405983
2059 -405983 -205403 329369 1008575 566446 970874 87289 -323754 92340 18396 -214384
2049 -214384 -457442 -278488 -177089 118000 -597775 -569610 -476943 -235308 -413164 -667980
$$ packed form
2120A169318l37022m7071L42233J0081m4261R2520m83186k56186j24437O3831
2110C85820K52817o2422o53344O95577q45339J7124L83186o5116J9090L8190L89375
2099E54958m95433N74257Q0675l81106M62015l99145K20359j56877k81586L66147
2089E44264K55311O626J16144o25488m4955L95993m06276J78021k57667K42461
2079D04434J72194j74659k17813q5279j47585K66273K43480J41303m37682m81634
2069c16968K57451j97115m45640O2075L16691M85213j71291J56688k93785k59302
2059d05983K00580N34772O79206m42129M04428q83585m11043M16094p3944k32780
2049b14384k43058J78954J01399K95089p15775K8165R2667K41635j77856k54816
$$ plain form
2039 -667980 -621981 -259113 86850 58339 85941 424671 769179 180696 520943 234450
2029 234450 367492 -420886 -413937 104913 -425101 -72137 228665 141904 51287 -628799
2019 -628799 -710057 -887721 -293603 -364942 -384760 -633444 -228156 -113627 -359324 -383281
2009 -383281 -45613 284825 -331994 -458833 -372786 -44236 588196 425016 22302 340390
1999 340390 395588 -202935 -136675 48838 -169472 -579065 -668944 261689 -77921 -170736
1989 -170736 -514630 -112464 473395 244943 -54953 -683732 -339170 -242147 -130816 367913
1979 367913 32144 -161650 -106493 336781 179875 367505 -169083 141071 91948 -133521
1969 -133521 -106594 305374 -643771 -262933 656214 511046 464647 512265 139622 -150508
$$ packed form
2039f67980M5999L62868L45963k8511K7602L38730L44508n88483L40247k86493
2029B34450J33042p88378O949N18850n30014L52964L00802q6761r0617o80086
2019f28799q1258j77664N94118p1339j9818k48684M05288J14529k45697k3957
2009c83281L37668L30438o16819j26839Q6047L28550O32432j63180m02714L18088
1999C40390N5198n98523O6260J85513k18310m09593q9879R30633l39610r2815
1989a70736l43894M02166N85859k28452k99896o28779L44562R7023J11331M98729
1979C67913l35769j93794N5157M43274j56906J87630n36588L10154m9123k25469
1969a33521K6927M11968r49145L80838R19147j45168m6399M7618l72643k90130
$$ plain form
1959 -150508 136220 492844 462970 171163 464155 -93747 -342125 -85229 867715 1143120
1949 1143120 982636 541922 367155 209408 7877 318257 171102 -469602 135938 -107126
1939 -107126 -217506 -245902 70286 630110 777554 1301093 1047137 381496 -27262 117341
1929 117341 246256 302801 85031 -567551 -169233 -850923 -1428434 -618700 -431184 -653802
1919 -653802 -516283 -508316 -630679 304895 -340444 -768884 -588504 -172026 -148956 -143781 129
1908 129 -65194 -79384 -192314 295705 -198836 -63960 -194882 -316684 -239117 -539100 -685634
1897 -685634 -803139 -332355 248589 -259989 -438380 -433934 -61411 295328 165521 -3625
1887 -3625 313586 392266 -27112 45982 -537779 -843354 7509 774134 226280 290354 -95945
$$ packed form
1959a50508K86728L56624k9874k91807K92992n57902k48378K56896R52944K75405
1949A143120j60484m40714j74767j57747k01531L10380j47155o40704O05540k43064
1939a07126j10380k8396L16188N59824J47444N23539k53956o65641m08758J44603
1929A17341J28915N6545k17770o52582L98318o81690n77511Q09734J87516k22618
1919f53802J37519P967j22363R35574o45339m28440J80380M16478K3070N175J43910
1908A29o5323j4190j12930M88019m94541J34876j30922j21802P7567k99983j46534
1897f85634j17505M70784N80944n08578j78391M446L72523L56739j29807j69146
1887c625L17211P8680m19378P3094n83761l05575Q50863P66625n47854O4074l86299
$$ plain form
1876 -95945 -829599 -436439 -361293 -717885 -28709 793995 112889 -49900 154666 210104
1866 210104 -464347 -893330 -774256 -777389 -725602 -847367 -611178 -871021 -152572 308735
1856 308735 -64714 -27879 -393946 -687402 -624341 140751 -420019 -422096 -382120 186142 746435
1845 746435 -46050 -306867 225966 617905 523659 353917 -225197 -408367 -568268 -55887
1835 -55887 -36092 35097 104507 575266 444551 -182221 -53959 -98473 480308 46472 -862900
1824 -862900 -786868 -878136 -1386368 -1215662 -590332 -91350 -226689 3828 25482 -678704
1814 -678704 -722249 -693433 -408683 -538416 -535595 -552288 -375013 -18192 -277752 178419 82818
1803 82818 -207998 -111647 -142034 -206539 -348748 156234 -74362 -394391 -744295 -399006
$$ packed form
1876i5945p33654L93160P5146l56592O89176Q22704o81106j62789K04566N5438
1866B10104o74451m28983J19074l133N1787j21765K36189k59843P18449M61307
1856C08735l73449L6835l66067k93456O3061P65092n60770k077L9976N68262N60293
1845G46435p92485k60817N32833L91939r4246j69742n79114j83170j59901N12381
1835e5887J9795P1189O9410M70759j30715o26772J28262m4514N78781m33836r09372
1824h62900P6032r1268n08232J70706O25330M98982j35339K30517K1654p04186
1814f78704m3545K8816K84750j29733K821j6693J77275L56821k59560M56171r5601
1803H2818k90816R6351l0387o4505j42209N04982k30596l20029l49904L45289
$$ plain form
1793 -399006 -682338 -1247983 -1082782 -817978 -652518 -226901 -120496 -54106 -238446 -380443
1783 -380443 -53953 523720 298263 -349741 -894180 -746270 -821984 -753044 -302411 -108068
1773 -108068 -479881 -481188 -348915 -299067 -2507 98639 -319130 -62625 711670 1001146
1763 1001146 184045 -249136 -966874 -814971 -344949 -8370 42819 -1099509 -812868 -293597
1753 -293597 -390883 -461022 163287 -509659 -481389 -685186 -192224 164222 -72038 -405348
1743 -405348 -367421 -161072 -57198 -556809 -683181 -231706 -72103 -662861 -549557 6132
1733 6132 540811 152476 -75724 -183554 131276 233843 -208702 -1017963 -320898 -465849
$$ packed form
1793c99006k83332n65645J65201K64804J65460M25617J06405O6390j84340j41997
1783c80443L26490N77673k25457o48004n44439J47910p5714O8940M50633J94343
1773a08068l71813j307J32273M9848K96560J01146m17769K56505P74295K89476
1763A001146q17101m33181p17738J51903M70022L36579N1189j142328K86641N19271
1753b93597r7286p0139O24309o72946K8270k03797M92962L56446k36260l33310
1743d05348L7927K06349J03874m99611j26372M51475J59603n90758J13304N55689
1733F132N34679l88335k28200j07830L14830J02567m42545q09261O97065j44951
$$ [...]
##END NTUPLES=NMR SPECTRUM
##END=
