##TITLE=1H_CG-1188-D1
 DMSO
 8 sc, 
 1.7.2024
##JCAMPDX= 6.0         $$ Bruker NMR JCAMP-DX V2.0
##DATA TYPE= NMR SPECTRUM
##DATA CLASS= NTUPLES
##ORIGIN= UXNMR, Bruker Analytische Messtechnik GmbH
##OWNER= root
$$ XWIN-NMR		Version 3.5
$$ Mon Jul  1 14:00:18 2024 Russian Standard Time (UT+4h)  she@DPX200
##.OBSERVE FREQUENCY= 200.1313
##.OBSERVE NUCLEUS= ^1H
##.ACQUISITION MODE= SIMULTANEOUS
##.ACQUISITION SCHEME= undefined
##.AVERAGES= 8
##.DIGITISER RES= 18
##SPECTROMETER/DATA SYSTEM= spect
##.PULSE SEQUENCE= zg30
##.SOLVENT NAME= D2O
##.SHIFT REFERENCE= (INTERNAL, D2O, 0, 15.4858)
##AUDIT TRAIL= $$ (NUMBER, WHEN, WHO, WHERE, WHAT)
$$ ##TITLE= Audit trail, XWIN-NMR		Version 3.5
$$ ##JCAMPDX= 5.01
$$ ##ORIGIN= Bruker BioSpin GmbH
$$ ##OWNER= she
$$ F:/spectra/data/she/nmr/H-F/1/pdata/1/auditp.txt
$$ ##AUDIT TRAIL=  $$ (NUMBER, WHEN, WHO, WHERE, WHAT)
(   1,<2024-07-01 13:59:00.78 +0400>,<she>,<DPX200>,
      <created by zg, POWCHK disabled, PULCHK disabled
       configuration hash MD5:
       00 E9 B6 7A A2 85 ED C7 34 08 36 98 17 FE 4E 26
       data hash MD5: 16K
       52 A9 1B 40 8C 73 55 1E 3A 4D FE C0 F6 FA 3D 4C>)
(   2,<2024-07-01 13:59:03.18 +0400>,<she>,<DPX200>,
      <Start of raw data processing
       efp BC_mod = 2 LB = 0.24 FT_mod = 6 PKNL = 1 PHC0 = -25234.14 PHC1 = 12.58748 SI = 16K 
       data hash MD5: 16K
       7F FC B4 17 F4 E6 5F 4A B4 FE 63 8B 92 B9 42 0A>)
(   3,<2024-07-01 13:59:31.71 +0400>,<she>,<DPX200>,
      <pk PHC0 = -170.7645 PHC1 = 4.4 
       data hash MD5: 16K
       99 75 F1 FC 0F 3E 02 8E C4 DF 5E E3 A3 FC F5 7D>)
(   4,<2024-07-01 13:59:35.59 +0400>,<she>,<DPX200>,
      <abs ABSG = 5 
       data hash MD5: 16K
       BF 11 51 C2 AD D0 B9 E3 3A C4 9D 72 73 80 F6 3B>)
$$ ##END=
$$ 
$$ hash MD5
$$ DA D5 8C 38 1C 0C 1C 4C 99 7E B0 C2 F8 20 0E 5C
##$RELAX= 
##$RELAX= 
##$RELAX= 
##$RELAX= 
##$RELAX= 
##$RELAX= 
$$ Bruker specific parameters
$$ --------------------------
##$DU= <F:/spectra>
##$EXPNO= 1
##$NAME= <H-F>
##$PROCNO= 1
##$TYPE= <nmr>
##$USER= <she>
##$AMP= (0..31)
100 100 100 100 100 100 100 100 100 100 100 100 100 100 100 100 100 100 
100 100 100 100 100 100 100 100 100 100 100 100 100 100 
##$AQSEQ= 0
##$AQ_mod= 1
##$AUNM= <au_zg>
##$AUTOPOS= <>
##$BF1= 200.13
##$BF2= 200.13
##$BF3= 200.13
##$BF4= 200.13
##$BF5= 200.13
##$BF6= 200.13
##$BF7= 200.13
##$BF8= 200.13
##$BYTORDA= 1
##$CFDGTYP= 0
##$CFRGTYP= 5
##$CHEMSTR= <none>
##$CNST= (0..31)
1 1 145 1 1 1 1 1 1 1 1 1 1 1 1 1 1 1 1 1 1 1 1 1 1 1 1 1 1 1 1 1 
##$CPDPRG= <>
##$CPDPRG1= <>
##$CPDPRG2= <>
##$CPDPRG3= <>
##$CPDPRG4= <mlev>
##$CPDPRG5= <mlev>
##$CPDPRG6= <mlev>
##$CPDPRG7= <mlev>
##$CPDPRG8= <mlev>
##$CPDPRGB= <>
##$CPDPRGT= <>
##$D= (0..31)
0 1.2 0 0 0 0 0 0 0 0.06 0 0.03 0 0 0 0 0.0002 0 0 0 0 0 0 0 0 0 0 0 0 
0 0 0 
##$DATE= 1719827940
##$DBL= (0..7)
120 120 120 120 120 120 120 120 
##$DBP= (0..7)
150 150 150 150 150 150 150 150 
##$DBP07= 0
##$DBPNAM0= <>
##$DBPNAM1= <>
##$DBPNAM2= <>
##$DBPNAM3= <>
##$DBPNAM4= <>
##$DBPNAM5= <>
$$ [...]
##$SUBNAM3= <"">
##$SUBNAM4= <"">
##$SUBNAM5= <"">
##$SUBNAM6= <"">
##$SUBNAM7= <"">
##$SUBNAM8= <"">
##$SUBNAM9= <"">
##$SW= 18.0517328524113
##$SWIBOX= (0..15)
0 0 2 0 0 0 0 0 0 0 0 0 0 0 0 0 
##$SW_h= 3612.71676300578
##$TD= 16384
##$TD0= 1
##$TE= 0
##$TE2= 300
##$TE3= 300
##$TEG= 300
##$TL= (0..7)
0 120 120 120 120 120 120 120 
##$TP= (0..7)
150 150 150 150 150 150 150 150 
##$TP07= 0
##$TPNAME0= <>
##$TPNAME1= <>
##$TPNAME2= <>
##$TPNAME3= <>
##$TPNAME4= <>
##$TPNAME5= <>
##$TPNAME6= <>
##$TPNAME7= <>
##$TPOAL= (0..7)
0.5 0.5 0.5 0.5 0.5 0.5 0.5 0.5 
##$TPOFFS= (0..7)
0 0 0 0 0 0 0 0 
##$TUNHIN= 0
##$TUNHOUT= 0
##$TUNXOUT= 0
##$USERA1= <user>
##$USERA2= <user>
##$USERA3= <user>
##$USERA4= <user>
##$USERA5= <user>
##$V9= 5
##$VALIST= <valist>
##$VCLIST= <CCCCCCCCCCCCCCC>
##$VD= 0
##$VDLIST= <DDDDDDDDDDDDDDD>
##$VPLIST= <PPPPPPPPPPPPPPP>
##$VTLIST= <TTTTTTTTTTTTTTT>
##$WBST= 1024
##$WBSW= 4
##$XGAIN= (0..3)
0 0 0 0 
##$XL= 0
##$YL= 0
##$YMAX_a= 300001
##$YMIN_a= -328716
##$ZGOPTNS= <>
##$ZL1= 120
##$ZL2= 120
##$ZL3= 120
##$ZL4= 120
##$ABSF1= 15.48576
##$ABSF2= -2.56609
##$ABSG= 5
##$ABSL= 3
##$ALPHA= 0
##$AQORDER= 0
##$ASSFAC= 0
##$ASSFACI= 0
##$ASSFACX= 0
##$ASSWID= 0
##$AUNMP= <proc_1d>
##$AZFE= 0.1
##$AZFW= 0.1
##$BCFW= 0
##$BC_mod= 2
##$BYTORDP= 0
##$COROFFS= 0
##$CY= -3
##$DATMOD= 1
##$DC= 0
##$DFILT= <>
##$DTYPP= 0
##$F1P= 0
##$F2P= 0
##$FCOR= 1
##$FTSIZE= 16384
##$FT_mod= 6
##$GAMMA= 0
##$GB= 0
##$INTBC= 1
##$INTSCL= 3.70164e-10
##$ISEN= 128
##$LB= 0.24
##$LEV0= 0
##$LPBIN= 0
##$MAXI= 10000
##$MC2= 0
##$MEAN= 0
##$ME_mod= 0
##$MI= 1.114404
##$NCOEF= 0
##$NC_proc= -5
##$NLEV= 6
##$NOISF1= 3.799351
##$NOISF2= 2.8
##$NSP= 0
##$NTH_PI= 0
##$NZP= 0
##$OFFSET= 15.48576
##$PC= 1
##$PHC0= -25404.9
##$PHC1= 16.98748
##$PH_mod= 1
##$PKNL= yes
##$PPARMOD= 0
##$PSCAL= 0
##$PSIGN= 0
##$REVERSE= no
##$SF= 200.130007192694
##$SI= 16384
##$SIGF1= 3
##$SIGF2= 2
##$SINO= 5.538805
##$SIOLD= 16384
##$SREGLST= <1H.CDCl3>
##$SSB= 0
##$STSI= 16384
##$STSR= 0
##$SW_p= 3612.71676300578
##$SYMM= 0
##$S_DEV= 0
##$TDeff= 16384
##$TDoff= 0
##$TI= <>
##$TILT= no
##$TM1= 0
##$TM2= 0
##$TOPLEV= 0
##$USERP1= <user>
##$USERP2= <user>
##$USERP3= <user>
##$USERP4= <user>
##$USERP5= <user>
##$WDW= 1
##$XDIM= 16384
##$YMAX_p= 393248327
##$YMIN_p= -25416
$$ End of Bruker specific parameters
$$ ---------------------------------
##NTUPLES= NMR SPECTRUM
##VAR_NAME=  FREQUENCY,     SPECTRUM/REAL,   SPECTRUM/IMAG
##SYMBOL=    X,             R,               I
##VAR_TYPE=  INDEPENDENT,   DEPENDENT,       DEPENDENT
##VAR_FORM=  AFFN,          ASDF,            ASDF
##VAR_DIM=   16384,         16384,           16384
##UNITS=     HZ,            ARBITRARY UNITS, ARBITRARY UNITS
##FACTOR=    0.220516191357247, 1,           1
##FIRST=     3099.16520717138, 0,            0
##LAST=      -513.551555834401, 0,           0
##MIN=       -513.551555834401, -25416,      0
##MAX=       3099.16520717138, 393248327,    0
$$ Real data points
##PAGE= N=1
##DATA TABLE= (X++(R..R)), XYDATA
$$ [...]
6882A479N42j040k864o73K327J097Q4L57k886J94j310o86K008n07J373J583j161
6865h3l024J259j67j292j898L216J18P3k190J900J582O09J849l842J161L635m95
6848B411l814k078J966Q67K352J987j613l337O06j48J868K39j523K83K470l730
6832a194p19l103K813J081j197m892n11M278M141l87k929j624J27N348N132l230
6816C134k609l44l19N34j547N79K026J230j296m368J226K482J909l463J847p82
6800B39k097j15J629k390j488J696j323L680N02j902J447k025k541Q37J867J77
6784a807L356j297q42q30J79K274j56J079l165n411K919q5l397L761k469L669
6768b222j69M436j80o999J034J651j526k73K448R85K916R8m059p14L778N76l614
$$ plain form
6882 1479 2021 981 -1883 -2556 -229 868 952 1309 -1577 -1383 -2693 -3379 -1371 -1878 -505 1078 -83
6865 -83 -3107 -1848 -2015 -3307 -5205 -1989 -1871 -1798 -3988 -2088 -506 103 1952 -1890 -729 2906 2411
6848 2411 -1403 -3481 -1515 -648 1704 3691 2078 -1259 -653 -801 1067 1306 -217 66 2536 -1194
6832 -1194 -1913 -5016 -2203 -1122 -2319 -7211 -7722 -3444 697 310 -2619 -4243 -4116 1232 6364 3134
6816 3134 525 181 -138 396 -1151 -572 1454 2684 1388 -2980 -1754 728 2637 -826 1021 239
6800 239 -1858 -1973 -344 -2734 -4222 -2526 -3849 -169 333 -1569 -122 -2147 -4688 -3851 -1984 -1807
6784 -1807 1549 252 -590 -1420 -1241 1033 877 1956 -1209 -6620 -3701 -3786 -7183 -3422 -5891 -2222
6768 -2222 -2391 2045 1865 -5134 -4100 -2449 -3975 -4248 -1800 -815 2101 2199 -1860 -2574 1204 1780 -1834
6751a834p30J105k89j991K930J206o09L64k537K116L887j748k641k453P72n94
6735c046Q45J426O47j085K18J610p09j2k164k888k594L476K730K411N36j777l171
6718c547N44J85k026K007J328q6M369r71J484j343l148K42M5N75l204N59K04j217
6700d000l364L630O09N06p89K10L215k91j883K582n43q77O37j68J374r9k317k112
6682c680K471J921J030j260j688J230k92M44P98l327l361J972K816k653j073K343
6666b309k131K620J325M97O60K360j297j197J27j811L766N99m158J825L201J568
6650E645J439j087j605m65r02r91m88L933j792k326j996K40k317J657J528q7J08
6633D94k416J65j342L91K973j751N53K44J860j809l385L406K195j611k790O49
$$ plain form
6751 -1834 -2564 -1459 -1748 -3739 -809 397 -212 152 -2385 -269 3618 1870 -771 -3224 -2452 -3046
6735 -3046 -2201 -775 -128 -1213 -995 615 -94 -106 -2270 -5158 -7752 -4276 -1546 865 1401 -376 -3547
6718 -3547 -3003 -2818 -4844 -2837 -1509 -1595 2774 1803 3287 1944 -1204 -962 -917 -342 -3546 -2987 -2783 -4000
6700 -4000 -7364 -3734 -3125 -2619 -3408 -3198 17 -274 -2157 425 -118 -995 -358 -526 848 749 -1568 -3680
6682 -3680 -1209 712 1742 482 -1206 24 -268 176 974 -2353 -5714 -3742 -926 -3579 -4652 -2309
6666 -2309 -4440 -1820 -495 2 662 3022 1725 528 655 -1156 2610 3209 -949 876 4077 5645
6650 5645 7084 5997 4392 3927 3025 2034 1546 5479 3687 1361 -635 -395 -2712 -1055 473 386 494
6633 494 -1922 -1757 -3099 -2708 265 -1486 -933 -689 1171 -638 -4023 -617 1578 -33 -2823 -2174
6617b174K582r14o69J52j98k129P84M99q58J868j911l33j145O385j583P96J180
6600B332j424K937L3l169k411L282k42j180q30M021j030m264R09M495K002r81
6584D480k542l337L593N10k688l596j22m78J362j36q66J097K218N67J551q14J751
6567B550j70lk829K53P59M123k140j179l6j273J30n96K44J278j4J753n56K6j080
6548A240J90j525R14m12k193L720N70l283n74J350L632O76k747K123M036l793
6532C924k362K243R5J568k732l930J80K183j272J240J038J037M26p30J825N9j965
6515B827L9l0j339K130l60k61k478k77J929l46O90j61j78j118j062j455M251K337
6497E138M18R1j509l80K099m354l647K753N011k471l112j782J866K336k008j142
$$ plain form
6617 -2174 408 -506 -1175 -1023 -1221 -3350 -2566 -2067 -2925 -1057 -2968 -3301 -4446 1939 356 1152 2332
6600 2332 908 3845 3878 709 -1702 1580 1338 158 -672 3349 2319 -1945 -1036 3459 5461 4480
6584 4480 1938 -1399 2194 2704 16 -3580 -3702 -4180 -2818 -2954 -3820 -2723 -505 62 1613 799 2550
6567 2550 2380 2377 -452 -199 560 4683 2543 1364 1328 55 185 -411 -167 1111 1097 2850 2294 2320 1240
6548 1240 1430 -95 819 407 -1786 1934 2504 -779 -1353 -3 3629 4305 1558 3681 7717 3924
6532 3924 1562 3805 3900 5468 2736 -1194 -1014 1169 -103 1137 2175 3212 3638 2908 4733 4792 2827
6515 2827 2866 2836 1497 3627 3267 3006 528 251 2180 1834 2524 2363 2185 1067 5 -1450 2801 5138
6497 5138 5556 5647 4138 3758 5857 1503 -2144 609 5620 3149 37 -1745 121 2457 449 -693
6481f93r89J168K972R74k55J562l258p87o25j157J458l327J5J072N870Q11J422
6464F233J866l268k04Q12l544L31l202O05J670k3J441p11j77R65K8k78j545q87
6446A12l130K283J123j04j141n04K906M70J650o28j867O3O93o37j039N136N51
6429E937j746m207K741K904l221j784j8k25M09L694n8J075m50k386j252j140J047
6412A320J607m10N662l978m178J243l68k458J254m00O40M128l40j363J677L988
6396H024m130k112j164j17J686r92R82m44J884Q0j714k29R27j014J494j69k73
6379B719J707j118k063k628K972n06j525K035o72K151j767p65K225J296P10J888
6363F659l319l225L079q97N46j251Q59j465r13J236l858K596N298J188k701q55
$$ plain form
6481 -693 -1682 -514 2458 3432 3177 4739 1481 694 69 -1088 370 -2957 -2942 -1870 4000 4811 6233
6464 6233 8099 4831 4627 5439 1895 2226 -976 -371 1299 1276 2717 2006 1829 2794 2822 2544 999 112
6446 112 -3018 -735 388 284 -857 -1361 1545 2015 3665 3037 1170 1233 1926 1289 250 5386 5937
6429 5937 4191 -16 2725 5629 2408 624 606 381 790 4484 4426 5501 5051 2665 1413 273 1320
6412 1320 2927 2517 8179 4201 23 1266 898 -1560 -306 -706 -66 4062 3722 2359 4036 8024
6396 8024 3894 1782 618 501 2187 1195 2177 1733 3617 3697 1983 1754 2681 1667 3161 2992 2719
6379 2719 4426 3308 1245 -1383 1589 1083 -442 1593 921 3072 1305 540 2765 4061 4771 6659
6363 6659 3340 115 3194 2297 2843 1592 2451 986 73 1309 -2549 47 5345 6533 3832 2977
6347B977M46j803k308L743K7j523L480j783J485K89m15r74j624L942r65J327j400
6330D921Q63j692R25j116k08m67r41k73P27J8J152j045J843K614Q11j153p92J802
6312G989j102j505l45M242m746j973M518j43L33P53n99r90q39K23k067j164K56
6295B841o3k782r15N063l96j002J501N94J112j588j571m42J119P77j223J475J416
6278E916j059K003m5k571l17Q09o63J054j761m71L675k21k412m492L05K888P85
6261C423K290N8J413l188O38R93N64n76j281L038P62o16N97l652l4K220o32L375
6243I392n18j547j663K087k387j810P82K211K504j928k152k030j119j06K720p23
6227C713K77n63k591L934j206J08j398l388L084M233J415n59n544l472M386O34
$$ plain form
6347 2977 3423 1620 -688 3055 3082 1559 5039 3256 4741 5030 4615 3641 2017 5959 4994 6321 4921
6330 4921 5784 4092 5017 3901 3693 3226 2285 2012 2739 2757 3909 2864 4707 7321 8132 6979 6187 7989
6312 7989 6887 5382 5037 9279 4533 2560 7078 6935 7268 8021 7422 6432 5593 5816 3749 2585 2841
6295 2841 2778 -4 -919 4144 3748 2746 4247 4841 5953 4365 2794 2352 3471 4248 3025 4500 5916
6278 5916 4857 6860 6815 4244 3927 4736 4073 5127 3366 2895 6570 6349 3937 -555 -250 2638 3423
6261 3423 5713 5771 7184 3996 4634 5627 6191 5615 4334 7372 8134 7518 8115 4463 4429 6649 6017 9392
6243 9392 8874 7327 5664 7751 5364 3554 4336 6547 9051 7123 4971 2941 1822 1716 4436 3713
6227 3713 3990 3427 836 4770 3564 3672 2274 -1114 1970 6203 7618 7059 1515 -1957 2429 3063
6211C063K975L713n65k029J310q71k522j485k39O35L54k77K900l98O10k485K022
6194F711N140J058k837j460l751K046J66l149mK748k377q17L679K856j668j800
6178F541l47L33j30k169j138J287K864P74j840L420k944j714M15K104J652L11
6162I419j229j736K59j57m82k16k83q54k294K041n3j0372P217M80L53M74l51J07
6144B323M20K201J976q86j411R91R45j296Q51j5K844j405m49K229p86O18N68k993
6126F725J309l0l586m69L746J757l283K194J311m308j518J586k039K116J419J100
6110H030J194j046R35N41l9m79K909k684Q87n236K838J453k428K263J186j44j366
6093H814K120l61j435k679J80K22K109K195K004k11j969j717r63k98O18J227n20
$$ plain form
6211 3063 6038 9751 9186 7157 8467 7596 5074 3589 3350 3985 4339 4062 6962 6564 7174 4689 6711
6194 6711 11851 12909 10072 8612 4861 6907 7073 3924 3920 6668 4291 3474 7153 10009 8341 6541
6178 6541 6194 6527 6397 4228 3090 4377 7241 8015 6175 9595 6651 4937 5352 7456 9108 9419
6162 9419 8190 6454 6713 6556 6074 5858 5575 4721 2427 4468 4415 -5957 1260 1740 2093 2567 2216 2323
6144 2323 2743 4944 6920 6034 4623 5614 6559 5263 6114 6099 8943 7538 7089 9318 8532 9150 9718 6725
6126 6725 8034 8004 4418 3949 7695 9452 6169 8363 9674 5366 3848 5434 3395 5511 6930 8030
6110 8030 9224 8178 9113 9654 9615 9136 12045 9361 10248 5012 7850 9303 6875 9138 10324 10180 8814
6093 8814 10934 10573 9138 6459 6639 6861 8970 11165 13169 12958 10989 9272 8309 8011 8629 9856 9336
6076I336j851J178L601o57o092N08L828m920l79N514J671q15k108l183j61P93
6060F263J09J231N76M47o75p63J959M0j450l057J281L660k820K31J798n15J379
6043I694J186J98j094l679R66m35k460K490l69K50j622L638K183K644j645k787
6027I158J706J977o35k985J932j63j817j109L027l206K769o80l120K794L192l577
6011I263N09K068J843j191k834q76J247p37O83M32k101o59M21N02J27K490j745
5994I442K419L19j325P28j155l431j042K053K919p25j223p78J056j848J180J738
5978A0327j178K905L45l849j28J63k421M187P45l036j266M440K969O57M29l254
5962A2035j818J720J494L63L95m38j508j202M29P45J042j591k989K410K30n45
$$ plain form
6076 9336 7485 8663 12264 11607 5515 6023 9851 4931 4552 10066 11737 10922 8814 5631 5470 6263
6060 6263 6372 7603 8179 8626 7951 7188 9147 9187 7737 4680 5961 9621 6801 7032 8830 8315 9694
6043 9694 10880 11078 9984 6305 7271 6836 4376 6866 6497 6747 5125 8763 10946 13590 11945 9158
6027 9158 10864 12841 12206 9221 11153 10990 9173 8064 11091 7885 10654 9974 6854 9648 12840 9263
6011 9263 9772 11840 13683 12492 9658 8782 10029 9292 9975 10407 8306 7647 8068 8570 8697 11187 9442
5994 9442 11861 12180 10855 11583 10428 6997 5955 8008 10927 10202 8979 8201 9257 7409 8589 10327
5978 10327 9149 12054 12399 8550 8422 8585 6164 10351 11096 8060 6794 11234 14203 14860 15289 12035
5962 12035 10217 11937 13431 13794 14189 13751 12243 11041 11470 12215 13257 11666 8677 11087 11317 10772
5946A0772j307n65j105J31l90J787N20M54R0j053k39J95j248O85N44Q5K909M09
5928A2674R83J053o36k427m375j223k546L115M058J473l213J765k25l537L280
5913A0219j028L151P28q09n88j035R11j343L438J726k446j38o72P67K605j263
5897A4223O3k04j204o187j263K242L794J675j039J573q86R23p32N22j936l27n99
5880A0638j814j167j626J945N242J77k282k879L048j162k26m71m14k68N77P65
5864A0083L476j082J180p80j174j134M163Ql801p62P69O93P1J366J208k26k472
5847A1586J00J726k399Q38L096P67k027j257J409k087M175k889k314L950k01k620
5831A1853j203J393J025j623M80k418L262J554j741j072J452K073k576J570j682
$$ plain form
5946 10772 9465 8900 7795 7926 7536 9323 9843 10297 10387 9334 9095 9290 8042 8727 9271 9356 12265 12674
5928 12674 13657 14710 14074 11647 7272 6049 3503 6618 10676 12149 8936 10701 10476 6939 10219
5913 10219 9191 12342 13070 12261 11673 10638 11549 10206 13644 15370 12924 12786 12114 12881 15486 14223
5897 14223 14286 14082 12878 6691 5428 7670 11464 13139 12100 13673 12787 13710 12978 13500 11564 11237 10638
5880 10638 8824 7657 6031 7976 13218 13395 11113 8234 11282 10120 9894 9423 9009 8741 9318 10083
5864 10083 13559 12477 13657 12877 11703 10569 14732 14740 10939 10177 10946 11639 11710 13076 14284 14058 11586
5847 11586 11686 13412 11013 11851 14947 15714 13687 12430 13839 11752 15927 13038 10724 14674 14473 11853
5831 11853 10650 12043 13068 11445 11925 9507 12769 14323 12582 11510 12962 15035 12459 14029 12347
5816A2347O87j190J630m94j361j203q07J499L083J026l497n74J16k124J920N64
5800A1622J510j261J73Q98l1k013J355K831j182J665k32M06J056K7l614J846J140
5783A6196m274j584j91q3L834K698j598l296J84k074k635N554K285l53j247k851
5767A0565J136K741q34J349J534k337J125m379k311K116J489l05N1K107L194l562
5751A3679p82p21m89k8M92o82P81j55k648j857K788J230k39j574J662L575k87
5734A4745j414J077p45J823l028j497J407J569q49M39K792l74N66K01j430j300
5718A3982K400k86j844J28l255L318L449L1j842j523k607o97K04K378J021k633
5702A2224J618l010j859J143P715J2310m767p331k020j508N0J022j006K475R65
$$ plain form
5816 12347 13034 11844 13474 12980 11619 10416 9609 11108 14191 15217 11720 11146 11262 9138 11058 11622
5800 11622 13132 11871 12044 12942 12911 10898 12253 15084 13902 15567 15335 15741 16797 16824 13210 15056 16196
5783 16196 11922 10338 10147 10064 13898 16596 14998 11702 11886 9812 7177 12731 15016 14663 13416 10565
5767 10565 11701 14442 13608 14957 16491 14154 15279 10900 8589 10705 12194 11889 11940 14047 17241 13679
5751 13679 12897 12176 11687 11659 12151 11469 12250 12095 9447 7590 10378 11608 11369 9795 11457 15032 14745
5734 14745 13331 14408 13663 15486 12458 10961 12368 13937 13088 13527 16319 15945 16511 16712 15282 13982
5718 13982 16382 16096 14252 14380 11125 14443 17892 17923 16081 14558 11951 11254 11458 13836 14857 12224
5702 12224 13842 10832 8973 10116 17831 30141 25374 18043 16023 14515 14565 15587 14581 17056 18021
5687A8021n165l2K24n82P5K613k218K41L000Q38P50J584K355k143j625J351j93
5670A9094k16j713m38k12M124j01l927j629J415N15j944j142K892L73k241o07
5654A4243L4J5q51L059J280m62K777j772k13Q39j078j291J492k49J938l363j321
5637A5077J488J047m53J463j712j053o92J580j951l3K297J354J45j394j125J389
5621A7427j685M35j83O44J973p73l683j99J187J341J885j426L735j447l337j158
5605A4736O06M228j432J214k370k751J344j437Q62j45j484J20K458J780k025J155
5589A6859O3k071j575k268M452K574Q62k204M94J965k385m276L886K758j030k531
5573A5573q30K338K174k753o97K14N45K544j082l166K120O49l49r81J110o50j483
$$ plain form
5687 18021 12856 12824 13048 12466 12541 15154 12936 13177 16177 17015 17765 19349 21704 19561 17936 19287 19094
5670 19094 18878 17165 16727 16515 20639 20538 16611 14982 16397 16912 14968 13826 16718 17091 14850 14243
5654 14243 14277 14292 13441 16500 17780 17318 20095 18323 18110 18949 17871 16580 18072 17823 19761 16398 15077
5637 15077 16565 17612 17159 18622 16910 15857 15165 16745 14794 14761 17058 18412 18557 17163 16038 17427
5621 17427 15742 16177 15994 16638 18611 17838 14155 13956 15143 16484 18369 16943 20678 19231 15894 14736
5605 14736 15342 19570 18138 19352 16982 14231 15575 14138 15000 14855 13371 13491 15949 17729 15704 16859
5589 16859 16922 14851 13276 11008 15460 18034 18896 16692 17186 19151 16766 12490 16376 19134 18104 15573
5573 15573 14743 17081 19255 16502 15805 16019 16564 19108 18026 14860 16980 17629 17280 16299 17409 16759 15276
5556A5276J988J950l327L424j441K9K947o02l622j084J898j586O44J965R82j02
5540A9339J356k299j406k747J256M17j467N77K501J082N207n335j088j92k14P52
5524A7739k045N59J751K695o63o47j022L943k777n46J186O32L164l753j425K086
5508B0877J23j094l066K192M0pj032N67r69j307M72J443L008q95p13L215j391
5491B1463K16J586N41l316j46l73K1J684j224j466Q16O6M24k034j930N503J299
5474B3130k895L80J352R4m264L677J527p46j551m2P11k478J105P34Q03k035j246
5457A8256J920P77J795J078k554K26k654r55Q29J757K326j227o71j19m33r37m9
5440A9365K473l020k995J360M587p91p09K53L969n58j329l17R00o6j011J226M50
$$ plain form
5556 15276 17264 19214 15887 19311 17870 17899 20846 20244 16622 15538 17436 15850 16494 18459 19441 19339
5540 19339 20695 18396 16990 14243 15499 15916 14449 15026 17527 18609 23816 18481 17393 17201 16987 17739
5524 17739 15694 16253 18004 20699 20036 19389 18367 22310 19533 18987 20173 20805 23969 20216 18791 20877
5508 20877 21000 19906 16840 19032 19072 19065 18033 18600 17631 16324 16796 18239 21247 20352 19639 22854 21463
5491 21463 21679 23265 23806 20490 20344 19971 19992 21676 20452 18986 19802 19868 20292 18258 16328 21831 23130
5474 23130 20235 20615 21967 22061 17797 21474 23001 22255 20704 20662 21373 18895 20000 20734 21537 19502 18256
5457 18256 20176 20953 22748 23826 21272 21498 18844 17889 18718 20475 22801 21574 20903 20784 20351 19414 19365
5440 19365 21838 18818 15823 17183 21770 20979 20270 20523 24492 23934 22605 22288 23188 23122 22111 23337 23787
5423B3787o89k258K50L125K344l673N60k567o66L74j76Q56j424L795M84j592L066
5406B5596N38l966j808j335J560P94N34j063P04L02N00j777R14K562O07o13j002
5389B3047r32J351O42J040k616j645R29q58K531j63L26j47p33l380k531J467M366
5372B2694o84Q12J217r77R63j946q15M41r96J474M532k254q19J895j914j999K077
5355B3701j362K663j591l648O196m83m91q2m18J615m79o78J356J868m814j119
5339B2234k404K782j503L049J271R67J088j787Q95M91k566m99l1j762k335M311
5323B4201L991k201J12m30J792l389j986j588J959L099J089J168R19k179R58o0
5307B7455m855j209K997K656j490j656K409N77l84p92J982j616k901L221K009
$$ plain form
5423 23787 23098 20840 21090 24215 26559 22886 23446 20879 20213 20587 20411 21267 19843 23638 24122 22530 25596
5406 25596 26134 22168 20360 19025 20585 21379 21913 20850 21554 21856 22356 20579 21493 24055 24662 24049 23047
5389 23047 22115 23466 24108 25148 22532 20887 21816 20958 23489 23326 23652 23505 22772 19392 16861 18328 22694
5372 22694 22010 22822 24039 23062 24025 22079 21264 21705 20709 22183 26715 24461 23642 25537 23623 21624 23701
5355 23701 22339 25002 23411 19763 25959 25476 24985 24903 24485 26100 25621 24943 26299 28167 23353 22234
5339 22234 19830 22612 21109 24158 25429 26396 27484 25697 26592 27083 24517 24018 23987 22225 19890 24201
5323 24201 28192 25991 26103 25673 27465 24076 22090 20502 22461 25560 26649 27817 28736 26557 27515 27455
5307 27455 22600 21391 24388 27044 25554 23898 26307 26884 26500 25708 27690 26074 23173 26394 28403
5292B8403k466K296k218r84m74J253K06R88Q88k63k132k299K067m49j491L11k102
5275B1534N39J627Q45L47j566o80R89j465J126o63N01o13K273R22K372m47K381
5258C0022j274j025k107j176j57n09K097k233L678l02o87m49J027J070M184K058
5242C4217k478R70J46L92n363K253q1j566K240J913J080o33j548j127j568l449
5226B5398L71K738J747N61L0J54j157j956J172k48P93r0K32j177K040K280k464
5209C0424k106p8M72J963M44j848L562q57l049m18L846k75J611j88k487K085o54
5192C2447o0l95K033j403J991n52M82k85O82m63R83Q0M18PK283k768k69l33j426
5173C3452K42M17j843K551J249k315p39K865j593q1N12l944M55K06J813j89k321
$$ plain form
5292 28403 25937 28233 26015 25031 24557 25810 26016 27004 27892 27629 25497 23198 25265 24816 23325 23636 21534
5275 21534 22073 23700 24545 24892 23326 22646 23635 22170 23296 22633 23134 22521 24794 25716 28088 27641 30022
5258 30022 28748 27723 25616 24440 24283 23774 25871 23638 27316 27014 26327 25878 26905 27975 32159 34217
5242 34217 31739 32709 32855 33247 27884 30137 30056 28490 30730 32643 33723 33090 31542 30415 28847 25398
5226 25398 25769 28507 30254 30815 30845 30999 29842 27886 29058 28810 29603 29513 29745 28568 30608 32888 30424
5209 30424 28318 28240 28712 30675 31119 29271 32833 31976 28927 28509 32355 32080 33691 33503 31016 33101 32447
5192 32447 32387 31992 34025 32622 34613 34061 34543 34258 34940 34477 35460 35540 35958 35965 38248 35480 35211 34878 33452
5173 33452 33694 34111 32268 34819 36068 33753 33014 35879 34286 34205 34717 30773 31228 31434 33247 33058 30737
5156C0737K198k02L299n83k002p85J165J5L067J00n134l12K518l79o02R55M21
5139C4476j569Q91K394j898o5K251K643k849j968q5o07J236j079j025K719L729
5123C9194J85P63o58k279N81K052l161m593J707n06k391m10K352J978k535K909
5107C5188K796j348P98k172J69m33l55j651j102k251Q14M9J745M10K901J914K81
5090C7753J195l9N20o78K6P40l807n78O23J385r0l785K582J907n161j184M873
5073C6282K695j099k710m194J406q66M55K1M227L034j010j594J904N702J828j874
5057D4207m863l805m63j44J50J593q54J620L37l049N08L126L671M551n45k530
5041D3510p49j558k887K537n36j490n45J575p82q50K433r93k13j899k132N293
$$ plain form
5156 30737 32935 32733 36032 35449 33447 32662 33827 33842 36909 37009 31875 31563 34081 33702 33100 34055 34476
5139 34476 32907 33798 36192 34294 34229 36480 39123 36274 34306 34221 33614 34850 33771 32746 35465 39194
5123 39194 39379 40142 39484 37205 37786 39838 36677 32084 33791 33285 30894 30484 32836 34814 32279 35188
5107 35188 37984 36636 37434 35262 35431 34998 34643 32992 31890 29639 30453 30502 32247 32657 35558 37472 37753
5090 37753 38948 38909 39429 38751 38777 39517 35710 35132 35755 37140 37050 33265 35847 37754 32593 31409 36282
5073 36282 38977 37878 35168 30974 32380 31514 31969 31990 36217 39251 38241 36647 38551 44253 46081 44207
5057 44207 39344 35539 35076 34932 35082 36675 35821 37441 37778 34729 35237 38363 42034 46585 46040 43510
5041 43510 42761 41203 38316 40853 40317 38827 38282 39857 39075 38225 40658 39665 39452 37553 35421 40714
5025D0714L72P70J571k098j292l652L747K174k10l005K275k006j424O9j81K521
5009D0345P29R18p02j384J578p6o71p73n27N28J315j811r75j448k149M716L478
4992D3091Q13R89l125J344j816l070L70P157K209l906k079j689l190k51J622L146
4976D1615K459j704k001j393K497Q10L559l250l286Q46k32L03K486l62r50j379
4960D0018J893j436K248L044l021l18J958l956k449N68j064J812J723k42O65K06
4944D1649J713k97J442l08J158j80k412K625o98k90k373O84K217q70J038j505
4928D3593J665L45J465K267k7m357j380k192po85j777K833J146J83j973J493K899
4911D5491k81J011k760R62Q55o60k747q59K475K806J744m822R44l96o36N028L264
$$ plain form
5025 40714 41086 41856 43427 41329 40037 36385 40132 42306 42096 39091 41366 39360 37936 38005 37824 40345
5009 40345 41074 41992 41290 39906 41484 41408 40737 39964 39437 39965 41280 39469 38494 37046 34897 39613 43091
4992 43091 43904 44893 41768 43112 41296 38226 38596 45753 47962 44056 41977 40288 37098 36847 38469 41615
4976 41615 44074 42370 40369 38976 41473 42283 45842 42592 39306 40152 39920 40223 42709 42347 41397 40018
4960 40018 41911 40475 42723 45767 42746 42428 44386 40430 37981 38549 37485 39297 41020 40778 41443 41649
4944 41649 43362 43065 44507 44199 45357 45177 42765 45390 44692 44402 42029 42713 44930 44060 45098 43593
4928 43593 45258 45603 47068 49335 49308 44951 43571 41379 41372 40687 38910 41743 42889 43072 41099 42592 45491
4911 45491 45210 46221 43461 44423 45278 44618 41871 41012 43487 46293 48037 43215 44159 43763 43127 48155 51419
4894E1419p21m921L57K222j848k93r44o6P76J735m10J284J41j221J935j371J974
4877E0048j167k907k933K684M64L008n44M06j47p92p73o95J386J275j901l042
4861D4370M565K906k777N65m40J931J48j31j595l253J762K498P77J17k335k883
4845D6225K077P08m24J109N83l116j088r60L996J703j92n97j353j236J765p17
4829D8483J663j494R82l29n8p66Q30K368K701l651L320j58m373K066K571j753
4813E2402K366o81k441p01J583j38M46K219M93J51K514m51l790j297k284j762
4797D8629J751J828j606k615J860L870j746K37p50L502J15n104P71K849m82l246
4781D9863r31J060J320m25J028m3J590j35j691K993J722M63J980J582l059j875
$$ plain form
4894 51419 50698 45777 46134 48356 46508 46215 45271 45205 45981 47716 47306 48590 48731 47510 49445 48074 50048
4877 50048 48881 45974 43041 45725 46189 49197 48653 49059 48912 48120 47347 46652 48038 49313 47412 44370
4861 44370 48935 51841 49064 49629 49189 51120 51268 51137 49542 46289 48051 50549 51326 51443 49108 46225
4845 46225 48302 49010 48586 49695 50278 47162 46074 45114 49110 50813 50621 50024 48671 47435 49200 48483
4829 48483 50146 48652 49634 49305 49247 48481 49311 51679 54380 50729 54049 53891 49518 51584 54155 52402
4813 52402 54768 54087 51646 50945 52528 52390 52836 55055 55548 55699 58213 57762 53972 52675 50391 48629
4797 48629 50380 52208 50602 47987 49847 53717 51971 52208 51458 54960 55075 49971 50742 53591 53109 49863
4781 49863 48932 49992 51312 50887 51915 51872 53462 53327 51636 54629 56351 56814 58794 60376 57317 55442
4765E5442K078L53L14j406o72o3j68K76Q05j341J577J717j26o573j966l92J214
4748E1069j792J367L469N77K923n6k673J514K930j60M59l295K139n47j522K76
4732E6678k6Q33J533L884m403j185N229q84N82P81j782O43J65l062l11k0N002
4715F3657j385l20k370j333j365K337M006j722j689R42P27q51j9J960l21j157
4699F1097q16J307l69J77J003M16k339J469q33K256j365j319J174J797r47J81
4683F2889L66K166l54J211k063l11r23J269m1N37J172k377L219k210p77l23K920
4666F6370M66o38j806j525J972Q14N69M84n11N59j261n71O41L252J400j370K282
4649G1127K47l442j339L182k226k024L62p52k180L180K787K45l147L518j125J93
$$ plain form
4765 55442 57520 57873 58187 56781 56109 56046 55878 56154 56959 55618 57195 58912 58786 52213 50247 49855 51069
4748 51069 49277 50644 54113 54690 57613 57557 54884 56398 59328 59168 59627 56332 58471 57924 56402 56678
4732 56678 56652 57485 59018 62902 58499 57314 62543 61659 62241 63022 61240 61883 62048 58986 58675 58655 63657
4715 63657 62272 61952 59582 58249 56884 59221 63227 61505 59816 60758 61485 60634 60615 62575 62254 61097
4699 61097 60281 61588 61219 61396 62399 62815 60476 61945 61112 63368 62003 60684 61858 63655 62708 62889
4683 62889 63255 65421 65067 66278 64215 63904 62981 64250 64209 64746 65918 63541 66760 64550 63773 63450 66370
4666 66370 66836 66198 64392 62867 64839 65653 66222 66706 66195 66754 65493 64922 65563 68815 70215 68845 71127
4649 71127 71374 67932 66593 69775 67549 65525 65887 65135 62955 66135 68922 69167 66020 69538 68413 68606
4633F8606J126r85M23l63m31n35R17j22J355k512K13J701J552r34k61K126P53
4616G2629m648K694q62l848K534L3K74M09k766J948l55J207J223K634k894j599
4600F8613M76J508J205l73K188M87m487M65J628K195j381q18j229K94j898n6L731
4583G2548J047J845k287l9j78q80O67j767k55J774J066Q6Q76p00k909p25M303
4566G4472j349J092P97p2r54K563l335j83K329O20q0J601o41j923n80m337J20
4549G0140J235J978J645m89J774K335j317j363q68r88L38N07j354q4J573j459
4533G3603Q04R36J500K005j872L54j541J739K933N30n14j483J724M47m81L559
4517H4243l779j580K009Q47j11J06l84k411M401m64k316j680K244r02J766L280
$$ plain form
4633 68606 69732 68747 69170 68807 68376 67841 68758 68636 69991 67479 67692 69393 70945 70011 69750 71876 72629
4616 72629 67981 70675 69813 65965 68499 68532 68806 69215 66449 68397 68042 69249 70472 73106 70212 68613
4600 68613 69089 70597 71802 71429 73617 74104 69617 70082 71710 73905 72524 71706 70477 70771 68873 68817 72548
4583 72548 73595 75440 73153 73114 72936 72056 72723 70956 70701 72475 73541 73627 74503 73803 70894 70169 74472
4566 74472 73123 74215 75012 74940 73986 76549 73214 73031 75360 75980 75900 77501 76860 74937 74357 70020 70140
4549 70140 71375 73353 74998 74509 76283 78618 77301 75938 75070 74082 74420 74927 73573 73489 75062 73603
4533 73603 74407 75343 76843 78848 76976 77330 75789 77528 80461 80991 80477 78994 80718 81165 80684 84243
4517 84243 80464 78884 80893 81740 81629 81735 81351 78940 83341 82877 80561 78881 81125 80223 81989 85269
4501H5269P52k13j04l244r59M73j838K386J258K646M755J259l350l214k725j271
4485H1880l64K443J068j72q4O09m8K473k440J800L34Q35J002l153l678L084K785
4468H8374k496Q31q92j077P104K694n021J001j887j340K633n23K784k596K950
4453I2539o44k947J029o27j191M054j942K355J622k098j213j584j136M659o10
4438I2266K18K08J946R74J158k113m74L48o07P22K43j046P47k159K754K828m97
4421I7516k811J880o63j845O55L250P35o70p83k783L313j088J778K23j851L227
4405A00083j015k043K496j640J990K470k348P36L116j243o40K696j199l32L376
4390A06503p57N73K95K79m19K428P8q47j6K99n96p45k628Q54J926J232j007K331
$$ plain form
4501 85269 86021 85808 85704 82460 81501 81974 80136 82522 83780 86426 91181 92440 89090 85876 83151 81880
4485 81880 81516 83959 85027 84855 84771 85380 85332 87805 85365 87165 87499 88334 89336 86183 82505 85589 88374
4468 88374 85878 86709 85817 84740 91844 94538 89517 90518 88631 87291 89924 89401 92185 89589 92539
4453 92539 91895 88948 89977 89350 88159 92213 90271 92626 94248 92150 90937 89353 88217 92876 92266
4438 92266 92484 92692 94638 95612 96770 94657 94183 94531 93924 94646 94889 93843 94590 92431 95185 98013 97516
4421 97516 94705 96585 95922 94077 94732 97982 98717 98047 97264 94481 97794 96706 98484 98707 96856 100083
4405 100083 99068 97025 99521 97881 99871 102341 99993 100729 103845 102602 101962 104658 103459 103127 106503
4390 106503 105746 106319 106614 106893 106474 108902 108980 108133 108117 108416 107820 107075 104447 105301 107227 108459 107452 109783
4372A09783k52J165k26R8J673J811k316J020L97P76m08j072Q81L435q47J029j924
4355A15023K253K206k529j803p14L461K174P14Q25j052K29k4M750m8j586J335
4339A25214k220R82R68l214j335J583L618k809J593j815l49J407J991m93P30J370
4323A27221J936k52n75j275j660K179j22j148L369K1P18P01k121J755K861P99
4307A34407k207J269K123j725j503J230r5K027K508j261L144q20j998K709L377
4292A43185K025k342L652K683m071J863L48j470P35n73L488j440J466j06J746
4277A51189P82k6M76K818M80L122P03j425L445L005k358j456j99L547K102k865
4261A63340L39Q50L82J164K60J271K055J104M22M495q27J585K596q11J828j629
$$ plain form
4372 109783 109531 110696 110470 110568 112241 114052 111736 112756 113153 113929 113521 112449 113330 116765 115918 116947 115023
4355 115023 117276 119482 116953 115150 114436 117897 120071 120785 121610 120558 120787 120763 125513 125465 123879 125214
4339 125214 122994 123976 124944 121730 120395 121978 125596 122787 124380 122565 122216 123623 125614 125121 125851 127221
4323 127221 129157 128905 128330 127055 125395 127574 127452 126304 129673 129694 130412 131113 128992 130747 133608 134407
4307 134407 132200 133469 135592 133867 132364 133594 133499 135526 138034 136773 139917 139097 137099 139808 143185
4292 143185 145210 142868 146520 149203 145132 146995 147343 145873 146608 146035 149523 148083 149549 149443 151189
4277 151189 151971 151945 152421 155239 155719 158841 159544 158119 161564 164569 162211 160755 160556 164103 166205 163340
4261 163340 163679 164529 164911 166075 166335 167606 169661 170765 171187 175682 174855 176440 179036 178225 180053 178424
4245A78424k43K29J603J262J644K437k099o37J477K823j34K148Q0j009k11K603
4229A90397j063L02Q87K842R53K509o99R72j321L882J817P03J810k548j501L130
4213B03072p00j10Q50J801P73J906J161Q0L311J124K270J246J884M53K439j532
4197B20028J467p40J054P588k162J212P94j869K200K065j028K260K407q03J968
4182B36441J404j715J576K503K562J63J851K924N194K407j612J440L318k412K183
4167B58227O259L236K709M227O24L058O11L064K770J75M636J079j70q78K482k828
4151B89281j140K894M1j75K643K368L26j167L181o89j86j1M946K902M310J756
4135C11280N327P510J278J746N996M987J0307Q377L193M347P327M465N315O237
$$ plain form
4245 178424 178181 178410 180013 181275 182919 185356 183257 182620 184097 186920 186786 188934 189014 188005 187794 190397
4229 190397 189334 189636 190523 193365 194318 196827 196128 197100 195779 199661 201478 202181 203991 201443 199942 203072
4213 203072 202372 202262 203112 204913 205686 207592 208753 208833 212144 213268 215538 216784 218668 219121 221560 220028
4197 220028 221495 220755 221809 229397 227235 228447 229241 227372 229572 231637 230609 232869 235276 234473 236441
4182 236441 237845 236130 237706 240209 242771 242934 244785 247709 252903 255310 253698 255138 258456 256044 258227
4167 258227 264486 267722 270431 274658 275282 278340 278951 282015 284785 284960 289596 290675 290505 289627 292109 289281
4151 289281 288141 291035 291076 290901 293544 295912 296238 295071 298252 297563 297377 297366 302312 305214 309524 311280
4135 311280 316607 324117 325395 327141 333137 338124 348431 356808 360001 364348 371675 376140 381455 387692
4121C87692O141O441N206R092N578J518P441O771O001L438R471K266L934N122
4107D66112N121N430M968j329N640K403P702O162K907L97L814M983N840J945N982
4092E28077K901Q23L864M832K431L773L050K663K523L436K000K592N626L663M025
4077E76279K884N075L722M821O133Q10N601J0625L498P479O023M197P176O745
4063F51068Q695O419J1365J1358P823Q448N836R596N601Q144Q663J5322J0218
4050G68556J2869J3749J3773Q613J0193J1533J2786J7193J6640J1158J8063J4916
4038I30042J5944J7320J6056J5646J9113J6197K0733J9688J7622K1125K1275J8162
4026A148923K2958K3129K4603K4925K6512K6901L2465L2532K9968L5636L4884
$$ plain form
4121 387692 393833 400274 405480 414572 420150 421668 429109 435880 441881 445319 454790 457056 460990 466112
4107 466112 471233 476663 481631 480302 485942 488345 496047 502209 505116 505513 509327 514310 520150 522095 528077
4092 528077 530978 531801 535665 540497 542928 546701 549751 552414 554937 558373 560373 562965 568591 572254 576279
4077 576279 579163 584238 587960 592781 598914 599724 605325 615950 619448 626927 632950 637147 644323 651068
4063 651068 659763 666182 677547 688905 696728 705176 711012 720608 726209 734353 743016 758338 768556
4050 768556 781425 795174 808947 817560 827753 839286 852072 869265 885905 897063 915126 930042
4038 930042 945986 963306 979362 995008 1014121 1030318 1051051 1070739 1088361 1109486 1130761 1148923
4026 1148923 1171881 1195010 1219613 1244538 1271050 1297951 1330416 1362948 1392916 1428552 1463436
4015A463436L8975L6834L8695L6885L9097M4020M3226M7418M7379M9596N0246
4004A935807N9612O2743N7279O6573O9903P0740P0673P5800Q5220Q2706Q6443
3993B723499R0355R3972J00090J10921J16240J26909J32212J44611J51561J58654
3983C949024J68963J78500J90280K06647K21282K37755K53428K67261K76965K96357
3973F246462L13357L29436L40522L36691L38072L53406L87147M25036M74596N27285
3963A0072010N94915O73663P68919Q75680J002569J134365J299246J478472J680845
3954A9580684J895324K162978K477998K859260L293623L740196M236875M886760
3946D5133698N379929N111552K922476l20092j957564k220949j779748j045244
$$ plain form
4015 1463436 1502411 1539245 1577940 1614825 1653922 1697942 1741168 1788586 1835965 1885561 1935807
4004 1935807 1995419 2058162 2115441 2182014 2251917 2322657 2393330 2469130 2554350 2637056 2723499
3993 2723499 2813854 2907826 3007916 3118837 3235077 3361986 3494198 3638809 3790370 3949024
3983 3949024 4117987 4296487 4486767 4693414 4914696 5152451 5405879 5673140 5950105 6246462
3973 6246462 6559819 6889255 7229777 7566468 7904540 8257946 8645093 9070129 9544725 10072010
3963 10072010 10666925 11340588 12109507 12985187 13987756 15122121 16421367 17899839 19580684
3954 19580684 21476008 23638986 26116984 28976244 32269867 36010063 40246938 45133698
3946 45133698 50513627 55625179 58547655 58227563 56269999 54049050 52269302 51224058
3938E1224058p08793j309725k767133l346076k611664j882215j722205j663175
3930C5213072j309288r08832p33111j170258j680851j685165j451781j185037
3922B5088749j004232r12221q71340q82638r91768j192320j390941j379899j236656
3913A5226734j081066r59559q79325q16891p42702o56124n75686n12749m69286
3904H533346m28601l90593l65569l40576l18964k93257k68231k50177k33977k16419
3894E426982k02259j83996j72465j59339j52612j46981j37237j32305j24488j18032
3884C897268j13098r9599j02021r6683r1268r0446q5058q1054q1569p5862p2229
3873B908381o6891o7059o7773o8435o3702o6672o0320o0047n6588n7393n4830
$$ plain form
3938 51224058 50515265 49205540 46438407 43092331 40480667 38598452 36876247 35213072
3930 35213072 33903784 32994952 32261841 31091583 29410732 27725567 26273786 25088749
3922 25088749 24084517 23172296 22300956 21418318 20426550 19234230 17843289 16463390 15226734
3913 15226734 14145668 13186109 12306784 11489893 10747191 10091067 9515381 9002632 8533346
3904 8533346 8104745 7714152 7348583 7008007 6689043 6395786 6127555 5877378 5643401 5426982
3894 5426982 5224723 5040727 4868262 4708923 4556311 4409330 4272093 4139788 4015300 3897268
3884 3897268 3784170 3684571 3582550 3485867 3394599 3304153 3219095 3138041 3056472 2980610 2908381
3873 2908381 2841490 2774431 2706658 2638223 2574521 2507849 2447529 2387482 2330894 2273501 2218671
3862B218671n5910n6397n8141n4623n4653m5164n1191n6089n1927m5313m8076
3851A641187m7845m6447l8663m0945m2767l7913l8253l4722l5228l7510l0583
3840A210311l0415l0795k8004k5738k5708k7128k4356k6179k3437k1409k2960
3829I24182k4731k5276k5767j8725k1719j9600j8333k1817j7589k0464j6064j5402
3817F78695j8923j2732j1194j4581j3693j5182j1705j3759j1883q224j0278q586
3805E27955j2748p143j0668q852r023q390j1150j1695q207p594r572p369n252
3792D10292l839r720o571n005n317o477o520p885n130n713p235o192n141p868
3778C21679p004p610m19m757l048n47n177n231k083o915L193p98k707l488j075
$$ plain form
3862 2218671 2162761 2106364 2048223 1993600 1938947 1893783 1842592 1786503 1734576 1689263 1641187
3851 1641187 1593342 1546895 1508232 1467287 1424520 1386607 1348354 1313632 1278404 1240894 1210311
3840 1210311 1179896 1149101 1121097 1095359 1069651 1042523 1018167 991988 968551 947142 924182
3829 924182 899451 874175 848408 829683 807964 788364 770031 748214 730625 710161 694097 678695
3817 678695 659772 647040 635846 621265 607572 592390 580685 566926 555043 546819 536541 527955
3805 527955 515207 508064 497396 488544 479521 471131 459981 448286 440079 432485 422913 415544 410292
3792 410292 406453 396733 390162 385157 379840 373363 366843 358958 353828 348115 340880 334688 329547 321679
3778 321679 314675 307065 306646 301889 298841 298294 293117 287886 285803 278888 282081 281283 278576 275088 274013
3763B74013k500j693K10j296l5K382M005M085M65Q50j703L66R56K603P84n28l245
3746B79719J190p78j797l383l371l08O49l058l445m764m128l475Q79m587n18l458
3730B45367l674k862k271k245j20l786j421j816k626Q08k24j659m43Kj962r42
3714B20126l140Q1k44k139L14P41m7m276j666r70N38M57j568l77l836J670j544
3697B04120J298l431J428k209n61j246o3K425j041m834Q94M60o68k968J436n75
3681A94465k942n63j855j798l678J972j632k328R16L476N20j971M9l451J094M18
3665A82692j459n152J814L48J00J169j010j814L773j805k642L346m5j832j523
3650A75960m035K317p83r59J757L242p245K98J038M202m081j704l175L729J020
$$ plain form
3763 274013 271513 269820 270030 268734 268699 271081 275086 279171 279636 280486 278783 279149 280105 282708 283492 282964 279719
3746 279719 280909 280131 278334 274951 271580 271272 271921 268863 265418 260654 256526 253051 253930 249343 248825 245367
3730 245367 241693 238831 236560 234315 234195 230409 228988 227172 224546 225354 225130 223471 223028 223030 221068 220126
3714 220126 216986 217067 216823 214684 214998 215739 215692 211416 209750 208780 209318 209775 208207 207830 203994 205664 204120
3697 204120 205418 201987 203415 201206 200645 199399 199336 201761 200720 195886 196780 197240 196572 193604 195040 194465
3681 194465 191523 190960 189105 187307 183629 185601 183969 181641 182557 186033 186553 184582 184631 181180 182274 182692
3665 182692 181233 176081 177895 178243 178343 179512 178502 176688 180461 178656 176014 179360 179315 177483 175960
3650 175960 171925 174242 173459 172500 174257 177499 170254 170552 171590 175792 171711 170007 166832 170561 171581
3635A71581L87m907m30J353M4M25K893K054Q4J944m392k525J715L17J87K280L93
3618A73403n86K102l38j391j413L433m338J438J715o57j413K702r50j492j795
3603A70420N37K047j473J582K720r73m478J358J739n90J9k491J578J669k204K567
3587A74027j184k480L279L395J540m412o40M475J102N07m76J493j981K541J232
3572A82418J422j344j282J462L777n345J365J350J1j728M21n90L340Q52L916n53
3556A89492j543l358J100P68J861L222j462k253K249m278J012l553Q94J118P83
3541A86052M22J33P55n23m580L243L193l97J545o4n693K519J723O86J412qj037
3524A89381L550p97Q85j162M324l274k538J937Q46J090K821L057r61l405Q21j693
$$ plain form
3635 171581 171968 167061 166631 167984 168028 168453 171346 173400 173484 175428 171036 168511 170226 170543 170730 173010 173403
3618 173403 172817 174919 174581 173190 171777 175210 170872 172310 174025 173368 171955 174657 173707 172215 170420
3603 170420 170957 173004 171531 173113 175833 174860 170382 171740 173479 172889 172908 170417 171995 173664 171460 174027
3587 174027 172843 170363 173642 177037 178577 174165 173525 178000 179102 179609 179133 180626 178645 181186 182418
3572 182418 183840 182496 181214 182676 186453 181108 182473 183823 183834 182106 182527 181937 185277 186129 190045 189492
3556 189492 187949 184591 185691 186459 188320 191542 190080 187827 190076 185798 186810 183257 184151 185269 186052
3541 186052 186474 186607 187362 186839 182259 185502 188695 188298 189843 189779 184086 186605 188328 189014 190426 190418 189381
3524 189381 192931 192134 193019 191857 196181 192907 190369 192306 193152 194242 197063 200120 199159 195754 196575 194882
3508A94882O5J612J093J188J734j930J778K37o11N892J317j116k73K78J651l84
3492B07413j05K201K658j304J177o02J468J321J011j309J085r69k887J343L063
3477B15564J524O47P35o76l38N052j740K666K220k325k120k69K471K204J931l106
3461B24440L226R96l868j58K939J592J771R30L017k697R45K468J031p92J187K434
3445B39461m42m106J464J419L310k173J061J01L754j202k77J193K052j760K557
3430B46412l75N30j388M921k58K823k959M775j111L248l492M0J278M877J946j722
3414B59545l416L406k417K811K499J677K056K047k055J198m034L157M648K745
3400B73867J302n80k657L268J950J175J368k057J825M957j170L704J583j786j11
$$ plain form
3508 194882 194947 196559 197652 198840 200574 198644 200422 200659 200048 205940 207257 206141 205868 206146 207797 207413
3492 207413 207308 209509 212167 210863 212040 211438 212906 214227 215238 213929 215014 214045 211158 212501 215564
3477 215564 217088 217735 218470 217794 217456 222508 220768 223434 225654 223329 221209 220940 223411 225615 227546 224440
3461 224440 227666 228662 224794 224636 227575 229167 230938 231868 234885 232188 233133 235601 236632 235840 237027 239461
3445 239461 239019 234913 236377 237796 241106 238933 239994 240095 243849 242647 242370 243563 245615 243855 246412
3430 246412 246037 246567 245179 250100 249842 252665 249706 254481 253370 256618 253126 253166 254444 259321 261267 259545
3414 259545 256129 259535 257118 259929 262428 264105 266161 268208 266153 267351 263317 266474 271122 273867
3400 273867 275169 274589 271932 275200 277150 278325 279693 277636 279461 284418 283248 286952 288535 286749 286638
3385B86638M483k529k97q87K795M201L17j358L279j431n10M066Q9N093n76q04
3369C02569J834L272J437M38j196q4J664N325K747l615K917L232K575M860l407
3354C24568r43K685K242N93J50J61J594L397L625n95M241k877J28m4K790Q18L059
3337C45592J697M024K6Q62j661M911r25J700L77K840J602M480j801L409J582M515
3321C73230j625K170L186L755J176L725N671L157Q8N553Q1L194K884O308o74K572
3305D14451K239N123K806K411j484J465L220N844J867M619J025L154O74N298K018
3290D54730M560K331L848J590K622J073L530L794O601L868j215M323M476Q023
3276E04154R038O194M901M227P735O107Q032Q570Q695R949J4437J4412J6666J2654
$$ plain form
3385 286638 291121 288592 288295 287408 290203 294404 294721 293363 296642 295211 294701 298767 298856 303949 303373 302569
3369 302569 304403 307675 309112 309550 308354 308270 309934 315259 318006 314391 317308 320540 323115 327975 324568
3354 324568 323625 326310 328552 329145 329295 329456 331050 334447 338072 337477 341718 338841 338969 338925 341715 342533 345592
3337 345592 347289 351313 351339 352201 350540 355451 354526 356226 356603 359443 361045 365525 363724 367133 368715 373230
3321 373230 371605 373775 376961 380716 381892 385617 391288 394445 394533 400086 400167 403361 406245 412553 411879 414451
3305 414451 416690 421813 424619 427030 425546 427011 430231 436075 437942 442561 443586 446740 447414 452712 454730
3290 454730 459290 461621 465469 467059 469681 470754 474284 478078 484679 488547 487332 491655 496131 504154
3276 504154 513192 519386 524287 528514 536249 542356 550388 558958 567653 577602 592039 606451 623117 635771
3262F35771Q732O411m666r084j994q399r591o745k443J406K156J236j997q62N363
3247F15294J223K483K893K880L635L142O427L250K004M040Q410M481R167O727
3233F76056O740O268Q503P071Q966P367R928P329J0641J0328R794J3592J2910
3220G95493R413J6064P329Q806M723J2541J1566J0362J2563J6537J1413J8047
3208I34857J5405J9420J5582K0767J7287K0742K4918K6094K5516K8403L0390L8539
3196A217920L6590M2959M5907N5556O3651P6358P6543Q3721R1563J03126J14538
3185B008432J35364J47103J76554K01787K34931K71441L03847L20455L07378K37752
3175D345044J55575K3566j08224k01473k80343l01573k84729k57326k11787j80347
$$ plain form
3262 635771 644503 650914 646248 637164 635170 626771 617180 610435 607992 609398 611554 612790 610793 609931 615294
3247 615294 616517 619000 621893 624773 628408 631550 637977 641227 643231 647271 655681 660162 669329 676056
3233 676056 682796 689064 697567 704638 713604 720971 730899 738228 748869 759197 768991 782583 795493
3220 795493 804906 820970 828299 837105 841828 854369 865935 876297 888860 905397 916810 934857
3208 934857 950262 969682 985264 1006031 1023318 1044060 1068978 1095072 1120588 1148991 1179381 1217920
3196 1217920 1254510 1297469 1343376 1398932 1462583 1538941 1615484 1699205 1790768 1893894 2008432
3185 2008432 2143796 2290899 2467453 2669240 2904171 3175612 3479459 3799914 4107292 4345044
3175 4345044 4500619 4524185 4415961 4214488 3934145 3632572 3347843 3090517 2878730 2698383
3165B698383j47955j30987j07620j00707q5063p4857o5355o5558n4650n2801n0050
3154A762780m6300l6713l5628k7260k7322k1065k1047j5086j0471q518r570m271
3142A499529p629L71K27o60l878j736j713L322M168Q20L564K215J343J462Q264
3127A509669j5K547M967R160O627M729O902M493N893R169P964J0108M850R450
3113A596513J1200J1385Q082J2246O156J2625R918J2841J1261J2333R527J5404
3101A729491R846J4352J2678J5748J3698J8052J6459J8749J8013K0158J3258J9903
3089A920405J7557K2966J9878K2628J6604K9140J6876K2823J9228K3547J4124
3078B145776K2177J7828J7179J2426J6441J2243K1490J6115J7518J4933K0374
$$ plain form
3165 2698383 2550428 2419441 2311821 2211114 2126051 2051194 1985839 1920281 1865631 1812830 1762780
3154 1762780 1716480 1679767 1644139 1616879 1589557 1568492 1547445 1532359 1521888 1513370 1503800 1499529
3142 1499529 1491900 1492271 1492498 1491838 1487960 1486224 1484511 1487833 1492001 1492821 1496385 1498600 1499943 1501405 1509669
3127 1509669 1509654 1512201 1517168 1526328 1532955 1537684 1544586 1549079 1554972 1564141 1572105 1582213 1587063 1596513
3113 1596513 1607713 1619098 1627180 1639426 1645582 1658207 1668125 1680966 1692227 1704560 1714087 1729491
3101 1729491 1739337 1753689 1766367 1782115 1795813 1813865 1830324 1849073 1867086 1887244 1900502 1920405
3089 1920405 1937962 1960928 1980806 2003434 2020038 2049178 2066054 2088877 2108105 2131652 2145776
3078 2145776 2167953 2185781 2202960 2215386 2231827 2244070 2265560 2281675 2299193 2314126 2334500
3067B334500J5544K8201J9804K9762K5655L0258K7233L2411K7323M1337L8181
3056B650209M6047M3064M8640N0078N7864N2464O2678N7902N7661N0787N2093
3045C229487M9298N4521M6952N5410M6542N2624M8578N1530M9473N5746N4444
3034C794605M9570M0756M7701N0472M7263M2639M1345L9375M1303M0185L8984
3023D274198M1946M3612M0504M0348M2947M5640N0132N3302M7262M5560M2855
3012D768306M6170M6665M5804M8683M9352N2769M9736N3957M9839N4268N4356
3001E319905N7441N8769O8264O0165O9771O4049P2647O6723P3841P0867Q2842
2990F065284P9328Q5885Q1876R1931Q2520R9535R6829J05610J01139J12917J02629
$$ plain form
3067 2334500 2350044 2378245 2398049 2427811 2453466 2483724 2510957 2543368 2570691 2612028 2650209
3056 2650209 2696256 2739320 2787960 2838038 2895902 2948366 3011044 3068946 3126607 3177394 3229487
3045 3229487 3278785 3333306 3380258 3435668 3482210 3534834 3583412 3634942 3684415 3740161 3794605
3034 3794605 3844175 3884931 3932632 3983104 4030367 4073006 4114351 4153726 4195029 4235214 4274198
3023 4274198 4316144 4359756 4400260 4440608 4483555 4529195 4579327 4632629 4679891 4725451 4768306
3012 4768306 4814476 4861141 4906945 4955628 5004980 5057749 5107485 5161442 5211281 5265549 5319905
3001 5319905 5377346 5436115 5504379 5564544 5634315 5698364 5771011 5837734 5911575 5982442 6065284
2990 6065284 6144612 6230497 6312373 6404304 6486824 6586359 6683188 6788798 6889937 7002854 7105483
2979G105483J13547J12963J25611J09486J25959J23055J40276J31720J44306J41918
2969H374324J56422J51079J66670J58634J73936J66856J82410J77377J93631J95262
2959A0096601K13091K06924K24990K20885K41848K33907K57507K52324K73649
2950A2221726K69766K94164L00477L27756L24060L55058L47276L72132L74842
2941A5187257L98168L99010M27565M34926M65908M72191N05470N11210N44964
2932A9346669N65730O11937O29636O70043O95129P49116P74453Q18672Q46830
2923B5708215R05315R44160J010969J059305J127051J181484J262788J325074
2915C4524361J421671J532715J653838J727104J721452J598571J417131J328962
$$ plain form
2979 7105483 7219030 7331993 7457604 7567090 7693049 7816104 7956380 8088100 8232406 8374324
2969 8374324 8530746 8681825 8848495 9007129 9181065 9347921 9530331 9707708 9901339 10096601
2959 10096601 10309692 10516616 10741606 10962491 11204339 11438246 11695753 11948077 12221726
2950 12221726 12491492 12785656 13086133 13413889 13737949 14093007 14440283 14812415 15187257
2941 15187257 15585425 15984435 16412000 16846926 17312834 17785025 18290495 18801705 19346669
2932 19346669 19912399 20524336 21153972 21824015 22519144 23268260 24042713 24861385 25708215
2923 25708215 26613530 27557690 28568659 29627964 30755015 31936499 33199287 34524361
2915 34524361 35946032 37478747 39132585 40859689 42581141 44179712 45596843 46925805
2907D6925805J436716J603904J743733J870392J977483K074718K175274K346696
2899F2154721K539966K742571K944642L179335L403100L658415L916335M178304
2891H8717389M400380M730863N104646N564414O013475O540860P072035P758587
2883A35902649Q445984R330149J0137835J0905947J1123089J1119565J1244755
2876B08209973J1936485J3076415J4648739J5834170J6519827J6457384J6627504
2869C13310497J6813641J8559821J9674264J8893266N996838o237264k091434
2862C84919629m635196j3552939j5558721j9607306k1533866j8072271j4579318
2855B77380012j1899419j1044880j1873924j2212633j0847322r352731p927665
$$ plain form
2907 46925805 48362521 49966425 51710158 53580550 55558033 57632751 59808025 62154721
2899 62154721 64694687 67437258 70381900 73561235 76964335 80622750 84539085 88717389
2891 88717389 93117769 97848632 102953278 108517692 114531167 121072027 128144062 135902649
2883 135902649 144348633 153678782 163816617 174722564 185845653 196965218 208209973
2876 208209973 220146458 233222873 247871612 263705782 280225609 296682993 313310497
2869 313310497 330124138 348683959 368358223 387251489 393248327 387011063 384919629
2862 384919629 380284433 366731494 351172773 331565467 310031601 291959330 277380012
2855 277380012 265480593 254435713 242561789 230349156 219501834 210149103 202221438
2848B02221438p720120q287115q982581r187087q774642p898919p152597o865169
2840A37353208p101582o573072n945801n320686m844784m410909m154709l828777
2832I5172888l519312l225908l101900k908508k763779k550058k431616k315899
2824G2355908k221419k046362j954323j840684j808697j832636k138718k104519
2816E6408550j901229j751931j679544j576595j512526j431873j366587j277110
2808D3911155j212041j142398j110220j074171j046972r94420r65480r19641q93912
2799C4551900q50465q11315p77602p86099p69128p65508p50100p12027o72777
2790B7656879o50561o37092o26968o02565n75275n57954n43181n28228n03267
$$ plain form
2848 202221438 194501318 186214203 177231622 168044535 159269893 151370974 144218377 137353208
2840 137353208 130251626 123678554 117732753 112412067 107567283 103156374 99001665 95172888
2832 95172888 91653576 88427668 85325768 82417260 79653481 77103423 74671807 72355908
2824 72355908 70134489 68088127 66133804 64293120 62484423 60651787 58513069 56408550
2816 56408550 54507321 52755390 51075846 49499251 47986725 46554852 45188265 43911155
2808 43911155 42699114 41556716 40446496 39372325 38325353 37330933 36365453 35445812 34551900
2799 34551900 33701435 32890120 32112518 31326419 30557291 29791783 29041683 28329656 27656879
2790 27656879 27006318 26369226 25742258 25139693 24564418 24006464 23463283 22935055 22431788
2781B2431788m95292m82069m63512m48335m34545m07927l92651l90374l96378
2772A8520705l80289l70704l58408l59606l50410l48246l40527l49190l38648
2763A5324677l44197l28638l23858l09001l04822k85214k91956k77968k69875
2754A2589148k56960k62809k50126k56012k43993k42591k27852k28954k12485
2745A0407366k12974j94246j95746j82072j86125j75019j80781j65276j72244
2736H742883j55621j60919j51807j56607j43840j46943j34326j40996j25097j34563
2726G292164j28468j32032j23651j27298j18786j24632j13902j17604j04646j10355
2716F090790j01689j06213r5892r9303q8395r6267q8546r1206q1197q9488q4437
$$ plain form
2781 22431788 21936496 21454427 20990915 20542580 20108035 19700108 19307457 18917083 18520705
2772 18520705 18140416 17769712 17411304 17051698 16701288 16353042 16012515 15663325 15324677
2763 15324677 14980480 14651842 14327984 14018983 13714161 13428947 13136991 12859023 12589148
2754 12589148 12332188 12069379 11819253 11563241 11319248 11076657 10848805 10619851 10407366
2745 10407366 10194392 10000146 9804400 9622328 9436203 9261184 9080403 8915127 8742883
2736 8742883 8587262 8426343 8274536 8117929 7974089 7827146 7692820 7551824 7426727 7292164
2726 7292164 7163696 7031664 6908013 6780715 6661929 6537297 6423395 6305791 6201145 6090790
2716 6090790 5989101 5882888 5786996 5687693 5599298 5503031 5414485 5323279 5242082 5152594 5068157
2705E068157q3906p9635q3747p3314p8450o5064p3485o8868p0044n8225n7658
2694D275761n3004n7673n0332m9167m2921m1651l4536m2299l7968l5674l6036
2683C794500l7514k5587k9689k6831k5530k2186k1326k0768j8849k3022l0599
2672C512599l2727l2826l4527l4489l2232l6612l9863l4986l4684m0547l9726
2661C119380l8747m1494m0797l7295l9277m3058l4982l8420l2438l5559l2340
2650B704973l5835l2226l1525k6036k3856k2726l0507k0097k1293k3066k2744
2639B415062k3121k4236j9613k3998j9570k4669j8439k0046j7588k0513k0221
2628B183048k1743j3816k4281j6210k1695j6056k1431k1831k3732j7641j8541
$$ plain form
2705 5068157 4984251 4904616 4820869 4747555 4669105 4604041 4530556 4461688 4391644 4333419 4275761
2694 4275761 4222757 4165084 4114752 4065585 4022664 3981013 3946477 3904178 3866210 3830536 3794500
2683 3794500 3756986 3731399 3701710 3674879 3649349 3627163 3605837 3585069 3566220 3543198 3512599
2672 3512599 3479872 3447046 3412519 3378030 3345798 3309186 3269323 3234337 3199653 3159106 3119380
2661 3119380 3080633 3039139 2998342 2961047 2921770 2878712 2843730 2805310 2772872 2737313 2704973
2650 2704973 2669138 2636912 2605387 2579351 2555495 2532769 2502262 2482165 2460872 2437806 2415062
2639 2415062 2391941 2367705 2348092 2324094 2304524 2279855 2261416 2241370 2223782 2203269 2183048
2628 2183048 2161305 2147489 2123208 2106998 2085303 2069247 2047816 2025985 2002253 1984612 1966071
2617A966071j2155k1641j8554k0397j0736k0785j5664j6719j2271j9427j0376
2606A787346j5190j1869j5713j0055j4085n971j4540j0206j1657l471j2545r111
2594A652933j0801n463q993o739j0082o671j2417m261k228m463r700l006M67M86
2580A569062j966N801j49L798O94J0599J0710J0825J1155J6808J9008L3074L1075
2567A720494M0080N0268N4258N6025P2486Q0940R1862J06216J27436J53434J76512
2556B730011K09551K45484K90056L15759L18723K68520J92608P4012o0433j58317
2546D425974k51965k90645k88670k71391k29368j95887j62156j50951j28160j13557
2536B343224j02467r8658r0602q0148p4427p6014o6599o3045n6646n5445m9061
$$ plain form
2617 1966071 1953916 1932275 1913721 1893324 1882588 1861803 1846139 1829420 1817149 1797722 1787346
2606 1787346 1772156 1760287 1744574 1734519 1720434 1714463 1699923 1689717 1678060 1674589 1662044 1652933
2594 1652933 1642132 1636669 1627676 1620937 1610855 1604184 1591767 1587506 1585278 1580815 1571115 1568109 1568576 1569062
2580 1569062 1567096 1572897 1572748 1576546 1577240 1587839 1598549 1609374 1620529 1637337 1656345 1689419 1720494
2567 1720494 1760574 1810842 1865100 1921125 1993611 2074551 2166413 2272629 2400065 2553499 2730011
2556 2730011 2939562 3185046 3475102 3790861 4109584 4378104 4570712 4644724 4584291 4425974
2546 4425974 4174009 3883364 3594694 3323303 3093935 2898048 2735892 2584941 2456781 2343224
2536 2343224 2240757 2142099 2051497 1971349 1896922 1820908 1754309 1691264 1634618 1579173 1530112
2525A530112m9823m1281m0719l2743l0071k9741k9272k5911k5694k0903k3185
2514A180769j6103k0295j8289k3163j5383j5102j3141j5940j4673j8459j3856
2503I96365k0327j3319j8138j2109j0085j2503j7927r397j0296q041r720r270
2491H45233j4897q801j2335n445j2848p732q925q727o507r992j5184k078n715
2478G26047r367r529o748o253n976r526q408q496l459q305n764p623k865p547
2464F26181m476o096o008p488o007p102m939n689n324m755m669p466k256k889
2450E51017m625p086l818m616k708l211m381o622n565m941n233l414o158m223
2436D84416o493l399l060l920l734k002n271l939j264J062q092q58n453l969k924
$$ plain form
2525 1530112 1480289 1439008 1398289 1365546 1335475 1305734 1276462 1250551 1224857 1203954 1180769
2514 1180769 1164666 1144371 1126082 1102919 1087536 1072434 1059293 1043353 1028680 1010221 996365
2503 996365 976038 962719 944581 932472 922387 909884 891957 882560 872264 864223 854503 845233
2491 845233 830336 821535 809200 803755 790907 783175 774250 765523 759016 749024 733840 731762 726047
2478 726047 716680 707151 700403 694150 688174 678648 670240 661744 658285 649980 644216 636593 633728 626181
2464 626181 621705 615609 609601 602113 596106 589004 584065 578376 573052 568297 563628 556162 553906 551017
2450 551017 546392 539306 535488 530872 528164 524953 520572 513950 508385 503444 498211 494797 488639 484416
2436 484416 477923 474524 471464 467544 463810 461808 456537 452598 451334 452396 444304 443446 437993 434024 431100
2421D31100j960m679k027l78k807m455l764l410k466p15K992j512j981j8j752
2406D02168n755K51n752J06j467j526m597l007n289k629l543m873j908l38m362
2391C57479l593l291K492m490n83j090O9l995n138o177p4k568K90n876M02m454
2375C19403k133j875J057k937j208m136q5k811o97k004l339j262j906l620J699
2360B94146j607k361k529k555k593M0m845k685J004K696j222k066n360j847K13
2345B68429l493k202K097n68n975l860j610k224Q35k405k039j190k495l409K230
2330B42121o95o19j525k094j651j804j723r18k168k586J578J7R0n612k276K535
2314B22670j703l811j417k59K871l912k924J022L858k735m867j306J434k748J593
$$ plain form
2421 431100 429140 424461 422434 422056 419249 414794 411030 407620 405154 404439 407431 405919 403938 403920 402168
2406 402168 396413 396664 390912 391018 389551 388025 383428 380421 375132 372503 368960 364087 362179 361841 357479
2391 357479 353886 350595 353087 348597 348014 346924 346993 342998 337860 331683 331609 329041 329331 323455 323857 319403
2375 319403 317270 315395 316452 313515 312307 308171 308086 305275 304578 302574 299235 297973 296067 292447 294146
2360 294146 292539 290178 287649 285094 282501 282541 277696 275011 276015 278711 277489 275423 270063 268216 268429
2345 268429 264936 262734 264831 264263 258288 254428 252818 250594 251429 249024 246985 245795 243300 239891 242121
2330 242121 241426 240807 239282 237188 235537 233733 232010 231092 228924 226338 227916 227933 228023 222411 220135 222670
2314 222670 220967 217156 215739 215480 218351 214439 211515 212537 216395 213660 208793 207487 208921 206173 207766
2299B07766K93J016n071n941Q38j001q25J223k712j84j992l041K502O45l261j286
2283A88969k228p06m386j97M20N0j352n19k501j240k832L147O27k846r5K77k527
2266A72061J71N82J746k601j701m663N42l139L5k625j566j414K723K7j140l977
2250A55061O7l060J409k849j844O42K021K74j036l655m08o07j083j289J175k337
2234A42481L563k284m421j815J059Q92o26j83j663l006O54J236J403j138l47k782
2218A33023j983R99J098L72N34r93o293n79p05K60J579K368j727k275k11l40M08
2201A25535j271k866J313k612j995nl584J213K607J303L75l306l375j746J563
2186A13149l163o84j618J266J52K350k454k865N96n5j362j048j069J031k326j132
$$ plain form
2299 207766 208059 209075 204004 198063 198901 197900 197075 198298 195586 195402 193410 190369 192871 193516 190255 188969
2283 188969 186741 186035 181649 181452 181872 181922 180570 180051 177550 176310 173478 176625 177252 174406 174311 174588 172061
2266 172061 172232 172814 174560 171959 170258 165595 166137 162998 163033 160408 158842 157428 160151 160178 159038 155061
2250 155061 155128 152068 153477 150628 148784 149426 151447 151721 150685 147030 146622 146015 144932 143643 144818 142481
2234 142481 146044 143760 139339 137524 138583 139475 138849 138666 137003 133997 134651 135887 137290 136152 135805 133023
2218 133023 131040 132039 133137 133509 134043 133050 126757 126178 125473 125733 127312 129680 127953 125678 125467 125127 125535
2201 125535 124264 121398 122711 120099 118104 118099 114515 115728 118335 119638 120013 116707 113332 111586 113149
2186 113149 109986 109302 107684 108950 109102 111452 108998 106133 106729 106674 105312 104264 103195 104226 101900 100768
2170A00768j164O22L252k013j550k808m86J404k855k5J468j465l798L256l325
2155I1281J634l49k492N29L663j346P83j924j902J2j783K50L567qj806l614l30
2138H6165J122j901l58K609j841k139O86M440j205m253l969K017O70J352r31j51
2122H2313k154j697O98q5L793k14l950K773k74Q40m062J286k603l053R20J247
2106G5778j115L80R69j306j11J504l485j207K574k606m557M240K079j125j376
2091G0636r83k798K339M277m47q44j672J389o22l250l018R56r21Q73P27r83j384
2074F4275J254M7M77k551l796K67K47l93j477J138K72j268j151O91p48r08K1p92
2056E5605K2o54P91L236k053L3L41j997L506o575P70K793J348r76M20p90m198
$$ plain form
2170 100768 99604 100226 103478 101465 99915 97107 96621 98025 95170 95145 96613 95148 91350 94606 91281
2155 91281 92915 92566 90074 90603 94266 92920 93703 91779 89877 89889 88106 88356 91923 91915 90109 86495 86165
2138 86165 87287 85386 85028 87637 85796 83657 84343 88783 87578 83325 79356 81373 82043 83395 82464 82313
2122 82313 80159 78462 79160 79075 82868 82654 78704 81477 81203 82043 77981 79267 76664 73611 74531 75778
2106 75778 74663 75043 76012 74706 74595 76099 72614 71407 73981 71375 66818 71058 73137 72012 70636
2091 70636 69653 66855 69194 73471 73024 72180 70508 71897 71275 68025 65007 65963 65042 65915 66642 65659 64275
2074 64275 65529 65576 66053 63502 59706 59973 60220 59827 58350 59488 59760 58492 57341 58032 57284 56376 56397 55605
2056 55605 55627 54973 55764 59000 56947 56980 57321 55324 58830 52255 53025 55818 57166 56190 56610 55820 51622
2039E1622r23L358r32m09j823J480R2P03J13k768k184M35o52M849k097k484M31
2022D8811R33m74J320L458j466n442J059k788L53J047M838j186J592M70k663j461
2006D8401r0j025l473N22J642om02M51L36m112Q15P34J682L54j788p69J181k639
1988D1814L837l175j108O53M162j206j397j802j801M85j333O60N7J65k498K096
1972C9609J697j480J316m819P93J151k991j879l10j26l471M82l3L772L92K05J265
1955C5573k351m193n6P92p71k350J383Q74l03j424o40J775J993k687P44k449o64
1938B5246P28L5J290p25J169J781k409L44N42K229l092j270j089j891L9K033m17
1921B4543Q04q94p60k0J667j291l98j646K179K851N14j829k146k584K336J482
$$ plain form
2039 51622 50699 54057 53125 52716 50893 52373 52465 53168 53281 50513 48329 48764 48112 52961 50864 48380 48811
2022 48811 49744 49270 50590 54048 52582 47140 48199 45411 45764 46811 51649 50463 52055 52525 49862 48401
2006 48401 48311 47286 43813 44335 45977 45971 45569 46020 46356 42244 43059 43793 45475 45829 44041 43272 44453 41814
1988 41814 45651 42476 41368 42021 46183 44977 43580 41778 39977 40462 39129 39789 39846 40011 37513 39609
1972 39609 41306 39826 41142 36323 37116 38267 35276 33397 33087 32961 29490 29972 29939 33711 34103 34308 35573
1955 35573 33222 29029 28973 29765 28994 26644 28027 28901 28598 27174 26534 28309 30302 27615 28359 25910 25246
1938 25246 25974 26009 27299 26574 27743 29524 27115 27459 28001 30230 27138 25868 24779 22888 22927 24960 24543
1921 24543 25347 24453 23693 23673 25340 24049 23651 22005 24184 27035 27549 25720 23574 20990 23326 24808
1905B4808q90l806p97L820j210j07J074o66K12j545r55J322K113j070j317n97
1889B0389M271j454p33j016M45J61k75k084J483k792K155n28k31l091J402K814
1873B0916J783l80M17k130j762J493O36k041l513q33m78q92R67q54P99J239L396
1856A8763L588J0Q18j074m665J518P87j772k269k550r25M65J818n38M633M485
1840B3092j708l028M05j325m373r02J333k081L327j053Q28j099J766K364J113
1825A8659n88J087n852q59l283k7k028l276K97j156L622L454K613K835L893K785
1809B2176r47p01k933k550k652J393l111j2233m360J274J913M472J741K923Q032
1794A4437P662P786J0272K938l487p108p38k663r598p523J020J730L17J185M582
$$ plain form
1905 24808 23918 20112 19315 23135 21925 21818 22892 22226 22438 20893 19938 21260 23373 22303 20986 20389
1889 20389 24660 23206 22473 21457 21902 22063 21788 19704 21187 18395 20550 20022 19791 16700 18102 20916
1873 20916 22699 22319 22736 20606 18844 20337 20973 18932 15419 14586 14108 13216 14183 13329 14128 15367 18763
1856 18763 22351 22361 23179 22105 17440 18958 19745 17973 15704 13154 12229 12694 14512 13974 18607 23092
1840 23092 21384 18356 18761 17436 13063 12161 13494 11413 14740 13687 14515 13416 15182 17546 18659
1825 18659 18071 19158 13306 12447 9164 9137 7109 3833 4130 2974 6596 10050 12663 15498 19391 22176
1809 22176 21229 20528 17595 15045 12393 13786 10675 -1558 -5918 -4644 -2731 1741 3482 6405 14437
1794 14437 22099 29885 40157 43095 39608 32500 31762 29099 19501 11978 12998 14728 15045 16230 20812
1779B0812J454k558n653m593n031J660o437k840l755k04K420O225M232N999K438
1764A4169K400J774J645Q04r22p39o783k375k725k124q05k817k93K281L709K835
1748A0034j349O716M383k328m69j835m107j684o87l124j27n07K665P38M372j93
1732A2498K084J584l461J967J28k118l169K791Q2N81l80j147k415K966L510J425
1716A6926J212n237j7J970l871m333j23J325K36Q10j42L303L668J4m89j556l679
1699A0017k561J510L92n59P39L198L42k175k805J840K528j133J23p78K495j232
1683A1941R22l774P10J001k86n49N50k589M80q75r60k483M025P98K697j234j867
1666H507J732J633n50k001o99l97j174J056M18p34K24O28o50l49n87k51J909l07
$$ plain form
1779 20812 22266 19708 14055 9462 4431 6091 -346 -3186 -6941 -7145 -4725 1500 5732 11731 14169
1764 14169 16569 18343 19988 20792 19870 19131 12348 9973 7248 5124 4319 1502 1209 3490 7199 10034
1748 10034 8685 15401 19784 17456 16987 15152 11045 9361 8674 5550 5423 4916 7581 8319 12691 12498
1732 12498 14582 16166 12705 14672 14800 12682 9513 12304 12386 12967 12587 11440 9025 11991 15501 16926
1716 16926 18138 12901 12884 14854 10983 6650 6527 7852 8088 8898 8756 12059 15727 15741 15252 13696 10017
1699 10017 7456 8966 9358 8799 9538 12736 13078 10903 8098 9938 12466 11333 11456 10678 13173 11941
1683 11941 12863 9089 9799 10800 10514 9965 10515 7926 8406 7531 6571 4088 8113 8911 11608 10374 8507
1666 8507 10239 11872 11322 9321 8622 8225 7051 8107 8525 7791 8015 8643 7993 7644 7057 6806 8715 8408
1648H408j832L692m912J78J648k578K455L757J995q57k083J617j4L500j263q79
1632A2832p21J2J022k227J160o82k710J998j37K192J085k892k781M14K368l139
1616G794k969J815J535r55J659l7L859J720l353j80Q0k303J882J520R94J548J734
1599A6343J666k785K849P9k864J238j368K02m84j028j349k269J351j378K343j29
1583A2417l345O78Q84J140j6p28k670k53k759J897K784j222l000L303L505j040
1567A1575n88j193j780j071L688R90r69J27k303K156k923q00j717M286k828r3
1551F557J101k27J636J504m081P94k856j206J953m53p12M444K205k615K49M743
1535A3036N82l733l128J333p71J624O13n83n83j334k119K073m15K680p6k51j043
$$ plain form
1648 8408 6576 10268 5356 5534 7182 4604 7059 10816 12811 11954 9871 11488 11474 14974 13711 12832
1632 12832 12111 12123 13145 10918 12078 11396 8686 10684 10547 12739 13824 10932 8151 8565 10933 7794
1616 7794 4825 6640 8175 7220 8879 8842 12701 14421 11068 10888 10968 8665 10547 12067 13061 14609 16343
1599 16343 18009 15224 18073 18152 15288 16526 15158 15360 14876 13848 12499 10230 11581 10203 12546 12417
1583 12417 9072 9750 10634 11774 11758 11030 8360 8107 5348 7245 10029 8807 5807 9110 12615 11575
1567 11575 10987 9794 8014 6943 10631 11621 10652 10779 8476 10632 7709 6909 5192 9478 6650 6557
1551 6557 7658 7431 9067 10571 6490 7284 4428 3222 5175 4722 4010 8454 10659 8044 8293 13036
1535 13036 13618 9885 6757 8090 7319 8943 9556 8973 8390 7056 4937 7010 6595 9275 9199 8948 7905
1518G905p42K578J933k325n448L119j220j19J711j892L77j614K335k428J919J704
1502G793l3Q04k224K03N63j250K251l34q03J604j751J404L16k274L04j999j914
1485B660J487M9k270J303j184K59j214K440J715k686J301K515o71j127J797n90
1469E784J081Q46K001k114j980k08J926p34K223j907j546O72l11j481J057J10
1453E419K250k488j291k11o80J845M959k305n569l408J723K727M354J354J079
1438I758l410j552J022L24k197j048j144K310o98K331j309J480N07J741j647j340
1422E128p35O65k052J635j895k295M16J932Q35L877k654P8j403O65J348k304j605
1405A636J326L43k918K59J58N97J360k945J363K688k145J559j951l24p80K604
$$ plain form
1518 7905 7163 9741 11674 9349 3901 7020 5800 5681 7392 5500 5877 4263 6598 4170 6089 7793
1502 7793 7760 8564 6340 6543 7106 5856 8107 7773 6970 8574 6823 8227 8543 6269 6573 4574 2660
1485 2660 4147 4196 1926 3229 2045 2304 1090 3530 5245 2559 3860 6375 5704 4577 6374 5784
1469 5784 6865 7711 9712 7598 5618 5410 7336 6602 8825 6918 5372 6044 5733 4252 5309 5419
1453 5419 7669 5181 3890 3679 2999 4844 9803 7498 1929 -1479 244 2971 7325 8679 9758
1438 9758 6348 4796 5818 6142 3945 2897 1753 4063 3365 5696 4387 5867 6374 8115 6468 5128
1422 5128 4393 5058 3006 4641 2746 451 867 2799 3634 7511 4857 4935 3532 4197 5545 3241 1636
1405 1636 2962 3305 387 646 804 1401 2761 -184 1179 3867 1722 3281 1330 1006 226 2830
1389B830L302k38k779m99k51k668K018k165j305N068J751l527L72J344p27k05
1373B321k03j175o39M90l82K074l24k298J809J08q33K238j626L417l976k084J603
1356E20K534k483j769L03J041k2m93l130O47K815J502K481p99l359j424m58L94
1339a700R7J632J39j009K395P06l877N056K200l253q30K00l17J193o231J904K808
1322A113o43M2K167O4j621R06n26k224L345l886R20J601P41j759j203j308K538
1305B67J31R06l54q54k679J733P27k786n24J889P64K318j644j98K397l36J104
1288B861o81j909K044J42j564k863o15K083M391j045m20J046k287P84k63J19L88
1271B211J969l378p47O06k61j574o83O11J114k152K048J947J385q50n65j161k140
$$ plain form
1389 2830 6132 5894 3115 2616 2365 -303 1715 -450 -1755 3313 5064 1537 1909 3253 2526 2321
1373 2321 2118 943 304 794 412 2486 2162 -136 1673 1781 948 3186 1560 4977 1001 -1083 520
1356 520 3054 571 -1198 -895 146 124 -369 -3499 -2852 -37 1465 3946 3147 -212 -1636 -2094 -1700
1339 -1700 -1603 29 168 -841 1554 2260 -1617 3439 5639 2386 1556 1756 1439 2632 -3599 -1695 1113
1322 1113 470 512 2679 2743 1122 2028 1502 -722 2623 -1263 -343 1258 1999 240 -963 -2271 267
1305 267 398 1304 950 96 -2583 -850 -123 -2909 -3433 -1544 -780 1538 -106 -304 2093 1757 2861
1288 2861 2180 271 2315 2457 893 -1970 -2585 -502 3889 2844 2424 3470 1183 1967 1704 1823 2211
1271 2211 4180 802 55 661 400 -1174 -1857 -1246 -132 -2284 -236 1711 3096 2246 1681 520 -1620
1254a620J764l42p54m10J376j84L75k295P58K260N56O18j129j391j574K219j23
1237A04j796j56L909K95j730j530K14j24K959m453k05M89K805k32Q80J54j654
1220g1J657K097j166j621k171K49O67K260l96j534j365J974r15J700R15m27m138
1203b285K507J925j187r85O73q05J268J661l359l514L59k178j346L516K683j626
1187b693k305K431L124j337K761n02k413j470p13l29m60J360J8m6K408j434j334
1170b934j884L184O1m6K138o44k885r57K676J989J192j938k251K897j830p92K87
1153a737J85J104p92N5m95K548k146j685K88L339k056K82J411K237j92k44j709
1136C93j677j638Q58p50M15N57J921J305p9Q1k238j5l03M81l082J134M705k979
$$ plain form
1254 -1620 144 -198 -952 -1362 14 -170 205 -2090 -1332 928 1484 2102 973 -418 -1992 227 104
1237 104 -1692 -1848 2061 2356 626 -904 -690 -814 2145 -2308 -2513 -2024 781 549 1429 1583 -71
1220 -71 1586 3683 2517 896 -1275 -1026 -359 1901 1505 -29 -1394 580 -335 1365 2280 1853 -2285
1203 -2285 222 2147 960 -25 648 -157 1111 2772 -587 -4101 -3742 -5920 -7266 -3750 -1067 -2693
1187 -2693 -4998 -2567 557 -780 1981 1479 -934 -2404 -3117 -3446 -3906 -2546 -2528 -2574 -166 -1600 -2934
1170 -2934 -4818 -1634 -1573 -1619 519 -125 -3010 -3967 -1291 698 1890 -48 -2299 598 -1232 -2024 -1737
1153 -1737 -1552 -448 -1240 -1185 -1680 868 -1278 -2963 -2675 664 -1392 -1110 301 2538 2346 2102 393
1136 393 -1284 -2922 -2064 -2814 -2399 -1842 79 1384 1305 1386 -852 -867 -1170 -689 -3771 -2637 2068 -911
1118i11j191p57K696O82k949P4K667n042p70M836L461L07m20k427l757k003j189
1101f693j733K272K018J321J721j850k424J723m42J23Q94J655o13j497j061K301
1085b285j373o73J189r04j978j8o30L121J300j235J91L19K984J38l063r37J091
1068b763L037l696J174j55J831L08k192l852K116L587j522j889p54q78L056L798
1052A206lk822q86J772K796k902R95j89k246l15k581k47J981K549K643k952l085
1035d286k648K943K266J605j197m243K350J716K730j008J385l187Q54m03J33K06
1019g84j360M66j863j611K489J503m12j061j208J881J266N14J593o67j720k602
1003c576k226K944R81k457L6J468J321J31O23k741J95M696J113j445R04n228J732
$$ plain form
1118 -911 -2102 -2859 -163 519 -2430 -2356 311 -4731 -5501 -665 2796 3103 2683 256 -3501 -5504 -6693
1101 -6693 -8426 -6154 -4136 -2815 -1094 -2944 -5368 -3645 -4087 -3964 -3070 -1415 -2028 -3525 -4586 -2285
1085 -2285 -3658 -4331 -3142 -4046 -6024 -6042 -6672 -3551 -2251 -3486 -3295 -2976 8 146 -2917 -3854 -2763
1068 -2763 274 -3422 -2248 -2403 -572 -264 -2456 -6308 -4192 -605 -2127 -4016 -4770 -5648 -2592 1206
1052 1206 1203 -1619 -2505 -733 2063 -839 156 -33 -2279 -2594 -5175 -5422 -3441 -892 1751 -1201 -4286
1035 -4286 -6934 -3991 -1725 -120 -1317 -5560 -3210 -1494 1236 228 1613 -1574 -720 -1123 -990 -784
1019 -784 -2144 -1678 -3541 -5152 -2663 -1160 -1572 -2633 -3841 -1960 -694 -180 1413 746 -974 -3576
1003 -3576 -5802 -2858 -1877 -4334 -4298 -2830 -1509 -1378 -755 -3496 -3301 1395 2508 1063 1967 -3261 -1529
986a529L4J297l156Q43k587P67O32J891L716K101k507k983J657k197o76M548k403
969e52K850k226J112l335q36K311J093j459l54r69k167L779l47M90l33k067J968
952a042J508q80N25P63j542M77L2K705P37j420l482k19K652J42j100p96J01r41
934a780K281m09k889j224K589N96J30o28L293K415j597J812k547k288K414K755
918D923l651l72L2j076k78j591l58j150J401J307k514R94L491k721J572J455j355
901A09j400J134J15j742M623R77k639n42J509O36P86j524k538M70l011K478R21
884C62r73n67K253n82M253o64o51n23k886O90q8J605O34m016j129r02Q86J191
866a107K442J124j564l960K220J862J421O22L655m719j383l359R12k50j308J41
$$ plain form
986 -1529 -1495 -198 -3354 -2511 -5098 -4331 -3699 -1808 1908 4009 1502 -1481 176 -2021 -2697 1851 -552
969 -552 2298 72 1184 -2151 -2987 -676 417 -1042 -1396 -2365 -4532 -753 -1100 -610 -943 -3010 -1042
952 -1042 466 -414 111 874 -668 -191 -159 2546 3283 1863 -1619 -1838 814 956 -144 -940 -839 -1780
934 -1780 501 92 -2797 -4021 -1432 -836 -706 -1334 1959 4374 2777 4589 2042 -246 2168 4923
918 4923 1272 900 932 -144 -422 -2013 -2371 -3521 -2120 -813 -3327 -2333 1158 -1563 9 1464 109
901 109 -1291 -157 -42 -1784 2839 3816 1177 635 2144 2780 3566 2042 -496 -26 -3037 -559 362
884 362 -611 -1178 1075 493 4746 4082 3431 2908 22 712 624 2229 2863 -1153 -2282 -3184 -2298 -1107
866 -1107 1335 2459 895 -3065 -845 1017 2438 3060 6715 1996 613 -2746 -1834 -2084 -3392 -3251
850c251L486k410Q52J045J024j082k547j354K561J002r38M1J307K54j670J896
834B16K747m213k872N049l34P52j576k597K005j265R58R44n88n88M0j821N505
817B362p03o56j942j831J108n7O85q19Q42J448p9l27J631k156J473M1Q36j353
799E03K138j194J97L32j401Q68J66m533j69K382J499k060J372J149l400M00k368
782d119p57J800k050K843q42j276P52k50L56M080l7J266J259j263q66n20o50J273
764I99k436K36K420j838n36n4k703L835O42K364k309J808l723K376k648j668k208
747e443o3L152K991j151M89K57L119K409k185m031j003q42j357O94k437p23L725
730b399J255k058M10M460J169J289P84p31k371L71k462J7P3K32O95j871k193k279
$$ plain form
850 -3251 235 -2175 -1323 -278 746 -336 -2883 -4237 -1676 -674 -1612 -1571 -264 -10 -1680 216
834 216 2963 -1250 -4122 927 593 1345 -231 -2828 -823 -2088 -1130 -186 -774 -1362 -1322 -3143 2362
817 2362 1659 1003 -939 -2770 -1662 -1719 -1034 -1853 -1011 437 358 31 1662 -494 979 1020 1856 503
799 503 2641 1447 1644 1976 575 1443 1609 -2924 -3093 -711 788 -1272 100 1249 -2151 -1751 -4119
782 -4119 -4876 -3076 -5126 -2283 -3125 -4401 -3649 -3899 -3543 537 500 1766 3025 1762 896 376 -274 999
764 999 -1437 -1201 1219 -619 -1155 -1209 -3912 -77 565 2929 620 2428 -1295 1081 -1567 -3235 -5443
747 -5443 -5506 -2354 637 -514 -25 232 3351 5760 3575 -456 -1459 -2301 -3658 -2964 -5401 -6124 -2399
730 -2399 -1144 -3202 -2792 1668 2837 4126 4910 4179 1808 2179 -283 -266 -193 39 734 -1137 -3330 -5609
712e609j66j72M77k341M512J039q70k057j393L49p82J936J077j01K833M68k98
695a098J025J640l261N380j237k714q81J677p22p42k134k981j64J087K16L737
679a172j670M85K95k61L236J705o13M86p62J302l362o10J146j764k78M98Q57j177
661a659r93J419K647Q93P7l04R04K157j499o89k472l213N39K45J628O77j129L063
643B291K585p09m237J186J204K00n60j917l096N12K220j85O01j521r24J45k02
626b407O064J289o01q12k061j020j879j59J230r43J516L16k410M84J946J976o07
609A922m2j700j421J667j472r48J67m23j459J63K180l851R85K124o62K579r2k025
591b308L03P07m9K489j796k685K290L65J192j913M42K344M58l083l273L538j153
$$ plain form
712 -5609 -5775 -5947 -5470 -7811 -3299 -2260 -3130 -5187 -6580 -6231 -7013 -5077 -4000 -4101 -1268 -800 -1098
695 -1098 -73 1567 -1694 3686 2449 -265 -1146 531 -191 -933 -3067 -6048 -6212 -5125 -4909 -1172
679 -1172 -2842 -2357 -2062 -2323 913 2618 2005 2491 1729 3031 -331 -941 205 -1559 -1837 -1339 -482 -1659
661 -1659 -2652 -1233 1414 2307 2384 2080 2984 5141 3642 2953 481 -2732 -2193 -1948 -320 357 -772 2291
643 2291 4876 4167 -70 1116 2320 2520 1960 43 -3053 -2541 -321 -506 95 -1426 -2350 -2205 -2407
626 -2407 3657 4946 4345 3533 1472 452 -1427 -1586 -356 -1299 217 533 -1877 -1393 553 2529 1922
609 1922 1880 180 -1241 426 -1046 -1994 -1827 -2250 -3709 -3546 -1366 -5217 -4232 -2108 -2770 -191 -283 -2308
591 -2308 -2005 -1298 -1347 1142 -654 -3339 -1049 -684 508 -1405 -963 1381 1839 -1244 -4517 -979 -2132
574b132l90N79J306M08j132J447J250j044l175J657L733k195p95L358j314j963
558d02q5J592p97j022j398j262J302K820K14k573K716O43l847O35K513J980k03
541B826j921j695J119L51R60j871k539K232M135j826j357O13L11k364N45J859
525A378L2N33R63J660k129j661J48n48J172j081L302J733m020p36j74j061j311
508a800k45j5k600M513j020P88K138o03j118J75j854J746J064j481r76L988j816
491H84O09p17M34j943j63j052L466J578r67J043l12Q5j670l107N28K298j056K825
473B763j113p04M86k82Q93K487j600K547j007k313k629n27M425p81m907K261l07
456c08j290M216M028j33l583L29r07p80J107k590J020J723K949j730n84P16M34
$$ plain form
574 -2132 -2522 -1943 -637 -229 -1361 86 1336 292 -2883 -1226 2507 312 -483 2875 1561 -402
558 -402 -487 1105 308 -714 -2112 -3374 -2072 748 962 -1611 1105 1748 -2099 -1464 1049 3029 2826
541 2826 905 -790 329 680 1640 -231 -2770 -538 3597 1771 414 1027 1338 -1026 -481 1378
525 1378 1410 1943 2906 4566 2437 776 924 376 1548 467 3769 5502 1482 746 572 -489 -1800
508 -1800 -2045 -2060 -4660 -147 -1167 -379 1759 1156 38 213 -1641 105 1169 -312 -1288 2700 884
491 884 1493 776 1210 -733 -896 -1948 1518 3096 2129 3172 2860 2945 1275 -1832 -1304 994 -62 2763
473 2763 1650 946 1432 1150 2043 4530 2930 5477 4470 2157 -472 -999 3426 2645 -2262 -1 -308
456 -308 -1598 2618 6646 6513 2930 3259 2352 1572 2679 89 1109 2832 5781 4051 3467 4183 4617
439D617k402n57j44k91L025j357j144m30J779l27j826r5K245M345k818n956k138
422c474N338J688j485M43J96k28j072O43j266Q19j143J12J937K080M1j036M029
405G622j294k086r50K619j552o36k293K507k153J019Q67L306j837j923K127K505
389G848r11o99l078L218j709j888J88L107p29n92m96J860j072l693j53L26K092
372C619J878p43R34J156m503J269n58j799K686L840o961M96K63K973r68q23K54
355C013J602K699j260j602q81r75K83K954l169M84L087n67k047j326N89L626K425
338H935l109Q92Q09J002k750J039Q52l33l77k637m51J041k035k93J680L37k520
321B082J005j408N06m35Q68K462M585j447j474k42j492M09Q31Q6R76k111j541
$$ plain form
439 4617 2215 1658 1514 1223 4248 2891 1747 1317 3096 2769 943 848 3093 7438 4620 -1336 -3474
422 -3474 1864 3552 2067 2510 2706 2478 1406 2049 783 1602 459 571 2508 4588 4629 3593 7622
405 7622 6328 4242 3292 5911 4359 3723 1430 3937 1784 2803 3670 6976 5139 3216 5343 7848
389 7848 6937 6238 3160 6378 4669 2781 2969 6076 5347 4755 4259 6119 5047 1354 1201 1527 3619
372 3619 5497 4754 5688 6844 2341 3610 3052 1253 3939 7779 818 1314 1577 4550 3582 2759 3013
355 3013 4615 7314 6054 4452 3571 2596 2879 5833 2664 3148 6235 5668 3621 2295 2884 6510 8935
338 8935 5826 6718 7527 8529 5779 6818 7670 7337 6960 4323 3872 4913 2878 2585 4265 4602 2082
321 2082 3087 1679 2185 1750 2618 5080 9665 8218 6744 6502 5010 5419 6250 6336 7312 5201 3660
304C660M752R37l306j489r78J842J862K118l584j993J381r38k05K970J528n05
288H052J402k55l354j604j582L502K597R53l554n80j196l519J435M22K800p12
272D807j64k258K004J051l31j466N7J386L489n858j236K867j808L840Q87l084
256D183J699K864k884j555P32l23J050o71j470K372k346O67P42K131o48k692J642
239E493j101J927k027o82p02J518J848k089J69R55O67k466J456j935J297J219
223E547p90J166j606L527j353j614J234J211O01o7r19j198L16J982q33j953J551
206F802j120k5j080l605q70L503K73K19J346R0p8o65K639k973k765j41j129L315
188C736N92J742K576j330j065L63j652p45N41J589j00R67mJ5L249k727j3j667
$$ plain form
304 3660 8412 9349 6043 4554 3576 5418 7280 9398 5814 3821 5202 4264 4059 7029 8557 8052
288 8052 9454 9199 5845 4241 2659 6161 8758 9711 6157 5577 4381 862 2297 2719 5519 4807
272 4807 4643 2385 4389 5440 5109 3643 3700 5086 8575 2717 1481 4348 2540 6380 7267 4183
256 4183 5882 8746 5862 4307 5039 4716 5766 5095 3625 5997 3651 4318 5060 7191 6543 3851 5493
239 5493 4392 6319 4292 3610 2908 4426 6274 4185 4354 5309 5976 3510 4966 3031 4328 5547
223 5547 4757 5923 4317 7844 6491 4877 6111 7322 7923 7856 6937 5739 6055 8037 7204 5251 6802
206 6802 5682 5657 4577 972 102 3605 3878 4097 5443 5533 5455 4790 7429 4456 1691 1550 421 3736
188 3736 4328 6070 8646 7316 6251 6614 4962 4217 4758 6347 6247 7214 7210 7225 10474 7747 7734 6067
170F067J771p07n37q34J081J645R71j65l197n38J611j265M24L77O8K190j243j439
152F280j2O71j010k165o31J489J113k223P6L178q33K07K576j429m13k090m68J21
134D437J423O79n6P39R40l228m44J847O68j38n44l678J372L244j9j124o79L50
116E789O72J851j106J660K907k85k877k297l96K84O71r51J491n6k833Q33J62j940
98C579J464L062j798p42O31j296O32J876K39j290J433k03k070j996K351L917j152
81H637l03j830K392j487J135n12q25j625R9M97J089O85j842L74l86j378M7J280
63F047m40K952j064l061J10J379r4j576K120q2K97m51k19O50J173r47R82p34J083
44H125K777j647j874k933o27K282l86j083Q50K045M0J634k834l201J447M263k25
$$ plain form
170 6067 7838 7131 6594 5760 6841 8486 9457 9292 6095 5557 7168 5903 6327 6704 6772 8962 7719 6280
152 6280 6268 6939 5929 3764 3133 4622 5735 3512 3588 6766 5933 6140 8716 7287 6874 4784 4316 4437
134 4437 5860 6539 6483 7222 8162 4934 4490 6337 7005 6867 6323 2645 4017 7261 7242 6118 5439 5789
116 5789 6461 8312 7206 8866 11773 11488 8611 6314 5918 6202 6873 5922 7413 7357 4524 5357 5519 3579
98 3579 5043 8105 6307 5565 6196 4900 5532 7408 7647 6357 7790 7587 5517 3521 5872 9789 8637
81 8637 8334 6504 8896 7409 8544 8032 7207 5582 5681 6178 7267 7952 6110 6484 6098 4720 4767 6047
63 6047 5607 8559 7495 4434 4544 5923 5829 4253 6373 6291 6588 6137 5918 6568 7741 6794 7776 7042 8125
44 8125 10902 9255 7381 4448 3821 6103 5717 4634 5484 7529 7569 9203 6369 3168 4615 8878 8653
27H653j991j15K42K582n04k369K254j426j707K05o35J194K54L05l85k020J979
10F516K162J005m65j587r01j82j042J305J465J646
0I922
$$ plain form
27 8653 6662 6547 6789 9371 8867 6498 8752 7326 5619 5824 5189 6383 6637 6942 6557 4537 6516
10 6516 8678 9683 9218 7631 6730 6548 5506 6811 8276 9922
0 9922
$$ Imaginary data points
##PAGE= N=2
##DATA TABLE= (X++(I..I)), XYDATA
16383h39602R553R778P621Q110J1098Q956Q072Q713J0697R509O314J0584J0413
16370g20184P461O812Q918J1252Q871R512Q251R757P148Q631Q428R459R759Q209
16356e97716P119Q949Q234P998R342R501N833Q876Q907Q444Q494P315P087J2338
16342d79279Q091Q060Q589P436R011J0777O815Q706O219Q152Q283P785O648P204
16328c67503J0761Q076R877P320P313Q708N715R179J0389Q162O401R116O884N354
16314b54248O161Q218Q512N497O744P148Q833Q940Q430N421N402O138P372R182
16300a52250R622N829N296R852O940P250P680O506O431N022N407Q040N862N543
16286e6970P268R427P782M968O075N081O828M960P233N372N615M180Q553M774
$$ plain form
16383 -839602 -830049 -820271 -812650 -804540 -793442 -784486 -776414 -767701 -757004 -747495 -741181 -730597 -720184
16370 -720184 -712723 -705911 -696993 -685741 -676870 -667358 -659107 -649350 -642202 -633571 -625143 -615684 -605925 -597716
16356 -597716 -590597 -581648 -573414 -565416 -556074 -546573 -540740 -531864 -522957 -514513 -506019 -498704 -491617 -479279
16342 -479279 -471188 -463128 -454539 -447103 -438092 -427315 -420500 -411794 -405575 -397423 -389140 -381355 -374707 -367503
16328 -367503 -356742 -348666 -338789 -331469 -324156 -315448 -309733 -300554 -290165 -282003 -275602 -266486 -259602 -254248
16314 -254248 -248087 -239869 -231357 -225860 -219116 -211968 -203135 -194195 -185765 -180344 -174942 -168804 -161432 -152250
16300 -152250 -142628 -136799 -131503 -121651 -114711 -107461 -99781 -93275 -86844 -81822 -76415 -68375 -62513 -56970
16286 -56970 -49702 -40275 -32493 -27525 -21450 -16369 -9541 -4581 2652 8024 13639 17819 26372 31146
16272C1146P061P400P290K020N710P275P052M881L965L367P773O394L077L540
16258A07951P541P170M637P521M263M711M607N730P073O441L205K538M716N295
16244A83399O761N727M441L749O363J301M504O600O025L279L278O147P86L670
16230B46030O555N951L565L993M273N275M927M458M421K123L356M260P062K248
16216C08497L064M339N5L419J830N694M079j6O076L746L521K050L655K978K046
16201C55033J221M639M132K706O021K075K995R63K47M893K987M083K099M502M466
16186D03062J386K964L37M553N019o20O01K41K90L851P514J945J148L51J327K725
16170D36694L377M088L216J555k358K846K981K69K493L606J403J520O85M491K373
$$ plain form
16272 31146 38207 45607 52897 54917 60627 67902 74954 79835 83800 87167 94940 101334 104411 107951
16258 107951 115492 122662 127299 134820 139083 143794 148401 154131 161204 167645 170850 173388 178104 183399
16244 183399 190160 195887 200328 204077 210440 211741 216245 222845 228870 232149 235427 241574 242360 246030
16230 246030 252585 258536 262101 266094 270367 275642 280569 285027 289448 291571 294927 299187 306249 308497
16216 308497 311561 315900 315955 319374 321204 326898 330977 330961 337037 340783 344304 346354 350009 352987 355033
16201 355033 356254 360893 365025 367731 373752 375827 378822 379785 380032 384925 387912 391995 394094 398596 403062
16186 403062 404448 407412 407749 412302 417321 416701 417302 417543 417833 421684 429198 431143 432291 432642 433969 436694
16170 436694 440071 444159 447375 448930 446572 449418 452399 452668 455161 458767 460170 461690 462375 466866 469239
16155D69239K768J122K724J704o68N62L687L123j059J732M560k356j772K50N349
16140D90965J404l13J584J045J057O029L88P9l25N33m00L371O422K611k776k323
16124E09351j736K658L687k92M03K519k207J228J390N30J766L093k008j158J559
16109E20783O50R34J259K057k439M36K859K01j581K068J907M125j215J181p56
16094E32469j366K713Q89m85K262J254k98J226j658Q05L525k176j439p24K126
16079E39123j55m463L688M081m021J763J283Q89K442j607J041M15j39J897o70
16064E45567j41J968L32J73m18l106R00J698J806K392l688Q07K308r09j604K952
16048E51037j348L85Q99p07l95P8J412j053N01P53J094L72k169J024J836R70N29
$$ plain form
16155 469239 472007 473129 475853 477557 476889 477451 481138 484261 483202 484934 489494 487138 485366 485616 490965
16140 490965 492369 492056 493640 494685 495742 501771 502159 502238 501913 502446 502046 505417 511839 514450 511674 509351
16124 509351 507615 510273 513960 513668 514071 516590 514383 515611 517001 517531 519297 522390 520382 519224 520783
16109 520783 521433 522367 523626 525683 523244 523680 526539 526740 525159 527227 529134 533259 532044 533225 532469
16094 532469 531103 533816 534705 534220 536482 537736 537438 538664 537006 537811 541336 539160 537721 536997 539123
16079 539123 538968 534505 538193 542274 538253 540016 541299 542188 544630 543023 544064 544479 544340 546237 545567
16064 545567 545426 547394 547726 547899 547481 544375 545275 546973 548779 551171 547483 548290 550598 549689 548085 551037
16048 551037 549689 550074 550973 550266 549871 549949 551361 550308 550809 551562 552656 553028 550859 551883 553719 554689 555218
16031E55218j023j031r04K765j060j461K595L269m541K010J130j334n22j509k113
16016E51489K178K771j370l409l53L74K615J659k139J032Q93o00k014m19K565
16001E55272j895K645j456J2K285j443Q88q50p77K66J638J50N34J213j120j46
15985E57216m79j98j86K236k630j299M78L984l841p62K145m19K158J302k219M78
15969E57964J216l001M136L57k937o9j670O29K160J74k322K487J15j788N08j730
15953E56229L534m05k638k23J744k25l58J596n09j305L154l19q44j051J915k487
15937E57808K362r78k237L655K156O87l127k411J630l03j891L015p61j023Q34
15922E59416j33K198R74J40J201l317L33J173n50r23J288J159l048l87J234L756
$$ plain form
16031 555218 554195 553164 552260 555025 553965 552504 555099 558368 553827 555837 556967 555633 555111 553602 551489
16016 551489 553667 556438 555068 551659 551306 551680 554295 555954 553815 554847 555740 555140 553126 552707 555272
16001 555272 553377 556022 554566 554578 556863 555420 556308 555458 554681 554947 556585 556735 557269 558482 557362 557216
15985 557216 556737 556539 556353 558589 555959 554660 555138 559122 555281 554519 556664 556245 558403 559705 557486 557964
15969 557964 559180 556179 560315 560672 557735 557666 555996 556625 558785 558959 556637 559124 559239 557451 557959 556229
15953 556229 559763 559358 556720 556497 558241 558016 557658 559254 558745 557440 560594 560275 559431 558380 560295 557808
15937 557808 560170 559192 556955 560610 562766 563453 560326 557915 559545 559242 557351 560366 559605 558582 559416
15922 559416 559283 561481 562455 562595 563796 560479 560812 561985 561435 560512 561800 562959 559911 559524 560758 564514
15906E64514k208l936J235l98j691R25O18K245K203m80l299J643o87R2L71k41
15890E60906j320K000k77K114m01P99n59j458K6k421k358j374N903L310m422k266
15874E58202L610j151l291L329P85j147J007J481n03J592j088j3l741K302K927
15859E64301O89j270j963N47J613L87m855R6l04K453O95K88L154n9p71K328n349
15842E61980J357L521j290J448J099j373m951r6k779J409K558P99k908J84K087
15827E63045n88L181l188k531J291J469R23j292j458J688K526n74j598m21J759
15812E64232p2r95j72n80J755j490L37L225L08j450J139j746L063J350k319k088
15796E64497K003m3M51j658J39R52j033m71K32j630Q88J637R2o3k629j138K783
$$ plain form
15906 564514 562306 558370 559605 559207 557516 558441 559059 561304 563507 563027 559728 561371 560684 560776 561147 560906
15890 560906 559586 561586 561309 563423 563022 563821 563262 561804 561830 559409 557051 555677 561580 564890 560468 558202
15874 558202 561812 560661 557370 560699 561484 560337 561344 562825 562322 563914 562826 562813 559072 561374 564301
15859 564301 564990 563720 561757 562304 563917 564304 559449 559545 559241 561694 562389 562677 565831 565772 565001 567329 561980
15842 561980 563337 566858 565568 567016 568115 566742 561791 561695 558916 560325 562883 563682 560774 560958 563045
15827 563045 562457 565638 562450 559919 561210 562679 563602 562310 560852 562540 565066 564492 562894 562473 564232
15812 564232 564160 563165 562993 562413 564168 562678 563015 566240 566548 565098 566237 564491 567554 568904 566585 564497
15796 564497 566500 566457 566908 565250 565389 566341 565308 564837 565069 563439 564327 565964 566056 565993 563364 562226 565009
15779E65009J12J045l273J0J374m13k259L087k105K158Q38K217l757k07J834j820
15763E63850K212J432q37L69q25r23K685j50N6l047J268J63N70R19k73K191j337
15746E68323j352J45j166J89J917J333K90J218o02J228j379K217K102j354m881
15731E68228q12J87j147J425J157k523Q91K64L970j478l89J38l674K218K77M96
15715E69228n32l05k095n96M48J926M99k91J038J435o66m79k252L43j71Q14J050
15698E69394q42m95j284j455o31K748P36K995j684j070j050N17J96L154k305J81
15682E69105K005j884p74K48J779J615M86P93n203N00J68j153K118K174l638m634
15666E63705o22L064J425L344O77K511k488j201r66K192J619j960k618O25l14
$$ plain form
15779 565009 565121 566166 562893 562903 564277 563864 561605 564692 562587 564745 565583 567800 564043 563836 565670 563850
15763 563850 566062 567494 566657 567026 566201 565278 567963 567813 567869 564822 566090 566253 566823 567742 567469 569660 568323
15746 568323 566971 567116 565950 566139 568056 569389 569679 570897 570295 571523 570144 572361 574463 573109 568228
15731 568228 567416 567603 566456 567881 569038 566515 567406 567670 571640 570162 569773 569911 566237 568455 568732 569228
15715 569228 568696 568391 566296 565700 566148 568074 568573 568282 569320 570755 570089 569610 567358 567701 567530 568344 569394
15698 569394 568552 568057 566773 565318 564687 567435 568171 571166 569482 568412 567362 567879 568075 571229 568924 569105
15682 569105 571110 569226 568452 568700 570479 572094 572580 573373 568170 568670 568838 567685 569803 571977 568339 563705
15666 563705 563083 566147 567572 570916 571593 574104 571616 570415 569449 571641 573260 571300 568682 569307 568993
15651E68993L758K444l183l81j042J575l244M72J296K049M65J620J730q30m34
15636E75288o69m21J268j276j479K442n43Q47j139m37q24j065r47J142J20N40
15620E72847M64j190J125p77j046j450K025J640J823M45j505k053J958k483N45
15605E72368n98j685K271K376o00j835l266J790n76L548O99m28L03J872p05J270
15589E76804m719j353L844J900j184o80P66j429P90o86j93R18o08J033Q11k456
15573E73558J552J234j107j055J879q68j093m64Q33N92K731r67l378o15Q01P18
15557E74351j041J538j654L432l048M53j569o03q28J186L082Q56J383N78m908
15542E73208J000K231j54Q7o72J637j122j893L551N93m84N50j541k147K106J2
$$ plain form
15651 568993 572751 575195 572012 571631 570589 572164 568920 569392 570688 572737 573202 574822 576552 575722 575288
15636 575288 574619 574198 575466 574190 572711 575153 574610 575457 574318 573881 573057 571992 571045 572187 572307 572847
15620 572847 573311 572121 573246 572469 571423 569973 571998 573638 575461 575906 574401 572348 574306 571823 572368
15605 572368 571770 570085 572356 574732 574132 572297 569031 570821 570245 573793 574492 574064 574367 576239 575534 576804
15589 576804 572085 570732 574576 576476 575292 574612 575378 573949 574739 574053 573860 574778 574170 575203 576014 573558
15573 573558 575110 576344 575237 574182 576061 575193 574100 573636 574469 575061 577792 576825 573447 572832 573633 574351
15557 574351 573310 574848 573194 576626 573578 574031 572462 571859 571031 572217 575299 576155 577538 578116 573208
15542 573208 574208 576439 576285 576372 575700 577337 576215 574322 577873 578466 577982 578532 576991 574844 576950 576962
15526E76962k560L666M13M63o53L154k438k562l402N22J380L338k367K08K755
15511E78879K566k66l15k695k310R32K998o80j251k608L2J211L821j91O1j51J636
15494E81669j073Q82J041K99r11l841J835J752L18r35k902j990L141N63j027J264
15478E80085K313P52O75l235n75J679P07M2j324R06k130J420k169p30K413m21
15462E80408j49J212R23m142j335J374M163o99q74l059K164q63n030J51N35P84
15446E75563K784O86J630K511r32j699K973j591k067J241K386k628J727j56j989
15431E80439oL01L364r17q06n67k95m678k211M868o09J664j472N399O70j652P13
15414E84205j793J176n35p62j408J367O55j771J813J284p81J262j423q26j933
$$ plain form
15526 576962 574402 578068 578481 578944 578291 581445 579007 576445 573043 573565 574945 578283 575916 576124 578879
15511 578879 581445 581179 580864 578169 575859 576791 579789 579109 577858 575250 575282 576493 580314 580123 580184 580033 581669
15494 581669 580596 581478 582519 582818 581907 578066 579901 581653 581971 581036 578134 576144 579285 579848 578821 580085
15478 580085 582398 583150 583825 580590 580015 581694 582401 582443 581119 582025 579895 581315 579146 578416 580829 580408
15462 580408 580259 581471 582394 578252 576917 578291 582454 581755 580881 577822 579986 579123 574093 574244 574779 575563
15446 575563 578347 579033 580663 583174 582242 580543 583516 581925 579858 581099 583485 580857 582584 582428 580439
15431 580439 580433 580734 584098 583181 582375 581808 581513 576835 574624 579492 578883 580547 579075 584474 585144 583492 584205
15414 584205 582412 583588 583053 582291 580883 582250 582905 581134 582947 584231 583450 584712 583289 582463 580530
15399E80530L141J17J434l200K301q57j122Q86j979K289k381O36Q97N8J679j483
15383E82946j652L532K574k859J074P64k284j955L95J416o3n86N82J672L09J567
15367E87432J939k569o9j397j801Q84M316k550l5j375p32j306J469j741j536J592
15351E82521J434L192J224K85k696l366J873p43Q53L56J397m63j464p49M02K453
15335E86509k352K137R64P99j898j283J14m85o80J59N06K464J049r18j947L042
15319E88180J286r37j005N994k575m409J800l91r29k145K1J899l14M589K417j583
15303E91898l467p83j417J59Q90j487J097K948j664M609k118l471q95K71J902
15288E88472r30k252J474L85J050J424j991K880K690m489J108j936k589L567q70
$$ plain form
15399 580530 583671 583788 585222 582022 584323 583466 582344 583230 581251 583540 581159 581795 582692 582750 584429 582946
15383 582946 581294 584826 587400 584541 585615 586379 584095 582140 582535 583951 583888 583302 583884 585556 585865 587432
15367 587432 589371 586802 586733 585336 583535 584419 588735 586185 586150 584775 584043 582737 584206 582465 580929 582521
15351 582521 583955 587147 588371 588656 585960 582594 584467 583724 584577 584933 586330 585867 584403 583654 584056 586509
15335 586509 584157 586294 587258 588057 586159 584876 584990 584505 583825 583984 584490 586954 588003 587085 585138 588180
15319 588180 589466 588529 587524 593518 590943 586534 588334 587943 587014 584869 584890 586789 586475 591064 593481 591898
15303 591898 588431 587648 586231 586390 587280 585793 586890 589838 588174 592783 590665 587194 586299 586570 588472
15288 588472 587542 585290 586764 587149 588199 589623 587632 590512 593202 588713 589821 587885 585296 588863 587993
15273E87993o2l35j6J463m81O68Q50J681l77Q9j868k833K533K609j282l327K122
15256E89427N5j231L22K815j664j186L293q35K752j054j954J458J611K745l615
15241E92939j840J541j716l113q28L011J817p90k83q5J988K18k777N6J168k925
15225E88381K722K557M87j44q05l145j396k03K042N94L569M74k633p91J719Q75
15209E94303J57q26J331k809Q38m8n05r56J370j559J879O78l329N58l043M66K587
15192E91092O75J433l52k925K516M17J89n48K543k125q20N40M3P41J925J681l629
15175E93396L344J126l66l404j2l44j54K14j46J382J807l372j834J938N04j431
$$ plain form
15273 587993 587931 587596 587580 589043 588562 589230 590080 591761 591384 591473 589605 586772 589305 591914 590632 587305 589427
15256 589427 589482 588251 588573 591388 589724 588538 591831 590996 593748 592694 590740 592198 593809 596554 592939
15241 592939 591099 592640 590924 587811 586983 589994 591811 591021 590738 590653 592641 592859 590082 590138 591306 588381
15225 588381 591103 593660 594147 594003 593198 590053 588657 588454 590496 591090 594659 595133 592500 591709 593428 594303
15209 594303 594460 593634 594965 592156 592994 592946 592441 591485 592855 591296 593175 593853 590524 591082 588039 588505 591092
15192 591092 591767 593200 592848 589923 592439 592856 593045 592497 595040 592915 592095 592635 592678 593419 595344 597025 593396
15175 593396 596740 597866 597500 594096 594084 593740 593586 593800 593654 595036 596843 593471 591637 593575 594079 592648
$$ [...]
##END NTUPLES=NMR SPECTRUM
##END=
