##TITLE=1H_CG-1187-a1
 DMSO
 8 sc, 
 25.6.2024
##JCAMPDX= 6.0         $$ Bruker NMR JCAMP-DX V2.0
##DATA TYPE= NMR SPECTRUM
##DATA CLASS= NTUPLES
##ORIGIN= UXNMR, Bruker Analytische Messtechnik GmbH
##OWNER= root
$$ XWIN-NMR		Version 3.5
$$ Tue Jun 25 16:08:40 2024 Russian Standard Time (UT+4h)  she@DPX200
##.OBSERVE FREQUENCY= 200.1312
##.OBSERVE NUCLEUS= ^1H
##.ACQUISITION MODE= SIMULTANEOUS
##.ACQUISITION SCHEME= undefined
##.AVERAGES= 8
##.DIGITISER RES= 18
##SPECTROMETER/DATA SYSTEM= spect
##.PULSE SEQUENCE= zg30
##.SOLVENT NAME= DMSO
##.SHIFT REFERENCE= (INTERNAL, DMSO, 0, 15.0087)
##AUDIT TRAIL= $$ (NUMBER, WHEN, WHO, WHERE, WHAT)
$$ ##TITLE= Audit trail, XWIN-NMR		Version 3.5
$$ ##JCAMPDX= 5.01
$$ ##ORIGIN= Bruker BioSpin GmbH
$$ ##OWNER= she
$$ F:/spectra/data/she/nmr/H-F/1/pdata/1/auditp.txt
$$ ##AUDIT TRAIL=  $$ (NUMBER, WHEN, WHO, WHERE, WHAT)
(   1,<2024-06-25 16:07:27.62 +0400>,<she>,<DPX200>,
      <created by zg, POWCHK disabled, PULCHK disabled
       configuration hash MD5:
       00 E9 B6 7A A2 85 ED C7 34 08 36 98 17 FE 4E 26
       data hash MD5: 16K
       DA 14 47 75 78 D3 53 FD D7 B6 D1 41 F9 E7 BB C1>)
(   2,<2024-06-25 16:07:29.89 +0400>,<she>,<DPX200>,
      <Start of raw data processing
       efp BC_mod = 2 LB = 0.24 FT_mod = 6 PKNL = 1 PHC0 = -25313.31 PHC1 = 6.38748 SI = 16K 
       data hash MD5: 16K
       35 DA 2A C9 0D 21 F8 71 33 6B 24 3D 88 91 6F 00>)
(   3,<2024-06-25 16:07:47.29 +0400>,<she>,<DPX200>,
      <pk PHC0 = -3.70797 PHC1 = 3.2 
       data hash MD5: 16K
       F1 19 8A 47 8F 93 8F 68 C5 10 96 C2 0D 28 CB 2A>)
(   4,<2024-06-25 16:07:50.48 +0400>,<she>,<DPX200>,
      <abs ABSG = 5 
       data hash MD5: 16K
       58 26 0C 49 59 FA 99 C0 12 8C F4 95 55 7B 90 76>)
$$ ##END=
$$ 
$$ hash MD5
$$ 43 B6 9A B9 76 6E 28 A8 8B C0 C9 9C 1E 20 1F 41
##$RELAX= 
##$RELAX= 
##$RELAX= 
##$RELAX= 
##$RELAX= 
##$RELAX= 
$$ Bruker specific parameters
$$ --------------------------
##$DU= <F:/spectra>
##$EXPNO= 1
##$NAME= <H-F>
##$PROCNO= 1
##$TYPE= <nmr>
##$USER= <she>
##$AMP= (0..31)
100 100 100 100 100 100 100 100 100 100 100 100 100 100 100 100 100 100 
100 100 100 100 100 100 100 100 100 100 100 100 100 100 
##$AQSEQ= 0
##$AQ_mod= 1
##$AUNM= <au_zg>
##$AUTOPOS= <>
##$BF1= 200.13
##$BF2= 200.13
##$BF3= 200.13
##$BF4= 200.13
##$BF5= 200.13
##$BF6= 200.13
##$BF7= 200.13
##$BF8= 200.13
##$BYTORDA= 1
##$CFDGTYP= 0
##$CFRGTYP= 5
##$CHEMSTR= <none>
##$CNST= (0..31)
1 1 145 1 1 1 1 1 1 1 1 1 1 1 1 1 1 1 1 1 1 1 1 1 1 1 1 1 1 1 1 1 
##$CPDPRG= <>
##$CPDPRG1= <>
##$CPDPRG2= <>
##$CPDPRG3= <>
##$CPDPRG4= <mlev>
##$CPDPRG5= <mlev>
##$CPDPRG6= <mlev>
##$CPDPRG7= <mlev>
##$CPDPRG8= <mlev>
##$CPDPRGB= <>
##$CPDPRGT= <>
##$D= (0..31)
0 1.2 0 0 0 0 0 0 0 0.06 0 0.03 0 0 0 0 0.0002 0 0 0 0 0 0 0 0 0 0 0 0 
0 0 0 
##$DATE= 1719317246
##$DBL= (0..7)
120 120 120 120 120 120 120 120 
##$DBP= (0..7)
150 150 150 150 150 150 150 150 
##$DBP07= 0
##$DBPNAM0= <>
##$DBPNAM1= <>
##$DBPNAM2= <>
##$DBPNAM3= <>
##$DBPNAM4= <>
##$DBPNAM5= <>
$$ [...]
##$SUBNAM3= <"">
##$SUBNAM4= <"">
##$SUBNAM5= <"">
##$SUBNAM6= <"">
##$SUBNAM7= <"">
##$SUBNAM8= <"">
##$SUBNAM9= <"">
##$SW= 18.0517418723606
##$SWIBOX= (0..15)
0 0 2 0 0 0 0 0 0 0 0 0 0 0 0 0 
##$SW_h= 3612.71676300578
##$TD= 16384
##$TD0= 1
##$TE= 0
##$TE2= 300
##$TE3= 300
##$TEG= 300
##$TL= (0..7)
0 120 120 120 120 120 120 120 
##$TP= (0..7)
150 150 150 150 150 150 150 150 
##$TP07= 0
##$TPNAME0= <>
##$TPNAME1= <>
##$TPNAME2= <>
##$TPNAME3= <>
##$TPNAME4= <>
##$TPNAME5= <>
##$TPNAME6= <>
##$TPNAME7= <>
##$TPOAL= (0..7)
0.5 0.5 0.5 0.5 0.5 0.5 0.5 0.5 
##$TPOFFS= (0..7)
0 0 0 0 0 0 0 0 
##$TUNHIN= 0
##$TUNHOUT= 0
##$TUNXOUT= 0
##$USERA1= <user>
##$USERA2= <user>
##$USERA3= <user>
##$USERA4= <user>
##$USERA5= <user>
##$V9= 5
##$VALIST= <valist>
##$VCLIST= <CCCCCCCCCCCCCCC>
##$VD= 0
##$VDLIST= <DDDDDDDDDDDDDDD>
##$VPLIST= <PPPPPPPPPPPPPPP>
##$VTLIST= <TTTTTTTTTTTTTTT>
##$WBST= 1024
##$WBSW= 4
##$XGAIN= (0..3)
0 0 0 0 
##$XL= 0
##$YL= 0
##$YMAX_a= 76364
##$YMIN_a= -93325
##$ZGOPTNS= <>
##$ZL1= 120
##$ZL2= 120
##$ZL3= 120
##$ZL4= 120
##$ABSF1= 14.99656
##$ABSF2= -3.055289
##$ABSG= 5
##$ABSL= 3
##$ALPHA= 0
##$AQORDER= 0
##$ASSFAC= 0
##$ASSFACI= 0
##$ASSFACX= 0
##$ASSWID= 0
##$AUNMP= <proc_1d>
##$AZFE= 0.1
##$AZFW= 0.1
##$BCFW= 0
##$BC_mod= 2
##$BYTORDP= 0
##$COROFFS= 0
##$CY= -3
##$DATMOD= 1
##$DC= 0
##$DFILT= <>
##$DTYPP= 0
##$F1P= 0
##$F2P= 0
##$FCOR= 1
##$FTSIZE= 16384
##$FT_mod= 6
##$GAMMA= 0
##$GB= 0
##$INTBC= 1
##$INTSCL= 3.70164e-10
##$ISEN= 128
##$LB= 0.24
##$LEV0= 0
##$LPBIN= 0
##$MAXI= 10000
##$MC2= 0
##$MEAN= 0
##$ME_mod= 0
##$MI= 1.114404
##$NCOEF= 0
##$NC_proc= -6
##$NLEV= 6
##$NOISF1= 3.799351
##$NOISF2= 2.8
##$NSP= 0
##$NTH_PI= 0
##$NZP= 0
##$OFFSET= 15.00869
##$PC= 1
##$PHC0= -25317.02
##$PHC1= 9.58748
##$PH_mod= 1
##$PKNL= yes
##$PPARMOD= 0
##$PSCAL= 0
##$PSIGN= 0
##$REVERSE= no
##$SF= 200.130002669683
##$SI= 16384
##$SIGF1= 3
##$SIGF2= 2
##$SINO= 5.538805
##$SIOLD= 16384
##$SREGLST= <1H.CDCl3>
##$SSB= 0
##$STSI= 16384
##$STSR= 0
##$SW_p= 3612.71676300577
##$SYMM= 0
##$S_DEV= 0
##$TDeff= 16384
##$TDoff= 0
##$TI= <>
##$TILT= no
##$TM1= 0
##$TM2= 0
##$TOPLEV= 0
##$USERP1= <user>
##$USERP2= <user>
##$USERP3= <user>
##$USERP4= <user>
##$USERP5= <user>
##$WDW= 1
##$XDIM= 16384
##$YMAX_p= 291261253
##$YMIN_p= -671748
$$ End of Bruker specific parameters
$$ ---------------------------------
##NTUPLES= NMR SPECTRUM
##VAR_NAME=  FREQUENCY,     SPECTRUM/REAL,   SPECTRUM/IMAG
##SYMBOL=    X,             R,               I
##VAR_TYPE=  INDEPENDENT,   DEPENDENT,       DEPENDENT
##VAR_FORM=  AFFN,          ASDF,            ASDF
##VAR_DIM=   16384,         16384,           16384
##UNITS=     HZ,            ARBITRARY UNITS, ARBITRARY UNITS
##FACTOR=    0.220516191357247, 1,           1
##FIRST=     3003.68914582711, 0,            0
##LAST=      -609.027617178659, 0,           0
##MIN=       -609.027617178659, -671748,     0
##MAX=       3003.68914582711, 291261253,    0
$$ Real data points
##PAGE= N=1
##DATA TABLE= (X++(R..R)), XYDATA
$$ [...]
11762 -136408 -166887 -105282 -134422 -37587 58822 53935 23821 -73712 17579 -16591 -29516 44904
11750 44904 97306 -19603 -63683 60112 -2516 -64733 1806 87783 99996 16116 58613
11739 58613 65697 70452 32279 99721 40142 -8412 129908 38354 -33858 40218 75885 74407
11727 74407 -6233 5395 72619 -79152 -30309 -117288 -55704 -135429 -81985 -48662 -58787
11716 -58787 -119060 -153266 -118956 125604 104082 -54466 5322 -55380 -66402 6352 85707
11705 85707 -10216 -18416 52830 65684 -6270 -17363 108923 70654 -50696 -16622 51263
11694 51263 55293 35824 51409 61404 50117 -23935 -40759 -19928 -37056 -58820 -16156 -30748
11682 -30748 -10537 74876 126378 172181 169561 32431 22007 32645 -11732 -48796 -148385 -56617
11670 -56617 35364 10381 -20073 7835 57269 17830 19818 -13889 -100146 27609 22141 -4566
11658 -4566 105887 47119 71933 26204 -55050 -67931 -150682 -77815 16567 77277 60998 -28905
11646 -28905 -126239 -150993 -93732 -67684 -42140 -19135 8173 52910 66139 18649 22580 -71227
11634 -71227 -120478 -18883 -40497 -47861 -23415 53300 11101 15374 57539 22684 16329 18169
11622 18169 68386 -12747 26618 -44257 74875 4796 -20637 -3065 -7659 -63109 -24524 -57145
11610 -57145 -54833 -105039 36917 -45396 -15718 41467 -120911 -30062 6740 56656 71956
11599 71956 41290 43892 74979 -66035 28994 -27470 -56950 17443 -70189 -1985 16912 -62933
11587 -62933 -82633 -79288 -83681 -83149 -116146 -103001 1716 -37407 -51470 -113778 -90180 -54362
11575 -54362 -167152 -195014 -107227 -37223 51427 28681 51444 -44670 -89917 6858 63212
11564 63212 -790 -30542 65591 4275 -72324 1273 -4417 -50636 -43823 -35701 -19382 -1899
11552 -1899 38307 117248 54668 10042 39076 20585 79165 23117 -1422 -11708 -29086 -59351
11540 -59351 -73871 -73838 -50476 38974 106634 106014 -43030 -2414 3614 -41599 -62985 103072
11528 103072 -42594 -36846 -56630 -187101 -161561 -42695 2341 58903 -9922 13971 -61753
11517 -61753 -129429 -79099 -36668 -12054 -90229 -16113 10665 38884 31140 -91072 -120718 -86214
11505 -86214 75584 41106 66601 145103 31672 36862 -40744 30403 61181 10578 3426 40273
11493 40273 -82149 -78457 -118376 -65901 -69525 -54127 -107857 -104769 -102801 -62408 -101104 -130462
11481 -130462 -102649 21187 3778 -14546 -55919 -52906 46355 24749 -38235 -74305 -109285
11470 -109285 -33670 53128 50133 -6787 -21001 -3595 -35762 -78392 -82719 -63240 -27976 -12291
11458 -12291 -51619 -12138 -77439 -106046 -29318 7101 -65586 -43240 -5690 -9235 -28474 -22044
11446 -22044 -5241 -52486 -68822 -73426 -53525 48507 -21719 105462 55949 -14905 30879
11435 30879 -51646 -173573 -146799 -40256 -58766 -91478 -41555 19549 20793 2782 -115421
11424 -115421 -130129 -84307 -35607 47446 32784 24503 35412 -13904 16448 -17951 -19346 31167
11412 31167 -37231 -10887 4779 53881 83495 -96358 -83050 66113 13975 -126735 -119394
11401 -119394 -25226 44544 94736 121977 27562 -23605 -36171 -110844 -113575 -47986 -99891 -75292
11389 -75292 -90930 -168509 -64725 32092 -12070 -30422 -8511 -103392 -46115 -7989 31759
11378 31759 54861 -21549 23391 94190 65226 -80978 -26137 -69078 -59718 -63020 10030 40755
11366 40755 24888 11855 23421 8195 143586 29708 -126124 37982 51413 -42370 8335
11355 8335 -37761 -130945 -88937 -134484 -50715 -126364 -115836 -77878 -15487 -126907 -20498
11344 -20498 54485 43840 -11205 -13394 -640 -13896 -65012 -60384 39672 -27303 -45927 -52342
11332 -52342 -90575 -94969 -107259 -65257 -63371 -41143 31781 -89471 -122254 -70642 -121688 -92152
11320 -92152 -75761 37099 36974 -108346 -44492 -44095 -13118 51356 47959 -91417 -190013 -86190
11308 -86190 -81937 -17878 -24094 -44211 -25868 -108156 -43478 11675 371 46827 9547 -777
11296 -777 61443 66858 47668 159014 85385 -49161 4675 14525 65418 1442 39224 1277
11284 1277 -8922 19484 -62587 -34344 -59246 5878 -51516 -108487 -41936 -41365 -22728 15218
11272 15218 -37924 -61528 -114739 -25751 12283 11843 -72253 -6763 -3398 -72385 -33484 -72057
11260 -72057 -21028 -82619 -122199 -128931 -97421 -69551 -8537 58750 -31324 -15511 -38866 -138414
11248 -138414 -26168 -27280 26865 -18373 -24575 43725 93667 58217 -366 -113647 -121136 -14734
11236 -14734 53630 -52047 -45280 -33432 2825 23881 103137 140098 33426 -12629 -18880 -25014
11224 -25014 -33526 1654 4272 92099 17565 -1644 29319 -31721 -19892 -93062 -85993 20772
11212 20772 41242 32437 57738 117150 59999 -51658 -149110 -77673 -782 25092 30738 -76389
11200 -76389 -172681 -134068 -142481 -166329 936 32631 49156 102588 75934 28486 80345 35910
11188 35910 -37817 -52947 -170866 -33276 129605 104526 223668 19103 -22347 5214 26861
11177 26861 79740 -47249 -122065 -30251 122781 54241 -16580 22597 36981 387 -29841
11166 -29841 -136690 -63784 -45422 -83207 80169 -7498 -63213 12993 -7940 41751 -1669
11155 -1669 22557 65210 14718 -1102 -63330 -105767 -26433 -5469 -50205 -61612 20651 17931
11143 17931 42680 -77766 -25086 -61096 -111347 -98702 -71792 -31227 -21658 -24348 -54510 -4408
11131 -4408 672 -18968 -126525 -129392 -5943 77703 94853 -17814 29153 -41161 -52149 -77723
11119 -77723 -109394 -46640 73852 91744 72753 -61975 -37406 -76235 -77468 -15707 -61013
11108 -61013 15521 -26560 50025 -4691 3302 7851 -18706 -39877 66367 67362 -14040 -52091
11096 -52091 -115659 -132745 -49064 -112896 -108827 -143096 25017 -15089 -97703 69467 39423
11085 39423 -82751 -79921 91495 122946 75675 16668 -118152 -162011 -95159 -79144 -48806
11074 -48806 -4020 -100547 -157835 -50001 -33995 -10047 7096 20885 15327 -65638 -57904 81521
11062 81521 37276 31439 54169 -14856 5434 52383 45375 98982 -10611 9813 35725 72723
11050 72723 69096 66082 36722 28711 -925 -54942 -80042 -51134 19679 -42866 -8611 90535
11038 90535 148101 71948 122142 122082 112723 15245 25591 -59931 -80754 -26905 -1094 1488 64247
11025 64247 -12111 -69140 -19007 11433 -80701 -141312 -92275 -83491 -22 54298 70827 48265
11013 48265 72198 36480 -26755 -59803 -45319 19724 33086 -61076 -49645 38253 19379 11952
11001 11952 52406 3624 57677 28696 -68632 -41553 -124206 -48703 -122473 -116519 -33268 -40188
10989 -40188 -83163 -114905 -95344 -23078 -1378 55126 21090 -13689 85101 46862 114872 56966
10977 56966 29646 89480 3867 -77312 -58684 4019 -27151 -60182 -3012 130722 184174
10966 184174 107818 12677 -49330 -72248 -7291 70553 119579 50682 42874 122093 50171 -8203
10954 -8203 -71529 -65289 -141827 -77992 -1760 -7168 -12441 -86474 -18112 23598 -83002 -22865
10942 -22865 -80110 -32749 -58274 -66378 -71539 33071 67425 32951 4513 -41356 35204 -11377
10930 -11377 72757 58080 -15280 -2584 14481 41432 14934 29174 -13229 -56708 -41027 -17599
10918 -17599 -29016 12816 7051 -57611 -54314 6684 43990 5445 -34908 -62688 -83410 -132713
10906 -132713 -129165 -123979 -119142 -45421 -55423 -48463 -69143 34924 88467 81723 186633 188513
10894 188513 -18395 -101119 -72414 -11681 74779 6344 -21093 -93773 -45378 -35240 -28994
10883 -28994 -2021 118214 64413 32585 -2670 -39303 -6583 60586 35083 -24338 4635
10872 4635 105632 115054 75195 -28920 -30941 48945 -39927 -24607 -18851 26090 7660 -21007
10860 -21007 9614 7977 -40463 -56708 -56334 18729 20351 -111654 -51962 44591 100293 97839
10848 97839 8989 -29285 -63399 -60581 -25493 -24300 -10907 81728 99224 55087 6453 14315
10836 14315 110142 73602 51542 1984 31750 27341 22307 -2054 104510 72393 16653 50930
10824 50930 -59042 4758 16113 74870 23352 -55627 88257 157141 182673 140539 64729
10813 64729 101366 112308 38855 37133 -2570 -22476 56198 19762 54579 31575 46797 40935
10801 40935 -24477 -5250 -1277 26038 44712 63934 -19846 -87860 -1919 -15673 -78169 13297
10789 13297 -10472 59449 65774 -16748 35908 107139 -2576 -131914 -62278 -80195 62541
10778 62541 21964 18848 -34901 -88334 -88746 -70243 -79505 -54035 43409 54140 12036 32065
10766 32065 57439 20456 -62673 -58253 77091 31322 -79626 -61717 -23485 -108638 26502
10755 26502 133656 142305 62372 15046 44313 11202 131043 16638 2881 28862 -89402
10744 -89402 12291 -58400 -36180 -4724 29344 161795 133197 86094 -105714 -109042 -70983
10733 -70983 -105257 -30044 -45310 -70211 2640 -24746 -72639 -16158 -18493 27849 65612 90277
10721 90277 -39598 -89813 -111670 -159515 -8193 48341 -11322 -28372 23038 50401 13927
10710 13927 -38514 -119970 -93271 33444 59223 -44343 -43624 -94916 -57305 38212 78556 -38951
10698 -38951 -25087 8998 -144285 -4988 163848 113745 -6507 -38700 -25883 57445 160104
10687 160104 162758 17978 53886 55354 83714 175730 60111 116664 185823 62839 -1443
10676 -1443 115541 122796 90557 117653 26390 2033 126866 168005 110717 39662 -5129 3140
10664 3140 44723 19746 14589 66880 80931 150372 95089 62083 9010 -66031 -37159 -8041
10652 -8041 89087 36645 35846 19240 112783 77543 -52716 -13746 57185 47105 38211 41585
10640 41585 -80098 -7572 24536 57575 98889 34213 32558 7407 -19898 -6458 37445 16729
10628 16729 -21364 99890 90671 68690 96537 21095 106438 118105 113793 90470 109286 176590
10616 176590 142799 75257 31639 172111 209044 116674 -13136 13307 120229 83659 17378
10605 17378 49981 46012 49531 64415 29679 -19602 11851 4410 -11731 -128574 -28384 -1051
10593 -1051 93035 126326 106219 170477 148502 208528 163216 71767 27675 107883 139912 103888
10581 103888 114101 158558 115808 133457 78664 81497 71355 24563 119972 29675 118031 126918
10569 126918 126824 127163 150196 129715 -2943 117958 135224 180348 158041 220434 245306 306502
10557 306502 369068 216022 253451 137828 113178 260363 319219 312833 208070 184024 190530
10546 190530 201237 146195 179771 302835 270248 236821 261989 331389 341507 288690 305270
10535 305270 215775 171114 233081 253415 293521 337412 341111 331209 240400 336747 440219 490525
10523 490525 361890 335031 363589 476368 450697 557917 538495 500246 563386 596872 692440
10512 692440 747448 629935 568180 587092 593313 630009 562488 615926 694832 678182 646983
10501 646983 707262 794966 746573 688971 899572 906890 840239 914111 1063431 1035065 1078346
10490 1078346 1121469 1286935 1349202 1264927 1278184 1305009 1420708 1490190 1635321 1636474 1582819
10479 1582819 1672971 1758332 1958147 1952215 2085909 2342839 2538925 2743307 2923490 3091768
10469 3091768 3361865 3723312 4038228 4426071 4968665 5594345 6238602 7004026 7886646
10460 7886646 8891914 9968908 10915788 11608492 12109273 12240797 12039772 11749127 11614131
10451 11614131 11649047 11766858 11678158 11571370 10974780 9902779 8784659 7799916 6868881
10442 6868881 5936989 5232437 4672746 4342294 3949142 3629895 3223082 3056164 2948590
10433 2948590 2788321 2709474 2495427 2411901 2261034 2052728 1945344 1838598 1800499 1701622
10423 1701622 1715369 1667189 1525821 1590552 1570069 1548580 1487723 1328523 1309887 1279837 1341372
10412 1341372 1202263 1110368 1147851 1104982 1128568 1035363 1113398 1109454 1015930 972106 854508
10401 854508 877765 890873 831798 866027 766971 669470 733300 658627 602469 631959 689220
10390 689220 698788 614998 550525 547082 512797 481598 510642 487213 373348 308522 373200 479530
10378 479530 526244 450725 482626 441481 451683 370321 404064 466535 351075 265591 284056
10367 284056 284656 289645 300741 188035 283907 251554 327960 225358 155338 270991 338660
10356 338660 275040 194704 236563 294009 266843 248468 243000 245087 249312 270484 198708 176223
10344 176223 349933 351409 264150 235523 239844 182797 85052 129434 169151 54636 124305
10333 124305 202153 263748 172888 209837 205609 188797 160503 55718 123891 199115 135931
10322 135931 226468 242360 242098 313158 216529 201626 300596 274192 197400 186450 172319 110518
10310 110518 143657 10666 -20025 64255 115176 83445 100472 55533 -19643 25084 66883
10299 66883 93271 79242 72883 35031 180370 50264 27539 88389 74348 49165 -42824
10288 -42824 -14303 114455 221830 63615 134185 207571 44601 766 34368 -57076 -90884
10277 -90884 21417 7395 117366 143213 102927 84465 120370 101339 -19287 -1084 22670
10266 22670 129123 104796 -29309 16938 55725 95641 67635 23772 109770 62271 70727
10255 70727 18224 -51437 16018 85026 10490 60687 60970 2244 -15374 -118424 -759 169179
10243 169179 136572 116816 89645 77213 192053 119885 185915 179420 125061 133150 158607 55471
10231 55471 112588 13488 -27581 68354 36934 98022 123358 67656 113077 127231 52462 -27000
10219 -27000 104482 181295 13194 -55323 -37804 -6633 71589 97598 -7367 -58378 9098
10208 9098 43417 82227 91793 101205 71156 123770 182346 118051 64140 66798 -63509 -94487
10196 -94487 17876 77647 157214 80251 44006 88150 117560 31916 42441 51543 47808 129631
10184 129631 146487 105142 90915 -42347 -26135 47155 101600 164383 98041 85219 17325
10173 17325 -3834 47095 55702 99572 49550 58978 35723 282 92294 61743 59282 6940
10161 6940 -77316 73802 52605 -8901 -73955 -85421 -19139 -64426 2983 30221 -29670 -12755
10149 -12755 -27799 53480 75471 55120 46675 32020 82688 55749 -17434 -5588 134011 167857
10137 167857 136270 100510 96059 154639 167440 227953 252899 121132 -4694 12077 61922
10126 61922 57985 17016 -16740 -13399 -31836 -73498 -18653 36163 -48525 -44483 59166 73600
10114 73600 38623 -34214 -23122 64537 132453 117737 -11376 -57540 23466 24212 31714 47229
10102 47229 79581 54898 20968 14578 34255 88365 17867 14895 30178 -114350 17407 92590
10090 92590 130628 88237 30142 -29417 -1842 41195 19479 -68602 -28323 116933 107749 75262
10078 75262 35740 90700 65657 55896 141284 45617 -60451 62775 83812 161168 126601
10067 126601 82406 47921 87665 15876 13043 137548 197053 117274 105659 120596 137823
10056 137823 87577 85241 136887 83480 27412 1200 -33009 66699 92406 -40300 38484
10045 38484 99605 47367 55707 -31654 69171 9951 -85051 44109 100472 137097 69940
10034 69940 69900 103938 184033 128382 170076 149290 37449 -12956 28673 148697 136353 82886
10022 82886 65480 117359 74530 70413 5763 -24552 -47558 -18511 -16991 -79200 -88135 -47627
10010 -47627 -45791 87548 94177 64987 -6581 -29558 46240 39649 3811 -53919 89498 67273
9998 67273 202980 132184 47911 39618 42197 -42165 -5956 -7755 4694 5372 -75676 20899 -18833
9985 -18833 -90911 33742 77370 131889 30434 -93896 -88967 -49046 37842 -58283 -24334
9974 -24334 -99068 -90809 -64473 12817 39887 8383 90744 98493 -72233 -56605 -53697 15977
9962 15977 23446 -41993 -22267 -50045 -56987 -89072 -121136 10927 114695 -35727 41892 66641
9950 66641 106201 16603 -77872 -110053 -124980 -87869 -52526 -14840 -15315 31673 -35264 -83481
9938 -83481 29803 127922 166085 69065 34768 -22641 -78145 -85945 19593 160919 113160
9927 113160 127931 108120 132590 37925 32029 98933 14314 -18910 -1511 25224 3229 112232
9915 112232 70523 109383 67699 61796 92440 3895 37743 87248 185281 157292 182070 150373
9903 150373 229169 234808 72036 21076 79609 36557 17120 180930 250320 208437 37787
9892 37787 49141 221627 184398 223729 232060 192584 156269 106823 104750 186386 93429 25802
9880 25802 90817 175770 179107 107328 90732 -15575 6524 18596 48458 146440 108297 74060
9868 74060 156322 179349 221089 211940 149767 60035 84067 171976 140444 56517 99273 217903
9856 217903 242831 184197 123030 170609 128288 39248 175491 168421 163763 187860 156570 133806
9844 133806 90864 118097 137180 164821 183509 34381 38122 230423 169379 65681 106063
9833 106063 171156 247480 175804 215092 257274 151918 158073 300717 366039 277808 210989
9822 210989 212975 261492 209790 177415 219514 269167 343587 319119 232979 242036 126341 222743
9810 222743 306194 304073 313381 286992 228789 238432 262684 272473 160010 148249 186932 233253
9798 233253 320389 283856 282866 338428 248837 309697 280479 185102 258693 369448 235930 235016
9786 235016 303792 298148 375047 435847 456147 362715 393081 478989 474520 409327 494742 432256
9774 432256 524965 548536 566146 570144 575920 538412 554897 670061 624741 672811 753021 800179
9762 800179 827786 861572 932905 971668 1007238 1112230 1230959 1178671 1224408 1196512 1337334
9751 1337334 1369123 1440305 1591107 1513496 1630537 1758341 1913990 2001527 2138410 2275862
9741 2275862 2434740 2610854 2852527 3235770 3608577 4011660 4268008 4315283 4363884 4255271
9731 4255271 4086998 3813001 3555515 3296897 3032365 3008223 3018854 3071725 2977640 2831192
9721 2831192 2814280 2869255 2893264 2916587 2937296 3080548 3202852 3275475 3386901 3516572 3740136
9710 3740136 3937881 4119729 4445062 4866913 5254228 5678385 6187536 6649423 7301606 8035924
9700 8035924 8713533 9722412 10853274 12018624 13213724 13982757 14401232 14417952 13863855
9691 13863855 12892949 11768514 10707959 9803661 9162499 8673893 8376686 8163195 8043449
9682 8043449 7937742 8082481 8284333 8604911 9046747 9572869 10283806 11141739 11847800 12215755
9672 12215755 12102193 11720326 11301907 10879227 10680907 10750128 11007556 11018603 10674151 9768928
9662 9768928 8757431 7854342 7077621 6275611 5685929 5201798 4776130 4489365 4202156
9653 4202156 3987544 3796778 3693920 3463156 3255978 3295487 3207474 3070777 2971666 3018132
9643 3018132 2981493 3034384 3050891 3027112 3206851 3200042 3310809 3415113 3560322 3776913 3756073
9632 3756073 3620811 3531841 3511067 3410573 3388630 3392320 3399407 3594279 3359789 3011314 2825596
9621 2825596 2634442 2476410 2266976 2103470 2005283 1830941 1711060 1637976 1609338 1540781
9611 1540781 1451220 1349178 1250018 1213888 1250547 1188647 1164116 1089911 1077911 1017806 915081
9600 915081 844849 856612 856366 828011 842161 786224 705991 649974 658677 614651 715123 824989
9588 824989 755904 721585 725089 651996 612784 624211 678959 701857 607858 519761 549269 593952
9576 593952 590000 563440 470704 488046 581917 544504 502534 525053 479417 579461 515103 537659
9564 537659 538167 478127 452939 401119 537463 481020 496880 506223 482671 419821 415227 609282
9552 609282 577077 584201 574629 498827 514123 460095 433640 468981 412164 424139 443590 274783
9540 274783 294475 316880 388696 358413 352469 342699 376882 302197 292170 238224 300080 343699
9528 343699 368319 395187 342479 343374 375234 297104 344030 316789 429406 386726 391866 435946
9516 435946 406034 516426 518277 470187 344508 322971 375534 429593 404463 438694 406823
9505 406823 456366 415286 296296 285341 346342 319975 374621 418514 284474 232115 121911
9494 121911 134825 201363 213322 184454 360575 415618 307037 366171 346271 299435 260540
9483 260540 288210 286377 230328 67027 165876 173704 228685 238385 213918 235596 262483 213094
9471 213094 237875 137406 190028 295328 279075 417031 494011 399687 432945 354247 310897
9460 310897 373879 347498 248006 265544 274085 232834 252992 288753 157521 189726 91266 62259
9448 62259 155164 140057 127243 104946 201156 99803 41039 219286 194362 174303 114503
9437 114503 110941 253902 148872 144738 161603 268021 229972 188315 160049 244021 262283
9426 262283 227435 227027 177597 201078 246601 332506 387351 286901 143533 131788 127616 -21307
9414 -21307 734 40321 112142 182106 337380 217918 156764 190638 169879 214398 151328
9403 151328 147221 119835 3373 -75200 49295 155809 84258 116307 198308 155958 148228
9392 148228 91463 34313 -7889 -51434 57562 81911 50670 24387 110695 155309 169259
9381 169259 79015 82658 35433 -1792 36955 25966 -57545 -73823 15215 32249 15344 55032
9369 55032 86750 132304 153429 74025 84706 42835 60607 164596 7998 39040 95819
9358 95819 107097 84576 28035 101729 157965 210841 119782 99956 122645 103977 115175 129678
9346 129678 90979 132207 106001 55067 50683 95823 51650 41786 1117 -109059 -89250 -43672
9334 -43672 19812 88821 49076 30013 15824 37021 -4268 41104 51445 81114 13856 43066
9322 43066 47793 -39597 61622 173987 64182 30616 102267 66193 -50616 46596 83786
9311 83786 98265 35940 75188 72782 151330 185489 159522 107580 21810 4916 -55435 -22675
9299 -22675 5826 101717 120448 34649 7534 40642 2350 34401 16142 -46759 43486 9282
9287 9282 -115639 -114666 -40848 36212 76787 143452 97155 28903 68323 64830 -58865 27142
9275 27142 13329 15789 44182 10981 61318 -75502 -32012 65868 893 -68053 -70377 64979
9263 64979 108482 66317 -19528 19277 55261 111259 31144 13097 26527 67858 107954 59136
9251 59136 40020 12149 -76464 10148 -31115 -96522 -235 75285 17437 -19116 -8386 -124697
9239 -124697 -95429 -103832 -111463 -37061 -123807 1489 33628 -64815 -145189 -121698 -157857 -167884
9227 -167884 -41370 106946 2457 -72519 -11461 -43379 5685 22349 -71809 -60262 -95375
9216 -95375 -34793 26651 -128343 -36756 -27248 -81557 -69886 -53876 -41856 -45563 55374 1878
9204 1878 -65739 -95430 -80010 -38415 -77313 -43182 -86847 1361 -18564 -153596 -236384 -99889
9192 -99889 -51923 -84796 -56363 -60977 -23221 5636 -5676 -21374 -17226 25719 -52554 -132369
9180 -132369 -72846 -63976 -54490 25212 -23666 -28156 -114890 -81692 -5231 -7823 1368 -79423 -71841
9167 -71841 -44515 -191875 -63093 11649 6886 -9104 -44634 15450 48734 -78891 -34397
9156 -34397 -63742 -101642 87152 -35724 7212 -8026 -65555 -45145 -99038 -93664 -125234 -37148
9144 -37148 119031 -54487 -30827 2700 -45064 -44362 -91044 84809 70272 587 -15159 24174
9132 24174 53632 -54651 -45144 -46614 -96995 -79881 -107279 -153944 -60117 -16639 -141858 -51970
9120 -51970 -75219 -113292 -83946 -84554 12423 89983 134516 167692 101623 -36227 -76101 -20785
9108 -20785 76429 34494 57065 80510 31913 2058 80363 35786 -16291 -63847 -9843 62416
9096 62416 -98175 -90298 -16599 -31227 20020 -19764 -56003 -88705 -96865 -71017 -103347 -25508
9084 -25508 -39054 -122181 -94739 -128797 -190728 -157200 -26893 -58389 -77092 -24282 -17944 -101964
9072 -101964 -172099 -178724 -21687 6616 -81045 -11653 115783 124044 60432 106106 60296 15677
9060 15677 -67137 -22623 -56145 -27547 8858 10749 -135960 -170004 30581 29807 23745 59410
9048 59410 -42997 -49710 -30076 -101306 -73311 -99695 -77868 8123 15878 -106043 -62486 -54552
9036 -54552 -67779 -80574 -62931 -48692 -30626 34184 -70781 -161239 -126189 -21139 -75877
9025 -75877 -80433 -9657 13748 -18313 -119841 -97872 -6322 13165 -55619 -67989 -95700 -99514
9013 -99514 -25621 -92292 -31605 -24505 -98578 -32296 43806 -25474 -144248 -27678 21117 -63612
9001 -63612 -183974 -68495 -52813 -50633 -118342 -112030 -111842 -50297 -5902 47289 106941 50685
8989 50685 -1269 -21715 -64817 -71390 12908 13688 61704 6770 64227 78821 25629 21260 -46314
8976 -46314 -58030 -119387 -52395 4949 -41240 -72517 -98580 -8844 -31152 24677 74487 97041
8964 97041 37629 -5180 89524 -35286 22645 108781 27502 88622 79004 99916 22800 -60304
8952 -60304 -107520 -83474 -94866 49566 18868 -32949 -124879 -51435 53143 -70051 -99721
8941 -99721 -122361 -75343 24900 30248 -33862 -20467 56152 -16091 -76144 -16424 -4791 -56437
8929 -56437 -100758 -78061 -41888 6687 -29855 -122367 -4188 59927 15698 -32050 -154688
8918 -154688 -96963 -33197 -50760 -84168 -97914 12904 -32274 -66685 -102093 -90992 -26587
8907 -26587 -25599 -72903 -45372 28803 14071 138435 125016 -13558 -27961 7758 -28785 -55112
8895 -55112 3936 -10236 -105263 39142 4533 -134934 -104061 -35249 -120637 -253825 -121715
8884 -121715 -50920 18169 2916 -112726 -65097 -32728 -144537 -82528 -35409 -48958 -5085
8873 -5085 -20928 -9021 -32072 -59567 -115378 -59836 -49061 -81614 -100396 -65511 -64022 -30639
8861 -30639 11913 -148022 -140485 -58534 -151242 -92510 -109073 -62719 -99400 -36396 17764 -60699
8849 -60699 -57275 -29225 -177618 -142570 -101493 -81309 -46150 -41241 -66103 12828 55358 -44117
8837 -44117 -61033 -50306 7102 -55959 -24106 17821 129462 -27157 -42065 -26208 -97700
8826 -97700 -57932 -140567 -100591 -97244 -21633 -45092 -124039 -173152 -112634 -49899 -25010 -56013
8814 -56013 -83559 -43595 47377 -45507 -125140 -39727 -62940 3414 15126 -10533 -143006 -211530
8802 -211530 -97275 -81734 -182999 -140863 -119011 -137605 -167771 7352 59580 -96850 -84058
8791 -84058 -54364 -84664 -57457 -84261 -16078 -77338 13388 24205 -11591 100000 40421 -9476
8779 -9476 -12154 -125983 -155024 3041 -5708 -40269 -63596 -109276 -105739 -35039 105385 82223
8767 82223 -8230 -58529 -145076 -190835 -182825 -179415 -96117 -136202 -182477 -22690 78100 5658
8755 5658 -94143 -73731 -21459 28859 -1085 -51487 -74255 -35013 -43319 -69629 -132629 2108
8743 2108 76382 23077 -59472 -165775 -69123 66157 66609 -16067 -21595 -2905 -56502 -54965
8731 -54965 32480 55256 -24729 -20714 112427 72085 117110 160350 23189 22835 53564 46239
8719 46239 50898 -73593 -70593 -17431 -36258 -31544 -3503 -76539 -151542 -59078 14083 53330
8707 53330 25245 4680 -16975 -88852 -28716 -73364 13577 33802 -44211 -35272 -19093 -42945
8695 -42945 -78098 33168 -109438 -108166 46370 -19125 -147089 -156647 -187802 -74716 -105243
8684 -105243 -120678 -126666 -117889 -126180 -149507 -76727 -111879 -10940 57290 -106667 -47901 -33871
8672 -33871 -14933 63309 -31604 -171845 -304386 -259104 -169198 -15725 24414 40778 16828
8661 16828 -18016 -2391 -19863 -17053 36904 -7822 -16590 -70083 11296 15652 4744 126298
8649 126298 138028 92913 28109 -74560 -29505 18541 19633 -8968 -11232 -9310 -14490 -115165
8637 -115165 -151654 -99969 -124192 -68248 2297 9311 16793 16151 -38238 -109452 -73470 60618
8625 60618 101853 68225 -14600 -106928 -157498 -84837 -57915 -106446 -188483 -110570 4827 16688
8613 16688 -22884 39064 79055 58517 -25004 -21647 32749 89871 27532 39305 -46436 -88051
8601 -88051 -92760 -70528 -93815 -101422 -71033 -135534 -232381 -209675 -74850 -58709 4716 -19764
8589 -19764 -58613 -34156 96116 67069 63789 6614 -135299 -91205 -150859 -193273 -177983 -70511
8577 -70511 -52975 -140860 -135749 -67471 63403 -29909 -98152 -49082 -58843 -160996 -155974 -87451
8565 -87451 -37855 -22975 -5430 6555 -85098 -67031 -44937 -85993 -95372 -62841 -34147 -58223
8553 -58223 -59299 -55690 -128348 -31897 8211 -15377 -91560 -98480 -54231 -213271 -78263 56070
8541 56070 -31619 -135318 -68456 -24416 -21957 -94679 -50935 -56557 -29867 23669 30068 -633
8529 -633 174 60168 -114417 -213422 -142924 -8667 29721 137174 63994 -40108 -12998 34129
8517 34129 -153742 -249656 -246030 -279535 -192589 -78493 -81274 -85201 -116709 -110085 51553 -29491
8505 -29491 -76308 -8402 -4789 5600 -44808 -58164 51392 27288 -36121 -22804 -40855 -89586
8493 -89586 -179304 -118687 -27680 -84946 -124386 -81365 46690 143729 135983 96082 93788 71468
8481 71468 -39957 -70105 33453 25607 2453 -49780 -73634 -19372 97020 -30376 -114007
8470 -114007 -78694 34137 -43312 -29949 4781 -86760 -125841 -124916 -105583 -1623 42654 -28803
8458 -28803 -26129 60953 129557 97140 11667 24008 67508 34994 71328 435 37963 -2147
8446 -2147 -60431 -21263 14676 18777 -66757 -78756 -61276 -14673 -20970 -64775 -21401 -23037 86451
8433 86451 97088 30288 84333 19549 16510 -830 -84336 -64904 46057 12662 -96696 29840
8421 29840 15547 -9249 28364 -5111 -96273 -178417 -78233 -33917 -39349 -31903 -98784 -50583
8409 -50583 -55749 -132861 -90516 -219547 -161026 -66037 -48093 99538 -52333 -219031 -271207
8398 -271207 -152331 -133809 -113175 -140856 -149855 -201791 -71628 -53842 7405 -38209 -182810
8387 -182810 -105154 -71382 -13420 22117 66594 -47928 -72379 -49204 -59333 18917 32595
8376 32595 19818 20180 -110633 -150281 -32078 116625 129283 128290 90503 -14239 -85777 -99650
8364 -99650 -63253 -134195 -137482 -128821 -212010 -65278 2884 -5334 26668 -38902 -51592 -72839
8352 -72839 -29397 -20507 -38715 50944 86447 47661 -73156 693 155061 -13000 -12276 -47641
8340 -47641 -7434 4813 -1072 29772 -35356 -99941 -118659 -133100 -79458 -130570 -104024 -125287
8328 -125287 -118972 -71571 -168471 -59347 -16544 -14148 -104289 17830 -69253 -86240 -64595 3256
8316 3256 -10619 -67952 -80943 -27384 -43801 -50039 -17100 -96837 7565 -30891 -57230 -11837
8304 -11837 34769 13514 32866 -47891 -228770 -275587 -157603 -48279 -63336 27380 -28069
8293 -28069 -97431 -113353 11718 -60962 -35255 -21802 -117922 -157822 -67439 -116677 -208784 -114130
8281 -114130 -148914 -62457 37508 90394 -24234 -63319 56444 25928 -29947 -87072 -152875
8270 -152875 -158829 -50851 58178 32066 -68198 -167737 -74444 -146817 -125541 -20643 -12263
8259 -12263 -14727 -46603 -14764 -14240 -5968 42996 -40638 -117870 -60920 -60961 -148403 -77312 55351
8246 55351 74597 75392 68140 -16248 -149472 -216422 -113498 -77566 -75559 -54467 64584 8735
8234 8735 -68480 -16646 26781 12989 -31950 -46833 -18451 31933 -17653 9402 -23907 41746
8222 41746 -9761 -5447 -79068 -33547 -17453 -19864 2307 16368 7755 -26670 33666 7531
8210 7531 -18531 -80100 -59916 -33943 -28580 -7688 -82547 -129217 -96013 -51024 58465 -85541
8198 -85541 -83443 -69658 -48172 -172653 -104245 -358366 -671748 -191500 -67076 -143505 -154021
8187 -154021 -78568 -92149 -114809 -102683 -124330 -89034 -26482 15317 -54234 -36639 -62534 -32598
8175 -32598 -56169 -67933 -151761 -163139 -119338 2665 33769 32199 56978 39045 60612 13132
8163 13132 -6442 -22378 122790 91330 11424 -13777 -1836 1587 -86307 -74142 -12546 -48047
8151 -48047 -223931 -185527 -56205 -142166 -126263 -231093 -108684 -66488 -113224 -66187 -33086
8140 -33086 72431 52697 24091 86017 156622 108410 16513 -14246 14185 -39052 83183
8129 83183 72374 62023 73721 37294 23418 43978 126320 149738 555 14887 99147 10950
8117 10950 -7149 34181 920 4534 -25041 -33417 -56359 -32836 66898 -17145 -77881 17938
8105 17938 24673 70421 103924 71249 -15873 -75868 -92466 -91785 110332 132588 29029 37704
8093 37704 77614 -33835 -11034 21161 61123 -19424 3222 63228 25446 14186 82284 164344
8081 164344 124528 129466 154270 102842 44601 92448 -3063 46385 11867 -65827 -51068 -3121
8069 -3121 99113 65888 1496 -39817 -13180 -73243 -75194 -81285 -113563 -119469 -70717 -49575
8057 -49575 -78958 -50084 -102943 -170635 -129257 -84598 -64448 19810 20837 50769 128411 9574
8045 9574 -105411 18127 49383 111889 27443 19849 170518 125658 35865 -20094 40408 -13654
8033 -13654 -31403 33854 -53021 -68330 22757 -72653 -73768 -113234 -59012 91966 53252 68465
8021 68465 75483 -45588 7918 -43688 42895 -58091 -117323 -90351 -128105 -115699 -45900 -46806
8009 -46806 -154632 -85490 -35284 -38764 -132241 -69888 65406 88893 10464 25321 109330 25908
7997 25908 2129 -40909 21704 -58574 -53458 55488 50184 -52972 -72710 62242 19962 -67528
7985 -67528 -92388 -115158 -101801 12642 -26182 -102734 -32368 32706 82497 65731 -21572 58320
7973 58320 -41198 23403 6750 43046 3354 -51160 -81895 -108126 -74511 -106272 -93525 -119142
7961 -119142 -94859 -147794 -74465 -2479 -74649 -7882 54393 7291 10624 19374 77601 33736
7949 33736 -72823 -16916 -85563 -53573 -89891 -183397 -142900 -141978 -66361 -22480 -15924 55679
7937 55679 -93888 11968 102226 68960 71946 -34146 -27317 -32327 -115664 -21234 -72432 -41702
7925 -41702 -140192 -159673 -141674 -166574 -66656 -36635 31973 -39419 -22238 -37987 37979 89836
7913 89836 -67555 -62039 -62633 35334 28990 -38617 -29668 -13785 92199 27116 -45142 127182
7901 127182 84010 -32986 -5090 -96263 -22169 17049 86193 112506 57768 -96761 -134209
7890 -134209 -63616 -84432 -150829 -37377 26069 56007 47294 44313 -92022 -72669 30635
7879 30635 6813 -21958 7071 100690 50120 5169 59741 47716 101387 -13623 -72918 25560
7867 25560 -83913 -31412 -56467 -153539 -70972 -50850 -70639 -57887 20866 -12895 -13371 -48282
7855 -48282 -121390 -45676 -90605 -22399 -148154 -201087 -174945 -102755 3625 16214 116629
7844 116629 -17811 -152889 -47056 18026 3873 -4267 -64338 -91067 -57746 73374 36904
7833 36904 -27241 40203 72247 -35256 -42650 -26405 -117100 -141371 -68318 -53204 -90986 -62121
7821 -62121 -21804 -45227 -68771 -9913 -186 -41732 -70893 -88554 -107768 -108932 -112875 -297912
7809 -297912 75911 204864 -50452 -21950 -1568 43500 101385 55766 139100 111086 107019
7798 107019 39036 -28172 -17898 13725 -60469 -185014 -65014 -87845 -145358 -169965 -82534
7787 -82534 38841 55409 -2752 54834 9731 4132 -97510 -60962 -32165 34757 29838 21603
7775 21603 -56822 -65427 9845 7608 51405 21117 -25904 -59009 25458 -44209 -46582 -30497
7763 -30497 -71326 184 55182 100605 87267 -15917 -1318 -394 45265 -21223 -34047 61843
7751 61843 32341 44466 33163 -49994 -52676 121834 133948 21111 -12546 -77281 -109335 55808
7739 55808 31949 24407 -41571 -60648 -40893 -8880 10373 122825 166132 178974 72709 29940
7727 29940 -18998 43351 66244 -52080 -37893 19619 18799 69232 130469 29130 -55543 -15863
7715 -15863 47355 -4463 10653 10167 -42143 -40316 16009 12984 -10598 76907 155929 80050 45585
7702 45585 -65646 -153244 -117013 -78783 -143450 -70083 -38840 -11609 -31034 -41223 -66671 -23637
7690 -23637 50383 100500 17226 -111672 -55942 -59590 40896 42307 -42039 21490 20117 24803
7678 24803 2964 3000 -83744 -61520 27119 41677 21693 -39222 -75614 -76332 43187 30269 64540
7665 64540 88477 5751 10143 93232 140672 62219 26907 -5531 -78883 -39777 -65642 948
7653 948 124789 65726 93979 855 -120543 -17464 61286 40293 -45783 -68075 -41077 31417
7641 31417 -53360 -89166 -55526 -101276 -35090 32348 -43532 -59205 -56269 -90789 -37887 -47571
7629 -47571 56939 5000 80606 60175 21389 -77924 -39190 77786 60127 80534 -36243
7618 -36243 -48193 -60056 45652 61108 -105062 -83320 34799 54378 -5532 -81182 -12038
7607 -12038 -33695 -15616 -77147 -81236 -20971 -104341 -33308 34188 -36042 -16792 -26902 -119957
7595 -119957 53162 -100469 -189972 -18668 62866 50921 -28431 31952 143707 56525 34350
7584 34350 26854 80397 122630 74514 48833 28192 -58763 -113160 -20227 10193 103665 42802
7572 42802 -78712 -59329 69701 96826 72365 -10391 15707 -44738 2151 103404 19087
7561 19087 -18707 -64787 26135 53572 479 -4425 9526 -17398 -86044 -78311 13425 -14057
7549 -14057 -29505 32343 68152 7881 24660 705 -54952 -32641 -21168 -33448 -4009 -17133
7537 -17133 -125770 -93766 -168375 -46924 -15814 -45663 -28337 -100507 -51264 -47018 -69012 -93550
7525 -93550 -101649 42552 26263 78781 52653 -13205 19899 56623 -3023 1694 51003 35767
7513 35767 -39008 3680 -24510 28475 6077 -63504 -71768 -147028 -106113 54929 -23841 21485
7501 21485 78826 61643 -5872 -16064 -18762 -90898 -14262 -3737 44621 4420 59725 26437
7489 26437 44513 -26325 -68268 87096 143396 76325 121580 73828 88387 -38430 -98718
7478 -98718 -75818 -31087 -21114 -33721 -27816 -33005 -50245 -17074 -38324 -69509 -39248 4906
7466 4906 44836 -51703 -112347 58309 14107 987 121162 60159 -51022 -41783 -13468 15656
7454 15656 17380 58362 56212 103503 133935 112620 -54146 -80581 -76394 -127833 36134 -51875
7442 -51875 -82364 -73332 -813 83119 -117657 -112726 22773 9742 67113 67290 -55255 -48704
7430 -48704 1139 -48721 -76020 34939 35994 -15185 7810 -63854 -59704 -22696 20506 54417
7418 54417 47243 -41195 17159 58454 74457 17352 -50067 3022 23407 29914 40301 3193
7406 3193 -2610 -18581 -64772 -90021 -86820 -54827 -18100 -118485 31688 6025 25793 68679
7394 68679 -19787 439 -80733 -114287 -7529 -109487 -52733 -13277 60084 8325 19426
7383 19426 30885 24982 41593 40573 73224 93430 151129 42184 -16394 -7172 78622 95252
7371 95252 93380 106241 143422 103962 41519 37992 52316 47756 72541 70041 10741 -7647 71395
7358 71395 48223 73023 97614 111410 101585 51294 13956 28299 29077 65032 39619 -23106
7346 -23106 -99860 40760 75257 9105 -19523 35565 -79391 -132643 -90377 -35622 -4490
7335 -4490 85910 58470 42543 -55904 -90741 47001 76591 17274 2788 -34633 3076 50677
7323 50677 75320 75294 105829 114601 25159 24361 25372 96302 141417 106956 19885 70092 58728
7310 58728 7188 -100176 -58857 7996 -7660 47295 8314 24636 -22140 9764 46772 118373
7298 118373 63047 -32924 88421 80003 62435 54042 49286 -5490 -40568 61949 -1863 89955
7286 89955 72133 -42906 -47536 -58581 -29461 29806 57172 9541 33248 11004 46942 4516
7274 4516 41691 75923 134308 11826 -40534 25762 126192 106221 91961 62856 -4994 -11201
7262 -11201 116852 31808 34474 57970 71923 127452 66424 -77435 -20344 14827 74272 27454
7250 27454 30702 89876 72269 75501 82756 29151 -33714 71586 166174 172839 163250 162716 61149
7237 61149 21406 101428 115479 152985 84079 158776 143035 101403 150218 118237 60086 84767
7225 84767 63666 83852 181286 152459 170250 114887 43712 -5748 10965 129627 230694
7214 230694 109045 240273 192352 138177 26595 75032 67333 19659 7560 121663 134993
7203 134993 105798 176442 187977 59903 11358 21047 86572 411 80672 94621 20129 63852
7191 63852 31496 70517 81265 66194 59941 201323 89024 39463 6098 64240 130213 124817
7179 124817 -11831 -68789 62984 134045 111597 12113 -20022 -15480 3365 36541 51298
7168 51298 36784 68307 59378 121956 134183 99908 82557 47207 49588 85342 1851 33751
7156 33751 51693 90841 85670 133928 86395 30205 28171 -32108 22110 -47902 51361 41413
7144 41413 -4829 36545 52051 46027 131174 -3335 -40661 13242 16731 64937 112622 166661
7132 166661 103972 14625 52876 54731 113395 86489 -31785 -35020 -28323 13851 19185 22739
7120 22739 74196 116682 126421 25853 -1642 177265 237017 199226 155207 124819 73347 119851
7108 119851 142926 193341 173923 260023 216242 124782 147105 186520 92814 39066 19177 -80269
7096 -80269 -51559 46273 51204 33795 63661 57524 92990 56171 72763 -20395 -29159 21798
7084 21798 88335 114974 47312 67211 157465 170831 168841 168851 200324 153810 183493 218065 152918
7071 152918 112966 84121 24367 35827 143647 171561 209480 142109 147797 140181 122558 255973
7059 255973 229489 73514 153742 243644 92205 66043 92344 141575 174889 112780 224072
7048 224072 271029 295905 314375 292440 223469 259338 257124 125821 236900 213462 222694 234724
7036 234724 185323 130305 135065 254436 270361 234103 262111 219487 202231 165828 102804 184897
7024 184897 312526 311574 330943 410207 370640 236078 224523 379701 338404 214229 139663
7013 139663 157231 313457 214270 370944 408058 375955 405683 428445 423799 319972 322980
7002 322980 251260 405784 441491 389821 471217 515069 576350 571528 601721 577352 596829 666108
6990 666108 576074 621867 651721 726031 734703 733203 759711 709264 746504 766317 741177 719899
6978 719899 815127 899784 979053 926162 886737 1049696 1045437 1064813 1230553 1226548 1258359 1414426
6966 1414426 1474641 1540181 1634574 1922994 1905283 2052118 2104727 2237329 2403529 2522740
6956 2522740 2703335 2958705 3173356 3156472 3377428 3554382 3706539 3839062 3981649 4099559
6946 4099559 4015954 4103927 4130853 4012504 4015267 4060529 3990589 4022469 4099526 4205761 4356215
6935 4356215 4627216 4863776 5014923 5124538 5342265 5702195 5872817 6200234 6375796 6450788
6925 6450788 6479319 6429111 6354695 6197016 5994318 5852269 5547972 5363223 5142022 4879428
6915 4879428 4790902 4594689 4402146 4552398 4450901 4399031 4328474 4320071 4284762 4286538 4286496 4294116
6903 4294116 4307425 4277832 4255732 4164705 4028899 3858826 3624767 3355670 3210420 3058241
6893 3058241 2824221 2590363 2434006 2248563 2200030 2215772 2160876 2002747 1924637 1861987
6883 1861987 1863223 1689885 1629974 1478293 1378062 1304634 1202908 1232446 1136881 1105950 1113750
6872 1113750 1020951 1049094 939257 882919 827567 786774 841119 857344 825176 683228 648259
6861 648259 731335 777383 859993 814148 718748 663269 689425 566542 505688 606479 657627
6850 657627 690011 542653 449622 656505 651186 561206 659656 555195 441647 401708 401827
6839 401827 437401 454825 482724 350704 296563 424584 471072 471247 438046 479074 422777 506938
6827 506938 436714 363563 454254 411912 331406 233452 319504 373823 303748 180323 185264 207891
6815 207891 264820 350934 362173 339567 265374 351177 319584 316275 445360 355592 365627 387947
6803 387947 300676 259179 216737 279569 225267 253623 264130 235291 195219 130581 232249
6792 232249 347079 386281 337226 300849 249002 268763 300526 393708 401219 254462 304346
6781 304346 263426 144993 170696 212894 206960 319179 410789 353378 291624 286123 171106
6770 171106 185572 171435 212796 279892 341774 305517 281427 159443 238191 273134 268019 382430
6758 382430 297392 303156 375931 402233 465748 464612 380471 305440 324127 250541 193594 211336
6746 211336 242263 260243 322543 435112 336047 346319 339719 373604 383194 398944 448427 455399
6734 455399 405203 483759 472492 284896 317876 283772 268254 203915 336586 364417 279610
6723 279610 327888 241018 293644 348377 274946 293418 283931 248046 240905 155546 181457 199826
6711 199826 246985 235255 194622 244204 231650 191432 235124 214907 233164 211518 270803 227969
6699 227969 265600 312512 279265 263318 380917 319232 323402 243029 235050 398921 300689 208063
6687 208063 168823 210394 347771 282928 250146 213229 139416 206499 351282 330849 343717
6676 343717 314800 286137 285021 184405 161506 178928 277345 326082 274915 207093 235176 227194
6664 227194 295319 278822 296023 333283 227425 225506 201027 236670 188031 203033 228242 193147
6652 193147 235862 240211 323735 466903 427777 346599 286114 294568 350655 289417 269625 302576
6640 302576 325703 404454 378566 313754 426571 379212 467766 483844 391394 315589 286814
6629 286814 338552 409387 540570 516023 472604 529507 545671 548804 535151 444688 414967 482992
6617 482992 474662 438592 453785 610003 587764 552521 549886 619496 671314 816118 716249 634548
6605 634548 733827 812200 822277 775599 792413 796931 873184 845601 883015 914896 984425 1061717
6593 1061717 1121499 1047524 1000537 1107201 1140333 1209276 1266645 1313675 1407334 1449879 1480303
6582 1480303 1529400 1710699 1821790 1890824 1988621 2092430 2281382 2456597 2698614 2921248
6572 2921248 3180170 3377440 3742854 4023633 4415796 4623946 4875861 5152200 5218959 5211100
6562 5211100 5053489 5052323 5070041 5062752 5121605 5317748 5462483 5717489 5890295 6037532 6102719
6551 6102719 6214898 6375430 6502044 6569514 6595206 6652639 6743500 6693922 6493868 6419913 6290503
6540 6290503 6101374 6118923 6107098 5918361 5863617 5876326 5776208 5654406 5446800 5334633
6530 5334633 5518735 5509825 5483900 5617778 5709903 5663491 5355248 5026632 4657964 4148826
6520 4148826 3698059 3386508 3058703 2816136 2597832 2425447 2312818 2020328 1954688 1889272
6510 1889272 1871591 1790303 1583908 1403713 1408872 1217525 1213236 1349024 1264088 1195933 1101677
6499 1101677 1001006 961857 900204 944230 1020177 941543 974955 848908 793007 827922 801054
6488 801054 670716 590490 539816 605775 680399 703692 588384 633147 566850 606120 636747
6477 636747 605204 500887 577312 511222 415729 525373 562940 570847 471832 428416 352293
6466 352293 413503 401209 410706 413333 367862 345280 328662 345192 328667 416423 342439 215214
6454 215214 222310 309495 384874 308329 292576 292333 334168 339880 289467 328203 302494 399045
6442 399045 361704 371122 363353 391397 470745 386533 367551 335696 352772 353335 279968 219829
6430 219829 270018 277520 317072 294851 278228 358374 322876 327927 394688 349468 292647 217571
6418 217571 173766 168794 250393 322190 208793 234480 140314 285976 328910 313608 296676
6407 296676 268642 237364 259214 300051 312880 350354 212469 195438 147493 195579 93369
6396 93369 117930 242276 307463 225917 173592 138831 207250 193930 188591 171820 226185 246853
6384 246853 325547 350939 301271 347232 305039 330748 304837 193810 229819 224535 243283 245684
6372 245684 312519 295908 267629 267513 230144 283138 301197 336002 255646 197446 178747 306622
6360 306622 285988 278180 233501 182447 296918 350732 399551 328176 335026 341967 383787 372244
6348 372244 318945 267653 371090 349773 228267 352893 311100 148517 223827 365527 302307
6337 302307 325965 387407 377883 370203 336948 381020 358467 299322 270667 307894 362643 399357
6325 399357 439379 431905 386918 314839 270571 371417 385107 443310 373102 347867 576866
6314 576866 530517 457516 455563 399933 403437 441730 456404 361525 349289 378612 389132 366767
6302 366767 421416 438709 531059 515889 477646 564388 607588 661069 690415 794759 778676
6291 778676 732849 636259 711560 733808 797687 857091 861290 825532 820739 715042 776651 786473
6279 786473 894333 921024 898458 962204 1004250 1034711 1035971 1121189 1161918 1166357 1172519 1205894
6267 1205894 1306614 1343228 1447793 1534590 1573593 1608868 1624156 1620998 1769100 1906472 2065391
6256 2065391 2155096 2219128 2261649 2477515 2672575 2802499 2961982 3126052 3313443 3540413
6246 3540413 3766906 3854865 4081949 4243357 4455715 4648226 4707344 4623039 4619355 4650818 4640460
6235 4640460 4571162 4576255 4554585 4644464 4630208 4766395 4793353 5072747 5267763 5522399 5765140
6224 5765140 5974661 6291516 6491373 6769505 6978131 7218758 7342131 7230709 7133858 6958690
6214 6958690 6626259 6295050 6016518 5580816 5318101 5143883 4909095 4757588 4678353 4542980
6204 4542980 4365732 4336205 4229549 4287847 4330023 4313647 4286250 4201926 4077638 4226566 4298952
6193 4298952 4238050 4091203 3914593 3614308 3422155 3201314 2976551 2807476 2679890 2442951
6183 2442951 2439023 2417583 2336734 2135845 1959902 1941520 1957297 1889311 1791383 1674811 1659279
6172 1659279 1573998 1529192 1555034 1441809 1382451 1356160 1344661 1326349 1375491 1224481 1161498
6161 1161498 1046305 1161875 1149488 1152934 1068607 1119892 1080861 996324 1061793 1092487 1077465
6150 1077465 1058795 1071590 1046073 1170590 1136477 1168759 1143128 953844 957988 1084062 1110761
6139 1110761 1031412 984547 923824 790708 876240 938831 928682 907503 1025256 899737 856709
6128 856709 876823 843711 948239 911437 936925 876908 891494 989382 917715 995856 1037812
6117 1037812 1111716 1079639 897486 900402 965235 1018585 1049973 1060449 1036960 1086155 1031598
6106 1031598 1059871 1047279 1094597 1057601 1000857 994768 1091618 1093281 1111472 1055322 1080771 1165806
6094 1165806 1226220 1301898 1423759 1400687 1499288 1489258 1496811 1489572 1504660 1581951 1575869 1554572
6082 1554572 1450270 1376481 1407924 1382975 1264375 1340981 1400626 1499307 1581101 1519144 1527439
6071 1527439 1525510 1532832 1669669 1739935 1753920 1780549 1709333 1788731 1793132 1841758 1907567 1993695
6059 1993695 2065519 2059341 2128222 2187477 2231436 2392134 2586985 2655661 2691469 2712607 2901924
6048 2901924 3076588 3173829 3250268 3438134 3705988 3958869 4177791 4432050 4657653 5145303
6038 5145303 5409453 5776848 6201398 6501388 6628271 6765365 6836090 6740505 6491396 6438744
6028 6438744 6465224 6525299 6591737 6707874 6839224 6929210 7027368 7140740 7085940 7183992 7239968
6017 7239968 7182740 7290908 7545508 7681145 7650324 7569485 7468005 7363768 7312402 7230135
6007 7230135 7011670 6940407 6861977 6707488 6565489 6480121 6305367 6096991 6150369 6233269
5997 6233269 6310464 6315671 6241708 6152143 5920541 5716309 5547068 5163897 4766775 4486160
5987 4486160 4227895 4077682 3785073 3528784 3495159 3324323 3214361 3113293 3027077 3007546
5977 3007546 2898407 2792793 2737047 2810144 2776048 2713712 2680618 2730138 2685362 2678220 2625707
5966 2625707 2592928 2529328 2570017 2639584 2617576 2564471 2537124 2591451 2497019 2500772 2652280
5955 2652280 2661311 2691017 2702644 2759563 2715297 2696678 2705823 2796994 2843539 2779442 2794699 2768654
5943 2768654 2755789 2825335 2888569 2867310 2977030 3073278 3130891 3175450 3256795 3322437 3336976
5932 3336976 3554098 3539828 3601079 3636648 3813873 3865803 3785557 3819808 3906576 4117736 4153966
5921 4153966 4296502 4437972 4439293 4545079 4621961 4696679 4859068 4918302 5045515 5223565
5911 5223565 5407054 5575926 5758840 5814269 6002883 6270402 6412738 6650142 6900083 7121066
5901 7121066 7361040 7617127 7954162 8328228 8890910 9209031 9458325 9880227 10181731 10366740
5891 10366740 10667284 10993096 11259422 11472403 11883454 12293879 12536132 13028855 13465175
5882 13465175 13856575 14243002 14860881 15326611 15932640 16539690 17097812 17981426 18754969
5873 18754969 19478484 20240970 21060518 21996631 22847238 23768162 24840212 25909001 26922158
5864 26922158 27965508 29247925 30542732 31815043 33291571 34810047 36571108 38504150
5856 38504150 40621484 43083658 45984754 49332872 53420092 58157806 63455661 69565387
5848 69565387 76221133 83710834 92083975 101657948 113039447 126342358 141638096 158964455
5840 158964455 178406359 200961512 227702544 257621334 283276565 291261253 278277077
5833 278277077 253862111 224835301 194482030 166829119 143946146 125812971 111482279
5826 111482279 99801339 89973669 81656221 74534384 68162688 62215547 56724103 52129104
5818 52129104 48214272 44850884 41902141 39297958 36984216 34763467 32916469 31303711
5810 31303711 29801042 28400009 27052371 25852317 24741742 23536544 22416070 21468848
5802 21468848 20414241 19520510 18712905 17890278 17136473 16514497 15952505 15349240 14739876
5793 14739876 14230071 13832311 13417567 12940856 12604686 12077265 11656542 11362687 11013190
5784 11013190 10682459 10293420 9823401 9656511 9351556 9134979 8985767 8721141 8489037
5775 8489037 8217663 8087633 7924174 7618446 7398505 7296923 7108082 6997640 6854263 6558346
5765 6558346 6439713 6350576 6084729 5986465 5907542 5681790 5541268 5415278 5214295 5042744
5755 5042744 4942360 4814625 4762832 4625534 4498347 4454684 4335371 4255682 4106267 3958094
5745 3958094 3793068 3784474 3733616 3634811 3655796 3464277 3374232 3269094 3217092 3257516 3186355
5734 3186355 3077848 3002851 2950820 2857974 2833568 2813012 2739858 2624954 2481689 2438879 2288515
5723 2288515 2356636 2365192 2268664 2265011 2213687 2082748 2021682 2030088 1990315 1932821 1900564 2046945
5711 2046945 2025680 1977801 2005618 2056856 2008058 1998393 1893527 1788207 1756457 1878247 1879569
5700 1879569 1818616 1778120 1713254 1622556 1781037 1771580 1728708 1674411 1615615 1570342 1565199 1620015
5688 1620015 1437366 1395197 1433717 1432650 1460117 1447094 1484755 1400978 1378344 1319447 1323010 1168057
5676 1168057 1223897 1254656 1288411 1229487 1202284 1136681 1157276 1088645 1048349 1106631 1131623
5665 1131623 1190355 1103235 1167742 1166397 1250956 1245238 1170641 1236013 1222401 1218742 1102624 954681
5653 954681 991443 1042860 1001405 1019268 1008002 894692 920787 880911 903534 875745 957638
5642 957638 902273 852319 859468 771823 759677 681511 645323 617644 529723 615865 657480 667399
5630 667399 702861 657014 586798 596603 614122 657096 743585 687044 674076 633506 611373 602829
5618 602829 648820 720411 591223 662506 757082 719063 692066 776024 699998 733258 776046
5607 776046 780938 716720 753233 675415 581199 694129 743576 699562 763530 727424 730194 750642
5595 750642 823213 835044 779649 737975 762390 641664 641512 687763 664271 696161 698598 656847
5583 656847 713496 864471 787226 710002 760977 739896 730168 705811 771500 915090 932192
5572 932192 911943 907870 931164 940858 936046 883935 888321 1005266 1018093 1014444 1111077 1070483
5560 1070483 1054553 1078915 1146896 1200121 1206448 1286887 1252074 1217412 1317894 1260765 1284566
5549 1284566 1416139 1469071 1477628 1562496 1571955 1619313 1693559 1712068 1764575 1832401 1931127 1949294
5537 1949294 1968779 2050737 2165856 2242517 2373354 2477742 2676441 2810733 2890598 3001058
5527 3001058 3219197 3323682 3353117 3443653 3584537 3658723 3848349 4119071 4465522 4744556
5517 4744556 5043012 5555077 5990686 6744357 7319990 8130380 9011911 9995628 11223697
5508 11223697 12743750 14229907 16040347 18385819 21265895 24686617 27795966 27931290
5500 27931290 25683201 22975038 19758009 16498809 13954824 12064320 10595845 9554392
5492 9554392 8601083 7824925 7223889 6693751 6089507 5555914 5074465 4569946 4134809 3808836
5482 3808836 3607787 3520364 3308590 3123752 2962873 2821649 2692747 2561463 2542098 2425028
5472 2425028 2283285 2121978 2033581 1976551 1825509 1766752 1752376 1628605 1564380 1644298 1619934
5461 1619934 1566185 1478558 1378879 1385964 1313561 1267284 1183751 1238798 1169408 1133551 1181535 1043355
5449 1043355 932255 929268 953828 877383 950358 955760 958336 912176 909014 882596 788685 684693
5437 684693 789415 839218 867613 771839 742123 675074 589023 640162 673774 645564 635217
5426 635217 619128 629839 760099 582841 597627 745089 670891 601096 542697 521632 502311
5415 502311 507360 547123 511425 527656 528165 537802 644062 633804 504097 532301 575199 507567
5403 507567 441177 441382 494955 458606 364813 393468 440926 392995 386232 468695 447359 378022
5391 378022 268342 233994 301194 413812 472057 354760 289758 266789 327445 344438 350333
5380 350333 386954 413107 399946 358026 298202 342842 321310 388757 258085 273504 385171
5369 385171 431960 453178 424753 434940 488422 462661 450798 474380 429470 442941 442124 526996
5357 526996 486086 494804 535542 508881 686559 589241 416844 501904 630003 606168 511380
5346 511380 487998 433966 515869 496040 431637 403470 433090 463504 440629 510558 464142 435670
5334 435670 550126 452096 404344 344482 331461 406152 407084 376752 310631 250041 243328 249753
5322 249753 269944 301416 262954 202091 309383 315447 220401 260079 259024 191293 208308 238689
5310 238689 363162 330538 286659 275371 237196 241950 278168 253670 189357 203206 152034 185328
5298 185328 353882 332220 190720 184105 178873 92170 55152 100066 165702 182216 119217 50608
5286 50608 126292 267303 283266 235991 221603 160521 243372 305228 348222 409955 326097 367122
5274 367122 371456 257346 235507 326361 349046 311082 261939 373464 323262 250975 288542
5263 288542 223936 206129 231283 196805 200219 277605 313160 335048 370045 492627 556558 507718
5251 507718 357832 351687 298693 334881 456805 354063 297496 237877 258596 351028 375940
5240 375940 478884 332830 287092 425932 403004 272470 206051 322492 352049 355272 340728
5229 340728 373061 383896 375271 339492 345886 301449 376823 419695 326117 329585 280106 311452
5217 311452 365513 351624 404977 511243 486729 373486 406191 467958 512286 550636 465862
5206 465862 363034 412801 498718 532451 415980 453937 551618 597853 548838 550431 593798
5195 593798 578406 594252 500549 488179 530337 596868 623065 509305 526884 540300 473950
5184 473950 498382 535905 534566 468208 543107 465078 419779 512163 522946 625956 658632 557329
5172 557329 513185 615640 569939 582552 508805 517917 605238 621570 624051 591332 604595 649719
5160 649719 610837 606015 653417 674372 637049 651878 780223 835611 800388 798802 891622 854728
5148 854728 963273 831545 813242 904463 860448 879247 894500 840410 930300 923149 980177
5137 980177 965418 977567 1011244 1078025 1077134 1081455 1054399 1127674 1143704 1139525 1185756 1241518
5125 1241518 1336010 1425522 1513246 1563658 1507018 1461575 1533486 1457337 1617913 1655434 1700213
5114 1700213 1774815 1992572 2031852 1997537 2102385 2201663 2366959 2384730 2410487 2506115 2591227
5103 2591227 2676387 2801212 2890324 3009007 3115619 3184083 3408097 3368142 3509454 3735806
5093 3735806 3882188 3926547 4036604 4258076 4473677 4635476 4643181 4804217 4953922 5067542
5083 5067542 5277595 5464763 5747748 5912462 6167843 6475339 6736210 7104299 7369251 7725811
5073 7725811 8075456 8366039 8899491 9411016 9935303 10513877 11135744 11813440 12604268 13529069
5063 13529069 14573960 15729179 17153284 18594405 20256261 22236830 24408720 26633797
5055 26633797 28728243 30524386 32133288 33714356 35401774 37561675 40078298 43047014
5047 43047014 45611198 47359624 48350080 48840675 49244321 50087793 51461692 53416260 55241064
5038 55241064 55988653 55430074 53722660 51647265 49638759 48099270 47110028 46543164 45770526
5029 45770526 44230400 41750085 38829352 36201570 33679450 31539018 29790978 28249135
5021 28249135 26722229 24765850 22675631 20544633 18551065 16774014 15268565 14025066
5013 14025066 12837403 11973870 11178681 10531087 9863506 9322386 8697915 8195858 7813418
5004 7813418 7423283 7108604 6783779 6463672 6197898 5942806 5649146 5253582 5049344 4969254
4994 4969254 4805495 4694769 4516719 4492468 4330826 4132974 4035585 3829494 3678262 3554134
4984 3554134 3410832 3345029 3153225 3093175 3117670 3017499 2905912 2802492 2729569 2635372
4974 2635372 2493299 2413693 2363894 2343287 2278416 2146496 2050476 2100309 2084543 2030928 1947387
4963 1947387 1874191 1761173 1672539 1678658 1629239 1578871 1504577 1519222 1440692 1437618 1511109 1521837
4951 1521837 1442066 1374961 1230002 1233920 1248688 1265106 1271445 1133615 1170455 1239719 1159477
4940 1159477 1172750 1102358 1091860 1005545 978297 1001627 955415 969478 983662 906913 828514
4929 828514 859389 877660 867575 731976 733222 807686 734054 742301 683731 674155 732195 620792
4917 620792 634923 591800 599841 714132 737650 660229 699085 715398 718231 453447 496555 514077
4905 514077 588188 519762 446696 494158 573164 521591 412372 447176 580184 557934 322783
4894 322783 274893 336980 377428 401010 452794 406442 463844 420978 417889 392065 432463 362023
4882 362023 359681 339441 317529 275866 274152 351284 343816 430677 488755 490448 337979 371207
4870 371207 404906 494016 480209 393568 470428 588833 495796 620283 682430 618308 634754
4859 634754 574510 738926 696892 703430 845612 960426 919960 1046017 1264828 1559197 1542972
4848 1542972 1458671 1413590 1126997 886235 814976 743311 665979 585564 483766 432008 392144
4837 392144 253070 276563 268523 163106 301565 434609 423372 448014 377177 168181 169508
4826 169508 215799 181947 194550 246660 290783 335367 326918 187903 106837 225298 240320
4815 240320 116297 153688 231557 157172 56545 -10250 91940 -26476 10244 131670 127984
4804 127984 182997 264821 238081 260355 192245 128686 86305 92295 175898 161310 226782 228547
4792 228547 166707 78346 102002 160439 124960 5928 64787 81685 147655 240422 142054
4781 142054 91614 75557 65924 172020 294476 289570 239242 114155 63701 47865 90834
4770 90834 260283 194750 170997 246984 172045 141197 148737 158358 165340 145303 234696 200824
4758 200824 155883 141613 153294 121184 31039 24803 222073 318597 221629 149473 149722 284311
4746 284311 171904 134937 290681 340516 245658 217332 260413 263244 324140 354270 360877 352632
4734 352632 339710 221288 213057 308859 399786 433516 468102 430705 318731 311239 330816 339724
4722 339724 437287 497779 485439 430251 392304 356756 351096 213950 227668 224176 247284 239650
4710 239650 175932 288289 219756 199303 155335 149007 179161 156805 81206 96618 159876 248905
4698 248905 136777 30990 99711 181009 147422 76981 167552 112935 92803 133475 118127
4687 118127 105283 107292 162023 208959 172558 84885 50953 -13876 25230 136081 77225 119920
4675 119920 231207 287442 278864 286125 361905 330813 364724 389637 257748 221103 433746
4664 433746 479259 513392 666382 885694 1141155 1243886 1105616 990853 828438 699503
4654 699503 584865 499859 468013 370176 254326 271686 238482 150355 182557 263974 109566
4643 109566 47164 146323 155428 39732 -22265 -12688 26922 124655 82177 -21398 69091 95990
4631 95990 85939 136011 154917 105451 25712 50343 133769 75032 3602 18359 50707 74793
4619 74793 54631 151481 145370 97466 105573 94300 87168 97184 126170 157836 35413 94993
4607 94993 161873 195172 54775 41855 131365 127778 15849 -46988 -80444 751 113354
4596 113354 60021 -85740 -75363 50783 64172 36726 -21193 11940 7348 -65938 -11899
4585 -11899 64081 115302 -7248 2679 -83738 -3307 76271 -9188 52832 76878 46633 -4416
4573 -4416 -70999 -84956 -70815 -20087 -79529 -163633 -164509 -85684 -3148 -36030 -69161 -55427
4561 -55427 -92821 -7704 98912 -33352 -15479 -25335 34817 48963 70420 472 47787 -19537
4549 -19537 -868 53749 14549 16511 43541 -43032 -24509 28850 40097 27054 111637 33192
4537 33192 21293 -20375 -93364 25347 -14018 -36296 5035 59405 112196 119765 110092 61612
4525 61612 25863 38620 -5003 100772 98641 -38659 -36464 -41496 -56730 87137 -790 -10220
4513 -10220 -2417 41915 25503 -16906 26201 34795 48113 -35434 -66820 -138905 -77713 25202
4501 25202 74755 -10502 -91543 -114350 -102180 -83148 15903 19823 50836 107266 37446 -55851
4489 -55851 -74480 -23844 70496 105495 22256 147460 127830 29800 102740 -9467 -77487
4478 -77487 -117149 -121548 -4694 -125121 -56942 -102233 -88129 17214 97158 24443 -36097
4467 -36097 -62197 -23208 -30617 14628 -72902 16707 115937 69884 119443 8366 -68799 30714
4455 30714 -11688 -34843 84392 142576 71571 19145 130161 86641 -2382 -11572 4550 41050
4443 41050 26902 -15130 5128 49012 49724 52746 21621 53430 24447 -31062 -95364 -48057
4431 -48057 61169 -62749 15269 -35406 -87647 -38761 62765 -16495 31197 93395 20148
4420 20148 79413 47674 34907 -31421 -65674 5758 -27130 -66564 -48267 15304 -80248 -131802
4408 -131802 -112087 -45409 -56099 -25888 -77260 -76952 -10523 16010 -27378 -104088 -59062 -5915
4396 -5915 84150 41634 -13319 -10858 -58991 -86335 -64051 -58942 -7482 -5257 1681 -23172 23263
4383 23263 -34452 -60333 19405 86790 185332 102776 36379 66510 24599 29299 75811 2335
4371 2335 -62222 -150626 -30018 35797 24832 32229 7494 -5910 -29611 89750 151784 59832
4359 59832 13830 -54839 139893 134195 93806 56640 2657 -9172 -58377 131 100157 -21595
4347 -21595 22576 19956 -50694 -51884 -34066 -28089 -49615 -18272 -81898 -7801 -66912 -11765
4335 -11765 -6991 -26806 -4449 5568 -40869 -13554 18325 22930 -17670 -4631 19839 -36921
4323 -36921 12349 530 15771 -1506 -86597 -103154 -116100 -156309 -34362 -51977 -37192 44698
4311 44698 40065 89874 441 -99531 -76972 -14793 -46024 46738 14469 96088 234794 230672
4299 230672 196559 72129 -22676 133331 165555 122529 53077 63329 3156 -33952 3819
4288 3819 62233 93372 118161 63702 -62589 -58293 25892 25552 92437 94309 133071 151767 126923
4275 126923 103185 188571 213979 57998 12135 96113 -14839 -33211 -20023 131984 32217
4264 32217 -51982 -19770 9159 23717 -55702 65005 135438 157847 109612 101574 209742 185166
4252 185166 131441 155605 91808 9538 5949 107624 62043 8436 92338 66090 17240 132990
4240 132990 53930 43629 13692 39080 101413 103592 -5993 -32167 45761 101622 76033 55774
4228 55774 -27624 23185 -2564 28957 83428 81955 55983 32574 -60906 -42710 -69573 -42440
4216 -42440 10540 -37710 -18201 -34161 -14296 104733 185769 144198 113024 154254 133505 68049
4204 68049 67548 78023 6032 346 8929 75147 163786 172565 206413 159432 132993 159389 101173
4191 101173 146798 146613 118932 68511 33900 53080 82572 11102 120009 76915 -36424 -5762
4179 -5762 22486 28512 92532 43402 95071 128514 128373 105270 111889 88322 72384 184383 81891
4166 81891 25566 -21277 138746 66181 -19394 50343 131720 178866 68486 91055 126312
4155 126312 91798 67505 13293 102471 161026 78395 9434 42748 37544 77621 9662 66662
4143 66662 107125 14166 59513 162463 172176 212560 139239 59632 88380 93536 74176 80239
4131 80239 99232 189916 194904 280439 160885 130769 78761 145775 169420 136211 140331 86846
4119 86846 70694 15627 51573 45660 -6121 29384 22214 -8442 153023 71714 12450 42167
4107 42167 79210 131234 157807 90540 48014 26521 92119 172454 151067 101739 30344 90197
4095 90197 114668 104245 33425 94328 119530 200545 117908 105306 89373 52777 102573 83270
4083 83270 132579 150016 186979 63900 88355 202422 233725 175867 147422 18483 126742
4072 126742 232972 141678 69513 146234 185873 92396 124106 171659 141335 184721 129534
4061 129534 33182 -11556 80907 30222 -22920 -4943 958 100488 173830 154480 58075 122523
4049 122523 125927 75025 5254 30353 200818 148586 96369 216002 178286 202579 138162
4038 138162 181893 199983 154138 211290 229420 163169 143118 171302 95107 176015 47008
4027 47008 1704 91782 -7372 56519 42936 79818 104444 61050 140043 187568 180086 127493
4015 127493 176553 124733 169992 238539 234570 171112 71526 -33773 19694 89912 124320 117515
4003 117515 130982 196800 182825 199191 246022 298290 267122 232197 202775 170813 187891 232845
3991 232845 274128 236636 220208 395540 317905 337869 301250 48095 201759 234298 187464
3980 187464 201399 252547 294203 241672 143355 161009 293129 247719 296840 325598 230389
3969 230389 255073 246142 313208 431823 412498 251415 313110 412036 247666 306113 304145
3958 304145 370829 328416 226478 205695 228911 185811 283272 346413 309724 434655 370161
3947 370161 359212 424854 424092 370118 349978 345904 304793 305186 420041 372591 390802 381808 408801
3934 408801 399951 318964 370257 416058 383235 434494 586958 533718 521756 423661 415997 436538
3922 436538 545069 581825 544141 546104 584099 606697 610671 581194 575069 669289 706072 710803
3910 710803 660308 659644 637992 770386 842136 811401 753314 728978 688027 703328 695962 727882
3898 727882 756221 751549 825785 786908 896125 958221 854817 1014580 1064743 981699 1024482
3887 1024482 1171846 1141421 1143073 1143396 1130598 1314580 1417645 1423572 1315483 1282542 1356029
3876 1356029 1372656 1342128 1375959 1365786 1364466 1367314 1411405 1376103 1405115 1405721 1370461 1397438
3864 1397438 1259924 1320520 1302568 1227764 1307094 1332866 1303166 1318939 1371866 1388533 1411405
3853 1411405 1442727 1560025 1566035 1526229 1571086 1583798 1594014 1629964 1642521 1654229 1658830 1618169
3841 1618169 1725840 1901146 1842884 1831690 1901905 1954136 2028757 2057363 2185952 2260285 2365179
3830 2365179 2373261 2304556 2160227 2166794 2226291 2193784 2198493 2228830 2176717 2182707 2185569 2164016
3818 2164016 2131984 2073950 2055703 2010826 2021628 1936928 2001973 1941314 1923303 1936092 1931171 1965344
3806 1965344 1897408 1841001 1758345 1704852 1736064 1696826 1672309 1673717 1622402 1448812 1444713 1321720
3794 1321720 1325639 1366943 1310882 1219116 1245964 1160242 1139502 1141261 1134717 1194791 1165410 1103013
3782 1103013 984190 973282 1011617 995159 955312 923745 873654 906854 975762 994329 909495
3771 909495 848870 757954 792999 825531 760537 650925 638857 720037 649279 594271 671999
3760 671999 623965 613834 670049 650994 692414 655661 687460 679906 689590 694544 665836 669697
3748 669697 633718 629516 537573 505287 634259 679437 539476 554552 567634 536013 532552 443878
3736 443878 336344 456337 549997 558308 541161 455333 573284 681764 570171 472471 401538
3725 401538 466690 506645 553199 493541 454873 357514 422946 473241 490350 469828 583475
3714 583475 495011 402761 447277 379199 360642 213512 228039 524265 486851 511771 380494
3703 380494 416339 491896 372642 428092 518150 515334 367984 314169 358591 427870 413082
3692 413082 369905 403237 528044 449011 419224 268081 267745 338984 436483 512193 445115 342106
3680 342106 381363 392422 369613 384638 369579 358042 384829 294355 293884 316300 265279 371543
3668 371543 570302 458695 332605 374770 350284 261538 289722 223288 323985 290766 157779
3657 157779 129866 215131 240514 329788 376221 308852 229097 182373 206659 153189 225165 264666
3645 264666 222300 183659 265637 207111 230857 182754 181078 220671 258776 281405 229862 174847
3633 174847 250931 198433 75091 149555 235802 206835 92164 78189 149293 124666 205646
3622 205646 251987 131463 109128 201331 177511 252588 305591 265361 265607 341462 314312 212558
3610 212558 208704 148520 124798 186328 218396 156730 288075 254886 268644 269621 257831 263319
3598 263319 219992 148159 190357 151488 202892 186882 150121 265917 139474 236217 317980
3587 317980 239061 220089 250413 241974 249584 157651 130603 245478 351563 262275 204400 290729
3575 290729 249872 363910 445544 356708 465437 404995 337084 452723 353673 294631 362717
3564 362717 353605 252769 199580 277322 352090 371490 440037 418853 403151 304726 365016 374969
3552 374969 395998 394240 307190 371709 491614 472879 503627 511788 601547 546994 452335 454733
3540 454733 418008 452831 458794 466779 500244 477557 507741 448449 400036 404479 492252 652884
3528 652884 541722 500275 507963 531691 497512 498687 569938 558714 492209 511756 573082 571102
3516 571102 509135 544476 693618 719586 691814 815614 674657 648383 511521 454954 574595
3505 574595 542303 568242 630035 645445 635118 634328 559066 615390 713852 596322 606366 587944
3493 587944 694240 801874 862758 825850 874481 848137 747137 677705 718876 684677 728997
3482 728997 849469 841198 796808 757369 749293 842360 819786 872132 915178 905741 923438 964978
3470 964978 990234 872048 795925 882438 958304 980905 941565 893939 892431 914663 909373 833822
3458 833822 840465 834116 850774 763815 877363 901946 912133 914583 1009325 1013829 926721 798784
3446 798784 787327 885860 937966 884979 863136 826285 780267 760224 757686 805725 707699 740307
3434 740307 761978 808554 845996 699672 666662 658552 651493 645091 632343 580869 571194 534920
3422 534920 676553 698449 674517 609585 597432 506651 481364 431004 335738 416674 511429
3411 511429 473821 418440 517683 441352 329160 426666 278608 266457 334973 329329 353911
3400 353911 339114 277602 199432 336458 400766 428944 286496 236873 205121 135841 132627
3389 132627 153671 214870 253029 258845 315845 228557 280030 177716 165641 308118 233341
3378 233341 178044 176752 259599 260363 260403 242672 260231 269884 246176 222214 66009 34064 79792
3365 79792 86752 194324 259102 319152 246947 173033 141495 198501 71029 37466 47825 16563
3353 16563 160893 189588 260312 188108 126578 8755 66228 198873 166536 61773 116814
3342 116814 122770 170481 234557 194392 245207 198753 138370 79605 128585 128964 108817 149903
3330 149903 146839 130572 177516 208922 146350 86736 82174 73454 191540 121077 106783 97833
3318 97833 -8151 -40220 -8420 39439 58140 10856 -92586 6257 41214 136295 207473
3307 207473 76386 9833 81251 205404 280059 222988 58052 65032 51581 50029 -11621
3296 -11621 -33702 117 -99992 -94441 -62962 78360 33840 82737 143618 81437 44381 -22184
3284 -22184 -78266 -37599 -77438 -98911 -168980 -127851 -117602 -44414 -35480 -18251 16288 21277
3272 21277 -54463 75962 158506 49596 79540 59655 86533 -39992 4877 22806 37307
3261 37307 -67810 -60518 -46458 -61279 -18010 -29460 26401 62112 135486 122302 79344 30743
3249 30743 88421 180899 164120 33602 -33350 -814 -80226 -64192 14213 -14718 -37715 57989
3237 57989 -48764 -11782 144794 64135 112090 54809 6107 135833 172532 82773 -27982
3226 -27982 -7653 -16061 24538 93622 112496 39361 88580 149010 83662 167197 67122 -98498
3214 -98498 -58800 -7984 -339 66898 114256 87526 142253 67198 -47161 34157 -121105 -125734
3202 -125734 -8117 82418 -4935 -44860 -37197 -52044 -46041 -16496 -40393 75686 29372 -68423
3190 -68423 104159 32344 34641 -109786 -83101 3375 50022 -293 -38915 46213 22851 -108290
3178 -108290 -170187 47960 93610 10650 -34156 -98985 -24104 -20342 -89689 -97011 7376 52063
3166 52063 -54918 -35092 83983 -20556 67084 180541 87734 -123660 -69937 75678 65217
3155 65217 16396 -32117 -91375 -33782 -34881 31362 7613 64935 119011 122532 27308 -8963
3143 -8963 62578 -33241 4390 603 -62986 -120276 13265 22852 -127493 -152516 -66003 -6993
3131 -6993 -17735 56830 14264 16564 38090 -5841 31977 90316 95007 73887 97432 -33564
3119 -33564 -13319 14434 -93555 -149504 -32758 -34457 50567 -9896 45521 93051 33103 34161
3107 34161 84719 54923 103938 97200 74028 40711 -31839 81775 40598 -41995 -145184 8686
3095 8686 71435 -30856 53355 80860 39864 23702 -33796 -8258 -32548 -73290 -71869 -44532
3083 -44532 -18231 80965 83933 37290 38878 -50598 -29473 36155 -62448 -116827 1840 -64941
3071 -64941 -76493 -25606 -17154 -45142 -46819 -25662 -108655 -112317 -18012 51315 133620 104696
3059 104696 95716 37115 -39472 -62484 -63390 -6304 28192 -35275 -149450 -123502 -84033 -13275
3047 -13275 -39331 27964 67405 34122 14107 48674 77885 31341 -38 53288 86777 60345
3035 60345 36624 32949 46477 34794 38442 -19103 45462 -70142 -137414 -93672 -30515 66302
3023 66302 -46520 -145681 -51201 12786 78999 119166 63753 -59500 -100879 52836 -21070
3012 -21070 -75434 90184 82250 -19852 -14536 20145 -2508 -55600 -77800 -27245 45156 38304
3000 38304 -12068 45964 69678 81501 25487 -9221 -37713 -90673 -115821 -149627 -131132 -67164
2988 -67164 -4883 -93700 -172235 -163424 -99414 -39580 2172 -2116 37579 34021 25451 4417 -30365
2975 -30365 -69251 -7633 77994 -14656 21584 -25892 53932 103076 -40007 -117191 -101054 -41626
2963 -41626 -100941 6156 112993 92943 -22768 37818 7473 -86088 -49612 7230 -91982
2952 -91982 -123099 -45400 -116992 -184536 -73352 -16083 -136066 -99290 37437 130242 156173
2941 156173 10154 -102119 -37351 -15222 22531 13483 -106786 -51671 77118 52421 -653
2930 -653 -4218 14055 1444 -18549 -32464 16368 11512 21358 107649 150935 119944 92893 -16523
2917 -16523 -136861 -100356 -110960 -151997 -157500 6948 64417 155649 73303 36952 -34497 -7886
2905 -7886 196220 83039 73657 55974 -20117 -37163 -74675 -102201 -121831 12145 61860 18275
2893 18275 148339 8460 38662 88189 -35203 5467 21587 -54258 -9130 -39344 28969
2882 28969 -82678 -111960 -18579 -109730 5520 41450 95695 54944 -79669 -103965 -107852
2871 -107852 37774 103984 -30 44530 49781 95406 136041 99312 -24266 -68989 -25202
2860 -25202 -23281 -23017 -84994 -57609 -26805 16834 -24375 -8280 -21354 12278 -48716 -72851
2848 -72851 -47932 -2891 113320 10463 5506 85007 12894 -62849 76213 48024 -26240
2837 -26240 -9340 -27229 -2070 -4106 22020 37595 -16118 115329 71322 95236 102760 23868
2825 23868 80722 201318 297967 220099 145005 229299 183022 68416 107174 85519 211376
2814 211376 188339 133993 210854 141100 118592 152534 176327 88252 101236 190743 264428 156891
2802 156891 214711 396555 347327 406850 361232 348182 286872 313120 381468 451311 474255
2791 474255 492124 572315 596294 618900 562620 507743 511652 653604 633829 631119 685755 690081
2779 690081 819110 1008478 1022850 991838 1034380 1184157 1495180 1635697 1813235 2160340
2769 2160340 2354695 2532262 2919483 3256715 3961547 4756550 5398555 5066765 4416458 3712245
2759 3712245 2990817 2472461 2071998 1733963 1484916 1425080 1325897 1215781 1029078 831376
2749 831376 887222 864614 844678 647837 489512 509303 473937 517627 397045 403287 344170
2738 344170 405316 366388 182833 188119 275388 186627 180691 293705 305548 292319 271209 232867
2726 232867 241351 235266 203203 84194 114157 156998 164802 214664 147132 134981 199895 273078
2714 273078 132256 42036 143983 177782 219211 42588 63144 125361 136578 154713 211830
2703 211830 202081 90859 -18380 7366 -26318 85348 99609 21608 -33877 64689 63520
2692 63520 -48387 -5884 135973 147352 52492 152400 117212 56967 -890 106596 91148
2681 91148 67294 89747 9960 54437 -44489 14154 -22831 -39097 34671 64213 46646 14239
2669 14239 -17949 41644 108871 91155 -19644 -70468 -66315 90230 148364 174605 185576 86293
2657 86293 57797 46646 119719 23200 -30846 14237 -53253 -168347 -195334 -170122 -58500
2646 -58500 83857 64419 -49718 -27593 -78016 -152401 -159897 -143824 22045 17496 57820 105525
2634 105525 21483 113334 76104 63650 -1865 -29700 -10297 -106116 -150398 -25177 32322
2623 32322 -8451 18796 65053 -104374 -38902 45779 -12499 -48527 -1687 -31410 -104314 -109581
2611 -109581 -3282 -31342 72145 17525 -91018 -52076 35326 46145 -13679 14361 -52893
2600 -52893 -59137 -49048 -73862 -130382 -35360 16838 -164271 -44082 31254 -15434 -27167 1149
2588 1149 -74887 -45769 15875 101785 1507 -47990 52299 89044 33339 -6455 24281 -47435
2576 -47435 -144127 -194483 -41404 54367 90809 48598 2213 -34215 -89521 -128465 -46788 -21068
2564 -21068 -70242 30047 97278 -3500 -124416 -83003 -97304 -137403 -78022 -104187 -98706
2553 -98706 -64672 -4506 -11818 -12313 -26303 -37170 -54141 -7366 -34784 -152221 -132479 -100133
2541 -100133 -23996 -2997 -79456 -44065 -106834 -88443 -53994 -59529 9531 -69343 -45402 -9464
2529 -9464 -61787 31337 67883 -16902 -26458 84307 12325 -78181 -100606 8433 -122241 -143094
2517 -143094 -101638 -45686 -5782 -48994 -95859 -97660 -60676 -25383 -55917 -45109 31020 200454
2505 200454 112513 489 40357 18862 10260 1676 -35239 -92053 -36188 -51931 -58908 -29029
2493 -29029 -81566 36228 117483 93470 58166 84654 41321 22522 -17733 -152934 -66952
2482 -66952 72498 111536 90861 111114 64271 -6166 32861 74836 -42180 -65498 -96681
2471 -96681 -105427 -70842 -114688 -51970 -50475 -50501 -55378 -34569 -1314 -71692 -30634 -59877 15668
2458 15668 8218 -32393 -52074 -67692 -81815 -106420 -18763 84648 43181 11025 -4151 14075
2446 14075 90549 34941 -60835 18077 -12065 -9694 -43992 -30683 57545 105816 63902 -98541
2434 -98541 -141340 -103239 785 24130 60571 68773 -1308 45089 59597 40986 66383 83885
2422 83885 138577 177285 165982 23737 57773 41796 65407 56841 -78108 -20814 -27132 27250
2410 27250 43523 -28493 105444 54369 -107166 -160461 -141790 24121 -69237 -61264 -7646
2399 -7646 -171654 -93769 -17012 -44918 73464 24587 -44046 -47595 -7116 -23147 25020 3085
2387 3085 -41329 7059 13243 40144 -17482 -198449 -196588 -177379 -99179 -34223 -93274 -154910
2375 -154910 -142910 -82121 -29165 -116690 -21142 6201 -30224 -69734 -53866 -82027 -201368
2364 -201368 -143567 -104055 -103290 -132373 -36564 -80234 -66491 -103644 -44434 -50391 -48144 14678
2352 14678 120500 62072 -57060 -39618 -6109 -46643 -42224 -99674 -11049 -32478 -98345 16133
2340 16133 34170 74667 25309 67495 65554 22681 -40577 30138 47932 -9533 36235 35502
2328 35502 -18767 -63645 -14942 -58132 -38046 -32245 27851 46903 20926 -3772 43550 -30643
2316 -30643 -80717 -83624 -121536 -142936 -93589 -17499 -13320 -39157 -40742 -27409 -187260 -69620
2304 -69620 -66741 -59819 26469 4410 4122 54231 64681 112987 46209 -55903 -69700 -127188
2292 -127188 -43332 -28901 -62241 60535 25216 -34604 -53787 -41003 6269 -95627 -69820
2281 -69820 7346 118676 -15664 -128908 -19627 -64179 -156881 -59854 3691 8562 32202
2270 32202 -19203 -42088 -37148 -76409 -81590 -48442 -21726 -9423 -36498 -66394 -50047 37505
2258 37505 -36151 -6903 -75717 -104516 -50209 -1357 -20193 -106246 -62399 -60332 -72569 38764
2246 38764 -53467 -8583 13792 -67833 -125558 -30206 1676 -57915 -19879 17360 -20658 -93337
2234 -93337 -21899 -18123 -3555 -67214 -31491 -80612 -100008 -84770 -11675 -5352 16599 -6307
2222 -6307 17106 -21507 -13047 -56898 -143209 -40214 22371 24804 -70917 -126126 31618 -11585
2210 -11585 -29750 -5837 -53479 -166088 -89397 -74372 -12910 -20481 -36340 -30957 -56449 41252
2198 41252 20308 43371 -6015 -65094 930 -40330 10121 101639 -15161 -41150 -71682 -108455
2186 -108455 -86138 -50497 -89174 -104266 -145027 -113087 -93971 -84621 -21043 -79772 -45343 -67849
2174 -67849 -78781 -389 -13116 111148 24331 -67892 -117163 -19631 38032 -4291 19141 52477
2162 52477 153510 27321 14337 102480 -42908 -70553 -40313 25625 -33522 -77598 -68486
2151 -68486 -15328 -28348 -12560 1512 27152 3109 -11400 -9470 -7547 -27935 -41509 28674
2139 28674 6760 -131625 -74955 -17943 -30653 -60062 -829 79135 58499 90682 24301 -35686
2127 -35686 -25938 32839 84042 -63318 -101410 -32850 -14054 -34973 3426 46476 -58616 -97842
2115 -97842 -39579 28563 37719 -23897 58612 -1437 -73800 -135793 -121347 -54765 -63949 -73943
2103 -73943 -95901 3351 139207 140630 -42935 40254 36568 -44542 -28914 -40429 11795 45271
2091 45271 8685 28413 17112 -20852 -99340 -65417 -30777 -52850 46347 68987 -146403 -127873
2079 -127873 -30551 -79174 -52776 44519 30000 66883 44284 -6318 23223 96503 -24965
2068 -24965 -44858 -9262 9651 -48251 98308 100081 42720 97018 62369 15218 40896 176891
2056 176891 59769 26035 81075 -45209 -61916 21465 -22270 29269 8167 -52263 -107172
2045 -107172 -136195 -198244 -177045 -119285 -32797 -12144 -56171 -175905 -92864 -62264 -64692 -95903
2033 -95903 -189894 -152254 -159995 -138155 -229985 -93453 -128094 -180997 -128326 -44830 -23056 7394
2021 7394 -4635 -54934 -68043 -37435 21396 -29766 -115659 -112861 -15413 68102 41135 -4151
2009 -4151 -58039 -33398 53124 3832 60798 18833 -21671 -14129 -76139 -73801 -57492 -74304
1997 -74304 -87581 -103825 -54501 63536 71137 -6925 12192 30304 -6612 -14590 -6355 -168167
1985 -168167 -143553 -56463 -66942 -25764 32320 -8497 17609 -1014 -30812 -71567 -57466 -54428
1973 -54428 33709 31842 47907 -33198 -32836 47243 68611 46902 -57461 -45995 -125503 -56209
1961 -56209 28496 -13237 -59865 -64080 71749 82406 -86857 -141968 -110364 -110428 -83629 -74180
1949 -74180 -73240 -23216 -25211 -50702 11896 10049 23315 -15080 -126533 -110558 -39926 -80541
1937 -80541 -218065 -119344 6071 128053 19979 -91706 -138022 38631 -32552 -148814
1927 -148814 -41033 -23300 16608 42338 -21154 35923 -22973 -119917 -90101 -96679 -58164 -68102
1915 -68102 -97210 -176681 -150668 30865 42033 -16966 10004 -35657 -17717 -65893 -164718 -157094
1903 -157094 -96247 -107828 -112777 -29903 95343 43560 17413 -96855 -44356 -24299 -95439
1892 -95439 -152952 -75786 -40212 3540 -4008 -71711 -17292 -61436 -121139 -137003 -107564 -8104
1880 -8104 30840 -27790 -23513 -51134 -12529 1636 52263 44060 93973 92447 -13739 -62387
1868 -62387 -41550 -176340 -209541 -133796 -178201 -20686 5612 -99495 -117409 -181610 -56718
1857 -56718 -18668 -2703 -11956 -14264 -31262 46541 48984 -56616 8084 -13964 33122 -6861
1845 -6861 9428 -6121 -32575 -71274 -131482 -165678 -125869 -50527 -21518 -34925 13829 46236
1833 46236 27827 -22084 -98381 -9187 -46816 -4335 12794 56546 -49778 -117710 32710
1822 32710 31 -104127 -82906 49626 5069 9118 73075 92558 11153 -102684 -133167
1811 -133167 -104539 -28968 -40870 -41567 11419 4583 38711 56826 104737 46684 -35108 -2527
1799 -2527 93948 49469 -64989 -130729 -112565 -98644 -99041 -59669 -1191 -12376 -25054 19982
1787 19982 137186 23938 12068 140768 40428 18443 -88967 -79550 -58161 10703 -47599
1776 -47599 -1625 -80803 -50035 -119805 -242085 -93461 115392 -16797 -4131 -40606 -130126
1765 -130126 -87602 -48900 -45364 -59990 -126489 -180181 -91025 -61422 -5836 -46270 -63751 11793
1753 11793 74828 -40334 -35849 -50037 -118911 -164664 -63596 -43649 -13 -42189 -40874 20369
1741 20369 27705 52360 4359 -66803 -55635 -14618 -59473 -67594 -44393 -98899 -90010 -21896
1729 -21896 -8241 -78057 39694 -39887 -68693 -43727 -70972 11091 68260 52909 155234
1718 155234 64662 -100826 -27686 29047 110015 20693 -36636 40682 67499 41138 25511
1707 25511 -27293 -123399 -124754 -106760 20760 43455 18244 -40348 -86809 -57600 -180711 -115646
1695 -115646 -89601 -82620 -18227 -35613 121490 100873 -42421 37199 -23046 -15252 -8565 -14709
1683 -14709 -6390 -111034 -14550 74999 90172 24108 51092 85598 -25154 51492 -43976 -58721
1671 -58721 -78858 -60549 42895 -59449 -160197 -150329 -134938 -20750 -44662 -120384 -67245
1660 -67245 -89069 -38493 -89055 57480 99960 76037 77026 21468 -12731 31091 106939 72399
1648 72399 54335 39804 11659 -9208 17601 14285 16013 -6014 -24712 -126029 -65717 -23265
1636 -23265 33271 -39438 -108020 -47156 -14136 -4813 -3135 164613 144128 114384 13981 -3789
1624 -3789 28247 51944 56363 134543 168973 49551 -3046 -42411 -3369 13236 131899 273176
1612 273176 186128 54735 -22121 -102062 -131028 -58061 -15785 89929 162553 19634 -64592
1601 -64592 -115340 -34793 -51395 -88870 -108315 -71219 -37006 20795 85107 62840 -39664 -32075
1589 -32075 27646 118948 27263 -96771 -44967 -92807 -110884 -102644 -15020 97419 58774 -37317
1577 -37317 -102947 -101992 -77641 -30738 -53228 -2053 13382 87671 88500 12601 -43475 -5124 -27845
1564 -27845 -7605 90932 -1496 -10139 5739 -26379 -33285 30483 -32993 -6039 53351 -36797
1552 -36797 -96356 -130927 -181933 -3261 -34951 -107763 -97102 -168603 -123070 -78820 -71920 29898
1540 29898 -68427 32789 155382 166347 67787 -22008 -140608 -120822 -54599 28866 -9523
1529 -9523 14246 3696 -51485 16807 -52486 -7740 860 37697 -79859 30764 -47628 -90474
1517 -90474 -64661 -22858 28564 46665 24586 -13289 83499 -12477 -27564 -18451 89846 33684
1505 33684 20691 -66803 -88906 -118356 -125584 -63339 -27036 -49161 -47470 -105669 2300 34540
1493 34540 11545 1086 -102386 -83820 -88760 -51438 -104451 -103275 -169637 -6763 -13998 -101344
1481 -101344 -149313 -27627 -151124 -64561 -35760 -56619 -13846 19626 -7988 -109205 -104392
1470 -104392 -56688 -53137 34028 78085 -52460 -9415 -20422 -114924 -94893 -19481 2663 20766
1458 20766 -10610 -34938 -141681 -95873 -98297 -57806 -73191 -100475 20543 134456 75540
1447 75540 144579 134651 49237 -4238 -33450 -74625 -153773 -72740 -67854 -89432 -99369 -54851
1435 -54851 -54568 4612 9726 -29379 17929 -10143 -144525 -96640 -94996 -93750 60997 35319
1423 35319 69115 62478 90867 54179 -27101 -100654 -77540 83484 36037 -12277 -30830 -38399
1411 -38399 20370 -29054 -61919 -82526 -151847 -63692 30596 -34021 34541 -28867 -72320 -43478
1399 -43478 -77920 -77449 -107025 -85698 -99141 -29911 95635 49561 -21510 -80924 -51615 13432
1387 13432 46367 91104 70261 16922 -89666 -22212 101864 63528 84421 105076 67943
1376 67943 34451 65901 32708 -67981 -47526 -3749 5877 -1135 50138 44997 -33180 -50065
1364 -50065 388 -87777 -132853 -69926 -8796 70405 65365 -42112 -43576 -48621 22017 -17958
1352 -17958 28675 36501 81718 78276 -65199 5891 -27205 -115805 -83081 32723 7678 24763
1340 24763 28823 -1289 -2913 49063 -21817 -83402 58357 156272 98177 109877 111042 79716
1328 79716 78190 -11052 -46994 -63099 46822 83488 -50362 3464 -31887 -14895 25898 -32354
1316 -32354 -129369 -146931 -83918 -83309 -43005 -92978 53747 152061 -41845 -68901 -118834 -568
1304 -568 26890 -5454 -72087 -102312 96484 35363 -81685 -139062 -103796 -45515 -54818 -16650
1292 -16650 -33945 -75451 25537 38193 23153 -62866 -20293 12273 19452 37560 80698 -11691
1280 -11691 -8074 -9600 21712 78594 -50214 -70757 44447 -28722 45398 65689 -109013 1744
1268 1744 -125297 -180104 -182961 -77656 -66011 -42599 88057 47320 -62310 -73906 -112662
1257 -112662 -77224 -46897 22501 75741 69214 68848 -10412 -51665 -54389 37067 38702 36440 -47610
1244 -47610 -9126 34011 105672 112185 1672 52911 -41360 -113774 1931 15184 -7089 -44404
1232 -44404 -16014 53428 21698 -90262 -89636 -10889 49422 95347 25692 -52659 27806 54057
1220 54057 22408 63164 44662 -20355 121080 73574 11738 2979 -5832 -24988 -89767 -10706
1208 -10706 40620 -21224 -25934 19490 -7803 40010 47712 78830 103055 104707 42857 68728
1196 68728 65527 3689 -74461 -117280 -109350 -15829 -34940 -22594 -74346 -115719 -62960 -29412
1184 -29412 -49912 5990 44083 -28322 -68709 -55859 -1830 123770 31432 -21814 -35193 -54091
1172 -54091 -49156 -50005 -177947 -179439 -142444 -34971 -73569 -82154 50618 115883 89392 41776
1160 41776 41530 56739 124874 21711 -15 7431 132997 139042 91550 18368 -2464 -53607
1148 -53607 52062 -20984 -28988 -78748 -85078 1330 -51855 -8596 -26919 -9750 -51973 -77002
1136 -77002 24440 -75490 -6234 -26718 4383 24528 -56765 -91281 52520 117044 15456
1125 15456 11913 -36056 -8746 -97368 -115702 -25596 -87938 -29612 22047 -7 31387 -43763
1113 -43763 -84400 -50720 -125720 -122635 -87241 8885 -23126 37378 136744 28916 30141 -17165
1101 -17165 38051 -21164 -111673 -108549 -61447 -45487 7989 16235 -48229 18275 144310 82266
1089 82266 24425 -30211 3750 71169 57720 -64914 -72503 -87299 -58662 -17318 28349 87574
1077 87574 101786 34720 77749 120695 7994 -26534 -19388 -136446 -62298 -2009 -82794 -35911
1065 -35911 -25432 -59912 -30438 -38864 -57253 -76589 -78249 -65638 -86419 -18884 -70335 30747
1053 30747 -44825 -34859 41019 -2860 -3971 -40324 -109619 -124619 -163259 -5830 38464 -18319
1041 -18319 32530 -5316 -32617 -44461 -8350 -11428 26038 138598 138775 109283 -10006 -168632
1029 -168632 -27470 -36129 2198 125424 215755 101566 -22683 82151 -42099 4472 95490
1018 95490 91382 18302 -3030 33006 86897 26501 32800 93578 88524 -32775 15176 59026
1006 59026 103531 14409 -20547 -56005 2385 1260 -84427 -52720 17447 48573 -22673 65025
994 65025 75993 120950 -55792 35271 42846 -36076 -131136 -32002 58960 107478 -8658 -33065
982 -33065 32139 -57530 -142042 -141979 -118505 -130380 -108955 -25899 38713 -8446 -6692 42847 63610
969 63610 88669 70241 16619 25639 48335 36494 -29788 -25790 -127490 -52386 26810 -3039
957 -3039 37622 -26704 28672 -164 43024 -49072 -22343 73856 31058 -91626 -119944 -88661
945 -88661 -65097 97120 66377 85718 93967 24570 -30082 34853 56736 1490 -71010 -55935
933 -55935 -113849 -181982 -107449 -44002 -142302 -76731 114477 75148 -53058 -23793 26567 46870
921 46870 81891 -16865 2284 109924 62028 -848 -18704 -4941 -78279 -55555 -32392 16404
909 16404 -83868 -58009 -119736 -93441 -71506 -34232 33966 1857 56536 113888 52907 -38163
897 -38163 16347 62967 93691 -43184 -57688 -20990 84290 52472 17152 2059 -87088 -70931
885 -70931 23747 -18037 144681 56269 5839 -29745 -14709 5504 -91 -61441 -3035 96821
873 96821 -48306 -44652 -64232 -16251 -46803 -122226 -60104 -12480 22159 75309 32037 176066
861 176066 65911 10614 31415 -15450 34401 -7239 55230 76495 2895 -4796 -37953 155239
849 155239 47887 -52153 39686 46894 -1332 55123 69286 54252 65507 96220 26841 -13997
837 -13997 82618 88300 56448 -29214 -46937 -9992 36716 -5188 -11784 -68391 -81720 -32759
825 -32759 24646 41822 92644 -14535 23723 202104 169933 92437 95082 -90813 -52272 54651
813 54651 5810 -24693 -11079 -32036 51149 116095 46141 -7370 -36112 13416 -23451 -75180
801 -75180 -52192 100504 77103 62240 24480 96731 163002 123742 167979 131309 78465 69723
789 69723 41570 110855 83310 79396 28856 -21452 -25159 18512 -9216 63385 110183 99923
777 99923 48232 72282 5455 -21713 56892 80037 -5464 44487 64077 -9349 -23199 -13138
765 -13138 94737 87493 42766 -7618 -45819 132905 102968 62080 107644 -22126 71533 93097
753 93097 141611 50049 97228 34127 -4729 -29615 -48657 -105180 52098 29277 2532 -2140
741 -2140 78235 88924 69313 105646 78844 -4836 47331 50527 30202 -21825 -97557 50837
729 50837 70546 -16184 8393 68332 -35602 -60754 -68782 5378 10947 -112550 -60671 -14629
717 -14629 -98393 -92003 -36976 -23682 15284 24195 7307 -100969 2557 50920 8111 32149
705 32149 8002 -182639 -125556 24135 -64903 -45427 -26360 3647 52802 26864 -77449
694 -77449 -64731 2144 126375 76056 117525 107849 86300 30127 40602 -14369 -38929 14606
682 14606 -3919 74662 56652 82804 62000 55856 54461 69163 87632 143199 176432 17553
670 17553 73764 17450 8266 61073 44803 112762 113136 73139 127749 41910 52694 20270 -8324
657 -8324 1236 1406 -26843 77782 63386 -12293 -27130 148392 117457 111610 172194 57420
645 57420 123343 131438 80963 105101 80527 -12317 -29995 -15063 23471 87326 -2416 24502
633 24502 60100 24268 70388 16320 -80457 -87781 -118780 -28043 -34087 14284 18540 30203 61751
620 61751 -1668 -21786 30300 120066 56356 54045 71040 32910 -29012 -39148 114497 76858
608 76858 -62822 60270 -32609 11283 30333 127774 139763 22252 54709 233038 158204
597 158204 161085 97141 151453 119569 -12428 14358 2968 -6453 64151 58167 26896 -55721
585 -55721 -46718 -56874 -14940 8070 72083 66875 52842 130785 63615 8892 -22096 13868
573 13868 -5523 54007 34869 -52088 74322 106876 51148 -52377 -28641 -42056 77577
562 77577 124214 22950 43799 16001 -47218 16270 -2568 -106691 7240 33579 64300
551 64300 12224 -42498 -54033 84442 101130 9039 -16152 41597 60852 65609 -81777 -468
539 -468 -26533 -66665 22333 -9493 -85954 -68507 82896 137960 86899 -81654 -61577 -68974
527 -68974 -75220 -58941 -37568 -8441 85913 102420 -10157 50909 149576 111519 153082 142278
515 142278 55043 102056 70104 7039 -13021 -69744 -104097 72420 104609 19883 -42339 7748
503 7748 67032 123867 83168 -9794 31899 71825 22136 32761 51056 6893 -9784 -74750
491 -74750 -192760 111 41824 53473 56040 48426 158202 99188 60908 56568 60709 -38307
479 -38307 -20474 -56791 -87261 38693 9756 -29336 110926 -58179 -50488 -16766 -29618 79930
467 79930 116347 -7795 -28794 15953 -26266 -80322 -138678 -49149 -22217 -58103 -83363 -14549
455 -14549 91889 176596 171704 98541 -27731 15242 87187 101603 78601 110956 -10511 29978
443 29978 -12498 -83715 -2151 8121 -25870 -16591 52420 36164 72316 158353 111641 85711
431 85711 37562 -81657 -66599 -24748 87165 135674 115435 4676 -89620 -89157 -59860 -71763
419 -71763 -64079 81055 175468 -969 -25104 15192 -17481 23183 104237 59601 79551 -26620
407 -26620 -127848 -120603 -14305 1782 62768 14255 -3918 130794 91158 2972 -6777 -24123
395 -24123 -39545 -62217 19779 74032 31242 -56957 -163120 -1823 112439 20945 11648 -63096
383 -63096 10922 -9971 -86222 14004 58131 52824 9783 -88879 -172456 -96114 -14309 12338
371 12338 3716 59076 -106423 -55776 46817 -49731 -93463 34830 41997 -58145 -85266 -22498
359 -22498 -46328 17085 -24711 45349 -67807 3444 79393 -45765 39191 66927 -76671
348 -76671 -102834 20052 45496 49872 27365 -69884 -39177 -52318 23505 -6344 2501 41010
336 41010 9643 13833 17530 10056 91670 75254 -20758 8873 -1782 -11606 8550 38834 102218
323 102218 178532 70909 66860 -7092 20106 -48504 -56328 -112265 -67952 -40077 -91789 -120374
311 -120374 -52002 -63259 -116073 -83763 -67566 -92036 -72383 -77505 -21044 -21767 93725 74849
299 74849 9786 79496 79926 -13063 12137 57368 117718 43870 14134 -57280 -108505 -34927
287 -34927 -18439 -56446 -101686 -32196 -59902 -71548 -56556 -19133 26440 -2521 77033 55951
275 55951 -31630 -39951 -32606 57424 41826 27495 10477 11386 48389 45468 -66432 -90065 10720
262 10720 59696 27299 -46403 -12836 6531 10881 10802 -3603 -61406 -146069 -160244 -108998 -77632
249 -77632 -109178 -16160 -15790 -8283 58827 55476 -62463 -95605 -52890 -107544 -17372 38822 -39894
236 -39894 25308 27671 -48467 -22814 -26304 11505 69276 111438 93517 64815 24436 -87506
224 -87506 16806 -15601 -44748 -75972 -39630 -121427 -101665 -34269 -30884 -134148 -22315 17830
212 17830 26135 -45435 -46486 -70846 -70368 -63139 -81025 -106404 -30469 -61536 88164 138475 -31707
199 -31707 -26609 -66551 10902 20437 26127 25781 24189 56477 111988 60506 72461 -6856 43673
186 43673 35831 -41773 -32893 -55230 37849 24652 11780 61497 -47378 71775 116663 89799
174 89799 74036 3788 -36638 -27312 -32189 -38634 -88043 -32921 -48060 -26617 -32212 -37780 -119968
161 -119968 -55648 52417 40828 -70730 -22257 64676 40164 129106 88257 79162 3509 20263
149 20263 -4655 34025 -24993 -133154 -106314 -80219 -26522 -107473 -131146 -132871 -25862 -80569
137 -80569 -101699 -10798 8222 -110414 -87553 -141296 -149397 -84259 -110187 -68564 -22877 -14350
125 -14350 -87959 -143320 -91401 -61791 54014 89252 82326 33595 22367 1932 -32000 -12820
113 -12820 -84649 -136903 -17341 13916 -27256 -68688 -14920 -36684 -71350 14053 39386 17215
101 17215 -66511 54443 17671 534 -19579 33157 -35709 3848 14331 630 -2490 -75204
89 -75204 -14033 4639 15279 47927 -8937 -1045 7338 54933 16104 22545 41783 -19910 -57868
76 -57868 -49954 -36397 -67209 -61749 -73701 -73979 -19758 -7006 71179 61166 41074 10687 -83225
63 -83225 -17931 -59806 -103968 -75938 -44981 22023 -264 7994 76266 9462 -57959 -114662
51 -114662 -92520 -91777 -16428 48299 -68807 -39671 -21614 -27118 25675 26258 45619 -3261 -49581
38 -49581 -98942 -20202 7667 -19432 13082 -19329 -7052 -42552 -14138 11427 18773 -59807
26 -59807 -62109 -60551 -80729 -76928 -35224 -26531 42611 17736 -25717 -3090 -66560 -85522 -73565
13 -73565 -53236 -86187 -76999 -87527 -64206 -28355 17311 52190 27335 10902 -6254 -885 -20429
0 -20429
$$ Imaginary data points
##PAGE= N=2
##DATA TABLE= (X++(I..I)), XYDATA
16383 -157674 -92941 -97923 -126093 -112239 -118130 -143545 -168272 -114315 -84319 -44059 -152406 -206329
16371 -206329 -200912 -245264 -202294 -171706 -143383 -120053 -112094 -100163 -97310 -126263 -98691 -174034
16359 -174034 -133543 -100613 -73050 -113846 -43752 -1016 -13164 -1217 9498 15453 -22984 6659
16347 6659 -18438 -44155 -60143 -20832 -30062 16707 -13681 -54756 -51584 42929 56243 10410
16335 10410 15436 95099 62984 61029 49264 140883 156158 84178 38259 41503 -704 99059
16323 99059 181646 94582 62950 45778 43817 91799 142626 149414 82230 56036 141527 112616
16311 112616 132937 184544 242793 204590 143777 15416 50960 124169 274082 207378 143865
16300 143865 114808 85153 191484 216875 148378 165934 193345 157733 200751 190945 104689
16289 104689 114033 139211 156143 147871 195814 176238 186337 194306 80326 238094 286974 241750
16277 241750 350570 307927 237801 224872 251020 226219 225099 216487 240199 331448 338663 249487
$$ [...]
##END NTUPLES=NMR SPECTRUM
##END=
