##TITLE=1H_CG-1187-a
 CDCl3+DMSO
 8sc, 
 16.2.2024
##JCAMPDX= 6.0         $$ Bruker NMR JCAMP-DX V2.0
##DATA TYPE= NMR SPECTRUM
##DATA CLASS= NTUPLES
##ORIGIN= UXNMR, Bruker Analytische Messtechnik GmbH
##OWNER= root
$$ XWIN-NMR		Version 3.5
$$ Fri Feb 16 15:42:14 2024 Russian Standard Time (UT+4h)  she@DPX200
##.OBSERVE FREQUENCY= 200.1313
##.OBSERVE NUCLEUS= ^1H
##.ACQUISITION MODE= SIMULTANEOUS
##.ACQUISITION SCHEME= undefined
##.AVERAGES= 8
##.DIGITISER RES= 18
##SPECTROMETER/DATA SYSTEM= spect
##.PULSE SEQUENCE= zg30
##.SOLVENT NAME= DMSO
##.SHIFT REFERENCE= (INTERNAL, DMSO, 0, 15.77)
##AUDIT TRAIL= $$ (NUMBER, WHEN, WHO, WHERE, WHAT)
$$ ##TITLE= Audit trail, XWIN-NMR		Version 3.5
$$ ##JCAMPDX= 5.01
$$ ##ORIGIN= Bruker BioSpin GmbH
$$ ##OWNER= she
$$ F:/spectra/data/she/nmr/H-F/1/pdata/1/auditp.txt
$$ ##AUDIT TRAIL=  $$ (NUMBER, WHEN, WHO, WHERE, WHAT)
(   1,<2024-02-16 15:41:00.73 +0400>,<she>,<DPX200>,
      <created by zg, POWCHK disabled, PULCHK disabled
       configuration hash MD5:
       00 E9 B6 7A A2 85 ED C7 34 08 36 98 17 FE 4E 26
       data hash MD5: 16K
       7B DB AC 1C 10 95 50 CB 33 67 0A D8 C6 30 30 E0>)
(   2,<2024-02-16 15:41:06.78 +0400>,<she>,<DPX200>,
      <Start of raw data processing
       efp BC_mod = 2 LB = 0.24 FT_mod = 6 PKNL = 1 PHC0 = -24967.95 PHC1 = 20.45264 SI = 16K 
       data hash MD5: 16K
       63 D2 94 1D F1 D2 7C 11 44 B3 55 F3 2D 31 01 52>)
(   3,<2024-02-16 15:41:28.96 +0400>,<she>,<DPX200>,
      <pk PHC0 = 10.42843 PHC1 = -13.4 
       data hash MD5: 16K
       C7 7D 96 D6 E2 DF BA 2F 5F DF B3 A2 6D DF A3 05>)
(   4,<2024-02-16 15:41:32.29 +0400>,<she>,<DPX200>,
      <abs ABSG = 5 
       data hash MD5: 16K
       B9 06 BE 07 7B C2 37 8E 43 E0 53 3B 33 B7 57 0E>)
$$ ##END=
$$ 
$$ hash MD5
$$ 8B 61 2C E3 1A 50 3C 08 EC 2F 30 5B 6E CB EC AD
##$RELAX= 
##$RELAX= 
##$RELAX= 
##$RELAX= 
##$RELAX= 
##$RELAX= 
$$ Bruker specific parameters
$$ --------------------------
##$DU= <F:/spectra>
##$EXPNO= 1
##$NAME= <H-F>
##$PROCNO= 1
##$TYPE= <nmr>
##$USER= <she>
##$AMP= (0..31)
100 100 100 100 100 100 100 100 100 100 100 100 100 100 100 100 100 100 
100 100 100 100 100 100 100 100 100 100 100 100 100 100 
##$AQSEQ= 0
##$AQ_mod= 1
##$AUNM= <au_zg>
##$AUTOPOS= <>
##$BF1= 200.13
##$BF2= 200.13
##$BF3= 200.13
##$BF4= 200.13
##$BF5= 200.13
##$BF6= 200.13
##$BF7= 200.13
##$BF8= 200.13
##$BYTORDA= 1
##$CFDGTYP= 0
##$CFRGTYP= 5
##$CHEMSTR= <none>
##$CNST= (0..31)
1 1 145 1 1 1 1 1 1 1 1 1 1 1 1 1 1 1 1 1 1 1 1 1 1 1 1 1 1 1 1 1 
##$CPDPRG= <>
##$CPDPRG1= <>
##$CPDPRG2= <>
##$CPDPRG3= <>
##$CPDPRG4= <mlev>
##$CPDPRG5= <mlev>
##$CPDPRG6= <mlev>
##$CPDPRG7= <mlev>
##$CPDPRG8= <mlev>
##$CPDPRGB= <>
##$CPDPRGT= <>
##$D= (0..31)
0 1.2 0 0 0 0 0 0 0 0.06 0 0.03 0 0 0 0 0.0002 0 0 0 0 0 0 0 0 0 0 0 0 
0 0 0 
##$DATE= 1708083660
##$DBL= (0..7)
120 120 120 120 120 120 120 120 
##$DBP= (0..7)
150 150 150 150 150 150 150 150 
##$DBP07= 0
##$DBPNAM0= <>
##$DBPNAM1= <>
##$DBPNAM2= <>
##$DBPNAM3= <>
##$DBPNAM4= <>
$$ [...]
##$SUBNAM3= <"">
##$SUBNAM4= <"">
##$SUBNAM5= <"">
##$SUBNAM6= <"">
##$SUBNAM7= <"">
##$SUBNAM8= <"">
##$SUBNAM9= <"">
##$SW= 18.0517328524113
##$SWIBOX= (0..15)
0 0 2 0 0 0 0 0 0 0 0 0 0 0 0 0 
##$SW_h= 3612.71676300578
##$TD= 16384
##$TD0= 1
##$TE= 0
##$TE2= 300
##$TE3= 300
##$TEG= 300
##$TL= (0..7)
0 120 120 120 120 120 120 120 
##$TP= (0..7)
150 150 150 150 150 150 150 150 
##$TP07= 0
##$TPNAME0= <>
##$TPNAME1= <>
##$TPNAME2= <>
##$TPNAME3= <>
##$TPNAME4= <>
##$TPNAME5= <>
##$TPNAME6= <>
##$TPNAME7= <>
##$TPOAL= (0..7)
0.5 0.5 0.5 0.5 0.5 0.5 0.5 0.5 
##$TPOFFS= (0..7)
0 0 0 0 0 0 0 0 
##$TUNHIN= 0
##$TUNHOUT= 0
##$TUNXOUT= 0
##$USERA1= <user>
##$USERA2= <user>
##$USERA3= <user>
##$USERA4= <user>
##$USERA5= <user>
##$V9= 5
##$VALIST= <valist>
##$VCLIST= <CCCCCCCCCCCCCCC>
##$VD= 0
##$VDLIST= <DDDDDDDDDDDDDDD>
##$VPLIST= <PPPPPPPPPPPPPPP>
##$VTLIST= <TTTTTTTTTTTTTTT>
##$WBST= 1024
##$WBSW= 4
##$XGAIN= (0..3)
0 0 0 0 
##$XL= 0
##$YL= 0
##$YMAX_a= 57337
##$YMIN_a= -78294
##$ZGOPTNS= <>
##$ZL1= 120
##$ZL2= 120
##$ZL3= 120
##$ZL4= 120
##$ABSF1= 15.48135
##$ABSF2= -2.570499
##$ABSG= 5
##$ABSL= 3
##$ALPHA= 0
##$AQORDER= 0
##$ASSFAC= 0
##$ASSFACI= 0
##$ASSFACX= 0
##$ASSWID= 0
##$AUNMP= <proc_1d>
##$AZFE= 0.1
##$AZFW= 0.1
##$BCFW= 0
##$BC_mod= 2
##$BYTORDP= 0
##$COROFFS= 0
##$CY= -3
##$DATMOD= 1
##$DC= 0
##$DFILT= <>
##$DTYPP= 0
##$F1P= 0
##$F2P= 0
##$FCOR= 1
##$FTSIZE= 16384
##$FT_mod= 6
##$GAMMA= 0
##$GB= 0
##$INTBC= 1
##$INTSCL= 3.70164e-10
##$ISEN= 128
##$LB= 0.24
##$LEV0= 0
##$LPBIN= 0
##$MAXI= 10000
##$MC2= 0
##$MEAN= 0
##$ME_mod= 0
##$MI= 1.114404
##$NCOEF= 0
##$NC_proc= -8
##$NLEV= 6
##$NOISF1= 3.799351
##$NOISF2= 2.8
##$NSP= 0
##$NTH_PI= 0
##$NZP= 0
##$OFFSET= 15.77003
##$PC= 1
##$PHC0= -24957.52
##$PHC1= 7.052641
##$PH_mod= 1
##$PKNL= yes
##$PPARMOD= 0
##$PSCAL= 0
##$PSIGN= 0
##$REVERSE= no
##$SF= 200.129950302369
##$SI= 16384
##$SIGF1= 3
##$SIGF2= 2
##$SINO= 5.538805
##$SIOLD= 16384
##$SREGLST= <1H.CDCl3>
##$SSB= 0
##$STSI= 16384
##$STSR= 0
##$SW_p= 3612.71676300578
##$SYMM= 0
##$S_DEV= 0
##$TDeff= 16384
##$TDoff= 0
##$TI= <>
##$TILT= no
##$TM1= 0
##$TM2= 0
##$TOPLEV= 0
##$USERP1= <user>
##$USERP2= <user>
##$USERP3= <user>
##$USERP4= <user>
##$USERP5= <user>
##$WDW= 1
##$XDIM= 16384
##$YMAX_p= 326365019
##$YMIN_p= -1583371
$$ End of Bruker specific parameters
$$ ---------------------------------
##NTUPLES= NMR SPECTRUM
##VAR_NAME=  FREQUENCY,     SPECTRUM/REAL,   SPECTRUM/IMAG
##SYMBOL=    X,             R,               I
##VAR_TYPE=  INDEPENDENT,   DEPENDENT,       DEPENDENT
##VAR_FORM=  AFFN,          ASDF,            ASDF
##VAR_DIM=   16384,         16384,           16384
##UNITS=     HZ,            ARBITRARY UNITS, ARBITRARY UNITS
##FACTOR=    0.220516191357247, 1,           1
##FIRST=     3156.05532450318, 0,            0
##LAST=      -456.6614385026, 0,             0
##MIN=       -456.6614385026, -1583371,      0
##MAX=       3156.05532450318, 326365019,    0
$$ Real data points
##PAGE= N=1
##DATA TABLE= (X++(R..R)), XYDATA
$$ [...]
9926 -418479 225457 -286635 -74827 402389 105431 -480532 -692138 420502 674333 1033089
9916 1033089 1031662 336646 141756 -548865 -93848 213524 -284874 27188 775293 230791
9906 230791 37461 738400 -355535 -518455 147633 -100261 240867 95259 374077 135704
9896 135704 -286636 -81977 242938 -364061 -964028 -542731 49444 -675614 -1110129 -443249
9886 -443249 -199756 -90875 -47059 35531 -252496 -608779 -101987 -104548 306761 149636
9876 149636 -65994 -137064 358322 55111 -516040 -676439 -547138 -316512 -414680 136197
9866 136197 373693 774463 683712 820638 345448 714474 776310 664870 470225 406255
9856 406255 483253 909387 585725 -40402 23196 589051 920704 385094 -225756 291196
9846 291196 794351 252016 207547 185371 268731 273523 408283 323247 381065 569290 649942
9835 649942 1152582 870002 293559 548601 861398 1117105 723445 313424 881356 893660
9825 893660 390994 194119 447659 100224 292527 510488 557103 141360 424905 627626
9815 627626 850633 501903 188017 74951 70168 283616 -266663 -741594 -466909 38679
9805 38679 -80718 425524 82661 296906 413585 364121 874160 469592 -23229 673697
9795 673697 832705 482109 350431 -205348 63732 509529 341346 276403 561046 1306705
9785 1306705 162004 -763089 -386555 -31090 285 -39491 663379 907571 139213 399671
9775 399671 603892 684569 442869 92456 -65204 320980 706435 -45768 553331 511608
9765 511608 315007 224404 121126 338261 -107124 68464 89057 131519 308357 376818
9755 376818 861291 130610 316915 -76924 -353591 475353 388056 485842 129637 543254
9745 543254 623499 403140 686959 -248132 262777 112485 -202570 -104390 26351 499053
9735 499053 155820 148413 -523 -306094 427245 246336 39043 115579 11177 1004320
9725 1004320 656942 472952 -4056 379017 1035006 316966 660074 268707 204569 136175
9715 136175 -54235 -61903 541899 894497 582953 457588 501618 1006843 611825 188627
9705 188627 -264900 340267 595553 370365 66004 215840 108051 462632 350612 164575
9695 164575 150296 30300 -374074 -197432 656330 462100 -39014 -20984 204464 192289
9685 192289 486658 630563 433392 -57091 19668 -284012 -90593 420346 435489 768874
9675 768874 354131 747774 48344 -696530 -541450 -618949 -747562 313177 1010286 790990
9665 790990 517279 576742 340466 120481 76555 -60337 357273 369199 61406 421064
9655 421064 729910 558240 984255 804855 477593 490897 291402 735969 1344820 884197
9645 884197 609148 983476 1199385 836067 902191 742049 717383 790951 841241 239567
9635 239567 57767 170396 832968 1515640 1623739 1147271 747646 811238 732668 578579
9625 578579 52849 178538 575562 1149349 1582287 1159788 921895 509752 870970 947106
9615 947106 1063178 1181040 887215 824300 632964 589069 1328875 1046456 999266 765339
9605 765339 151344 486354 1088759 900696 1030966 1103881 1615660 2070840 1671760 961451
9595 961451 534714 1029800 1154662 1698075 1593964 1290529 952163 1079652 992438 1145751
9585 1145751 1513612 1125197 685793 578092 414091 1072006 1168336 1299286 1006248 783017
9575 783017 1416996 1421024 974960 1884591 1545127 1368596 2102439 1732185 2430095 2570079
9565 2570079 2325203 1947377 1804598 1979282 2293756 2113103 2262886 2538317 2432874 2569837
9555 2569837 2239204 2399318 2260415 1723902 1983587 2491046 3027584 2851212 2720399 3098314
9545 3098314 3206410 2928715 2622411 3147416 3537632 3007404 3094718 3676608 3909006 3901195
9535 3901195 3245767 3609888 3868979 3670428 3681611 4285419 4281435 3561585 3855133 4312705
9525 4312705 4441339 4796669 5050144 4681863 5485397 6007505 6324309 5893562 5901684 6398307
9515 6398307 6449534 6767011 7225694 7556613 7668002 7886930 7840066 7638969 8143263 8120952
9505 8120952 8394952 8921574 9532169 9717294 10318193 10665747 10638645 10890978 11843781 12237299
9495 12237299 11831033 12847811 13301594 14056525 14630528 14176660 14161971 14508359 15611597
9486 15611597 16462053 17486810 18702057 19024097 19691552 20109404 21091754 22137363 23000855
9477 23000855 24438398 25945023 27540804 29749444 32409619 35049771 37615475 41658473
9469 41658473 46027813 50567009 54992648 60023740 64793239 70407246 76563330 82745682
9461 82745682 89323914 95386535 99311956 101440670 101325762 98684723 95859073 93457691
9453 93457691 91323089 90928372 89154131 85503877 81063113 75096426 67245259 59434856
9445 59434856 51842813 45755524 41382727 37515585 35017340 32576345 30126532 28039335
9437 28039335 27354126 26087709 25359379 25240403 24987335 24275171 24071229 24086947 24529707
9428 24529707 24935004 25421087 25923394 26378240 28505535 29429621 30024798 30894019 32157106
9419 32157106 32952328 32911286 32912509 31948931 31128652 30381286 29850829 29096641 28651367 27458942
9409 27458942 25446902 24334135 22049071 19722018 18296866 15933444 13956383 13067023
9401 13067023 11873691 11002190 10373920 10053282 9313032 8725756 8479032 8025858 7789821
9392 7789821 7526107 6865953 6917067 6800176 6236286 6728575 6767737 6724954 7024810 6392775
9382 6392775 5874838 6056800 6130400 5777111 5044201 4985378 5610721 5365684 5262185 5407437
9372 5407437 4835848 4503834 4039713 3714829 3712361 3027020 2653402 3393953 3208131 3473021
9362 3473021 3730897 3429995 3418558 3143282 2300543 2567727 2384234 2626745 2459685 2091876
9352 2091876 2541734 2240374 2370444 2211061 2079999 2987698 3200821 3526699 2917733 2452271
9342 2452271 2371863 2691147 2882193 2591387 2165256 2078200 2210213 2240620 2066144 2189003
9332 2189003 1682118 2056789 2518525 2535842 2530183 2342153 2044474 2445309 2197850 2058590
9322 2058590 2122550 1679906 1953536 2283844 2305410 2393050 2188664 1802499 1763851 1957857
9312 1957857 2084091 2018121 2036418 2486263 2756272 2230915 1794946 2156093 2086814 1507074
9302 1507074 1546129 1054708 1061025 907673 197275 1097932 1188655 433874 615137 109169
9292 109169 606074 995099 1207123 1269480 860957 948292 751538 980915 851582 1131568
9282 1131568 1588947 1364366 1496326 1721896 1845111 2271444 2587625 1541830 1958315
9273 1958315 1279856 1436538 1434560 1402266 1088734 1202027 1050504 1418709 1063138 1561658
9263 1561658 1521019 1082991 502386 873844 610138 544305 653340 542668 154267 332670
9253 332670 574000 276993 164661 546186 1233283 1018201 838160 375738 532721 779882
9243 779882 829797 1258837 810616 586803 866571 652693 884374 1291123 1415815 1036923
9233 1036923 565184 339969 584949 1148059 1376257 466327 464863 832696 1364599 903774
9223 903774 986938 1160456 372481 -131169 601939 917074 855236 104221 412145 1125745
9213 1125745 984350 1014462 904572 970287 514317 581653 308715 133507 697348 975554
9203 975554 1273940 1174767 893536 981300 944519 623476 878453 611479 570241 1062584
9193 1062584 1129219 907259 1230933 1369528 1444642 1353445 941651 724771 1045806 1565356
9183 1565356 2010787 1899129 1727934 1425550 1111904 484237 776143 592255 824008 916504
9173 916504 745008 1014848 1426387 1229728 1118544 1078567 1261550 1239382 1104717 966179
9163 966179 1034528 994133 842184 871350 928338 263343 674640 1121531 1057007 923421 1219898
9152 1219898 2185202 2096122 1539097 1251752 1194689 1222583 1173184 1198105 1453570 1401178 1268286
9141 1268286 1613798 1652531 1384378 1834136 2463916 2199655 1928507 2009919 1979671 2281336
9131 2281336 1928956 1380259 1155151 1101146 1274430 1546110 1514337 877254 631672 1617679
9121 1617679 1443247 969316 1276585 1829784 1668017 1868112 2225815 1706200 2354025 2207260
9111 2207260 1552125 1691292 1698490 1697910 1776305 1600829 1641227 1409028 1645966 1749183 1694313
9100 1694313 1715538 2141114 2248400 1833651 1710239 1704723 1869022 2462162 2824611 2267486
9090 2267486 2946556 2993570 2557044 2539762 2552300 2349884 2432567 3381798 3115287 2473636
9080 2473636 2951319 3029291 2281830 2461301 2808932 2011164 2536681 2319199 2254585 2177589
9070 2177589 2610798 1932717 2131756 2416855 2901233 2605977 2175548 1965390 2131410 1932298
9060 1932298 2188783 2468462 2431297 2142740 2515109 2940396 3516390 3355381 3198129 3224640
9050 3224640 2821021 2827645 2356484 2434795 2470329 2660697 2613050 2761717 2582663 2357667
9040 2357667 2769306 2574622 2705553 3191781 3424195 3087299 3112793 3694207 3416796 3495826
9030 3495826 3635084 3672311 4120246 4125589 4339943 4024236 4119752 4685632 5145984 5491556
9020 5491556 5325459 4876828 5344162 5516825 5164110 5381223 5693153 5877085 5961515 5976787
9010 5976787 6354980 6605054 6504665 6991530 6702587 7367777 7549817 8207492 8275900 7869881
9000 7869881 8161389 8590281 8923046 8698463 8885884 9797321 9411904 10092614 10323945 9923746
8990 9923746 10027535 10945302 10702876 11197374 11625875 11999936 12619546 13063260 12688708 12917937
8980 12917937 13667361 14306914 14830086 15318376 15329212 16016988 17094239 17773133 18269694
8971 18269694 19154710 19957900 20685534 21540965 22375531 23140636 24320980 26138248 27405141
8962 27405141 29184399 31660986 32962271 34508174 36917607 38936357 41687261 44689400
8954 44689400 47150834 49220219 52143795 55240740 56470574 56197509 55754936 55895962 55659101
8945 55659101 55233926 54933160 55526569 56533781 55977426 55187613 54842032 55146624 56437966
8936 56437966 57808217 60998539 64945812 70275314 77658954 87883948 102017781 119682012
8928 119682012 135930274 153379997 165247969 150210164 126113276 103987368 88393791
8921 88393791 78541734 72965598 70480591 68898035 69758131 71522304 73884713 75234107
8913 75234107 77479371 79950051 82544237 81607919 79076138 76312289 74756250 71879859
8905 71879859 67712683 65617901 65574508 63611743 59541490 54075705 48182827 44121329
8897 44121329 39672738 35256752 32315881 29870632 27774889 25949139 24268489 23788752
8889 23788752 22682644 21953259 21110651 20337395 19147712 18236347 17010712 16552259 16737806
8880 16737806 16210114 15860874 15444508 15373768 15504869 14683921 14585332 14294261 14171843 13996102
8870 13996102 13733526 13346303 13218804 13024522 13348230 13740584 13946157 14041547 13976426 14026619
8860 14026619 13677216 13838658 14229070 14246251 14150624 14217062 14261065 14368713 14652694 14834165
8850 14834165 15189275 15257293 14860924 15039683 15935371 16169242 16005686 15957303 16216533 16984291
8840 16984291 17483007 17852077 17729130 18057951 18170008 18717759 19346347 20115746 20441640
8831 20441640 21248114 22263947 22023619 23216504 24631949 25476604 26902556 28186470 29633328
8822 29633328 31258383 33548120 36132896 38982287 43023515 46978936 51791473 57460956
8814 57460956 62796838 69064322 75477091 80765272 85804677 90199173 94918754 99401010
8806 99401010 100174157 97961277 93376395 86052600 76460791 67014213 58775065 51890291
8798 51890291 45709539 40944835 37937871 35228061 33265512 32011118 31341052 30777982
8790 30777982 29390561 28661058 28574137 28075054 28014551 28174112 28741283 29391687 29554161 31127195
8780 31127195 32869877 34207535 36345489 38910598 41746991 44928581 48196064 51406417
8772 51406417 54737471 57350199 59497783 61752020 64147706 65670614 64838750 62903644
8764 62903644 59364923 54012687 46956971 40719477 35702784 30691112 27028305 24199056
8756 24199056 21880124 19658926 18431764 17152175 16053030 15102835 14380216 13531584 12593270
8747 12593270 11758081 10709950 9977382 10030836 10248976 9466886 9680534 8545484 8635677
8738 8635677 8242048 7860140 7729133 7238783 6445967 6283422 6551608 6489099 6662348 6029126
8728 6029126 6632219 6772186 5591579 5510818 5863282 5477857 5227381 4947816 5435382 5696518
8718 5696518 5417614 5035985 4863040 4764846 4370868 4024465 4302416 3980563 4381399 4309694
8708 4309694 3671255 3386887 3264269 3642391 3061031 2601100 2992208 3109747 3666506 3230390
8698 3230390 3029278 3152466 3036188 3013762 2955440 3248324 3460296 2693897 2496032 2151805
8688 2151805 1406277 1935434 2152758 1849620 2057666 2619912 2214341 1667399 1520278 1450061
8678 1450061 1720739 2411571 2244005 2397173 2711070 2401837 2392481 2720726 2398248 2114817
8668 2114817 2313910 2749354 2773773 2645900 2255438 2859311 3162867 2452212 2630719 2161088
8658 2161088 2583200 3444612 2861685 2836595 2391646 2374433 2426748 2440237 2435723 2436291 2491020
8647 2491020 2557351 2467018 2320351 3074117 2517154 1942377 1974430 1781742 1453153 1918579
8637 1918579 2054955 1808553 2483692 1805761 1028405 1594458 1489423 1323764 1658255 1806892
8627 1806892 1515385 1982871 2244446 2417306 2084496 2195218 2108421 1891702 1591470 1421796
8617 1421796 1384253 2303572 1575209 814492 1068892 1348938 1905357 1938809 1385487 1056984
8607 1056984 1483998 1276179 1780147 1755396 2208907 2398036 1492857 1750252 2083289 2091864
8597 2091864 2042060 1268569 1289274 1825018 1714227 1912416 1931132 1713163 2055436 2822272
8587 2822272 2474077 1853645 2055594 2871201 3447598 3419159 2622113 2754539 3045503 3055320
8577 3055320 2204966 2167577 2458792 2675197 2490092 2181232 2587793 2393704 3035937 3337340
8567 3337340 3395530 3148222 3716906 3443630 3613387 3666339 3989708 4093690 4220573 4540715
8557 4540715 3825365 4599759 5169149 4795575 6060049 6475663 6331764 5935181 6102225
8548 6102225 5891693 6595247 7519177 7877623 8327708 8831756 9495201 10583522 11899909
8539 11899909 12596811 13490595 14924549 15697583 16292113 18197725 19475251 19513143 19456835
8530 19456835 18218746 16992181 15823603 14340042 12737885 10499650 9417356 8736809
8522 8736809 7934695 7358477 6955216 6688284 6348696 6109053 5698098 6068448 6673950 5869276
8512 5869276 5367356 6031294 6783860 6670236 7354230 7243424 7128812 6814172 7168831 7542461
8502 7542461 8765602 9181724 9354075 10523652 11549251 12202013 12966228 13332597 13726072
8493 13726072 14133883 14306722 14741307 13980191 12427478 11055640 9913026 8140438 6768710
8484 6768710 6146226 5390206 4957097 4773581 4180443 4073354 3747755 3136919 3151298 3186353
8474 3186353 2458205 2523843 2528392 2291904 1843543 1489189 1396369 2036696 1778293 1588605
8464 1588605 1208261 1409748 1807577 2091048 1693521 2048196 2093161 1704016 1603421 1488676
8454 1488676 1270999 532313 942875 1366213 1499919 1618862 1451260 1643561 2286221 2171714
8444 2171714 2017380 2020042 1057496 1066425 1003832 860200 742566 465755 287601 628757
8434 628757 1234638 1281568 559084 -91550 930950 841727 1013996 764406 116659 -151550
8424 -151550 -70524 293823 163083 560930 428839 939575 613797 -82989 550507 127571
8414 127571 -136659 -406706 87662 -212899 -457328 -69376 134319 -53743 59372 -316361
8404 -316361 -80605 -33568 316922 269211 820709 826112 335074 210998 180415 558722 502575
8393 502575 638361 649849 327711 546709 840255 774388 396888 347640 809322 901910
8383 901910 683981 457095 148694 128087 405405 417373 469298 354688 -109429 -159486
8373 -159486 -174148 -390360 -100803 -295032 -202650 95240 493927 642266 531217 863463
8363 863463 1081015 836821 412580 -107495 -1256840 -611552 -79811 373120 660671 82709
8353 82709 -464146 10370 387975 -172421 -185389 -552810 -178199 -530565 -743153 -532764
8343 -532764 -692923 -56953 295965 283229 649424 630065 564457 -156320 413975 -290221
8333 -290221 -152026 57218 241881 534685 508827 370470 273505 838499 590646 374437
8323 374437 -306414 284485 589580 427641 947609 566769 742166 703006 -131656 -214088
8313 -214088 3638 20226 80156 111389 404350 383237 154977 619513 417780 -143739
8303 -143739 -133310 -326842 -248783 185507 241657 -462009 -244524 -233153 -297384 -98255 269463
8292 269463 -206901 -341514 116532 151428 198988 290475 493154 -161739 -320298 34235
8282 34235 -376629 -21652 -174908 172325 642983 -68370 168722 -158981 112157 304197
8272 304197 227429 292126 434459 131231 512494 643850 619728 461456 111663 531611
8262 531611 584035 189965 -17363 74683 249263 -10359 -503420 -429580 52019 376760
8252 376760 -161394 -143529 -632266 -152049 338839 30004 -25467 -308962 -737105 -935287
8242 -935287 -436922 -439449 -65131 48828 -239743 -304779 -111170 -203589 -116540 -431789 -953974
8231 -953974 -1176508 -970291 -558357 303936 302475 170768 -380253 -913226 -473439 -330619
8221 -330619 190455 -228291 33034 -368494 -674411 -611883 -411163 18512 157757 -322439
8211 -322439 -376062 -58022 577875 291706 -282239 -598505 -123662 -595529 -641772 -343616
8201 -343616 -601785 -652856 -647673 -35043 -1034993 -732641 -582878 233102 -155856 4318707
8191 4318707 3686605 1167141 939989 213670 362617 158401 471142 202703 513913
8182 513913 795763 700563 145838 301416 -410602 5285 327322 740662 702053 682736
8172 682736 767333 45898 -161865 -182487 -522043 -193733 -65280 -82532 -431841 536545
8162 536545 653816 358064 -172295 -575086 -175105 115620 -28952 549492 391985 47803
8152 47803 -2021 -227741 -436112 15921 261610 191603 565693 842681 417260 -57240
8142 -57240 -145752 -329501 -65229 -376301 -144221 -438577 -632450 -588485 -317727 -226030
8132 -226030 -14602 -612783 -836379 -110931 228777 39472 210261 57208 -518639 -1042065
8122 -1042065 -706203 -529084 319638 203788 644465 94117 -95772 -329924 -521107 -42389
8112 -42389 80657 -71239 -260002 -408436 -348776 442212 133533 295107 -225743 -455029
8102 -455029 -732007 -41406 328317 -150468 -55952 -234265 284642 30383 -70089 233892
8092 233892 -638856 -749873 -948991 -204059 74507 269072 339183 243176 265553 161281
8082 161281 -411124 -637155 -289453 -161289 -168743 272549 396295 515430 362861 -115418
8072 -115418 -896408 -759197 -1206238 -820247 -395208 -429742 -737535 -421559 775583 595868
8062 595868 141728 -704559 -1360502 -277125 478926 -226318 -479430 -135494 22525 171066
8052 171066 170611 479615 186921 -242396 445049 647684 192793 88378 -113225 -338245
8042 -338245 41454 77674 11535 50030 280282 518536 463883 37146 -119292 187455
8032 187455 332950 145940 99436 -292918 -515727 -258309 -390743 -456904 -559520 127231
8022 127231 58334 -403639 -736419 -666969 -137652 -449735 -415356 340502 661233 106189
8012 106189 454425 604855 745259 418615 715404 16641 -223519 -482084 -525182 -332040
8002 -332040 -319306 -455335 -612967 -479776 -281488 -285792 -788414 -151039 -182792 -523477
7992 -523477 -401922 168136 -401749 -420281 -180530 -211384 421358 288075 -234563 125890
7982 125890 484654 106292 -20483 6913 -183190 -999391 -706324 -384977 -305569 -595073
7972 -595073 -199885 -429921 -367403 33627 168773 184274 298873 435705 -11557 -51601
7962 -51601 237526 548633 -46552 -19459 -84669 -564730 -605657 -493930 -289490 39514
7952 39514 240417 -631373 -443556 234018 -348018 -825680 -1099420 -668336 -124138 -153729
7942 -153729 -286095 -526993 -425273 -800876 -256689 -254248 -144535 240821 -148447 303292
7932 303292 254380 204627 61655 126364 218044 -48700 88877 131307 -206255 6964 -75764
7921 -75764 -268099 127692 -241028 -448124 -421787 -419277 48778 -426245 119076 558897
7911 558897 99313 -415564 -56275 336337 -457077 -127446 44787 249758 921245 542212
7901 542212 47477 -146302 164133 -217074 -207624 136944 -229031 138567 669087 214832
7891 214832 -98659 172893 -21656 -288392 -669473 -621398 -269900 -569605 -370608 419874
7881 419874 76424 367645 470060 418394 -173630 -706118 -698217 -899984 -579973 -889055
7871 -889055 -260206 131160 134497 337965 409910 337011 -23133 -369186 229033 -153958
7861 -153958 -704888 -144722 -362250 -667203 -487817 -953854 -713550 -551729 -351965 223160
7851 223160 -284426 -997918 -661550 -322051 -306297 -584254 -305242 -701603 -453424 -220382
7841 -220382 -690801 -734254 -261971 -167544 202862 769046 -40993 -404093 -137117 -443726
7831 -443726 -519779 -365694 -436772 -220492 -345799 -151511 -636989 -72894 383028 -96819
7821 -96819 -533242 -493023 -100212 100235 84131 -486802 -162658 -56145 -342080 -211117
7811 -211117 -248879 -284501 -781900 -320236 -790671 -1300073 -485233 -668736 -923101 -907015
7801 -907015 -714206 -872103 -965228 -503797 -347351 -484257 -466252 -329417 -82465 -134936
7791 -134936 109673 26176 -104103 -514961 -551416 34329 -357633 -430057 -355150 93538
7781 93538 -231159 -228065 -204251 -374974 87474 -24252 18384 -397122 -275739 317221 172512
7770 172512 267765 681695 423317 -5768 19503 132945 -139754 -381653 -731994 -270175
7760 -270175 -530823 -758688 480807 327921 102881 -380620 -440522 -505245 -303909 -30637
7750 -30637 76260 -330855 20274 169124 729151 298377 -151979 -34506 -85129 -520295
7740 -520295 -668776 -511687 -179144 -395821 -762345 -293740 -362129 29559 58743 -467149
7730 -467149 -558144 -57881 -113875 -226224 -348407 -209756 -536656 -457728 -92884 363889
7720 363889 -253771 -58924 481951 127161 -47293 184849 -165286 -294854 -217052 -556109
7710 -556109 -1139464 -728491 -260902 -467417 -524517 -402562 14590 -179685 101480 -581199
7700 -581199 -907859 -493407 30279 155605 230192 -578112 -213262 -331764 -537580 -426460
7690 -426460 264478 312033 -60817 193912 -601758 -182917 -94896 88464 -360680 178510
7680 178510 303508 144586 -209589 -103331 64769 -60085 -859520 -342278 -142513 -407196
7670 -407196 410492 -187872 -258564 -95960 -446037 -729199 118402 177179 -169922 -129414
7660 -129414 -281817 -129311 167844 317671 204434 -149164 -90169 -535384 -836605 -626841
7650 -626841 -90663 -413039 -538694 -168444 -328494 60991 -156965 -185746 -368863 -479386
7640 -479386 -603502 -624619 -748891 -135212 -487680 -764043 -176215 56407 179540 44941
7630 44941 -250263 -890635 -275961 187822 -50650 -102609 -401432 -80108 -237397 -443091
7620 -443091 236252 733635 654972 364269 -164794 145600 -120817 443265 497166 103736
7610 103736 584597 -298648 -431772 -375379 -268376 -387972 -48759 515112 334319 -18193
7600 -18193 -833460 -442348 241393 -153969 33076 -301510 -150044 -521086 -592103 -443154
7590 -443154 -139585 252303 -585271 -533316 -251515 108534 318392 236094 336406 350135
7580 350135 418645 115091 -332945 -115665 -10153 45658 302864 -72899 211744 238089
7570 238089 110852 -784896 -1058289 -629723 -676375 23426 -206357 45051 -536648 -335921
7560 -335921 -590736 -903186 -298591 -175689 -282067 -779932 -254206 -97919 -431484 31888
7550 31888 -113303 -94080 -5962 -147158 332296 703468 684215 -6761 143744 26205
7540 26205 -144452 -515499 127314 215357 41813 308553 -86758 -430942 -221907 -80354
7530 -80354 311169 -57809 -100727 329037 -38350 -277697 -371178 -172702 -156963 -311224
7520 -311224 -29971 394552 193180 656396 605294 122030 662982 537481 309754 -244781
7510 -244781 -141178 73362 -777477 -656914 -317593 67713 -445857 -151235 242640 14763
7500 14763 93769 87525 -770843 -542990 -21379 478099 628688 -154060 65384 -56220
7490 -56220 375041 472312 418128 153383 -426442 -600377 -367215 57870 315021 -354838
7480 -354838 -364120 -661523 -483602 -717246 -907871 -548506 -300613 -103952 -287705 113919
7470 113919 -34690 -206315 -544141 -315594 -214311 -138942 250999 -409103 -395765 -117660
7460 -117660 -777084 -569621 -173735 141417 68714 67293 299184 594966 27496 -228748
7450 -228748 -34019 -303700 45475 -11552 -499336 -402129 -606681 222358 488947 585603
7440 585603 833243 782646 912006 136030 676882 460317 574340 693133 371290 46065
7430 46065 -54741 -347519 -597829 -127378 -737396 -631224 -151755 -563892 -347460 -272867
7420 -272867 -208084 -572190 -477129 -555106 -279693 2199 -7186 -221544 -679501 -431825 -635146
7409 -635146 -884194 -297960 -164249 -877462 -356810 -453605 -155773 7992 -62807 -168768
7399 -168768 -353090 -415906 -189159 -1009825 -1170857 -175147 347006 101571 54096 325190
7389 325190 -131508 -731805 -94187 571649 371125 170558 -105783 -415738 -93442 -112806
7379 -112806 91169 278424 649547 -429672 -628617 -168081 -578455 36281 166242 -253588
7369 -253588 -439907 -182294 -148824 302278 581445 -84997 -373323 -369738 55455 -14096
7359 -14096 13928 -514019 -892310 -213201 -556616 -1086516 -749591 -834772 -198443 -356787
7349 -356787 -753957 -765956 -250283 -85424 -510444 -482663 -112560 629113 297489 -280337
7339 -280337 -766848 -707677 -350537 140080 141150 104851 -762933 -621143 -454914 -457961 -184926
7328 -184926 -162433 225317 -46847 -635231 -48032 -1897 703 71120 -6553 -629277 -776376
7317 -776376 -246818 -246454 -355485 -516704 -598603 -292716 220710 183427 -203100 194925 -156052
7306 -156052 -99559 -285400 -331988 -195016 -362764 -94358 -184099 -280488 448008 707505
7296 707505 729492 222875 -560837 -435595 -446156 -337928 -1083190 -477780 -197532 -720575
7286 -720575 61254 46515 -37815 -443038 -428645 62979 -442665 -631799 101726 -402720
7276 -402720 -289179 -728527 -640857 -366824 -73649 -281529 -281588 -41032 274441 358275 8997
7265 8997 -581615 -335431 67693 -604838 -243815 -408890 -274859 -116858 -498916 -103718
7255 -103718 149426 -75226 -85152 -303861 -446047 -567207 -679120 -464879 154194 -124967
7245 -124967 -599121 -616932 -1422077 -1583371 -1129354 -375916 179939 253706 -132969 -685275
7235 -685275 -416389 14960 -185246 104969 -241166 -459899 -271928 -602690 -644352 -338517
7225 -338517 260877 -265711 -113661 -184472 -325450 65375 369923 -305640 -120264 -354169
7215 -354169 -477924 -890028 -926866 -420863 -582811 -362125 -397634 -375048 -447924 -598733
7205 -598733 33523 -340157 -321000 -356439 10378 339159 96701 89957 -547719 -936405
7195 -936405 -754618 -275896 360310 -164994 276398 -203238 -364761 -855235 -552626 -342993
7185 -342993 -395671 -414137 -47933 209254 437366 34993 -152281 -351635 -570786 -171780
7175 -171780 -410510 -433141 -119945 74913 281013 -159034 -713534 13366 -85580 195483
7165 195483 219016 146332 -457152 -308808 24976 324087 586626 -213367 -492112 -59213
7155 -59213 386079 179475 620190 202824 100604 596153 638678 131130 -613265 130619
7145 130619 -61714 -817940 -672890 -117645 -229747 -71156 -264321 -43909 -43883 122794
7135 122794 97366 243774 -238366 -237612 -212110 485934 901131 811391 691862 710709 108604
7124 108604 56862 -343380 67562 19894 -362416 145506 -718826 -565995 -599015 -551282
7114 -551282 -914387 -448584 -876580 -769202 -192739 -897497 -840969 -681244 -766029 -422168
7104 -422168 -380582 -689661 -126280 -346627 -344195 -245939 -1065451 -540725 53506 -517956
7094 -517956 -702588 -526985 308248 61926 -470317 -623537 -91953 16202 624649 46224
7084 46224 46393 -260095 -362635 -284387 -194862 281042 -14557 588816 378040 -26301 -106718
7073 -106718 -833442 -591973 52118 -280207 187753 345891 -608405 -259638 -61696 111007
7063 111007 6947 -11780 -142205 183462 415163 -96115 -553768 -330994 -533950 -664507
7053 -664507 -34632 -336002 -337905 5202 362908 614878 317493 65390 -302569 -459610
7043 -459610 -769934 -1482999 -825730 156297 -478421 -772177 -535684 243198 619115 253011
7033 253011 472324 94452 588941 -196206 -252131 -46940 110215 -281959 -98368 -564377
7023 -564377 -380238 170573 223112 -147657 457648 -139161 -50640 -140114 -201161 219876
7013 219876 47571 -14365 6636 323552 302002 535247 638094 108387 -306946 -125086
7003 -125086 230287 168791 -514059 -393820 -78790 -191261 -46129 -482183 -580291 -1351910
6993 -1351910 -1261759 -920701 -563952 -296910 15514 559697 374512 762836 569356 152040
6983 152040 -920115 -540688 -6981 -198762 -54404 403264 118785 -151210 135198 504383
6973 504383 285084 122934 207921 -235865 -606491 -786083 -222580 -291983 -90379 -535894
6963 -535894 -356872 -177848 239690 -95827 -418058 -63683 -19427 167660 647068 285405
6953 285405 -568914 310338 -268552 -384877 -195851 99694 229309 43117 382371 498659
6943 498659 436694 82439 -631852 132065 487442 226217 -251466 -328118 -135598 -48913
6933 -48913 426766 546218 -100917 -366664 464409 78801 88814 107695 -164922 -171369 129765
6922 129765 888405 565040 1086097 379778 -337861 187752 -85656 -390095 -379931 -161584
6912 -161584 502056 460211 -147048 5387 -28501 -243306 -156573 -228959 403620 308190 -606411
6901 -606411 -640239 -311786 -340415 -355074 90799 159649 92716 458341 -140747 690484 823351
6890 823351 609436 491253 34836 67553 625993 548663 436691 -237417 -49590 396241
6880 396241 362130 512972 -104270 -198548 92939 402321 595275 237342 -340352 -358509
6870 -358509 -584457 -575805 -348068 173083 635669 597257 -16708 -50589 -324806 -69650
6860 -69650 -71962 -754230 70203 194383 905813 909564 461382 468239 611561 14245 -411078
6849 -411078 522454 177920 -113498 55635 -58041 96221 482685 -38972 255164 541272
6839 541272 399155 434864 675059 304373 251189 461027 -356284 360087 -35653 -301643
6829 -301643 540388 281202 365114 746323 821677 871241 843739 761649 1118976 733361 233184
6818 233184 523861 758592 5062 -212608 258778 463853 511140 312523 -248975 -722357
6808 -722357 -679897 -531921 -872558 -284763 40608 -162590 -321283 -336942 -297687 295905
6798 295905 -172567 -503304 -215226 -146229 280681 274200 60139 232974 -350660 -51068
6788 -51068 -197334 -240192 -453731 164160 303143 528294 617383 585783 274133 260035 210172
6777 210172 -14177 30926 301134 491036 219316 -118978 32042 -253710 -21940 330687
6767 330687 -124225 592235 307407 -108727 75695 785495 618241 123270 -152007 -134308
6757 -134308 -446968 -360604 206197 694161 102254 49124 -119008 -609409 -625136 2190
6747 2190 113368 -644876 -786167 -431783 -535671 -106438 462513 154488 3342 -440700
6737 -440700 -425163 -200997 -253981 79767 743830 105456 -1072984 -944557 -198592 35239
6727 35239 -207125 -490996 -754824 -258302 -101759 158124 -282836 -159448 -326888 -447142
6717 -447142 99505 262994 544118 424387 -8682 81489 -112797 -508572 -876235 -92329
6707 -92329 -580187 -847229 -567725 -131863 42680 -18269 70913 200795 734914 941023
6697 941023 636028 41718 -39632 -109196 -359477 -62862 -88390 -8927 301283 -253807
6687 -253807 -757229 -711621 -196975 555424 627305 5095 -539206 -656996 -228427 104968
6677 104968 215347 345934 336350 339642 -59218 -458305 -420455 -362282 -649543 -253890 588571
6666 588571 593661 1018153 415538 -8229 -216202 -417164 -749533 996 1105405 746848
6656 746848 77005 -19621 -109826 -406709 -80436 -31347 -314116 -424353 -721312 9063
6646 9063 -206290 -296168 -481077 -289309 -344081 87311 -129961 -69744 -274900 -263077 -407454
6635 -407454 -640049 162672 477916 262495 -327481 -639879 -750116 -562449 -218831 112268
6625 112268 -188281 319689 101154 -53161 16213 158909 478805 330702 225326 77694
6615 77694 312823 431472 -224351 -318882 -442254 -239611 -381032 233593 307438 494698
6605 494698 161323 -772249 -274777 -358559 55537 244331 222791 1011282 398807 38791
6595 38791 171713 521981 318660 -18213 -13067 569340 605750 578300 210513 -163395 -597184
6584 -597184 -84819 278052 316272 31203 243154 638483 252855 -149106 -95247 463116
6574 463116 676304 630421 -151446 -98653 -353365 -519176 -393593 -100507 124452 107855
6564 107855 428263 309896 373560 223289 95255 521881 897590 964934 629737 1182519
6554 1182519 1055424 1056193 1085492 1001538 511132 347336 441213 288401 96643 481876 555287
6543 555287 891686 507966 -70170 36341 119282 -141863 262389 247929 214478 373542
6533 373542 910387 1037452 416543 90256 327517 193712 480786 485297 566122 775066
6523 775066 472863 95317 11437 111094 315262 82581 214835 36195 283756 391051
6513 391051 572068 797640 865543 -93136 -112621 151318 34042 -184527 -601944 120181
6503 120181 -230530 319648 540898 488539 666570 1075367 80682 239009 275901 383236
6493 383236 446410 286919 418528 345976 335796 469222 316002 43105 27251 725154
6483 725154 563230 521162 770492 763935 264260 -103945 470739 139568 -274667 252480
6473 252480 379590 19833 147095 159247 438756 589690 298588 540346 715914 851626
6463 851626 396502 947167 1407804 912324 452270 -39445 -354931 -87813 102566 125640
6453 125640 283672 794707 566821 168895 397513 233448 -458743 314134 554215 111602
6443 111602 55491 19092 36931 306054 386678 -60707 -59497 563622 744768 473216 111007
6432 111007 183509 487268 748963 780817 421902 872653 625566 740792 229458 332647
6422 332647 18924 450975 683278 339344 864642 923211 795060 327893 -277459 -416422
6412 -416422 -397157 -538797 -570677 -279935 74687 -47532 161807 416150 939776 1230582
6402 1230582 867016 904399 410786 537942 712333 34141 73063 479306 1010209 652483
6392 652483 423264 439085 157926 -85181 189418 762884 891676 680207 -158441 219868
6382 219868 537699 448532 475283 624378 880064 907602 552479 447643 -147628 309248
6372 309248 737481 569758 743336 489982 995123 691997 278088 784438 887693 470315
6362 470315 46808 20039 833975 559169 892481 1143603 1107060 1272586 1352341 1165053
6352 1165053 1308591 920298 335756 439248 1058004 885733 424486 10318 743900 943541
6342 943541 479325 315333 829724 1228224 897996 1426903 935226 1045250 1487904 1255503
6332 1255503 646564 839140 1290814 1165595 1010809 1318063 1766531 1767556 1223606 1788133
6322 1788133 1620033 1112496 1049369 1809494 1751502 1450135 1392076 1540603 1088497 1586831
6312 1586831 1763647 1347291 1111054 1224750 1503102 1849477 1804187 1330884 1234518 1187080
6302 1187080 1829074 2076402 1637741 1564882 1840128 1728974 1938691 1873316 1760799 1828875
6292 1828875 1570952 1518987 2288732 1960115 1362597 1766672 1236091 802378 1071700 1345363
6282 1345363 1771237 2056634 1806442 2356997 1849590 1743369 1480931 1898638 2552780 2376807
6272 2376807 2111306 2165379 2312956 1666155 2017290 2645649 2686431 2503544 2369933 2314511
6262 2314511 2031811 2034712 2745923 2714213 2407582 2095763 2788471 2598783 2537247 2817469
6252 2817469 3371931 2709729 3301226 3370076 2844089 3313143 3328730 2767580 3119733 2931759
6242 2931759 2827333 3543306 3919364 4291816 5088753 4835883 4537932 4688091 4224636 3913729
6232 3913729 4732000 4769301 5824400 5985492 4959577 5130796 5311334 5416872 5693284
6223 5693284 5893688 5940811 5976995 5643824 6227173 6449568 6828336 7266302 7738353 8061010
6213 8061010 7635419 7775833 8038722 7619308 7984744 8699252 9293296 9094293 9022255 9660377
6203 9660377 10111862 10196136 10458361 11206049 11981438 12388482 12672076 13302844 13689933 13814384
6193 13814384 14159383 14106663 15147992 16446021 16848410 18082920 19746170 20388117 21375578
6184 21375578 22983354 24966244 26264355 27445192 29262410 31106584 32633014 34228967
6176 34228967 35546053 37230699 38107750 38875359 39131356 38511794 37567612 36538552 35513746
6167 35513746 35379452 34898488 34243505 34664482 35454327 36069996 37360805 39962762 42073717
6158 42073717 44681961 47422849 50360838 52745084 54838194 57147643 59409363 61369556
6150 61369556 62104785 62690001 61445201 58629947 56020504 51529156 47320676 44091281
6142 44091281 41721531 39001998 37085324 35486512 34448782 33808070 33222661 33635867 34801632
6133 34801632 35144297 35702939 35558851 35874131 36731730 37030310 37569126 37780446 37693628 35907947
6123 35907947 33925934 31675628 29486202 26837173 24582249 22251929 20063530 18308341
6115 18308341 17408557 16268897 14557744 13121937 12720361 12231237 11032277 10493279 9645006
6106 9645006 9059867 8899919 8912904 8539408 7861063 7284273 6597638 6489438 7030924 6848233
6096 6848233 6026543 5997127 5029328 5060022 5354437 4885412 4043756 4510661 4523750 4959727
6086 4959727 4516099 4524824 5049610 4511430 4997809 4763769 4628272 4197719 4235933 4370636
6076 4370636 3831634 3943904 4245718 4385887 4440615 4498971 3970471 4180126 3802442 3290493
6066 3290493 3452907 3393054 3388020 3508513 3420204 2858440 3578281 3727294 3544005 3733023
6056 3733023 3678729 3800894 3744435 3617725 3932075 3741041 4045498 4353972 4239281 3827485
6046 3827485 4037655 3794468 4055391 4261434 4030116 3359655 3973653 4103732 3947043 4395069
6036 4395069 4727277 4044407 3798524 3488593 3645351 4056252 3956435 3176781 3000780 3983442
6026 3983442 3563699 3202470 2905001 3466730 4106157 3771660 3755425 4233045 4303468 4319799
6016 4319799 3847797 3800127 4335733 4467476 4244238 4903760 4910527 5003906 4670352 5132824
6006 5132824 5289395 5262317 4600190 4604793 4788726 5045834 5757445 5610867 5871045 5472399
5996 5472399 5425221 5812598 6155315 6197106 6186497 6402434 6384067 5952164 6013113 6360562
5986 6360562 7119415 7242700 7004725 7083693 8229584 9284517 9769902 10123137 9920995
5977 9920995 9737366 10612852 11774091 12230199 12423915 12754688 12442729 12741507 13048896
5968 13048896 13379631 13345115 13177823 13240879 12868539 13396603 13496539 13049851 12712848 13155319
5958 13155319 13968192 14734879 14668216 15300265 16785122 17441730 18135925 18795227 18936349
5949 18936349 19474701 20309375 20446066 20137668 20309599 20302003 19736433 19369213 18720641 18321497
5939 18321497 17224408 17261701 17376885 16887340 16656297 16330726 16248253 16535270 17041545 17297648
5929 17297648 17689667 18425135 17991239 18659276 19095483 19530021 20065869 19891001 19965646 20108363
5919 20108363 20499730 19808825 19776106 19486036 19385482 19506030 19894525 20607908 21209004 22017499
5909 22017499 22807622 23906455 25431699 26108255 28262929 30012588 31197857 33135997
5901 33135997 35051652 37375461 39212882 41878713 43913868 46052210 48437166 49167846
5893 49167846 49677149 49317492 48333874 47394990 46445522 46482152 47410696 48436882 49227092
5884 49227092 50282373 52078223 53665725 54994599 55271152 55545159 55891338 55816167 56822576
5875 56822576 57839671 56946949 56208510 54515565 53109294 51966026 50491878 49606046 48952924
5866 48952924 49038119 49543544 48830985 46989306 45964718 45613154 45736087 44707631 43922634
5857 43922634 44142147 43778959 44210803 42641479 40346675 37985465 33725291 30015280 26803869
5848 26803869 23740756 21242092 19216367 17067917 15172537 14763661 13427809 12088487
5840 12088487 12052801 11457133 10696283 10344330 10127202 9284533 8757857 8572296 7744362 6987574
5830 6987574 6733915 7034247 6850982 6406144 6495071 6587915 6563732 5668729 5232342 5213760
5820 5213760 5225828 4967714 4866655 5173703 5087512 4789848 4379261 4255038 4243996 3486792
5810 3486792 3396597 3424860 3586192 3752231 3349040 3406474 2792379 2594830 3132240 2745396
5800 2745396 2409862 2550032 2980779 3375286 3108776 2835229 2327762 2458219 2627556 2399266
5790 2399266 2569444 2486590 2844633 2662501 2665523 2652400 2419404 2405309 1903287 1767144
5780 1767144 2545834 2706823 2542396 2355656 2324813 3077533 3028093 2539869 2741599 2579483
5770 2579483 2486810 2212300 2062968 2050623 2067593 1805209 2423255 2387575 2372230 2012461
5760 2012461 1930101 1534494 1253587 1926300 2514251 2957274 2500257 2492913 2394363 2666994
5750 2666994 2280539 2367864 2902679 2663914 2693018 2539728 1940292 2123223 2173505 2342141
5740 2342141 2447425 2120763 2229464 2208433 1875901 1400763 1746984 2035399 2682072 2379347
5730 2379347 2567063 2541681 2440691 2777565 2379141 2250397 2900944 3055560 3174467 2959684
5720 2959684 2612566 2120078 1953274 2988049 3173952 2744454 3119174 3000368 2671383
5711 2671383 3032917 3360405 3206308 3026723 3187823 2630243 2615363 3416419 3851366 3626336
5701 3626336 4346260 4204900 3495275 3750119 3913178 4093698 4356894 4792211 4495764 4491987
5691 4491987 4824185 4016354 3886995 4273144 5104572 5241227 6041195 5742737 5315287 5093396
5681 5093396 5227430 5332542 5320448 5143214 5467841 5919076 6660270 6535104 6733219 6954811
5671 6954811 6887672 7207869 7277053 6854377 7221488 7941154 8449843 8637371 9029569 9382865
5661 9382865 9770971 9461253 9421062 10113803 10530408 10493402 10626489 11310316 11886101 11680025
5651 11680025 11949475 12745775 13065536 13961891 14235709 13474245 14186412 14502432 15234408
5642 15234408 16742057 17481342 18154280 19202204 20990196 22630445 24426023 25006918 27042254
5633 27042254 28813909 31028034 32874270 33800318 35656065 37822412 39630067 41315297
5625 41315297 43114284 43550379 43198367 43616887 42659512 41071024 39855597 39034452 37439393
5616 37439393 37075468 37377603 38225876 38679462 40154983 41727815 43748366 46321003 49050493
5607 49050493 51014523 53456079 55766854 58043005 60421377 62368652 63315777 63393938 62543470
5598 62543470 60055768 56874903 52250749 47351658 44117819 41571365 38165280 35575393
5590 35575393 33809317 32685185 31951004 31088835 30644741 31500293 32183452 32214549 32604401
5581 32604401 32725071 33321157 34540783 34345944 34225784 33732036 32438078 30700899 28406573
5572 28406573 26090830 23807371 21617961 20179434 18373890 16702874 15313478 14654870
5564 14654870 14281320 12863369 11828310 12281959 11474357 10860309 9890060 9123167 8807259
5555 8807259 8836948 8362428 7204189 6495232 7011390 7321149 7270811 7835353 7534569 7171308
5545 7171308 7130951 6246501 5892694 6498582 5755218 5713230 6252275 5572935 5628846 5816976
5535 5816976 6128528 6094319 5480705 4622311 4745017 5233975 5550257 5011745 4806068 4959708
5525 4959708 4327302 4485907 4379368 4661441 4642277 5001338 5092880 4905918 4670098 4534148
5515 4534148 4642627 5191900 5539904 5053675 5145320 4961853 4867853 5200186 5153825 5080719
5505 5080719 4932724 5136652 5226472 5216018 4925959 4917125 4718437 5117438 5155721 5586741
5495 5586741 5785549 5537109 5661141 5763437 5378207 5700647 5054193 5250904 5599369 5124862
5485 5124862 5681654 5939541 6074255 6252085 6016593 5697954 6045099 6463233 6286182 6505348
5475 6505348 6654843 6501094 6570076 6513171 6651006 6817900 6841067 7157458 6780277 6307530
5465 6307530 6632176 7086533 7708079 7820327 7947828 7949199 8299858 8484610 8455617 8819651
5455 8819651 9221016 10497657 11326627 11006086 12073840 12437651 12672106 13128003 13408877
5446 13408877 13743645 14402886 14680125 15232875 15122282 14514853 13737185 14115583 14355777
5437 14355777 13359269 13993069 14518205 14402333 14829732 15184619 14863860 15324844 16323495
5428 16323495 17545958 17906390 18317192 19042022 19440575 19522152 19941882 21237608 21217879
5419 21217879 21500100 21524810 20728273 20105783 19124314 18666715 18429160 18142068 17259597 16814902
5409 16814902 16579391 16703921 16244909 16277216 17068100 16811143 16562730 16295052 17862772
5400 17862772 17603968 18101040 18713536 18931338 18820477 18670004 18586344 18654018 18324739 18160334
5390 18160334 18517068 18623281 18747263 18623828 18319236 18800717 18905702 19652316 20078960
5381 20078960 21019131 22104941 22350538 23486681 25113586 26524688 28382393 30411558
5373 30411558 32283071 35322433 36932998 39288264 41365228 43923146 45876418 47910143
5365 47910143 49987813 51849905 53325418 53700215 53050646 52087727 50582728 49417850 48735834
5356 48735834 49223414 49906431 50596709 52286811 53765838 54396643 54578348 54471253 54997969
5347 54997969 55863443 56003426 56422357 56445661 56928717 56187503 54865633 53214538 51119592
5338 51119592 49381048 48316227 47896947 46465524 45412801 44024614 43220497 41720464
5330 41720464 41133908 40865216 40796065 40150351 39802594 40025209 39956353 38206021 36176246
5321 36176246 33285913 30176801 27445979 23961153 21648274 19765440 17493269 16688995
5313 16688995 15263891 14032844 13310747 12513719 11536582 10606893 9898981 9008782 9183270
5304 9183270 8823190 8657514 8413394 7855664 6931205 7367012 7207310 6801552 6656958 6348349
5294 6348349 5902955 6086079 5542304 5413188 5570332 5681206 5519806 4957844 4797796 4786747
5284 4786747 4518367 4179764 4221600 4005648 3949817 4252765 4172411 4152210 3558580 3536479
5274 3536479 3547451 3100591 2676802 2969391 3323489 3911217 3258536 3185785 3272101 2913688
5264 2913688 2461884 2491758 2345136 2733915 2642109 2658429 2918202 2424154 2660316 2216208
5254 2216208 2474690 2510502 2200001 2441035 2961962 2934510 2518332 2080530 2275432 1906246
5244 1906246 1727038 1810445 2271064 2438690 2191722 2230575 2563818 1736344 1679610 1566780
5234 1566780 1947370 1841369 1558549 2085586 1943147 2300811 2163973 1504920 2112211 2226901
5224 2226901 2084346 2797832 2673875 1500328 1168730 1146552 1496678 1420090 1284657 1458594
5214 1458594 1251092 1027134 1129520 1813216 2078560 1720675 1811966 1683700 1549352 1144466
5204 1144466 1035798 331271 281984 1239169 1586195 1224865 1008338 1560676 1362987 1477872
5194 1477872 1585808 1952148 1075847 1322488 895154 786667 937606 528186 464190 1262978
5184 1262978 1017844 798498 1371094 1504934 1202088 1456342 1343803 1739149 1698538 1507471
5174 1507471 1489859 1587656 1442362 1174956 1679017 1304276 696597 514637 355342 705362
5164 705362 1343750 1548090 902502 1112367 1337219 919930 1318060 1144674 1166457 809941
5154 809941 761407 512803 100931 133085 435276 466776 426469 957170 1037085 1369891 892907
5143 892907 195294 465401 404347 694449 938558 1036998 761425 1605330 1829776 814547
5133 814547 198521 805533 553415 430522 170078 504753 1183590 1427527 1942748 1432110
5123 1432110 1305628 1283459 1103824 647834 454078 272562 668297 1185890 887704 635781
5113 635781 717492 1116215 710475 280354 723708 765833 713440 396309 461319 335693
5103 335693 357673 999660 838745 1346108 817280 730035 1014764 1375585 1002059 988828
5093 988828 1276344 1756694 1341694 1545681 1739741 889604 611723 1137254 1434610 1497886
5083 1497886 1789177 1554637 1421252 1486953 1489510 793926 639703 914301 926267 806232
5073 806232 1111254 1435031 1411615 1088535 835836 1175925 1131565 881375 1225143 918953
5063 918953 932993 931477 1911212 2102525 1858665 1030093 903167 1512410 1182721 1702450
5053 1702450 1956131 1192878 1594657 1490527 705398 876153 978583 1124390 1378291 1922986
5043 1922986 1885827 1182592 891806 1078711 1586496 1482258 2013581 2117839 1934652 1849112
5033 1849112 1710039 1524018 992309 1412215 1972803 1979096 1987475 1819510 1931676 2308574
5023 2308574 2810235 1737041 1711408 2416099 1691697 1623868 2701062 2391958 1598068 2158947
5013 2158947 2544724 1661725 588293 1263200 1493657 1965675 1853777 1558265 1434051
5004 1434051 1537477 1569055 1457491 1792129 1367043 1038701 1211842 1442471 1449902 1063984
4994 1063984 1283206 1526130 1903061 1181242 889172 1728752 1373954 944002 781159 1418055
4984 1418055 1400594 1125051 1487285 1064858 1384580 1132141 1511959 1441935 1521063 1186266
4974 1186266 1728697 1887103 1592042 1717022 1508646 1585774 1600981 1733673 1268690 1419669
4964 1419669 1921538 1272583 1121345 1222959 1127869 1392697 1667703 2247529 2298464 1922114
4954 1922114 1801026 1523999 1556904 2156032 2045506 2665053 2656180 1852788 2032208 2623212
4944 2623212 2478453 2726271 1775140 1762709 2328780 2245200 2009741 2263236 2058693 1833538
4934 1833538 2286166 2423507 2483422 2350202 1932029 1395751 1608183 2079201 2391286 2376274
4924 2376274 1998648 2825337 2936885 2613178 2958185 3128642 2969609 3621470 3308297 2953830
4914 2953830 3486166 3645123 3790830 3456674 3536291 3046530 3571976 3598948 3589849 4123488
4904 4123488 3997551 4480879 4306140 4537566 4306486 4318864 4248876 5076805 5172131 6068791
4894 6068791 5976506 5927824 5997899 5451683 5988907 6338098 6638458 6564435 6666942 6103509
4884 6103509 6129902 5871896 5690890 5980983 5867605 5942545 5549700 5186818 5642130 6839395
4874 6839395 6918927 6479046 6101446 5671199 5942900 5988442 6411246 6372433 6054764 6075123
4864 6075123 6517466 6396040 6903307 6754995 7370766 7008258 7557264 7825207 7750417 7052439
4854 7052439 7231150 8231395 8210712 8916506 8910059 9011889 8738994 8771663 8916450 9112745
4844 9112745 9343702 9286579 9570983 10036358 10622978 10365612 10721592 10499201 10501278 11032123
4834 11032123 11506653 11931926 12397835 12219784 11648121 11644588 12256975 12707738 12742582 13148456
4824 13148456 12644962 12973256 13023109 13899490 14387681 14424586 14767167 14582173 14784354 14793958
4814 14793958 15346160 15732946 16538598 17107056 17613987 17115413 17071593 18420876 19139288
4805 19139288 19447959 19713349 20018828 21058805 21516768 22074975 22594494 24087289 25067613
4796 25067613 25727596 26099881 27110057 28144448 28881596 30342553 30750708 32099057 33292295
4787 33292295 33520348 34534296 35880477 37301322 38746599 39067363 39707395 41025489 42395473
4778 42395473 44161814 45465050 47313804 49264094 51379155 53468473 55865907 58583991
4770 58583991 60673085 64602682 68960592 74138366 80332761 88026904 97074344 107996253
4762 107996253 121409106 137481612 155813242 178474003 203669951 232359198 261280477
4755 261280477 287971171 311310079 326365019 324779136 303547303 269505510 232297648
4748 232297648 196568406 166038795 141446450 121402430 106506058 94992672 85886421
4741 85886421 78283219 72210431 66633238 61819517 57245233 53123257 49566607 45629979
4733 45629979 42496239 40099964 37720443 35402105 34017680 32251185 30409865 28776252
4725 28776252 27511886 26319636 24417850 23237307 22423359 21630427 21038089 20044018 19262761
4716 19262761 19074289 18650999 17478106 17492189 17061355 16469142 15832874 15624179 14903482
4707 14903482 13924029 13516895 12915445 12401024 12223541 12176461 11857851 11573203 10977487 11400118
4697 11400118 11160584 10852385 9980565 9078750 8859244 9084114 8953926 8768177 8580627
4688 8580627 8596699 8262651 8246872 8535765 8453467 8053180 8422300 8570374 7750808 8074987
4678 8074987 8240125 8627592 8482363 7985793 8536593 8421884 8072572 8337177 8091415 8319530
4668 8319530 8749579 8474421 8314287 8912099 9168937 9421569 8968340 8413169 8449149 8686218
4658 8686218 8167438 8581798 9086846 9059517 9709096 9629340 9519836 9908949 10218825 10716418
4648 10716418 10594027 10927571 11229822 11947951 12476633 12186915 12218838 11708453 12520408 12777686
4638 12777686 12893024 12721451 13147306 13631647 13570043 13635613 13604148 13917178 14310527 14443542
4628 14443542 14616272 14873197 15286402 15048450 15355974 15825215 16861642 16742163 17480253
4619 17480253 17863662 18086141 18191466 18342788 18727503 19447680 20056559 20481227 21228292
4610 21228292 22427697 23053612 24249202 25121512 25638023 26242612 27351434 28483828 29246058
4601 29246058 29977359 31525775 32394763 33294139 35137062 36520088 38710335 40864498 43837629
4592 43837629 47601064 51892290 57931388 63993957 71068181 79780815 91045438 103821896
4584 103821896 116949046 127673292 135897349 147138122 162842928 176980979 183928928
4577 183928928 191050738 204617799 203624733 181980506 157244852 132796454 111195205
4570 111195205 91518466 76420947 64888078 56911671 50701594 45556228 41437806 38615083
4562 38615083 35451134 32694287 30369320 28506662 26682848 25139864 23599777 21921109
4554 21921109 20607898 19534256 18059397 16873511 16751394 15952936 15117854 14573343 14022214
4545 14022214 13638600 13280988 12514397 12066258 11448856 10543928 9967400 9571891 9599618 9405905
4535 9405905 9280106 9087929 9675201 8820505 9059234 9857404 9860197 9487190 9021831 8682473
4525 8682473 8146714 8943535 8419722 7492324 6937119 6253452 6088319 5169401 4836362 4809358
4515 4809358 5077511 5115783 5409939 4637352 4626836 4611531 4473281 4605887 4971186 4753674
4505 4753674 4658035 4256250 3647582 4103073 4488191 4434144 4149769 4038078 4195536 4143384
4495 4143384 3958224 4069921 3600411 4181916 4041808 4223413 4425991 4754422 4584275 3806025
4485 3806025 4075472 4451474 4795531 4636146 4844925 4981683 4690225 5472453 6086118 6062479
4475 6062479 5393304 5096701 5348614 5391876 4897234 4629460 4263152 4860777 5552316 6050386
4465 6050386 5799623 5027466 5366188 5912356 5873944 5959681 6020327 5397559 5152610 5727385
4455 5727385 6443454 7383805 7932653 8081154 7768621 7587866 8044754 8812945 9943847
4446 9943847 11301202 11512368 12964343 13731112 13930557 14283114 15765981 16794756 17400456
4437 17400456 18116004 19025332 20305150 20665783 21558540 22323722 22682822 23410229 23946732
4428 23946732 24774361 24822746 24449442 24514162 25232055 25400711 25192218 25439348 24496829 22876661
4418 22876661 22313277 21756372 21115884 20663891 19716901 19097726 17350465 16745546 16042936
4409 16042936 15337889 13734500 12550315 11718363 10717897 10262746 9576406 8915596 8561034
4400 8561034 7122634 6281220 5588165 4960358 5527121 5307760 4594083 4006896 3899188
4391 3899188 3949905 3882117 3338425 3043008 2078489 2582972 2946313 2710827 2480208 2562643
4381 2562643 2306754 2408201 2217960 1968505 1459531 1140791 1551678 1755922 1596622 2063937
4371 2063937 1977621 1960957 1723057 1608461 1156119 940175 1142795 1461081 1436802 1212294
4361 1212294 740065 729242 837499 606531 320400 854371 1208835 993904 1692488 983737
4351 983737 948672 985183 865907 653214 645934 512337 1292039 1108177 247946 473718
4341 473718 1261032 1542495 1034673 -70700 -28205 483775 384716 164690 158391 620495
4331 620495 907110 863110 605420 467162 839409 1281586 804941 98402 634542 451740
4321 451740 488340 911328 548068 331610 289779 67956 66641 338794 791104 365812
4311 365812 -7398 58815 179941 -273083 -185330 -95880 -65318 -490859 298906 10853
4301 10853 126438 830376 531986 -265957 397738 319642 247263 -83139 92722 359512
4291 359512 603643 813944 107453 201975 10961 303427 143324 136370 -157053 29174
4281 29174 -147009 755124 320554 -132596 174223 -199691 -291015 -363285 -117080 -293098
4271 -293098 246174 150276 281163 -7934 406907 326195 1065353 1316779 1092480 1252060
4261 1252060 899956 737726 415102 421399 211299 634770 989530 1446603 1195068 552308
4251 552308 440951 54660 -119190 367158 397115 266934 372334 -38746 238859 234293
4241 234293 -410721 20094 38251 106706 97162 280818 -275972 -541583 -205332 221547
4231 221547 505584 702877 221678 487229 189613 230797 -217545 -155925 -23679 -208078
4221 -208078 279987 383968 402841 733157 238709 36923 -272944 712159 286631 -314011
4211 -314011 -290532 -572726 -251297 346803 393992 497368 -92682 -669765 -1133132 -562662
4201 -562662 -280113 -245455 -308531 -358804 -126501 -162690 39184 227359 -84334 -463544
4191 -463544 -44178 -976184 -945897 -561111 -852998 -1137990 -1082535 -863425 -546430 -595141
4181 -595141 -541789 -670087 -791654 -554608 -363219 1890 57905 -258729 -332619 -271524
4171 -271524 -273196 -21437 -509004 141528 -77051 -325813 181618 575259 649603 183558
4161 183558 -340118 -46825 360084 13164 -323202 -188217 -129797 -193943 -80755 -189219
4151 -189219 364679 558440 -140594 -711640 85385 -356668 -712479 137008 -302927 -303883
4141 -303883 421024 -175579 128905 -159366 71651 174511 262313 -278895 -251840 -618104
4131 -618104 -45601 -33681 114190 478802 968015 780821 517099 229425 -440293 289316
4121 289316 531803 866977 899545 293791 1041012 303574 384644 130922 366734 454373
4111 454373 -91265 185102 728908 511815 -147067 349677 183692 -20952 47011 162803
4101 162803 45352 94987 -404423 -274296 -22480 35313 222564 28198 -377650 -596100
4091 -596100 -1393361 -872617 -112145 -29078 -349294 -207859 565017 639982 258104 73855
4081 73855 -37234 115742 549459 407586 -137790 -105643 -142018 158340 292050 482601
4071 482601 448118 158563 575715 536281 -58570 1868 57135 -306434 -544004 225690
4061 225690 -487025 -517574 377928 95410 520605 387820 101729 7605 156831 476559
4051 476559 -25156 -500599 440 179212 -150838 -231920 426395 400339 478555 654302
4041 654302 265850 188006 -180418 -109490 -30863 -420173 239700 1361 -514910 27588
4031 27588 59211 -238363 103065 -526722 -128621 155624 -579720 -71861 389834 59199
4021 59199 -249909 77101 243817 103974 -131745 68104 -141323 275693 -189313 -186881
4011 -186881 257194 83767 -336424 -397365 -184782 -115919 -81532 223017 -409502 -418699 -631235
4000 -631235 -450590 3434 112628 185296 87188 483472 89491 -421543 40726 -317918
3990 -317918 -234230 355188 43663 12880 144475 -442473 -189699 128902 331968 371416
3980 371416 332670 137626 96927 259648 23451 259572 517926 498561 335647 66264
3970 66264 15296 2499 -68825 -99448 -221881 50832 -270189 -110568 -194092 -597863 -89516
3959 -89516 558459 361515 -104186 -368132 -703058 -332120 -222810 -117171 -1024388 -663739
3949 -663739 138793 206440 148582 -257446 592060 760465 287866 -375522 -255429 -62242
3939 -62242 -533455 -763803 -173853 5758 -76424 -508377 -473826 -481983 -267795 -395944 -433749
3928 -433749 10314 -370534 -144171 708018 289773 -31700 203476 -104104 -563306 -478572
3918 -478572 -745195 -339845 84806 150185 -108210 79342 11418 -745732 19488 980924
3908 980924 1071588 521185 -108179 10347 -16869 93865 266075 -125864 -353376 -299912
3898 -299912 -725292 -938949 -398473 -487445 -375802 -246694 -284826 -95873 -360873 108752
3888 108752 69598 142983 53983 -401268 -34338 263578 340091 318747 336176 94567 -79781
3877 -79781 127866 169246 143454 48482 -244162 -513953 68159 791889 938514 464748
3867 464748 110010 215996 17402 175053 -18209 -531812 -492336 -240832 -359069 -413680
3857 -413680 -577419 -115640 228334 -435204 -564224 1863 -735499 -937001 -624506 -95109
3847 -95109 229323 -271962 358806 254192 427103 -373044 40380 464495 -35679 183874
3837 183874 -27367 -121855 -539497 -633114 -495324 -802176 -551652 -15390 -277517 177433
3827 177433 -10332 -281625 92779 493842 598306 24730 -226636 -499698 -900637 -242736
3817 -242736 -214795 -581587 -633232 -853341 -458641 -229484 16639 310999 -138352 -217857
3807 -217857 -265298 -298916 111407 859287 349660 342071 97578 -48457 -82948 539382 742554
3796 742554 554228 930379 1210597 681840 -322217 115496 491442 24582 186321 101189
3786 101189 -625824 -329245 135111 -454994 -654906 -721663 -727027 -372454 117187 490569
3776 490569 352439 -484436 -917941 -429595 -521338 -573756 -47998 118970 -134789 -169794
3766 -169794 -58724 332074 44008 439282 424307 289267 484274 381913 705953 1052960
3756 1052960 567939 656095 1022014 565859 291089 496723 -143947 250553 142785 -22954
3746 -22954 319664 -15951 312439 440267 271133 -211802 272189 1004443 642541 180968
3736 180968 -111368 -50242 -39845 262935 448516 799410 362684 -374628 -311641 -254864
3726 -254864 -1275531 -1056306 16670 501536 828831 404936 889488 922745 885312 640519
3716 640519 630242 269335 394419 665895 327430 791317 691427 114641 373163 715359
3706 715359 329930 395451 605741 40186 373849 777858 1017873 638745 521198 383249
3696 383249 611337 648383 586985 -190314 -351903 533042 1090789 1200211 855346 406597
3686 406597 195673 830384 1203847 751204 712896 503545 396906 170360 -349660 213405
3676 213405 687546 399315 -220106 271571 229902 93561 661206 824879 559573 995644
3666 995644 478532 197713 397835 458104 335125 -328693 -443245 -335035 9250 636223
3656 636223 264162 656287 997174 791637 718320 936130 1174040 638919 1059687 1372784
3646 1372784 534122 451532 1069710 1134405 512337 586428 797490 707136 521414 707182
3636 707182 924576 765784 541703 667796 400141 628018 1226739 1072821 800977 775983
3626 775983 946677 238152 257997 748284 1139986 1182600 786446 498065 563850 469625
3616 469625 307124 577666 -37820 -14310 426585 889846 859216 212421 -107429 603698
3606 603698 1177786 1005881 698467 1056096 1238439 804663 780384 1307412 1101357 1052289
3596 1052289 748512 249770 369785 693016 843695 572734 101309 -145537 -145111 112132
3586 112132 1059713 1321038 867294 961200 1001514 830984 899302 993978 1116893 568236
3576 568236 432111 505784 979741 705648 891012 797002 1445444 964478 757947 980659
3566 980659 389194 380259 466743 477307 689360 1075760 990787 1138584 1189657 1610739 1494476
3555 1494476 1317987 1121572 1014321 990044 971266 625070 683917 596882 -141897 654075
3545 654075 1454971 1238338 607564 793464 855711 466361 565166 200562 -340339 556130
3535 556130 967780 589878 771436 1168482 1035524 1165760 552206 277335 554751 953625
3525 953625 1056167 1331969 805804 711249 737675 880386 1234089 1005627 1042934 1032486
3515 1032486 1370791 1189244 550329 463296 940515 782763 1169967 1106643 1173066 1552865
3505 1552865 984913 992730 1008491 448603 1076419 1240668 1096875 589335 290139 937434
3495 937434 1586404 1030933 682028 895688 723552 1244972 1319740 954522 1082559 630468
3485 630468 564069 334992 774589 999794 1065326 1334770 1170894 1511852 1669689 716062
3475 716062 423466 923678 975238 889070 1110335 1030676 1058269 1230689 1250348 1458382 1310966
3464 1310966 1380965 1332698 1143621 1171009 1690519 1430657 1063329 889259 1102222 895436
3454 895436 368824 898937 1167582 1524839 1625638 1587687 1340982 1189064 811555 938651
3444 938651 1644500 1329235 1300218 1085957 1157705 1263512 1223293 780951 774896 1128797 1719660
3433 1719660 1478055 1033444 1162267 1056595 1584799 1702142 1500141 1128930 1322976 1419110
3423 1419110 1603547 1362607 1014197 663997 927739 1482247 1732868 1652867 1800554 1818551
3413 1818551 1736210 1514220 1233152 555558 331218 856009 1028535 727065 813596 1190107
3403 1190107 1636956 1521734 1010908 1366073 1272051 885263 1593068 1217608 1247921 1066391
3393 1066391 1199822 1120208 1238063 1854454 1732275 1760787 1119488 1371164 1020116 1135175
3383 1135175 1597435 1690981 2100027 2365383 1931115 1479741 1010257 1538051 1880280 2018006
3373 2018006 1645076 2307815 2007232 2159068 2250246 1604139 1478759 1660209 1371045 1789882
3363 1789882 1395274 1477871 1891082 1764623 1908685 2312053 2278366 1736150 1737591 1825522
3353 1825522 2498381 2803368 2862547 2590421 2756720 2080380 2036527 2090312 1556264 1295845
3343 1295845 1612434 1556390 1371668 1613958 2052412 1980223 2179567 1948302 1816955 2258029
3333 2258029 2207332 1451837 1888081 1941662 1773984 2086956 2605687 3114851 2674406 3095449
3323 3095449 3141794 2430486 2500507 2616103 2685286 2494025 2376717 2892356 3365319 3327536
3313 3327536 3415135 3370553 2792218 2482346 2576196 3037462 3051395 3152099 3599365 3566351
3303 3566351 3085252 3216465 3383176 3868157 3857106 4028248 3640446 3461805 3631836 4123222
3293 4123222 4589258 4807428 4749345 4412207 4144486 4370761 4408785 4405225 4547998 4809299
3283 4809299 5468433 5519004 5530476 5227067 5424534 5699739 6035309 5310101 5663608 5979671
3273 5979671 6169003 6111814 6090335 6314840 6887785 7054261 7380422 7847078 7762072 7484064
3263 7484064 6726841 7634594 8247496 7902465 7014933 7065009 8203064 8377220 8122118 8745610
3253 8745610 8748808 8859069 9666728 9243477 9056603 9203449 9317813 9904426 10221655 10120722
3243 10120722 9808687 10328423 11172999 11174662 11592911 11649794 11945003 12537624 13111901 13497521
3233 13497521 14001193 13916828 14189370 14858987 15803553 16601825 16914232 17476558 18401076 19137399
3223 19137399 19331136 20762337 21656164 22943125 23360963 24397858 25206549 25901226 26150486
3214 26150486 26809154 28029463 28345871 28586149 28051218 27844737 28118085 27458281 26353669
3205 26353669 25400051 24347868 23369354 21931434 20497664 19516786 18796219 18419052 17665779
3196 17665779 17461448 16869149 16254667 15397100 14595126 14310141 14150829 13544244 13487079 12781604
3186 12781604 12082470 12057191 11657259 11471655 11514584 11606193 11595441 12129419 11477323 11504449
3176 11504449 11173159 10707057 10666645 10633118 10256199 10457878 9860115 8692398 8288324 9107705
3166 9107705 8625935 8168432 7585544 7737209 7675904 7241033 6915175 7763843 6996925 6838937
3156 6838937 6657078 6200908 6873072 6651219 6548498 5923178 6492678 5813800 5738189 5661184
3146 5661184 5604243 5286279 5489570 5961070 5211153 4357043 4655778 4935342 5187134 5120593
3136 5120593 5453056 5175069 4893084 4471052 4431551 4490338 5050239 5144284 4884389 4608387
3126 4608387 4006936 4042767 3700794 3187085 3183503 3261120 3152286 3248923 3323635 3596049 4028667
3115 4028667 3908610 3577747 3633345 3550069 3347746 3489316 3159204 3122673 3613541 3593971
3105 3593971 3494991 2597639 1965363 2699005 3754456 3995205 3376486 3375030 3082526 2642137
3095 2642137 3110843 3063709 2992795 2781882 3325429 2886165 2679554 2486783 1887167 2389053
3085 2389053 2904720 2493096 2603250 2440384 2538883 2677119 3055317 3150450 3130761 2940177
3075 2940177 3203383 3263205 3220186 2604001 2176699 2767974 2196619 2800674 3343386 2815809
3065 2815809 2439456 2093030 1634842 2183034 2331885 2199990 2266325 2566098 2523039 2528664
3055 2528664 2394745 1779446 1477148 1737486 1706239 2248061 3049149 2825190 2730641 2844083
3045 2844083 2007409 2331983 2499515 1663267 1750160 1608737 1741066 2171980 1863368 1556284
3035 1556284 2033280 2052874 2505644 2490351 1553383 1218322 1804969 1604956 1825026 2086621
3025 2086621 1844292 1701953 2147392 2306270 1964215 1808344 1903659 2171767 2130461 1810621
3015 1810621 1368706 2083333 2267975 2063025 2269549 1646900 1972936 2109748 1562326 2261914
3005 2261914 1859502 1885422 1589245 1854935 1349257 1515538 1438750 1376870 1165014 1735569
2995 1735569 2124587 2004390 1900384 1801905 2124852 1512698 1550859 1406144 1373043 1413989
2985 1413989 1304379 1303316 1427219 1726361 1579934 1847438 2034410 1262574 1587867 1860325
2975 1860325 1944173 2254565 1973639 1745844 1801539 1992615 2167004 1933292 2239137 2012676
2965 2012676 2117641 1764283 1603262 1672749 1788815 1936714 1505413 1390350 2169853 1895148
2955 1895148 1445325 1837822 1613067 1498874 1780215 2696996 2569075 1716605 1863993 1953646
2945 1953646 2067013 2686837 2421514 2107931 1914801 2218733 2118359 1536970 1981124 2628309
2935 2628309 2503393 2790900 2417257 2344843 2650724 3027936 3516111 3339362 3181834 2361913
2925 2361913 2145526 2611653 2766787 2871633 3813307 3435455 3183881 3019972 2878561 2935438
2915 2935438 3142571 2622591 3413796 3760817 3492108 3925045 3977543 3962993 3712020 4475826
2905 4475826 4707626 4913314 5147064 4389602 4539872 4580088 4437957 4303167 5037104 5397493
2895 5397493 5262381 5714129 6000607 5587256 5568148 6066840 6370106 6332576 6275891 6439127
2885 6439127 6655146 6944891 7345061 7460174 7726155 7509666 7733665 7824408 7788573 8680367
2875 8680367 9031984 9068428 9378771 9554986 8819500 8862232 8730523 9621852 9959692 9364261
2865 9364261 9070620 9126766 9047306 8541024 8342396 8161688 8410358 8712119 7677799 7877441
2855 7877441 8588180 8301375 7934342 7799569 8135467 8990174 9256486 9653341 9905793 9655562
2845 9655562 9707177 10110218 9825075 10043126 10028393 10183669 9420841 8661753 9148502 8328045
2835 8328045 8439254 8488077 7592094 7496984 7752990 7194473 7005227 6682240 6234246 6714759
2825 6714759 7161614 6920540 7067256 7058255 6657131 6559233 6271405 6469878 6165271 6047910
2815 6047910 5875230 6227653 5994055 5330895 5248491 4771618 4351068 4284434 4052547 3939975
2805 3939975 3326196 3477497 3178660 3023891 2663014 2941829 2974331 2719885 2763852 2609726
2795 2609726 2847726 2325301 2851682 2299666 2164889 2224252 1943319 1977905 2202284 2262424
2785 2262424 2233202 1700487 1048032 1631143 2056788 1622712 1080186 1203527 983517 1125382
2775 1125382 2063472 1626582 1609854 1913232 1127706 754641 1302745 1637416 664033 184223
2765 184223 481420 572097 572037 635075 1304638 1187970 1225253 1216735 1170710 1473550 1452316 756799
2753 756799 996410 1005888 1036399 1438157 914257 689584 1086663 1025483 807518 610083
2743 610083 69512 -46233 645284 600623 85945 291825 634527 1209114 1107748 -75795
2733 -75795 -34189 97304 142109 -58336 368525 861849 538880 446287 370907 252449 647805
2722 647805 952566 426468 454634 340367 73675 272131 435678 140385 600966 643096
2712 643096 174333 176453 43590 220977 34831 -327742 -155169 -369397 195029 678988
2702 678988 521870 908355 -148950 542360 445348 325613 10109 -620059 242785 342756
2692 342756 -19357 314213 115141 462612 167828 6233 802727 -286459 -575278 -581584
2682 -581584 -304588 -504475 -526089 -273885 395525 572983 845977 1145057 989977 555933
2672 555933 458898 589767 769817 396455 473156 231645 706336 188177 -184403 -225735
2662 -225735 -173089 194381 316756 19082 -396005 -180091 -197084 -143414 -121964 -510991
2652 -510991 -818552 218516 842168 776808 -38522 120845 -52895 377652 764796 856540
2642 856540 484544 -81907 579743 245525 345389 -164723 -545811 -165263 432055 565256
2632 565256 239208 -143611 82113 -20335 159240 465661 -276523 -364910 -256616 -229605
2622 -229605 -158620 43786 103217 649624 654545 26403 211426 557956 587157 59535 -15394
2611 -15394 -491958 -622830 -419236 -106575 -98954 -758831 -158736 -24782 -63397 156080
2601 156080 -29877 -188633 523058 690264 116741 277350 377321 210123 784824 793281
2591 793281 563324 365173 670381 464462 -590231 -254587 -219454 -365632 -139020 -355835
2581 -355835 -361161 -428304 -521621 -417323 -394110 -679970 -1219824 -1157785 -593622 -468734 -573965
2570 -573965 -357966 -281373 -1121942 -628051 -1022817 -1487702 -793274 -503662 -625318 -795414
2560 -795414 -284371 -161771 416149 496974 -114078 -341792 213077 -500175 -752290 -264049
2550 -264049 -762230 27522 -255284 -609404 -559497 -209783 -225603 -71989 194674 92137
2540 92137 38003 -151719 -323816 153026 522967 401617 658188 -81620 171738 158943
2530 158943 -121455 -195909 165184 122793 -512126 -313066 -299924 149656 -214924 172584
2520 172584 -203663 -516527 512495 265984 -155679 314967 262504 -159453 -200342 -184523
2510 -184523 341436 -4071 -691581 -238781 144135 -262219 1602 218553 -474155 -958997
2500 -958997 -290999 -906307 -774373 -551603 -50219 547638 200784 -228230 -747384 -468002
2490 -468002 -22168 -72597 117457 -193434 3329 90787 85943 379460 63300 -30263 -70574
2479 -70574 -10521 -124255 20242 -51731 -95808 -310931 -27574 -212388 167097 183214 -255540
2468 -255540 170573 -16510 -451751 -835924 110192 -501182 -670890 -415521 149762 75498
2458 75498 50333 286145 -639119 -915968 -930952 -162902 -378562 -210901 202265 288515
2448 288515 646175 294651 -610687 -830935 -2272 285826 338443 -421219 -411125 271985
2438 271985 -196127 -302275 15324 901450 551939 -120822 -862415 -119028 -23601 -385753
2428 -385753 -200591 -586102 -630879 -478564 -732335 -457682 -183667 -98733 -167521 -31988
2418 -31988 270616 180570 592331 708873 179561 -123984 -134698 -873340 -800180 -345630
2408 -345630 -508526 -258248 -346997 -621081 -210496 683451 676074 137754 282775 -329095
2398 -329095 -357323 -493814 -1014563 -362716 -100141 -344324 -893616 -516135 -554634 -485754
2388 -485754 153824 275996 471058 748602 1080576 616439 319491 210350 534265 348732
2378 348732 229490 -165194 150817 910825 566237 648261 526423 479677 187567 -38524
2368 -38524 446070 235527 412846 276466 114513 -295826 -530968 476818 650651 356286
2358 356286 -136381 574036 242874 413211 -334117 -662193 376769 434210 198248 235629
2348 235629 341462 259724 218026 244850 148538 -190002 267806 335592 641559 356120 406631
2337 406631 402788 352626 324153 457485 667267 817947 324232 539901 294305 88914
2327 88914 -362921 -535211 -619712 -670865 -1133311 -557508 150050 287173 161389 147630
2317 147630 -52549 -575641 -465629 -319904 24827 -55106 495835 353222 -79607 -207011
2307 -207011 -34483 333318 113257 98755 556167 -44646 194238 -1328 -103818 -529935
2297 -529935 108317 186637 170334 397316 -399280 -445933 -311980 -107481 -184660 -336628
2287 -336628 -252830 -500115 -504698 -357987 163900 509707 370711 -161631 -310183 -690978
2277 -690978 -360435 247667 -23098 -496465 -571397 371336 18962 726991 607586 -401765
2267 -401765 -293633 331125 832702 898417 632420 522338 327457 533424 1473 -217571
2257 -217571 298550 -451390 -606832 189191 104635 388229 -17756 -388313 105880 424962
2247 424962 226453 1079877 508372 46477 138014 264384 414186 274425 1249742 996222
2237 996222 935907 659673 816734 902243 223339 809823 1313981 1016608 924039 881212
2227 881212 997412 257202 650065 759320 1210127 1020370 1164599 1427604 933952 480048
2217 480048 248692 351523 1105628 1371548 975094 981294 671744 221212 98588 264560
2207 264560 542103 242557 612815 751763 1024533 509659 411972 1250573 921079 165062
2197 165062 319813 536266 175516 449293 759509 1043569 1070291 754097 943126 1426010
2187 1426010 412741 825589 557803 128784 931643 865482 920918 1325550 1284812 824155
2177 824155 558535 941310 582673 -82031 310302 967738 958086 820659 1387908 1632567
2167 1632567 1983517 1863119 1438862 966245 1788799 1743642 1422220 2535433 2238988 2589286
2157 2589286 2415692 2177486 2143571 2173485 1765150 2328178 2325656 2486655 2673675 2633657
2147 2633657 2645453 2723281 2435998 1989029 2702213 3161498 3255863 2605924 3315846 3083604
2137 3083604 3642896 3779827 3656724 3798032 3755038 4131352 4579637 4912747 5076737 5178156
2127 5178156 4737374 5173085 5643830 5848418 5661608 6090347 6547747 6966801 7263837 7408596
2117 7408596 7411763 7991007 7767729 7796380 7787808 8234442 8170461 8315512 8847820 9277585 10337393
2106 10337393 10848488 10767662 11318241 11886901 12200496 12045732 12261619 12998172 13616880 14054695
2096 14054695 14923067 15572706 16373037 17272435 18187590 19583613 21136209 22875529 24411289
2087 24411289 26573222 29154549 31647103 34219383 37458995 41525766 47467180 53181796
2079 53181796 58141139 61617250 66432748 73169885 82226179 85470779 85082410 88314765
2071 88314765 96827381 95528252 83413234 72362224 62346375 53452313 45016951 37930560
2063 37930560 32092477 28155923 25095433 22970787 20338670 18503561 17483062 16849069
2055 16849069 15491567 14222092 13942228 12544544 12166052 10989053 9783594 9260180 8509296
2046 8509296 8475216 7766740 7451298 6752457 5783959 5189920 5405563 5064157 5386863 5189616
2036 5189616 4941609 4300581 3533353 3493379 3417074 3417668 2913329 2818815 3182495 3547364 3032835
2025 3032835 2462312 2544917 2396724 3028974 2685300 1950165 2284381 2406647 2493013 2092114
2015 2092114 1692755 1387463 1284085 1365258 2094708 1520367 1436094 1345481 545426 992760
2005 992760 845614 864965 543838 882183 1293391 1153618 816018 939150 1047194 1267562
1995 1267562 1099504 995323 805842 474941 802318 637174 957634 804255 -9323 181990
1985 181990 572346 768391 986733 955498 699629 1095527 539238 215350 707935 685359
1975 685359 1069811 900746 541120 767845 150019 167543 215222 -268961 -315595 -405126
1965 -405126 162912 191776 126648 912269 509385 87254 109574 146095 158474 -397736 -602407
1954 -602407 54715 742240 573310 788572 871597 -355238 -864391 -42612 -327228 -59309
1944 -59309 -326617 -72469 -42477 312188 541850 -52225 376363 1175202 400880 246837
1934 246837 301951 827269 820247 428920 -103187 483201 384595 -377042 120952 -167285
1924 -167285 -525196 30347 293878 538267 998463 663055 633196 32242 636728 284996
1914 284996 303619 226896 19880 29115 -24483 148402 237578 69230 446660 135507 -486539
1903 -486539 -72918 -245021 386735 62413 -70211 -326795 -699763 -356712 -209919 -380001
1893 -380001 -535749 -222638 501290 12803 -146274 -315219 -175713 565209 -22740 124156
1883 124156 -75638 -159562 92261 -267136 -739613 -481184 228271 306027 -468367 -874081
1873 -874081 -295472 -251879 -322166 270317 -81729 583121 338677 3479 -244923 -199865
1863 -199865 -247157 -493639 -160694 666159 524288 429244 343 -368878 -792180 -693813
1853 -693813 3760 -350117 -6375 -42276 26421 -366683 -597204 -954146 -152812 245248
1843 245248 293089 454175 366009 261693 -692490 -679615 126042 592351 77701 -164389
1833 -164389 -264843 -712087 -1119223 -887388 -649298 -541482 -779068 -467100 -201892 -153540
1823 -153540 239703 -529938 -396733 -874045 -1302519 -719884 -130748 -358417 -479518 -504324
1813 -504324 -631136 -14334 -50107 -407575 -486868 -212554 -90669 270398 73414 -378886
1803 -378886 -135743 93483 -53502 23313 -280672 427845 330871 561253 -46989 -299404
1793 -299404 104104 -22401 327763 164913 -14001 -183684 -759077 -285269 76689 130394
1783 130394 28645 -526771 81692 162700 136321 -797448 -743715 -421264 -249527 -482862
1773 -482862 -671545 -304566 -599877 -868676 -533635 -254962 -442559 -500099 -401238 -491562
1763 -491562 -350424 -67074 -340801 -613644 -221895 -722168 -1032243 -1137669 -1279709 -601491
1753 -601491 -35486 -439354 -389583 -439554 -495047 -682488 -55741 89615 -2436 -841866
1743 -841866 -432131 -433650 -110065 227226 -24551 59309 -717756 -442621 -344868 -221301
1733 -221301 -415482 -239295 218144 -329993 -811711 -637635 -115171 -146629 -540236 -327300
1723 -327300 -623503 -802078 -388032 -233270 -246447 -318320 -412783 -846364 -301055 -243088
1713 -243088 -654452 -947707 -719545 -118678 -38696 95567 -345500 -305307 -22069 310925
1703 310925 226770 -454792 -596760 295225 117554 43419 332120 120562 101356 -217480
1693 -217480 -677054 -467034 -307052 -321281 -411001 -358291 -281240 -724527 -639495 -957759 -195714
1682 -195714 -116078 -648029 -624592 -809995 -747715 -984751 -427631 -563048 -790502 -1093588
1672 -1093588 -574667 -460135 -834133 -341692 -506012 -1206006 -663547 -495886 111087 -214187
1662 -214187 -504368 -492368 -439010 -68560 -473715 -888637 -392572 -428910 80145 237176
1652 237176 227808 -3536 41437 -746276 -508801 89806 -253030 -72015 -174487 -133262
1642 -133262 263650 133451 -99857 -536592 -211253 -27524 -247453 -466684 -778118 151691
1632 151691 -683261 -303017 133349 -320025 -516226 -228571 -251041 -355562 -531151 -390707
1622 -390707 -788848 -492783 -314041 -214755 -395632 -553172 147455 -152375 -530159 -64153
1612 -64153 -85716 -431189 -266062 -290420 -284651 -352338 -477063 -377979 -507032 -490953 -591343
1601 -591343 -667069 -630406 -496326 -259154 -467979 -550919 -431059 -155592 -134306 -132261 -129349
1590 -129349 -138014 -138511 24456 177291 139352 582778 345043 12285 -449690 -674931 -454496
1579 -454496 -599507 -633901 -979481 -546153 -552917 -114617 -23244 -171388 195854 20260
1569 20260 296354 93888 -294053 -401560 260709 317112 -505827 -535422 -235312 194455
1559 194455 90342 -579668 -457271 -637563 -85466 477976 249874 -109095 41488 -68320
1549 -68320 -68588 246275 169726 -571145 -968212 -651288 -239333 -98583 -109541 72311 -132397
1538 -132397 367817 -309131 -479255 -431374 -360139 -7397 226502 230432 -385384 -570975
1528 -570975 -594848 -794481 -898543 -833339 -902654 -589584 -270798 334918 -57464 471081
1518 471081 324290 -373911 -620480 -632761 436227 554196 430484 443054 162929 -155
1508 -155 -566020 -946717 -673728 -101580 96264 -305923 -247028 -551089 -410275 576916
1498 576916 -174849 104420 -219697 -75919 -178807 -815834 -706220 -440288 -441160 42732
1488 42732 180613 -181448 -162215 -533181 5095 -31866 -34207 -114184 -114420 153159 298975
1477 298975 279537 500676 159798 272879 -100070 -292085 258780 653698 600505 -18964
1467 -18964 -195714 -300933 -325227 -568130 -82361 714903 332734 46104 61947 -336365
1457 -336365 -638499 -35467 -356083 37881 -533285 -936152 -497906 -244801 -411675 -1040568
1447 -1040568 -801858 69784 97723 449624 525610 144041 272520 723909 406331 -32080
1437 -32080 286752 227009 -51218 -239054 -236083 -135132 -161495 37787 -6960 -469406 -507753
1426 -507753 -365431 -95820 -108744 -5773 -286970 -464561 -210325 -516541 -509018 -260610
1416 -260610 -686552 -89916 -396008 -493852 -118376 -210803 -419227 -51048 349382 236970
1406 236970 423968 87011 30988 471502 626911 88476 -134454 -544172 -592428 -600957
1396 -600957 -515803 -661851 -286463 -660196 -618858 -14054 -60598 455147 399745 87456
1386 87456 14199 -213923 -433432 -44299 -39412 -60937 380964 182478 534972 115197 -299508
1375 -299508 -17965 210138 246075 42295 282156 -60712 -431111 -377170 -542457 -217653
1365 -217653 -211015 -659460 -655735 -618365 -108231 463328 259173 276976 656161 594956 437524
1354 437524 -100628 -272596 -550075 -630442 -122961 -132711 -385852 421373 309290 421988
1344 421988 59323 350780 454960 -235803 -79491 -243450 -715058 -592594 -75654 174734
1334 174734 -183001 -232537 -536319 -391287 -276430 -161933 -210663 -739415 -256684 25651
1324 25651 280984 21983 -779825 -658690 499390 668781 304637 550123 728146 340749
1314 340749 458715 135277 -516324 234982 -159789 -431329 -306634 -637793 -289600 -79755
1304 -79755 -413568 117992 -668355 -470163 -109631 92014 315454 134683 90256 -256628
1294 -256628 -910340 -1291164 -913232 -1111651 -1089368 -392810 25486 -489072 -774773 -860300
1284 -860300 -297889 -95874 -787406 -783687 -320715 -516053 -32150 16133 -382161 -207681
1274 -207681 -619687 -230780 -158914 -46525 157598 83409 471337 148819 -174355 -583867
1264 -583867 -845349 -826438 -630397 245801 606043 274884 -17560 -18714 -113188 591076
1254 591076 684996 -177727 -231714 -450107 -339725 -192732 208682 -453694 -95505 -71791
1244 -71791 280676 193750 -452389 -241268 -533 273521 416475 39918 -222028 -19498
1234 -19498 -8985 -106587 452318 722616 357089 334370 409103 -90049 -363922 -41080 -42769
1223 -42769 -558916 -213873 159302 395277 608862 207729 393795 235453 -637106 -458822
1213 -458822 159907 554907 156998 226286 495707 197935 -221480 -443641 -853155 -365303
1203 -365303 -244288 233735 976054 849364 178344 215708 94161 -722821 -241132 452504
1193 452504 512402 69131 527131 188230 317416 448468 156081 445649 511863 505887
1183 505887 42031 -15005 -125476 315364 15629 -435794 203629 -126110 -636127 -824269
1173 -824269 -567892 -801431 438265 346446 -112695 -553598 -378561 344469 513268 153194
1163 153194 -252509 68763 364170 -426201 -1016217 -321324 -327526 -634611 -735529 -13111
1153 -13111 265847 59648 174083 168245 252103 26244 -444078 -438335 -491492 -259060 -6313
1142 -6313 56943 -5861 180096 113068 54160 -480908 -459862 -624457 -981967 -139016 145159
1131 145159 -67474 -692692 -544713 759 -302737 -581987 -546188 -908676 -1116266 -594064
1121 -594064 342112 137242 375257 75302 -4070 182512 -170644 138317 509273 -1075699
1111 -1075699 -976227 198718 50504 -281845 -193236 304230 480503 364355 234909 -198165
1101 -198165 -576652 -604017 -524391 -81422 -121961 153632 187236 -178279 -394890 -365153 -766918
1090 -766918 -1208563 -441190 -373857 -847138 -677540 -548526 -339881 -208240 -374614 -272093
1080 -272093 -372478 108161 396675 -496332 -168904 -13066 229674 -449974 -491309 -590370
1070 -590370 -338169 130585 -193808 257987 -42033 178826 286524 -187575 -723923 -1071637
1060 -1071637 -1155319 -647693 74936 340984 -252970 -730776 -355483 -51109 8677 439235
1050 439235 191837 -213856 182913 -5692 -180183 -57901 211117 207491 -399895 -619126
1040 -619126 -698807 -30415 -286220 -173350 135125 -45814 433594 340162 709184 312636
1030 312636 164946 85916 27086 -173067 -437407 -567722 -172344 -79455 -478698 377177
1020 377177 404062 -62322 197257 296803 142347 -266115 -607677 -357014 235978 -198977
1010 -198977 -256128 250288 2020 93192 3672 40603 -93652 -490263 -121598 87929
1000 87929 890257 138784 -539430 -232507 120491 927007 481455 276810 112801 591000
990 591000 678517 182202 437232 352302 114699 458126 627999 81167 314775 -400519
980 -400519 78336 137800 287823 122067 98498 139129 -243523 -286254 -240219 55066 141626
969 141626 66073 59068 240074 474590 -77314 61960 440239 118058 112137 310013 367028
958 367028 259499 494740 -400825 -613907 35220 -249578 -468912 -386676 -61428 87523
948 87523 77334 259152 409774 97193 -426145 -8149 233902 513175 848055 432313
938 432313 424350 437400 345049 486000 -575496 -400775 -2372 415203 -303140 607710
928 607710 226113 -399754 -668355 31779 -359074 -313630 1481 -299467 739925 169447
918 169447 588258 796640 223088 -70730 -853876 -883246 -193846 91454 -55853 -294059
908 -294059 -22404 -611551 -608711 -41726 56728 323488 54042 14598 -372809 -995184 -639846
897 -639846 -629094 -445010 195717 197410 -415447 -415029 -496200 -125377 316694 -60557 -98675
886 -98675 158562 300653 565479 358298 515583 309798 73434 279172 -41974 -374895
876 -374895 -558466 -245814 -206156 -71354 -334631 -227007 207403 40122 95842 309173
866 309173 426041 -42967 -262846 -486129 -275163 370601 -35331 -765288 -436628 -250640
856 -250640 -288544 -295792 241807 282050 252927 913724 580357 594656 1057560 554875 510409
845 510409 557107 371562 391918 206129 101864 -192373 -184222 -288218 96345 -248598 -996847
834 -996847 -469463 -498562 -556745 227231 756183 181441 -181029 -622264 -343843 509849
824 509849 558328 499797 58072 104414 164159 317718 574284 700732 783825 53310 -70169
813 -70169 35039 316512 202175 180925 -181998 -325881 -251006 -1039091 -742861 -623430
803 -623430 -779885 -554669 -271018 424525 537494 216087 196644 303273 222387 -213155
793 -213155 -308689 365580 316162 161209 -29182 72479 368845 260636 447740 -77088
783 -77088 97909 438829 179487 -176579 -23629 147306 436663 710311 259915 125087
773 125087 -142808 -325165 94323 306673 -63451 -426699 -202151 -90428 -86539 -225726
763 -225726 72391 -67711 186571 708044 123560 -89686 -57745 331130 298589 188105
753 188105 634591 604987 -60031 -331736 171358 -23495 -457433 175012 541482 373229
743 373229 359743 -18831 -5802 389622 -88737 -389815 -389183 -206823 702683 624507 430855
732 430855 520285 279760 705333 396007 -440453 -804954 -213192 -345873 357857 487322
722 487322 785222 -144750 -44916 121011 -177328 532380 647806 525246 512874 76960
712 76960 -154285 -318744 -245687 120578 -216324 -222743 -359015 459516 745640 455951 407841
701 407841 332417 301960 639318 297697 503877 44890 74754 -198869 138367 971540
691 971540 673634 342895 248030 19786 261410 797315 192119 -314290 249498 -260500
681 -260500 -5646 36417 -148948 -564449 -533056 429450 679011 -690454 -588643 -542081
671 -542081 -539605 -266394 96188 -420581 -477983 -294229 -257612 658722 552210 430591 551624
660 551624 676584 -107572 377089 397872 247527 418020 408120 188069 378617 54255
650 54255 -140692 661082 691479 525357 675284 895110 253500 -18652 -45832 118491
640 118491 413575 115708 742775 931810 -44631 -381394 -382920 248276 397581 29425
630 29425 -203831 -277945 85874 477073 720152 -158547 369667 754728 180466 -40306
620 -40306 44232 -873461 -272752 837736 882808 -294162 -539618 -271649 -206209 -12855
610 -12855 -244356 -215792 -499023 96317 455706 -503083 -206983 340476 495471 520016
600 520016 323394 24120 161741 539140 914139 1364790 954070 225630 104382 136746
590 136746 -11426 146312 -287068 -498387 -215803 40512 207409 415098 175054 -565376
580 -565376 -577977 -403142 -519483 -369062 -46707 16472 -274232 48160 251860 282980
570 282980 115459 468153 645403 235881 199281 637489 652224 444815 220580 24335
560 24335 149563 -45090 -45989 450305 517042 830313 356843 227802 567426 -369189 -259491
549 -259491 -204778 365806 -15129 402610 293249 516273 701097 95267 778136 107768
539 107768 -204051 104419 277478 8683 -346391 110094 291932 156515 264346 456590
529 456590 103770 -300756 -145119 226246 618226 199841 23756 -113795 170072 425108
519 425108 355054 225134 -101786 -396852 540300 517947 504771 503622 583120 816672 112421
508 112421 -168804 3571 -124111 450886 727431 839543 589272 133272 -200024 55915
498 55915 -43524 -627078 -371903 -723274 -677961 -172312 -275922 415227 158350 124999 -140354
487 -140354 -869921 -514801 25029 184107 -57418 842520 630941 645659 -81372 -590242
477 -590242 -386550 -131664 -26257 786837 694324 205606 616424 96203 1755 120328
467 120328 -652419 -1032406 -783478 -327894 -309045 -285460 107261 -179396 -163079 -311270
457 -311270 113140 319477 140749 164655 575634 710969 -375235 -177671 -142119 284617
447 284617 53602 -68462 205074 -57780 207108 -130809 33754 6403 -280169 -259218
437 -259218 -162023 -308052 -424862 -101373 -290070 100479 331465 -71384 -411610 83557
427 83557 449906 599888 1051775 330385 702152 498313 281343 415635 456904 965
417 965 287090 461107 -84531 -306718 131065 675627 631867 374531 22278 -265354 -656834
406 -656834 -338389 -607767 -749462 -452252 -53025 -392321 -116559 480216 227311 347819
396 347819 478388 -221232 207382 192916 184413 558381 427463 40699 -62861 1868 -11077
385 -11077 -394034 -417700 -16718 -288341 -360381 -449781 235664 311551 183605 373698 513242
374 513242 241795 290743 357607 -259775 -468590 -403311 419236 597629 366376 -419039
364 -419039 -746362 -683771 -371096 55540 -477698 -390967 -150619 -365618 -507345 -328341
354 -328341 253520 1054656 643839 876370 240079 -342698 -485171 -272931 -205783 53677
344 53677 -153701 68643 445529 411900 275384 15188 -86334 -344336 -20268 -95244
334 -95244 -162691 -493986 -990268 -548013 -244390 125319 232906 -53425 163013 99863
324 99863 -204873 -57532 76685 -225461 -241287 -61005 -3597 -286605 9472 83750 225628
313 225628 317351 453102 -114312 21718 -120274 249564 -133822 124418 1009466 601586
303 601586 -173374 233156 80014 -593740 142511 66242 -126820 -625671 -323558 164060
293 164060 -629171 -752689 -330242 -518873 -189248 -456027 -678991 -1042092 -145224 784877
283 784877 485578 477440 512981 266517 233993 397097 523884 198888 -100820 -560783 -795047
272 -795047 -758706 -579236 -241859 55033 -104380 -293484 -204581 -237044 -205029 -312956 189739
261 189739 28807 381707 139912 -547866 -294299 -102341 -982968 -207784 -349662 -1012710
251 -1012710 -1133349 -822479 -435477 -166354 14076 -494441 272714 730080 380989 99311
241 99311 -36611 303664 -76252 -417189 333590 77908 -464714 -296197 210279 -216742
231 -216742 414791 750322 424453 -222689 -457489 99505 -330674 -31336 619391 142072
221 142072 -184697 152361 362836 76438 -44262 -253051 -133148 -128540 129313 521619
211 521619 468989 605251 -301141 -991562 -32229 -13623 -386649 -554898 -433545 -148175
201 -148175 -49603 -111737 101493 -452272 -539503 -295266 -13906 401440 476074 616627 223292
190 223292 -37255 -249341 -241610 -387838 -34653 -541274 -901872 -174078 11691 134381
180 134381 -52987 198004 424278 304384 319995 458920 623294 690862 762826 346777
170 346777 443180 213226 66989 -542596 -559959 308609 125371 -170765 -392065 -543292
160 -543292 84550 -295730 -514922 -875142 -577180 100534 258726 48339 -572852 -54150
150 -54150 -140333 -177040 106692 135898 -827448 -628712 -221070 -55226 181753 143500 206598
139 206598 -160258 360885 459220 84322 -103860 -47573 -430746 -642539 -329957 -155193
129 -155193 229739 430880 568642 579811 530173 111057 111672 461032 67667 7743 -276954
118 -276954 -482926 -506869 -358925 -84716 -241165 -203718 -46131 -234171 -482308 -342590
108 -342590 -451458 -419475 -143836 -302694 -458122 -544604 -93191 -279772 86933 613286
98 613286 -256089 -247687 120993 101480 286776 614922 514635 56471 -293817 -64707 192046
87 192046 -164357 -395235 -315608 -164761 -664468 -392722 -16273 99460 -146774 -416512
77 -416512 -287057 -145721 -178067 -359650 39081 -111507 210439 704493 342840 299605
67 299605 468675 75754 -240227 -638365 -377712 -104406 162960 -311223 -670350 -248616
57 -248616 84633 -376948 -109323 -453910 -404436 99882 21065 326214 265176 -75173 -131160
46 -131160 -385357 -220455 64481 357510 475561 -103638 -62642 12934 340284 98470
36 98470 -223189 33491 64291 -349019 65059 -18158 -22693 -10819 -251122 -186387 -236114
25 -236114 98266 599165 -183237 -626965 -393960 -288167 85393 -64723 -123247 -5137
15 -5137 -8464 -415193 -300307 -150819 -170899 239002 434531 31118 -67030 -75578 -279514
4 -279514 -158626 239514 -204363 45326
0 45326
$$ Imaginary data points
##PAGE= N=2
##DATA TABLE= (X++(I..I)), XYDATA
16383 -584344 -230769 -462939 -724498 -1063397 -724121 -381853 -177513 -347286 -430540 -522691
16373 -522691 -367642 -439992 -754494 -478537 -248852 -33279 256895 -329996 -887639 -1164123
16363 -1164123 -816319 -478635 -752217 -512377 -648444 -58314 249817 37628 -183464
16354 -183464 -168220 -251533 -327689 -211151 234921 225702 -12033 3802 299587 129059 196228
16343 196228 48886 43888 -308426 100311 -94326 -298371 -516053 -337379 125202 240903
16333 240903 193977 -139971 -342768 -618243 -352008 506135 737765 925807 908473 759059
16323 759059 1101576 1280446 860206 568633 333237 366321 253488 366353 292610 138286
16313 138286 405843 77319 338803 573615 136980 356737 832879 722321 533904 688528
16303 688528 551884 613653 654521 439610 719699 712908 977847 1265198 1197406 973648
16293 973648 821200 920989 998462 770656 979725 992337 1094683 985951 957172 1142489
16283 1142489 894597 1062264 1168703 1047082 842598 815182 1103104 1139447 1136867 994233
16273 994233 870569 781586 1049859 1414680 1521159 1027901 1339306 1870628 2028828 1648488
16263 1648488 1668845 1908709 1444516 1291509 1766595 746022 1172337 1596244 1307743
16254 1307743 1629518 981932 896818 902976 1420201 1330418 975586 1679577 1695091 1182477
16244 1182477 851935 1450063 1554685 1596165 1567319 1782315 1268153 1481302 1567560 1601284
16234 1601284 2050339 1980601 966058 764579 1631996 1901943 1992016 1624247 1616995 1585863
16224 1585863 1801104 2294555 1915466 2220225 2531265 2250195 2186867 2183450 2034238 1871143
16214 1871143 1773137 2037433 2179495 1887309 1593223 1588073 1916404 1779446 1590304 1736312
16204 1736312 2577231 2079951 2151216 2046599 1948434 2142758 2630383 2420205 1828200 1367074
16194 1367074 1718227 2115884 2664827 2172533 2176861 2495408 2456307 2182336 2105598 2181729
16184 2181729 2162827 1972053 1333122 1539692 1635790 1721511 2244366 2270369 2385927 2355340
16174 2355340 1782650 1572338 1781024 2210028 1987062 1910494 2161961 2453958 2258849 2333599
16164 2333599 2684430 2235018 1689750 1741425 2326321 2477723 2003570 1803652 1587009 1793693
16154 1793693 2170967 2796875 2874434 2602736 2383101 2116148 2362937 2963268 2753567 2366879
16144 2366879 2820873 2479215 3000252 2917867 2546302 2095510 2227173 2202876 2334060 2463878
16134 2463878 2453177 2242776 1792399 2071743 2574215 2489259 2052751 2079391 2336580 2079447
16124 2079447 2753933 3260671 2896760 2863229 3003855 2739414 2756756 3045944 2764219 2621705
16114 2621705 2715893 1531060 1528492 2279963 2489492 2475425 2552837 3408833 2578266 2725759
16104 2725759 2626494 2650719 2006770 2199114 1601223 2339207 2981581 2760135 2527420 2464501
16094 2464501 2539755 2762428 2941573 2198320 2540784 2763630 3088800 2595929 1975426 1853258
16084 1853258 2131431 3065819 2880394 2603690 2045685 2138436 2053256 2425718 2423681 2395897
16074 2395897 2925250 2885517 2334908 1842371 1326561 1926433 2732215 2203129 2017276 1758391
16064 1758391 1280279 2025233 2437682 2838698 2172402 1724832 2346341 2174920 2458378
16055 2458378 3003171 2475748 1886394 2472980 2863087 3179710 3215493 2964823 2413994 2336623
16045 2336623 2792601 2981208 2299195 1915609 1891546 2302638 2204022 2096517 1782027 1821985
16035 1821985 2000537 1858437 2090058 2183945 1944890 2401792 2143230 2441165 2506228 2524971
16025 2524971 1845447 1831885 2107194 2076282 2094628 2555378 2754717 2981807 2401969 2105478
16015 2105478 2152193 2821435 3032512 2493944 2492386 2266521 2395457 2738862 2970530 2693140
16005 2693140 2994918 2691567 2331065 2510509 2840767 2257656 2189480 2595493 2992475 3030345
15995 3030345 2576626 2168497 2304516 2494789 2736204 2603810 2336367 2611331 2666256 2835206
15985 2835206 2829811 3334026 3355150 3255731 3763586 2987617 2121603 2294090 2419064 2357090
15975 2357090 2383255 2650023 2814286 2671479 2666524 3090262 3264788 3363627 2543599 2407265
15965 2407265 2664091 1970103 2264061 2206930 2339475 1846465 2334705 2490368 2001169 1806254
15955 1806254 2048018 1917619 1948757 1938371 1889561 2089031 2369291 1857886 1881941 1545565
15945 1545565 2005844 2484967 2500747 3009828 2976709 3450866 2806658 1953835 2073295 2346393
15935 2346393 2063611 2617995 2206528 1075017 1070815 1919454 2362845 2355534 2156027 1585979
15925 1585979 2642698 2765767 2224313 2330215 2137579 1695531 1708674 2299575 2294238 2634778
15915 2634778 2829655 2943133 2628202 2689635 2988348 2606550 1982793 2518679 2748151 2555862
15905 2555862 2238816 2411005 2281683 2224838 2041401 2024463 1905074 2618142 2414715 2376168
15895 2376168 2547770 2384256 2525499 2405455 2639295 2746662 2313058 2132163 2594016
15886 2594016 2238208 2486573 2630858 2034953 2066560 1962402 2031349 2641551 2098512 1608462
$$ [...]
##END NTUPLES=NMR SPECTRUM
##END=
