##TITLE=1H_CG-1187-A
 DMSO
 8 sc, 
 24.6.2024
##JCAMPDX= 6.0         $$ Bruker NMR JCAMP-DX V2.0
##DATA TYPE= NMR SPECTRUM
##DATA CLASS= NTUPLES
##ORIGIN= UXNMR, Bruker Analytische Messtechnik GmbH
##OWNER= root
$$ XWIN-NMR		Version 3.5
$$ Mon Jun 24 15:33:06 2024 Russian Standard Time (UT+4h)  she@DPX200
##.OBSERVE FREQUENCY= 200.1309
##.OBSERVE NUCLEUS= ^1H
##.ACQUISITION MODE= SIMULTANEOUS
##.ACQUISITION SCHEME= undefined
##.AVERAGES= 8
##.DIGITISER RES= 18
##SPECTROMETER/DATA SYSTEM= spect
##.PULSE SEQUENCE= zg30
##.SOLVENT NAME= DMSO
##.SHIFT REFERENCE= (INTERNAL, DMSO, 0, 13.5169)
##AUDIT TRAIL= $$ (NUMBER, WHEN, WHO, WHERE, WHAT)
$$ ##TITLE= Audit trail, XWIN-NMR		Version 3.5
$$ ##JCAMPDX= 5.01
$$ ##ORIGIN= Bruker BioSpin GmbH
$$ ##OWNER= she
$$ F:/spectra/data/she/nmr/H-F/1/pdata/1/auditp.txt
$$ ##AUDIT TRAIL=  $$ (NUMBER, WHEN, WHO, WHERE, WHAT)
(   1,<2024-06-24 15:31:52.48 +0400>,<she>,<DPX200>,
      <created by zg, POWCHK disabled, PULCHK disabled
       configuration hash MD5:
       00 E9 B6 7A A2 85 ED C7 34 08 36 98 17 FE 4E 26
       data hash MD5: 16K
       1B A4 B5 FB 88 EB A4 74 EC 54 F3 5F 7A C8 E1 62>)
(   2,<2024-06-24 15:32:15.71 +0400>,<she>,<DPX200>,
      <Start of raw data processing
       efp BC_mod = 2 LB = 0.24 FT_mod = 6 PKNL = 1 PHC0 = -25316.75 PHC1 = 9.58748 SI = 16K 
       data hash MD5: 16K
       E7 9F 49 C2 5D E7 4E E1 3F CA 23 94 5A 74 91 8D>)
(   3,<2024-06-24 15:32:20.32 +0400>,<she>,<DPX200>,
      <abs ABSG = 5 
       data hash MD5: 16K
       9A EB D1 51 8D FD 8F 4E 19 DC 93 23 13 CE AD FF>)
$$ ##END=
$$ 
$$ hash MD5
$$ 90 59 B7 EA 0D FB 22 50 DA 2F 4D F7 5F AB 5A BE
##$RELAX= 
##$RELAX= 
##$RELAX= 
##$RELAX= 
##$RELAX= 
##$RELAX= 
$$ Bruker specific parameters
$$ --------------------------
##$DU= <F:/spectra>
##$EXPNO= 1
##$NAME= <H-F>
##$PROCNO= 1
##$TYPE= <nmr>
##$USER= <she>
##$AMP= (0..31)
100 100 100 100 100 100 100 100 100 100 100 100 100 100 100 100 100 100 
100 100 100 100 100 100 100 100 100 100 100 100 100 100 
##$AQSEQ= 0
##$AQ_mod= 1
##$AUNM= <au_zg>
##$AUTOPOS= <>
##$BF1= 200.13
##$BF2= 200.13
##$BF3= 200.13
##$BF4= 200.13
##$BF5= 200.13
##$BF6= 200.13
##$BF7= 200.13
##$BF8= 200.13
##$BYTORDA= 1
##$CFDGTYP= 0
##$CFRGTYP= 5
##$CHEMSTR= <none>
##$CNST= (0..31)
1 1 145 1 1 1 1 1 1 1 1 1 1 1 1 1 1 1 1 1 1 1 1 1 1 1 1 1 1 1 1 1 
##$CPDPRG= <>
##$CPDPRG1= <>
##$CPDPRG2= <>
##$CPDPRG3= <>
##$CPDPRG4= <mlev>
##$CPDPRG5= <mlev>
##$CPDPRG6= <mlev>
##$CPDPRG7= <mlev>
##$CPDPRG8= <mlev>
##$CPDPRGB= <>
##$CPDPRGT= <>
##$D= (0..31)
0 1.2 0 0 0 0 0 0 0 0.06 0 0.03 0 0 0 0 0.0002 0 0 0 0 0 0 0 0 0 0 0 0 
0 0 0 
##$DATE= 1719228711
##$DBL= (0..7)
120 120 120 120 120 120 120 120 
##$DBP= (0..7)
150 150 150 150 150 150 150 150 
##$DBP07= 0
##$DBPNAM0= <>
##$DBPNAM1= <>
##$DBPNAM2= <>
##$DBPNAM3= <>
##$DBPNAM4= <>
##$DBPNAM5= <>
##$DBPNAM6= <>
##$DBPNAM7= <>
##$DBPOAL= (0..7)
0.5 0.5 0.5 0.5 0.5 0.5 0.5 0.5 
##$DBPOFFS= (0..7)
0 0 0 0 0 0 0 0 
##$DE= 6
##$DECBNUC= <off>
##$DECIM= 32
##$DECNUC= <off>
$$ [...]
##$SUBNAM3= <"">
##$SUBNAM4= <"">
##$SUBNAM5= <"">
##$SUBNAM6= <"">
##$SUBNAM7= <"">
##$SUBNAM8= <"">
##$SUBNAM9= <"">
##$SW= 18.0517689322627
##$SWIBOX= (0..15)
0 0 2 0 0 0 0 0 0 0 0 0 0 0 0 0 
##$SW_h= 3612.71676300578
##$TD= 16384
##$TD0= 1
##$TE= 0
##$TE2= 300
##$TE3= 300
##$TEG= 300
##$TL= (0..7)
0 120 120 120 120 120 120 120 
##$TP= (0..7)
150 150 150 150 150 150 150 150 
##$TP07= 0
##$TPNAME0= <>
##$TPNAME1= <>
##$TPNAME2= <>
##$TPNAME3= <>
##$TPNAME4= <>
##$TPNAME5= <>
##$TPNAME6= <>
##$TPNAME7= <>
##$TPOAL= (0..7)
0.5 0.5 0.5 0.5 0.5 0.5 0.5 0.5 
##$TPOFFS= (0..7)
0 0 0 0 0 0 0 0 
##$TUNHIN= 0
##$TUNHOUT= 0
##$TUNXOUT= 0
##$USERA1= <user>
##$USERA2= <user>
##$USERA3= <user>
##$USERA4= <user>
##$USERA5= <user>
##$V9= 5
##$VALIST= <valist>
##$VCLIST= <CCCCCCCCCCCCCCC>
##$VD= 0
##$VDLIST= <DDDDDDDDDDDDDDD>
##$VPLIST= <PPPPPPPPPPPPPPP>
##$VTLIST= <TTTTTTTTTTTTTTT>
##$WBST= 1024
##$WBSW= 4
##$XGAIN= (0..3)
0 0 0 0 
##$XL= 0
##$YL= 0
##$YMAX_a= 93366
##$YMIN_a= -186738
##$ZGOPTNS= <>
##$ZL1= 120
##$ZL2= 120
##$ZL3= 120
##$ZL4= 120
##$ABSF1= 13.45625
##$ABSF2= -4.595599
##$ABSG= 5
##$ABSL= 3
##$ALPHA= 0
##$AQORDER= 0
##$ASSFAC= 0
##$ASSFACI= 0
##$ASSFACX= 0
##$ASSWID= 0
##$AUNMP= <proc_1d>
##$AZFE= 0.1
##$AZFW= 0.1
##$BCFW= 0
##$BC_mod= 2
##$BYTORDP= 0
##$COROFFS= 0
##$CY= -3
##$DATMOD= 1
##$DC= 0
##$DFILT= <>
##$DTYPP= 0
##$F1P= 0
##$F2P= 0
##$FCOR= 1
##$FTSIZE= 16384
##$FT_mod= 6
##$GAMMA= 0
##$GB= 0
##$INTBC= 1
##$INTSCL= 3.70164e-10
##$ISEN= 128
##$LB= 0.24
##$LEV0= 0
##$LPBIN= 0
##$MAXI= 10000
##$MC2= 0
##$MEAN= 0
##$ME_mod= 0
##$MI= 1.114404
##$NCOEF= 0
##$NC_proc= -7
##$NLEV= 6
##$NOISF1= 3.799351
##$NOISF2= 2.8
##$NSP= 0
##$NTH_PI= 0
##$NZP= 0
##$OFFSET= 13.51685
##$PC= 1
##$PHC0= -25316.75
##$PHC1= 9.58748
##$PH_mod= 1
##$PKNL= yes
##$PPARMOD= 0
##$PSCAL= 0
##$PSIGN= 0
##$REVERSE= no
##$SF= 200.130001231189
##$SI= 16384
##$SIGF1= 3
##$SIGF2= 2
##$SINO= 5.538805
##$SIOLD= 16384
##$SREGLST= <1H.CDCl3>
##$SSB= 0
##$STSI= 16384
##$STSR= 0
##$SW_p= 3612.71676300577
##$SYMM= 0
##$S_DEV= 0
##$TDeff= 16384
##$TDoff= 0
##$TI= <>
##$TILT= no
##$TM1= 0
##$TM2= 0
##$TOPLEV= 0
##$USERP1= <user>
##$USERP2= <user>
##$USERP3= <user>
##$USERP4= <user>
##$USERP5= <user>
##$WDW= 1
##$XDIM= 16384
##$YMAX_p= 457237914
##$YMIN_p= -473546
$$ End of Bruker specific parameters
$$ ---------------------------------
##NTUPLES= NMR SPECTRUM
##VAR_NAME=  FREQUENCY,     SPECTRUM/REAL,   SPECTRUM/IMAG
##SYMBOL=    X,             R,               I
##VAR_TYPE=  INDEPENDENT,   DEPENDENT,       DEPENDENT
##VAR_FORM=  AFFN,          ASDF,            ASDF
##VAR_DIM=   16384,         16384,           16384
##UNITS=     HZ,            ARBITRARY UNITS, ARBITRARY UNITS
##FACTOR=    0.220516191357247, 1,           1
##FIRST=     2705.12730150241, 0,            0
##LAST=      -907.589461503362, 0,           0
##MIN=       -907.589461503362, -473546,     0
##MAX=       2705.12730150241, 457237914,    0
$$ Real data points
##PAGE= N=1
##DATA TABLE= (X++(R..R)), XYDATA
$$ [...]
10270b43051j79487J65260J51848R9199P8472j01483L4181K1469L0430m3550M807
10259A8095q1433J26057j19351R6768M851O0472L3364j49814k1006m9156o3427
10248a44580J11381p0882L8138K2139k9057p9773o3754K41380K8701j96330j35209
10237b77846K3400J50879l151k33599K58088O5855J10919r5793J1385k2528k3645
10226c6036m5164J54636J3821k44768K23157K6128r0385p9756m1692j1208j53270
10215b84537k5744K61009J33148j25203q3790K4209K4645K46503R6847j57018
10205A10069j85139K793J38261l09374P7764J64611M2195L0259q6909k39283O465
10194b48288J91301o1342J45038j31389r4470m2602J23904p8246r8403O1289N5741
$$ plain form
10270 -243051 -422538 -257278 -105430 -6231 72241 -29242 4939 26408 56838 13288 18095
10259 18095 -63338 62719 -56632 40136 44987 105459 138823 -10991 -31997 -81153 -144580
10248 -144580 -33199 -104081 -65943 -43804 -72861 -152634 -216388 24992 53693 -142637 -277846
10237 -277846 -254446 -103567 -106718 -340317 -82229 -16374 94545 -1248 10137 -12391 -36036
10226 -36036 -81200 73436 87257 -157511 65646 91774 1389 -78367 -120059 -131267 -284537
10215 -284537 -310281 -49272 83876 -41327 -125117 -100908 -76263 170240 267087 110069
10205 110069 -75070 -72277 65984 -243390 -165626 -1015 41180 71439 -15470 -254753 -248288
10194 -248288 -56987 -118329 26709 -104680 -199150 -241752 -117848 -196094 -294497 -233208 -177467
10183a77467J41917N5439j8248j17265j9962l6275J1685J10254j4889j38636j40386
10172c43833Q1711J75559K2895l0964j05394j9152M4245n6685M8062O5949o2264
10161a79871L3632J56029j73078r5340n7971L66856J19416J507n010j25126j35450
10150i4406L2508L6791J79015P8432l4520j72040k51730l3109K18001K29447j62363
10139B6026p5767P881l74981K34255K77210m2548J79877j80287k88713j50904
10129c87951J88348J57349j83563p018K9692Q1476J44015p8125j54039k6976P2780
10118a64012o6866O6417J63335p1617O7065J18991k9052M0752M73N7919k98786
10107a15381k0869k4862k2311p1404L71808q1757l52290K36163p0979P3163O7884
$$ plain form
10183 -177467 -35550 19889 1641 -115624 -135586 -171861 -160176 -49922 -64811 -203447 -343833
10172 -343833 -262122 -86563 -63668 -94632 -200026 -219178 -174933 -231618 -183556 -117607 -179871
10161 -179871 -146239 9790 -163288 -258628 -316599 50257 169673 171180 166170 41044 -94406
10150 -94406 -61898 -25107 153908 232340 197820 25780 -225950 -259059 -41058 188389 26026
10139 26026 -49741 -41860 -416841 -182586 94624 52076 231953 51666 -237047 -387951
10129 -387951 -199603 -42254 -225817 -232835 -203143 -121667 22348 -55777 -209816 -236792 -164012
10118 -164012 -230878 -164461 -1126 -72743 -5678 113313 84261 125013 125486 183405 -115381
10107 -115381 -136250 -161112 -183423 -254827 116981 35224 -317066 -80903 -151882 -78719 -10835
10096a0835p0142k223O9608J80431j11488k51527j74137J72493q6309K34872j0346
10085e9603k8943J62798j40370o6902j07473l79J0046J38241o620p310j3931j03412
10073b23858J23848K11776o5749l7770J92968K6249L5188j30924k37522M2540
10063f3254J14942j84855j55917K11487Q2879R3374j45752L6079J89271j69212
10053I042j9901K11471O3410k43609j84039J09625j76081M0524N706p0453J26443
10042a27862P9068r1535J67728Q3492j43925J04394r7780P1512K37807j30361
10032A52538j60134J91816j58692n2786J55159J50095n7343k24453Q4833J65571
10022B46604j92963k59344J3128M6315O7690K3655K14232j45131Q937K8032o2504
$$ plain form
10096 -10835 -80977 -83200 -13592 166839 55351 -196176 -370313 -197820 -284129 -49257 -59603
10085 -59603 -88546 74252 -66118 -133020 -240493 -240872 -230826 -92585 -99205 -106515 -120446 -223858
10073 -223858 -100010 111766 46017 8247 201215 227464 262652 131728 -105794 -63254
10063 -63254 51688 -133167 -289084 -77597 5282 98656 -47096 -11017 178254 9042
10053 9042 -10859 200612 264022 20413 -163626 -54001 -230082 -189558 -183852 -254305 -127862
10042 -127862 -48794 -140329 27399 110891 -33034 71360 -26420 45092 282899 152538
10032 152538 -7596 184220 25528 -27258 127901 277996 220653 -3800 81033 246604
10022 246604 53641 -205703 -192575 -146260 -78570 -54915 159317 14186 23123 51155 -11349
10011a1349j31848q7006q2341K49324P2565j97880N5259l3359p5794R6650J03651
10000d2128O9781p3942k5255O0964R1097o4574j08836J61756J3663P1223k07710
9989e3961r6362O0800n1795j28796Q0872J21115Q8752q7666q2806o2068Q9525
9978a22390L1457K507K6947n3010m1427m7144L0467J17695J35725j56908k61016
9967c37097J65871j47673L9888n0601J70689J96251k17831M7358R3773p1259l2016
9956a42647n4753P3883K52806r3930j17571q1033J56284o7150R8058J24364j75145
9945b6834R8286j351m5798k96440K1933P0995J28448j56918o5802J24720r3998
9934b42759Q716O6171J37695k64770K16477N0559O6748L6499l1208Q1342j11495
$$ plain form
10011 -11349 -143197 -230203 -312544 -63220 9345 -188535 -133276 -166635 -242429 -145779 -42128
10000 -42128 27653 -46289 -71544 -10580 80517 15943 -92893 68863 82526 153749 -53961
9989 -53961 -150323 -89523 -141318 -270114 -189242 -68127 20625 -67041 -149847 -211915 -122390
9978 -122390 -90933 -88426 -61479 -114489 -155916 -203060 -172593 -54898 80827 -76081 -337097
9967 -337097 -171226 -318899 -279011 -329612 -158923 37328 -180503 -133145 -39372 -110631 -142647
9956 -142647 -197400 -123517 129289 35359 -82212 -163245 -6961 -74111 23947 148311 -26834
9945 -26834 71452 70101 24303 -272137 -250204 -179209 -50761 -207679 -273481 -148761 -242759
9934 -242759 -234043 -167872 -30177 -294947 -78470 -27911 38837 75336 44128 125470 13975
9923A3975N628J15752k96249p0631K22222O9125k54738j09578K78331J58136j02568
9912B9405o9262k28431J94690J55509l8207Q264q9315Q0086l5097j42393p3371
9901b08122K0628k2060j32287N2517K54385N8569J9040k59958j19996K21315J56398
9890D0429j84004J32706K121J7386j27912k102J16726M9687j43929m4693K02788
9879E9203j34981P2954j68284L033Q5430J05966J322j19854j15286j0374J50182
9868g0689J35151j36683j90998Q2613L06715q4555q7415P0164N1578j97490L5692
9857h5917P0925l6085j48196J76123Q148k12235K1532K6187l3008K0636L77772
9846A85882j99782J964J46848K7341L9839m5593M9840j26460k22197J3681j1147
$$ plain form
9923 13975 19603 135355 -160894 -231525 -9303 59822 -194916 -304494 -26163 131973 29405
9912 29405 -39857 -268288 -73598 81911 43704 51968 -37347 42739 7642 -134751 -208122
9901 -208122 -187494 -209554 -341841 -289324 -34939 23630 42670 -217288 -337284 -115969 40429
9890 40429 -143575 -10869 -8748 8638 -119274 -121376 -4650 45037 -98892 -143585 59203
9879 59203 -75778 -2824 -171108 -168075 -82645 23321 24643 -95211 -210497 -220871 -70689
9868 -70689 64462 -72221 -263219 -180606 126109 41554 -45861 24303 75881 -121609 -85917
9857 -85917 -14992 -51077 -199273 -23150 -15002 -227237 -205705 -179518 -212526 -191890 185882
9846 185882 -13900 -11936 134912 162253 202092 156499 206339 79879 -142318 -128637 -139784
9835a39784K1308k0907p9927l8885K14419q9054o4378O8823R5222N6955k2112
9824A680q7023o4160J61842j82912n1520o5543J74649j36868R2946J57584n4024
9813e3349j111k43259J52883k28963J51820K87576j87628Q9815j2806p5010R6007
9802b4025J40031L9587l26872j6364J50349R7181n6387O7670J84961j34784j74734
9791e3387J74780j69831M5087j15925L1455J33126l2068Q7426K0046j28186O3845
9780E6368l4135K7056j13835k03861L85323K7705j6641j86056j65289O7224J71299
9769A5158M9907j78671R580Q7693p5977L076j1328O7150J64285k48544Q2302M9220
9757A3851j31650m3855o7019L3591J18847P7572o7403J09711n0719k74344q2056
$$ plain form
9835 -139784 -118476 -139383 -219310 -258195 -43776 -132830 -197208 -128385 -33163 23792 1680
9824 1680 -85343 -149503 12339 -170573 -222093 -287636 -112987 -249855 -156909 675 -53349
9813 -53349 -54460 -297719 -144836 -373799 -221979 65597 -122031 -32216 -45022 -120032 -24025
9802 -24025 116006 155593 -171279 -187643 -37294 59887 3500 71170 256131 121347 -53387
9791 -53387 121393 -48438 -3351 -119276 -87821 45305 13237 100663 120709 -7477 56368
9780 56368 22233 49289 -64546 -268407 116916 144621 127980 -58076 -223365 -156141 15158
9769 15158 65065 -113606 -104026 -16333 -92310 -89234 -100562 -33412 130873 -117671 -35369 13851
9757 13851 -117799 -161654 -228673 -195082 -76235 1337 -66066 43645 -7074 -281418 -363474
9746c63474O6169J92964m9698m8337R3521N4873R630R0716o3074k185J08426M8083
9734A37614j33972k81116K29540j7353K5418j70118n6253l1959L02531J28694
9724A33026m4436M6333j76022r6349P8113M4433j49106r0006J28314J89119j22768
9713e9349l01475J96758K66906m5652r3190j54586O9063m313m4312j8792O4181
9702a24761J44547j55533K1636m9935k6621J89462r331k6163n5794J41414J54485
9691B03406n1366r0000j10911j34171n2798J8460L2075J8439J29856Q5630q8089
9680c9469j11786L1745L08329j30579k0023j60789n3374J01201k3738j94866K14816
9669g8533M8745j9854k516K18556j18708k86727J0461j760J35928j03595O0O250
$$ plain form
9746 -363474 -297305 -104341 -154039 -202376 -108855 -53982 -44352 46364 -16710 -18895 89531 137614
9734 137614 3642 -277474 -47934 -65287 -39869 -209987 -266240 -298199 4332 133026
9724 133026 88590 134923 -41099 -137448 -59335 -14902 -164008 -254014 -125700 63419 -59349
9713 -59349 -360824 -164066 102840 57188 -36002 -190588 -121525 -125838 -170150 -188942 -124761
9702 -124761 19786 -135747 -114111 -164046 -190667 -1205 -10536 -36699 -92493 48921 203406
9691 203406 152040 62040 -48871 -183042 -235840 -217380 -185305 -166866 -37010 48620 -39469
9680 -39469 -151255 -119510 188819 58240 38217 -122572 -175946 -74745 -98483 -293349 -78533
9669 -78533 -29788 -49642 -52158 166398 47690 -239037 -228576 -230336 -94408 -198003 -197943 -191693
9657a91693j02714J40586N584R543P8222j85486O2479p1224J7134J20191k9006
9646a46384R0995K8300j03234K2302p4169K5310j52193J37319M9639K1804j02852
9635b03163J4485J65209J57899j93711j82649j26746K10856L475p7191R9049M9254
9624h3233L0763J28149J2031o7061J3516J18932K39563j97977J19091m8557j92558
9613G2659L1480J6931j55182n9443J09340O2454P2653L029m1777M2877J35850
9602B90871k17653l6513j34166N2181N6752j12979O1296Q617P7575J45269p1769
9591A19481k21643m8319L17385j34712k85409J89783q44L536Q1474j75022J48395
9580e895J79743K8289q4773L0094o149p5807N0339j0730k0888M9454L2827Q939
$$ plain form
9657 -191693 -294407 -153821 -148237 -138694 -60472 -245958 -183479 -254703 -237569 -117378 -146384
9646 -146384 -55389 -27089 -130323 -108021 -182190 -156880 -309073 -171754 -122115 -100311 -203163
9635 -203163 -188678 -23469 134430 -59281 -241930 -368676 -157820 -154345 -231536 -132487 -83233
9624 -83233 -52470 75679 87710 20649 34165 153097 392660 194683 313774 265217 72659
9613 72659 104139 121070 -34112 -93555 15785 78239 150892 153921 112144 155021 290871
9602 290871 73218 36705 -97461 -45280 11472 -101507 -40211 -31594 45981 191250 119481
9591 119481 -102162 -150481 166904 32192 -253217 -63434 -64278 -60742 20732 -154290 -5895
9580 -5895 173848 202137 117364 147458 141309 65502 115841 105111 84223 133677 166504 175443
9568A75443k00361J1267K34808k25332k74070J13639Q904O5261P9283m6771J55979
9557I8050L9084k2472o9136j05197j22404L19364O8162j54796M2954m7188k00614
9546a54193L3205J04689J72600m7284r0060k4034m4730P256J15211j71564J96589
9535I7685m7755O0573M4537m3040p6144n0594Q2263j3330j22229R8033J34005
9524A64004j63050P5042k43707n210J15333N337K1075m8140K32725P4033j59580
9513F7862j78064J37850j17921J40222Q4462j03756p7817M6250R1253n0669j50942
9502a11270K5248o6472J59405K9397j6364R7134L7277K7962o7152o5412l3512
9491A6241j21622L5606J49735j41417J37055l9323J62769j28579j3525R2176j11958
$$ plain form
9568 175443 -24918 -13651 221157 -4175 -278245 -164606 -155702 -90441 -11158 -57929 98050
9557 98050 137134 114662 45526 -59671 -182075 137289 205451 50655 93609 46421 -154193
9546 -154193 -120988 -16299 156301 109017 18957 -5077 -49807 -42551 72660 -98904 97685
9535 97685 49930 110503 155040 112000 35856 -14738 67525 54195 -68034 29999 164004
9524 164004 954 75996 -167711 -172921 -57588 -52251 -31176 -79316 153409 227442 67862
9513 67862 -110202 27648 -90273 49949 134411 30655 -47162 -912 90341 39672 -111270
9502 -111270 -86022 -152494 6911 36308 19944 117078 154355 182317 115165 49753 16241
9491 16241 -105381 -69775 79960 -61457 75598 36275 199044 70465 56940 149116 37158
9480C7158K2398j1209j0127K07211k8166r8598n9763N7197j00519n9990R8337
9469E3929L09958k52060k1045l03512o8705Q1466J02576R365r6102O0110J6191
9458a07829J24994L6776j53551r2848N5879J02083k7354J20367r6569j7035r7575
9447a52662J82251K99863k88912j0709J2762J04662K2104j23033k37366J76606
9437a4434K15938p9955l21337M8649M2677J14091Q4214j8630O755n7645l782m5070
9425b8529k5317K005J09733J74272q0377j60447j06779j15270J00705K28427l8570
9414E9853j2031J36273q557j42080K230n313O575R0088K24080k57608o1713Q0693
9402A12490n7271M1914J4936j5398l1302n261J2019K39832j30857R6810j54545
$$ plain form
9480 37158 59556 48347 38220 245431 217265 118667 58904 116101 15582 -44408 53929
9469 53929 363887 111827 90782 -212730 -281435 -199969 -97393 -88028 -184130 -124020 -107829
9458 -107829 17165 53941 -99610 -192458 -136579 -34496 -61850 58517 -38052 -55087 -152662
9447 -152662 29589 329452 40540 29831 42593 147255 169359 46326 -191040 -14434
9437 -14434 201504 121549 -199788 -151139 -108462 5629 89843 71213 77968 20323 16541 -28529
9425 -28529 -53846 -51841 57892 232164 151787 -8660 -115439 -230709 -130004 98423 59853
9414 59853 47822 184095 175538 33458 35688 30375 36950 127038 351118 93510 31797 112490
9402 112490 55219 97133 112069 96671 65369 60108 72127 311959 181102 277912 123367
9391A23367J26557j45942N8593J00190k18535q236l3462K69834k11735r5498q7462
9380a22329o2391J34551J84211j63777j18784j05167K64347J68613K35053k10107
9370B04220n5358o9829J02193Q725Q3543p1195k59036K77567M2602L0268p1245
9359B22455O6019m3811K13227j42499J70945K50162Q2070o4906m39361j52032
9349A62269M7122R7323k12878m0609Q1343o4930n4478J4075o9885l0172O4533
9338f287m203m18L0096j63410R0694J47693j18593p4223O7353J25169j50565R3496
9326C6802K1432j10083o9570K0408J9436N5878K7968j3507l3458J89337P5585
9315B20228J120l67376P0030J53452J10707j9282k6281o1760N7863J31412j10842
$$ plain form
9391 123367 249924 103982 162575 262765 44230 35994 2532 272366 60631 -34867 -122329
9380 -122329 -184720 -50169 134042 -29735 -148519 -253686 10661 179274 414327 204220
9370 204220 148862 79033 181226 189951 273494 202299 -56737 220830 263432 293700 222455
9359 222455 288474 244663 457890 315391 486336 736498 818568 753662 314301 162269
9349 162269 209391 306714 93836 53227 134570 69640 15162 29237 -40648 -70820 -6287
9338 -6287 -10490 -10908 19188 -144222 -53528 94165 -24428 -98651 -31298 93871 -56694 36802
9326 36802 58234 -51849 -121419 -101011 -81575 -25697 2271 -11236 -44694 144643 220228
9315 220228 221348 -146028 -75998 77454 188161 168879 142598 80838 138701 270113 159271
9304A59271k79043n501K76207J46642j15830o7559n4264O2081k25450j49447J31344
9293a21549P8499Q68K39055J37543l08814J96077j923j29147O87J42046j15351
9282A17991j35111j01595j7424P595N0587Q7223j08401R0118J39886P3435J05473
9271C09777p3105j34204n3498q155k35701m4649J22182j6371N0788j70721j05430
9260c59087K40108O1261O5055p9696R0417O3444L9090N7858n7738k55020j1242
9249a45550P486K37957P4599k29059P0555l9402j05788o0828N9243O5908J43655
9238G8776K7034L7366l5875K9845k5484k18590J95117L8336L134O590j11419P78
9226B5608L5948m1641L231j27391K33613J27138k55449r7234l8628M1588J50556
$$ plain form
9304 159271 -119772 -125273 150934 297576 181746 114187 59923 122004 -103446 -252893 -121549
9293 -121549 -43050 -42182 196873 334416 25602 221679 219756 90609 91296 233342 117991
9282 117991 -17120 -118715 -136139 -128544 -77957 9266 -99135 -9017 130869 204304 309777
9271 309777 236672 102468 48970 40815 -194886 -239535 -117353 -133724 -82936 -253657 -359087
9260 -359087 -118979 -57718 7337 -72359 18058 81502 120592 178450 120712 -134308 -145550
9249 -145550 -138064 99893 174492 -54567 15988 -23414 -129202 -190030 -130787 -64879 78776
9238 78776 105810 143176 107301 137146 111662 -106928 88189 126525 129659 136249 24830 25608
9226 25608 61556 19915 23146 -104245 129368 256506 1057 -96177 -134805 -93217 57339
9215E7339j23780j69902J33300J09319k2192O8437q1343M7990j596m4917j641
9204b8986J1263R7997r6301j53453j12471L5376R0097K2067n9756K71833Q999
9193H6665j06373J39524l8471j1535J64011l3670j49347M4634m447J288J03458
9182A95737r401N2269j42809p9354j51962L5180M6442M1327M9429n2257p2643
9171h8042Q1746l182k9159L7378O4447J38268p9406n4961l0518r6425k24559K13014
9159g1399K1392J19371J09105J84067p0011k6512j21499k26048N7966j63123L62474
9148A75783J21943j33937j09328L6892R322M0809j78486R4144p777n4692J63309
9137A57982N4323k74818p7524J03063N2429J38780l431j99570k0070K7496j33949
$$ plain form
9215 57339 -66441 -236343 -103043 6276 -15916 52521 -28822 19168 17572 -27345 -28986
9204 -28986 -17723 80274 -16027 -169480 -281951 -246575 -156478 -134411 -194167 77666 86665
9193 86665 -19708 119816 81345 69810 233821 200151 50804 95438 90991 92279 195737
9182 195737 186336 238605 95796 16442 -135520 -100340 -53898 -12571 36858 -15399 -88042
9171 -88042 -6296 -9478 -38637 -1259 63188 201456 122050 67089 36571 -59854 -284413 -71399
9159 -71399 -50007 69364 178469 362536 292525 266013 144514 -81534 -23568 -186691 175783
9148 175783 297726 163789 54461 91353 100675 141484 -37002 57142 49365 -5327 157982
9137 157982 212305 -62513 -140037 -36974 15455 154235 150804 -48766 -68836 -41340 -175289
9126a75289R0046J74910l0732n3213P0285P1660L9330r3104m0697J28911o6595
9115A15512j23131j57448K276L18115p6655q6519K3795k22596L01966K10313k33987
9104G1641k15011r6316K12858p7663N1879L32585o5413j62715M7834L26927K3034
9093D49640j40028j14524m8165j21694K697n7773r3238J45950n3193q1093P5913
9082c5508K89745l06577j56054J39796n0306J12250R3549J4836J75921j62016
9072A15636k48085j92739J74142J47661P8436J845J50402l5984j58996N9099q7665
9061C752k57167R2296K87449J50662J860j47001j34606N7725o9934O4258P7051
9050A26345l207n2268j50420K4885j8169J21933O1317J39907j76336j95541J17131
$$ plain form
9126 -175289 -85243 89667 58935 5722 76007 147667 186997 93893 53196 182107 115512
9115 115512 -7619 -165067 -162791 155324 78669 -7850 15945 -206651 95315 305628 71641
9104 71641 -143370 -239686 -26828 -104491 -52612 279973 214560 51845 99679 426606 449640
9093 449640 309612 195088 146923 25229 27926 -29847 -123085 22865 -30328 -111421 -35508
9082 -35508 254237 -52340 -208394 -68598 -118904 -6654 86895 101731 277652 115636
9072 115636 -132449 -325188 -151046 -3385 75051 76896 227298 191314 32318 91417 3752
9061 3752 -253415 -161119 126330 276992 278852 131851 -2755 54970 -14964 49294 126345
9050 126345 123138 70870 -79550 -54665 -72834 49099 110416 250323 73987 -121554 -4423
9039d423J01138Q3357O8369k3008l9514R1191J9331P8431K1622j63666j06790
9028A26038j33807j16454J18029l8694N1365J55472q8119o1073j07622J72684
9018G7819l9536K6587o693O5351r1070J1823P4164k40934O8340k1015m049J2991
9006f6222n7362Q3431R7784j11689J31922l8702m7452K30463J85848j22619k32679
8995E2723j31785o7197Q990N7564M43735q3422n627j81186k16673K37551m704
8984A09969Q4174n8674j3005j2005n9737J3567k1721J9485O1767k6418Q4146l7094
8972A44454J9732J07904j12115k0189k8902J04088p2887j03633J97853o6041R9169
8961B69433q188l2812j3107L7753J1195P1048p0205p3336R6596l651J5364j38447
$$ plain form
9039 -4423 96715 180072 248441 225433 185919 277110 296441 374872 396494 232828 126038
9028 126038 -7769 -124223 -6194 -44888 6477 161949 73830 12757 -94865 77819
9018 77819 38283 64870 58177 123528 32458 44281 118445 -122489 -54149 -75164 -79213 -66222
9006 -66222 -123584 -40153 57631 -54058 77864 39162 -8290 222173 408021 285402 52723
8995 52723 -79062 -146259 -137269 -79705 364030 280608 274981 93795 -122878 114673 109969
8984 109969 194143 135469 122464 110459 50722 64289 42568 62053 123820 97402 181548 144454
8972 144454 164186 272090 159975 139786 110884 214972 142085 38452 236305 170264 269433
8961 269433 261245 228433 215326 253079 264274 335322 265117 191781 288377 284726 300090 161643
8949A61643j15759o7937J36565N8656J62282k93305K1129L06654L2126m8427K1311
8938C74938p4750k45752O7030l3987J52846J19710r2774m7936J8869j34195j15253
8927a1254K94624J09956k07910l5837J6090M5825k6705L6194r1168k8103O453
8916A08165P3200O0979J65739P8581k10817j5741J46307k27047j63999J97005
8906B12372k7683K79511k17575j72809Q5183R9305n7074k36988J99551J62422
8896C26215j81040m0701R2801J81662q1575J5528Q8440m2084q1932N8443o921
8885C28836k39584m4929O9490j03018P231J4789L1505O8589m2181j70476R6486
8874A6738J95027k13630J48305K22104j41401J11696P7169n5114j71017j39864
$$ plain form
8949 161643 45884 -22053 114512 173168 335450 42145 63274 369928 402054 353627 374938
8938 374938 300188 54436 121466 87479 240325 360035 267261 219325 238194 103999 -11254
8927 -11254 283370 393326 185416 149579 165669 211494 184789 220983 129815 101712 108165
8916 108165 181365 242344 408083 486664 275847 260106 406413 179366 15367 212372
8906 212372 184689 464200 246625 73816 158999 258304 201230 -35758 163793 326215
8896 326215 145175 104474 197275 378937 297362 312890 401330 359246 277314 335757 328836
8885 328836 89252 44323 113813 10795 18026 32815 64320 132909 90728 -79748 16738
8874 16738 211765 -1865 146440 368544 227143 338839 416008 360894 189877 50013
8864E0013J30735q0858K1063M2146J39319l7604j92169O668J47362K03322M6270
8853D76267j96716j17282J99917k05001j87236k8681J36903K98947k1771j05261
8843B50086j15804M5431l6359m2053P6710M7812l0627J09286o4433j80563k4022
8832C5464K07739M8204m9896J6849M7259j56739j28410J26317O8149l7289o5486
8821A12161j50575K16053o6242k2407J11655j04646l0964m4670n9306l6528J77296
8810A01827j01722k5316J73912R2316m5134q452J50107N6614L5271O802j42828
8799B93397m48112J25698K37429J5827p7581p222K81780k47371L4762o2706k1066
8788A24835L11732k72697J0230k3038N8140m7399m6635L7475o1498J11684J07017
$$ plain form
8864 50013 180748 99890 120953 163099 302418 264814 72645 79313 226675 429997 476267
8853 476267 279551 162269 362186 157185 -30051 -58732 78171 377118 355347 250086
8843 250086 134282 179713 143354 101301 178011 225823 195196 304482 240049 59486 35464
8832 35464 243203 291407 241511 258360 305619 148880 20470 146787 214936 177647 112161
8821 112161 -38414 177639 111397 88990 200645 95999 65035 20365 -38941 -75469 101827
8810 101827 105 -25211 148701 241017 195883 187431 337538 394152 429423 436225 293397
8799 293397 -154715 -29017 208412 224239 146658 139436 421216 173845 208607 145901 124835
8788 124835 436567 163870 174100 151062 209202 161803 115168 152643 91145 202829 309846
8777C09846J6372j12392l7099P4821j9199J06033J9087R3492J02991j58667j95281
8766B00004p7971J90894K50932N200k71390n7986J45788o3120m1925n918j76999
8755I7509J68110j46809M2404K7469j46050J6188R7500j9240K34687J06231k07585
8744B70414r3415K95800j28611k69490j54114N583P5365L10031n8668j81602J79778
8733B51071j39108P9007L7194k314J67744n2093J09986k8544j18196p6778k62888
8722c4919J02019K85604N1165o7347j28779k01246K37636l1023j24854M8993j6197
8711A21052L8103L9860J81371r4916O647J38817J09135k2888n6865P3790r4931
8700D39175j16529l1121K5526J7083j42171L935L42941Q6544r3552k3129j03234
$$ plain form
8777 309846 326218 213826 176727 251548 232349 338382 357469 450961 553952 395285 200004
8766 200004 122033 312927 563859 569059 297669 239683 385471 322351 280426 274508 97509
8755 97509 265619 118810 161214 188683 42633 58821 156321 137081 371768 477999 270414
8744 270414 176999 472799 344188 74698 -79416 -73833 1532 311563 252895 71293 251071
8733 251071 111963 190970 228164 225850 393594 341501 451487 422943 304747 227969 -34919
8722 -34919 67100 352704 403869 336522 207743 6497 244133 213110 88256 137249 121052
8711 121052 159155 199015 380386 285470 292117 430934 540069 517181 460316 534106 439175
8700 439175 322646 291525 317051 334134 191963 195898 538839 625383 531831 508702 405468
8689D05468J40868j50817k54951J35857m3278M6418J01948R5246M2809J98009
8679G17577l3526l07149n0871N2835o9081r920J56882J31536q7830P482J31689
8668F39624n7923k19960J0565o0564J87257o880P2964j53690L7803l7682p5478
8657C36036K214K48662l5621m7599P2894j77210n009j3263n3248L24833N523j41886
8645E16326j97022o5821J48137j32315K30223O5417o8614j3750r7953p6613J12446
8634D20461J7615M3652K9251r8081j92449J114K70130J00006k51717l2385j00289
8623B07308Q2507J94318J39380j22364M12636j8501j74067q2790J07301k77468
8613D68260Q5844J16078q7856o9018R8032J16507j35327p1788J27759p127J28062
$$ plain form
8689 405468 546336 395519 140568 276425 233147 279565 381513 476759 519568 717577
8679 717577 684051 376902 326031 378866 309785 299865 456747 588283 500453 507935 639624
8668 639624 581701 361741 372306 311742 498999 492119 565083 411393 449196 411514 336036
8657 336036 338250 586912 551291 503692 576586 399376 394367 381104 327856 652689 658212 516326
8645 516326 319304 253483 401620 269305 499528 564945 496331 482581 384628 308015 420461
8634 420461 438076 481728 510979 412898 220449 221563 491693 591699 339982 307597 207308
8623 207308 289815 484133 623513 501149 913785 895284 721217 638427 745728 468260
8613 468260 554104 670182 582326 513308 611340 727847 592520 520732 648491 641364 769426
8602G69426k6825l03181j7709M8614K94161L4761O9987J36637o794j19685N9577
8591I38969M9498l35547p933K979J16456K37870j04341k7795K3760L9462K11476
8580A144854k41046j05285Q6435j6899K75963j1806k89630m21746K00897K7603
8570F49340Q2922p3977R6443j02576k17484J45873J02558O3447m1336j18632K56871
8559H43449j23602K93490n0616j98424O9854O5853q2728J202J35395j58731n2643
8548G42499J68175L0545j75457n5139J07480J04264o087K9l04264K66997J59148
8537A038190j86655J84836l19805Q519P5705k44575J92211O9482l7282j27221
8527F53405O8470p3157P8669j42434p3724O6142N7493J03580j19551j2170l4293
$$ plain form
8602 769426 742601 439420 421711 470325 764486 799247 869234 1005871 999077 879392 938969
8591 938969 988467 652920 644987 647966 764422 1002292 897951 870156 893916 933378 1144854
8580 1144854 903808 798523 884958 868059 1144022 1132216 842586 420840 621737 649340
8570 649340 732262 658285 754728 652152 434668 580541 683099 746546 705210 586578 843449
8559 843449 719847 1013337 962721 764297 834151 900004 817276 818478 953873 795142 742499
8548 742499 910674 941219 765762 710623 818103 922367 916280 916309 612045 879042 1038190
8537 1038190 851535 1036371 716566 725085 800790 556215 748426 817908 780626 653405
8527 653405 721875 648718 727387 584953 511229 577371 634864 738444 618893 606723 572430
8516E72430r511o7249J16346j9052J87924Q5714j63165k5977J00196K04791j70413
8505H12034M136K26366n931K4730j3592m26539Q78o352J03036M49J3881K10485
8493I43581q3314o2303p8448K4886p1950Q9810O1567J33381n776q1722j96059
8482F73653P2639L47399J4426k7872m2344q3705o2370J52165j15838j11083K36265
8471A053335J18635R4397J84318j99782j90943J3753r9452J24775J9369j81341
8461I37064k03225M6865J52658J05395r9869M4948K28081p8570L5598N7875K8084
8450A254904j45901j34195O0236J58455j20692J95053j4020j19729M4304Q1096
8440A259511J43706k19189j74180J38445K10118k8420j58973K40957l6911n7802
$$ plain form
8516 572430 562919 495670 612016 592964 780888 866602 703437 677460 777656 982447 812034
8505 812034 816170 1042536 1036605 1061335 1047743 621204 622082 615730 718766 719215 733096 943581
8493 943581 860267 797964 719516 744402 672452 762262 823829 957210 951434 869712 673653
8482 673653 746292 1093691 1108117 1080245 1037901 954196 891826 1043991 928153 817070 1053335
8471 1053335 1171970 1266367 1450685 1250903 1059960 1073713 974261 1099036 1118405 937064
8461 937064 733839 780704 933362 1038757 938888 983836 1211917 1133347 1168945 1226820 1254904
8450 1254904 1109003 974808 1035044 1193499 1072807 1267860 1253840 1134111 1178415 1259511
8440 1259511 1403217 1184028 1009848 1148293 1358411 1329991 1171018 1411975 1375064 1317262
8430A317262M1086N8131l3551n4657q979J88270r4249P2601J90337l9269O9600
8419A706582k02430L4497j80256o0075m8517J08516L03321j59448J40893L9605
8409A682688L0944K39826q8584Q6434J51536k05115k36505l478J83705J0388p7965
8398A773874J64145j11492P637P6880L72560J3433j5112j57434k01942J79255
8388B101804J3718M5137N8818K69768j35288m2156K84207K25633q6280j73751
8378B561610n4758K89762J15452k22725J42818j65019J54858K70433m1350o2846
8368B988235j69186L6016K25499M9273l1890j9063Q570Q3368Q7482P0696O9480
8357C398480L9671m5333J49290J76434j6204Q2917r6661l5171K19965m4695m0526
$$ plain form
8430 1317262 1358348 1416479 1382928 1328271 1319292 1507562 1413313 1485914 1676251 1636982 1706582
8419 1706582 1504152 1538649 1358393 1298318 1249801 1358317 1661638 1502190 1643083 1682688
8409 1682688 1713632 1953458 1864874 1951308 2102844 1897729 1661224 1657746 1841451 1851839 1773874
8398 1773874 1938019 1826527 1834164 1911044 2283604 2297037 2281925 2124491 1922549 2101804
8388 2101804 2115522 2160659 2219477 2489245 2353957 2311801 2596008 2821641 2735361 2561610
8378 2561610 2506852 2796614 2912066 2689341 2832159 2667140 2821998 3092431 3051081 2988235
8368 2988235 2819049 2855065 3080564 3129837 3097947 3078884 3087454 3170822 3258304 3329000 3398480
8357 3398480 3438151 3392818 3542108 3718542 3702338 3785255 3688594 3653423 3873388 3828693 3788167
8346C788167M27948J59202k6683n5180J24802O7596Q0614K17112K06116M8764
8336E038458R2983L82020J62457j3293N5465O4125L69964j70207L1560K41461
8326F254993K15952L92807M04078M70468J39076L3135K08973L84085K81575M23084
8316I208226J29712L20200M23983K96284O08511N56418L51524O53601Q08411O05208
8306A3962078M72376P76398R29042P01178O07217O57948R65126R95131O04837
8297B0671331O03241L38791K12446K59439J83945L92772J77913K08403L28922
8288B3377203J15289M71295M08137L01304Q59503R23349N14091R69357R16014
8279B8855542Q89486R91164J091652P89594P48190O90129J84009P0177l08974
$$ plain form
8346 3788167 4216115 4375317 4348634 4293454 4418256 4485852 4566466 4783578 4989694 5038458
8336 5038458 5131441 5513461 5675918 5662625 5718090 5782215 6152179 5981972 6013532 6254993
8326 6254993 6470945 6863752 7267830 7738298 7877374 7910509 8119482 8503567 8785142 9208226
8316 9208226 9337938 9658138 10082121 10378405 10986916 11543334 11894858 12548459 13356870 13962078
8306 13962078 14434454 15210852 16139894 16841072 17448289 18106237 19071363 20066494 20671331
8297 20671331 21274572 21613363 21825809 22085248 22269193 22661965 22839878 23048281 23377203
8288 23377203 23492492 23963787 24371924 24673228 25532731 26456080 26970171 27939528 28855542
8279 28855542 29745028 30736192 31827844 32617438 33365628 34055757 34239766 34309943 34000969
8270C4000969o38174m42642p91575q53641r07038r05243q23263p15886n13184
8261B7410323p34065n58291o01687P2698j36529j22424j9613J60315q5309j72034
8251B5213384j22262k45682m02514p07622n24327o52229o53185p98695j071983
8242B0034885r13665q16399o61372q05677j005701o59640p54361o08453l59416
8233A3450201n07188n40958m93834m14492m59782j58501j22751l56955l58808
8224A0036932m01253m01097l38125r7089j08100n07539l34369k80993k87035n8403
8214G222929o8066j00164r7274k60248m03309L9734N4141j45035j95683l09461
8204E737564j08155P8655j16006O1629J944j18223k53457J90872j65253J56030
$$ plain form
8270 34000969 33362795 32920153 32128578 31274937 30367899 29462656 28639393 27923507 27410323
8261 27410323 26676258 26117967 25516280 25588978 25452449 25330025 25310412 25470727 25385418 25213384
8251 25213384 25091122 24845440 24442926 23735304 23210977 22558748 21905563 21106868 20034885
8242 20034885 19121220 18304821 17643449 16837772 15832071 15172431 14418070 13809617 13450201
8233 13450201 12943013 12402055 11908221 11493729 11033947 10875446 10752695 10395740 10036932
8224 10036932 9635679 9234582 8896457 8799368 8691268 8183729 7849360 7568367 7281332 7222929
8214 7222929 7154863 7054699 6957425 6697177 6293868 6333602 6387743 6242708 6047025 5737564
8204 5737564 5629409 5708064 5592058 5653687 5655631 5537408 5283951 5474823 5309570 5465600
8194E465600l8455Q57474j200526j675118O10618j4331K13632J41005M5653J6645
8184D422197K2656j41685j61240k39832M9130M3329r7069q0038J85521K7415j28607
8173C901777O8385j68328K11274J55559k0252m7206j00461K00124o7048j1847
8163D121977q9416J95897n1027p2277R4524m9073k3628R3538K05092J30357r8658
8152D457306M4150J29375M8128J17226Q8470R5901j00600N903J75517Q8120J68452
8141E317948k58248O8158K39667R8677J28485K23270J99514K20432K40539l1184
8131F447258L15135M93712K69625K07652M31966J75898L81707J51926J78981L06142
8121I360002M26666K72700L37752P8935M0611J50569P1638K41823J3492K11145
$$ plain form
8194 5465600 5427145 6284619 5084093 3408975 4019593 4005262 4218894 4359899 4405552 4422197
8184 4422197 4444853 4303168 4141928 3902096 3951226 3994555 3897486 3817448 4002969 4030384 3901777
8173 3901777 3970162 3801834 4013108 4168667 4148415 4101209 4000748 4200872 4133824 4121977
8163 4121977 4032561 4228458 4177431 4105154 4199678 4150605 4126977 4220515 4425607 4555964 4457306
8152 4457306 4501456 4630831 4678959 4796185 4884655 4980556 4879956 4885859 5061376 5149496 5317948
8141 5317948 5059700 5127858 5367525 5466202 5594687 5817957 6017471 6237903 6478442 6447258
8131 6447258 6762393 7256105 7525730 7733382 8165348 8341246 8722953 8874879 9053860 9360002
8121 9360002 9786668 10059368 10397120 10476055 10516666 10667235 10738873 10980696 10994188 11205333
8111A1205333J24944K7994K67067P5379M46935J86309M40491K86328J534J57563
8101A3219877L94154M93694L0950J92426n064J57172l2394Q5801k37504l28734
8091A3970378k69608k96389l06543k90023k66637j24358k41948j90159j58294
8082A1826419p2582k76813j96524k40097J6174m8415r4656p9296r493k30890l44858
8071A0248969p7735j48154k10990m07932m35198m58234l35800j78940l70976l16804
8061G308206l1087j67272k33409k3755l07515l24726l16918j33604k31136j57872
8051E380912K09942q9246k22217k45719k42572q5362p9946K9649n9843q0902m7113
8040D467583P384j48703k0204j36088j41224j65322j56413q760P7683Q1650k33165
$$ plain form
8111 11205333 11330277 11358271 11625338 11700717 12147652 12333961 12774452 13060780 13062314 13219877
8101 13219877 13614031 14107725 14138675 14331101 14326037 14483209 14450815 14536616 14299112 13970378
8091 13970378 13700770 13404381 13097838 12807815 12541178 12416820 12174872 11984713 11826419
8082 11826419 11753837 11477024 11280500 11040403 11056577 11008162 10913506 10834210 10824717 10593827 10248969
8071 10248969 10171234 10023080 9812090 9404158 8968960 8510726 8174926 7995986 7625010 7308206
8061 7308206 7277119 7109847 6876438 6852683 6545168 6220442 5903524 5769920 5538784 5380912
8051 5380912 5590854 5501608 5279391 5033672 4791100 4705738 4625792 4655441 4595598 4514696 4467583
8040 4467583 4474967 4326264 4306060 4169972 4028748 3863426 3707013 3698253 3775936 3857586 3624421
8029C624421k00658J3115k7745k35571K13127R5728j66113j05561j4075K70822
8019C467490l3950j5809l3413l19578J48841p3747P8028j77997J54432O2443p168
8008C249572j04613Q0127o3986k43346p8168K69555m0277N5030J29873k1563j01636
7997C130568K49313j89673J3407J94460P5230n9807j06718j25714J80898R0208
7987C452172j9093J606J79030M0842j7992J12219J15428M5764j51037o1133J23816
7976C821622R0302J74127J3523J16047r876J447K87790L13679K24645m03787K68303
7965D897822Q0424r204K78155L5743m1065O0628K02090L20475K53123N884n6196
7954F027879N2691P7583M10752L27881J77410K95428J88758J32282L33279L59557
$$ plain form
8029 3624421 3423763 3436878 3409133 3173562 3386689 3482417 3316304 3210743 3196668 3467490
8019 3467490 3433540 3417731 3384318 3064740 3213581 3139834 3217862 3039865 3194297 3256740 3249572
8008 3249572 3144959 3225086 3161100 2917754 2839586 3109141 3068864 3123894 3253767 3232204 3130568
7997 3130568 3379881 3190208 3203615 3398075 3473305 3413498 3306780 3181066 3361964 3452172
7987 3452172 3433079 3434685 3613715 3654557 3636565 3748784 3864212 3909976 3758939 3697806 3821622
7976 3821622 3911924 4086051 4099574 4215621 4205745 4207192 4494982 4808661 5033306 4629519 4897822
7965 4897822 4978246 4969042 5247197 5282940 5241875 5302503 5504593 5825068 6078191 6084075 6027879
7954 6027879 6080570 6158153 6568905 6896786 7074196 7369624 7558382 7690664 8023943 8383500
7944H383500M28457L46338N63532J99831M17574L92920O79398M40172O37464R59393
7934A3448579P08514J082844J090505J053643J167132J350989J543107J415892
7926B2861205J162594J031096P27637L41931L40550J79208m1514j58312J4705
7917B6459100L84435P57437K94584O69370P57060N69762L27980M73384K14361
7908C0907473O10751K18161K44216n9642l15029k91870m35776n57432l64733j22386
7898B9833733l97191j39391n47683m62201l87345k83175k72678l49296l06406
7889B6688367N7188l578j28489j76278m77760j011699j182815j240071j510441
7880B1014424j449749j593716j647006j170470q52305r07895q56231q84376o91620
$$ plain form
7944 8383500 8811957 9158295 9721827 9921658 10339232 10732152 11411550 11851722 12489186 13448579
7934 13448579 14157093 15239937 16330442 17384085 18551217 19902206 21445313 22861205
7926 22861205 24023799 25054895 25782532 26124463 26465013 26644221 26602707 26444395 26459100
7917 26459100 26843535 27600972 27895556 28564926 29321986 29891748 30219728 30693112 30907473
7908 30907473 31518224 31736385 31980601 31920959 31605930 31314060 30878284 30320852 29956119 29833733
7898 29833733 29436542 29297151 28749468 28287267 27899922 27616747 27344069 26994773 26688367
7889 26688367 26745555 26741977 26613488 26437210 25959450 24947751 23764936 22524865 21014424
7880 21014424 19564675 17970959 16323953 15153483 14301178 13393283 12537052 11652676 10961056
7871A0961056p03341m58577m32156m47077k31020l28624n47456k25267l14556
7862G272982l94633k17652m69336j17115p2960l32996j79451j04024j31127R7018
7852E350706j77516j29986j37706O8596j41476l91248l02529N9998j48965K4548
7842D074422o2501K02332l3043j59271R815N754k88637K35113m2336l8517P0931
7831C974062l18J38170k18017j76531j43326p6219J61425J12819r7071j53430
7821C521564N0563O9007K81567p839k3978J53621j81116j67740p0701J44559K30621
7810D000128q4920j05666J05316n1918L1188l3367J07223J6336P8129J07132j91614
7799C977967j43925r4801n6755J13491J07035q9704P9321j5612J3547j88988k03899
$$ plain form
7871 10961056 10257715 9799138 9366982 8919905 8688885 8360261 7812805 7587538 7272982
7862 7272982 6878349 6660697 6191361 6074246 6001286 5668290 5488839 5384815 5253688 5350706
7852 5350706 5173190 5043204 4905498 4974094 4832618 4441370 4138841 4198839 4049874 4074422
7842 4074422 4011921 4214253 4181210 4021939 4031754 4037508 3748871 3983984 3941648 3903131 3974062
7831 3974062 3973744 4111914 3893897 3717366 3574040 3497821 3659246 3772065 3674994 3521564
7821 3521564 3572127 3641134 3922701 3914862 3890884 4044505 3863389 3695649 3624948 3769507 4000128
7810 4000128 3915208 3809542 3914858 3862940 3894128 3860761 3967984 3984320 4062449 4169581 3977967
7799 3977967 3834042 3739241 3682486 3795977 3903012 3813308 3892629 3877017 3890564 3701576 3497677
7788C497677K5198M0666p8975r2089K3800q609m4880p1451K5112J9616J19421
7777C455486j32972j39938J59894R8616j86783k44155j32166R7521j34124N7384
7767B898763K3315k2862K3573m4684m7768N0658j32990j1196J62915o8541j50831
7756B680352O6533N4327q1228M961l9896K4885m577j36949q6695O0240J50558
7745B692511j0634J23388o6813k13393n4019M0425R6371n1338J7177Q9199j15350
7734B547524Q6833l8553l2961k9048K02956R0507L2628n5796O7940n9427l8371
7723B774232m958J10329J02729N8030R1743J30559k14030p1172L33879m9890j8141
7712C243310q4071J20215r1463K32287J60048l0487o8176o4734M086n8472J77134
$$ plain form
7788 3497677 3522875 3563541 3484566 3392477 3416277 3407668 3362788 3291337 3316449 3336065 3455486
7777 3455486 3322514 3182576 3342470 3441086 3254303 3010148 2877982 2975503 2841379 2898763
7767 2898763 2922078 2899216 2922789 2878105 2830337 2880995 2748005 2736809 2899724 2831183 2680352
7756 2680352 2746885 2801212 2719984 2724945 2685049 2709934 2705357 2568408 2481713 2541953 2692511
7745 2692511 2681877 2805265 2738452 2525059 2471040 2511465 2607836 2556498 2573675 2662874 2547524
7734 2547524 2634357 2595804 2562843 2533795 2736751 2827258 2859886 2804090 2872030 2812603 2774232
7723 2774232 2769274 2879603 2982332 3040362 3132105 3262664 3048634 2977462 3311341 3261451 3243310
7712 3243310 3159239 3279454 3187991 3420278 3580326 3549839 3481663 3416929 3421015 3362543 3539677
7701C539677K0723J6345J43151J5238K11293L2447j48785p6721j0317J68903R7605
7690D009559p8265J42417J52759j24053J6295J09215r1031m6927K2701O4023j10660
7679D066033J77553k16988P7265K07523J43870j6906q8649m9172R4961K22541
7669D618031j19263J94087J20615k97863m6535K60649J11592P3805j01486k6778
7659D786854k6235K87073J77739j52381q4845J89778P2662j2729P1619J08725
7649E418260p2996K69540p0769K04031L29718j65805J48798R1554k5765J74483
7639F301049O2496J75872J74327K52515Q9330R9656L13911j26461J78300K73252
7629G794247P5755K67215L18780J35545L40662K58781K20477K03478K51772K39755
$$ plain form
7701 3539677 3560400 3576745 3719896 3735134 3946427 3978874 3830089 3753368 3743051 3911954 4009559
7690 4009559 3931294 4073711 4226470 4102417 4118712 4227927 4136896 4089969 4112670 4176693 4066033
7679 4066033 4243586 4026598 4103863 4311386 4455256 4438350 4349701 4300529 4395490 4618031
7669 4618031 4498768 4692855 4813470 4515607 4469072 4729721 4841313 4915118 4813632 4786854
7659 4786854 4760619 5047692 5225431 5073050 4988205 5177983 5250645 5237916 5309535 5418260
7649 5418260 5345264 5614804 5544035 5748066 6077784 5911979 6060777 6152331 6126566 6301049
7639 6301049 6363545 6539417 6713744 6966259 7055589 7155245 7469156 7342695 7520995 7794247
7629 7794247 7870002 8137217 8455997 8591542 8932204 9190985 9411462 9614940 9866712 10106467
7619A0106467L60061M92023K99893K81170P14568N07638K32732M23647M77438
7610A3895637P11822O07102N18891O78414R03065Q38541R38408R91646P44299
7601B0827825R34959J166267J216952O95580O04943P74709L69279M60506P9076
7592B7130096Q4127j14709K7265M25167J27307N6683M28608K32949P64904N50016
7582B9712413P99035J237441R20072J017237J166910J604433J305901J256449
7574C9019891O05869L15242l5932l94448o84917r03271j036391j184660j565844
7565C4135539j268517j203410j030993q05580o45157o04415n45143m28993k40339
7556B7362992r7115L15603p4831J49426J79006n9810j23154j32766m18192m99568
$$ plain form
7619 10106467 10466528 10958551 11258444 11539614 12254182 12761820 12994552 13418199 13895637
7610 13895637 14607459 15214561 15733452 16411866 17314931 18153472 19091880 20083526 20827825
7601 20827825 21762784 22929051 24146003 24841583 25446526 26221235 26590514 27051020 27130096
7592 27130096 27214223 27099514 27126779 27551946 27679253 27735936 28164544 28397493 29162397 29712413
7582 29712413 30511448 31748889 32668961 33686198 34853108 36457541 37763442 39019891
7574 39019891 39625760 39941002 39905070 39510622 38825705 37922434 36886043 35701383 34135539
7565 34135539 32867022 31663612 30632619 29827039 29181882 28577467 28032324 27603331 27362992
7556 27362992 27265877 27581480 27506649 27656075 27835081 27775271 27652117 27519351 27101159 26601591
7546B6601591l54932l92670o58370m63342p00373l73126j96303k52518J22251
7537B3332208m2377o59094r70936j031653r90219q96823r32370r31564q99611
7528A5977561l82835l21261m54848k59201k02001o28485j41050k93268j3978k69333
7518A3011301j93236l09462k9470p6374N0338q4572j80263k40976p5645K2457
7508A1894098j47871k45952k83251j7481J8165K453j41859O0067j33044L6842
7498A1042167n3382M2116k3612l43386j70728J36713m6340M137J09491J17135
7488A0814311M8090j89782j2482K62160K43970p1985o4490K42963L13531j80086
7478A1406200K78183n4182K57928J83003j8187J74416J33554J21407q5043J42658
$$ plain form
7546 26601591 26246659 25853989 25195619 24732277 24031904 23658778 23462475 23209957 23332208
7537 23332208 23289831 22630737 21659801 20628148 19637929 18741106 17808736 16877172 15977561
7528 15977561 15594726 15273465 14818617 14559416 14357415 13728930 13587880 13294612 13280634 13011301
7518 13011301 12818065 12508603 12479133 12402759 12453097 12368525 12188262 11947286 11871641 11894098
7508 11894098 11746227 11500275 11217024 11199543 11217708 11220161 11078302 11138369 11005325 11042167
7498 11042167 10988785 11030901 11007289 10663903 10493175 10629888 10583548 10587685 10697176 10814311
7488 10814311 10862401 10672619 10660137 10922297 11166267 11094282 11029792 11272755 11586286 11406200
7478 11406200 11684383 11630201 11888129 12071132 12052945 12227361 12360915 12482322 12397279 12539937
7468A2539937P25740K54239K60467K37685J93714L75900L11528L47504L95908
7459A5642622M18775M19052L86337M67759K26409J69133K60515J55357K77126
7450A8423085K02874M85863L34535J4674o1447J9525L17665L68815L11661J62861
7440B0580111J86213L52696K97988M97046K45553N19838K59042M66391L59523
7431B3764401L07326J89995J51820K01050l7517j56613k34520j76830p9846l49553
7421B3579713l31619j11491J02278N8605j7796K77948J00326Q2420P6593K82304
7411B4099281L49801J79613K20156L32867L84731K69725L99341O16614O23392
7402B7475521L58536O20589Q45055Q70739J140597R85032J207864J486685J317023
$$ plain form
7468 12539937 13265677 13519916 13780383 14018068 14211782 14587682 14899210 15246714 15642622
7459 15642622 16061397 16480449 16866786 17334545 17560954 17730087 17990602 18145959 18423085
7450 18423085 18625959 19111822 19446357 19461031 19399584 19419109 19736774 20105589 20417250 20580111
7440 20580111 20766324 21119020 21417008 21914054 22159607 22679445 22938487 23404878 23764401
7431 23764401 24071727 24261722 24413542 24614592 24577075 24420462 24185942 24009112 23929266 23579713
7421 23579713 23248094 23136603 23238881 23297486 23279690 23557638 23657964 23740384 23816977 24099281
7411 24099281 24449082 24628695 24848851 25181718 25566449 25836174 26235515 26852129 27475521
7402 27475521 27834057 28454646 29299701 30170440 31311037 32296069 33503933 34990618 36307641
7393C6307641J496320R67824N22495K27422K22698p4761j26049p0659m4206K64240
7383C9692965J7175L69280M02778O69247K92162j10371J45950M37294O45575N23546
7373D3085601L97513K22603J96131k8354k46876l21267l24949m91672m04209k67188
7363D1817333k28526n47447n84893l34455q5612j64490K4950J64240N08310N63847
7353D1133257N76090L55131L9940k41276O723j500o711J03132j93426k43688j405828
7342D0121844j796749j462104j508502j362472j308495j416777j198447p32540
7334B9335758n25244p65950n82049j33819p586k71416j35003j70135l8848r7072
7324B6608636M2932J06467K7886J4139J40303K32421L35084K39050L13750J06702
$$ plain form
7393 36307641 37803961 38771785 39294280 39521702 39744400 39669639 39543590 39472931 39428725 39692965
7383 39692965 39710140 40079420 40482198 41151445 41443607 41333236 41479186 41916480 42562055 43085601
7373 43085601 43483114 43705717 43901848 43873494 43626618 43305351 42980402 42488730 42084521 41817333
7363 41817333 41588807 41041360 40456467 40122012 40036400 39871910 39896860 40061100 40569410 41133257
7353 41133257 41709347 42064478 42104418 41863142 41869865 41868365 41861654 41964786 41771360 41527672 40121844
7342 40121844 38325095 36862991 35354489 33992017 32683522 31266745 30068298 29335758
7334 29335758 28810514 28044564 27462515 27328696 27321110 27049694 26914691 26744556 26705708 26608636
7324 26608636 26651568 26758035 26785921 26800060 26940363 27172784 27507868 27746918 28060668 28167370
7314B8167370L07352K94028K89340N25993N43567O82855O90141N90619O39883
7305C2731148P54921O15473O43252O59785P10528P47147P96769P20529O12797
7296C8992349Q00119R34566O10584R87889R84776O55941J002710J095068R14067
7287D6978069R67047R25413J106877R53022J407145J470791J129897J322081J546496
7278E7806838J513187J824716J782008J776012J843249J741502K332617K396791
7270G3016920K138715K223040K667797K605380K767533K917161L005820L260242
7262I4602608L526819L634135M097995M382058M622528N003360N452621O073701
7254A31395825O496306O856967P698137Q490093R416082J0338134J1526288J2377665
$$ plain form
7314 28167370 28474722 28768750 29058090 29584083 30127650 30810505 31500646 32091265 32731148
7305 32731148 33486069 34101542 34744794 35404579 36115107 36862254 37659023 38379552 38992349
7296 38992349 39792468 40727034 41337618 42325507 43310283 43966224 44968934 46064002 46978069
7287 46978069 47945116 48870529 49977406 50930428 52337573 53808364 54938261 56260342 57806838
7278 57806838 59320025 61144741 62926749 64702761 66546010 68287512 70620129 73016920
7270 73016920 75155635 77378675 80046472 82651852 85419385 88336546 91342366 94602608
7262 94602608 98129427 101763562 105861557 110243615 114866143 119869503 125322124 131395825
7254 131395825 137892131 144749098 152447235 160937328 170353410 180691544 192217832 204595497
7246B04595497J3669746J5030803J6489461J7911091J9361897K1080576K2110501
7239C30249572K3040314K3443396K2912169K1045220J7693570J2533786O319887
7232D57237914p31253p593942j3654511j8790678k2339199k4400580k5141941
7225C44585810k4568552k3680104k2045710k0593085j8635666j6636962j5387599
7218B03038132j3989293j2985427j1425384j0149914r307936q457532p496789
7211A29225857o882800o353904n837884n285891m927103m396820m190472m050897
7203H7300086l755081l542045l190639l262910k994026k636311k526199k538634
7195F2854241k335832k415486k042516j961057j941612j631134j704000j704295
$$ plain form
7246 204595497 218265243 233296046 249785507 267696598 287058495 308139071 330249572
7239 330249572 353289886 376733282 399645451 420690671 438384241 450918027 457237914
7232 457237914 456506661 448912719 435258208 416467530 394128331 369727751 344585810
7225 344585810 320017258 296337154 274291444 253698359 235062693 218425731 203038132
7218 203038132 189048839 176063412 164638028 154488114 145180178 136722646 129225857
7211 129225857 122343057 115989153 110151269 104865378 99938275 95541455 91350983 87300086
7203 87300086 83545005 80002960 76812321 73549411 70555385 67919074 65392875 62854241
7195 62854241 60518409 58102923 56060407 54099350 52157738 50526604 48822604 47118309
7187D7118309j627519j633255j441725j269933j398035j042801j145002j114071
7179C6445968j074159j123909p61669p12951q44830r14590p57019q27909o20984
7170B8807948m46950p08687r67521m90862o37670o56790k79335o30478j85305
7161B3804350n01962l15522m05848q51565j05164m53521m85846l67210m78297
7152A9839415j60564n8399l34586o01448m07155k93622m49946k69972l16058k86796
7142A6660869n63068m45167n41437l00533n31802m06620k92981j84943j39415
7133A3254903l00547l29645j30798k13836l55293l29137l61425J0032j84218k49513
7123A0810523j01361k76299k73837j31559p7254m24196j55086n4435j2874J07603
$$ plain form
7187 47118309 45490790 43857535 42415810 41145877 39747842 38705041 37560039 36445968
7179 36445968 35371809 34247900 33486231 32773280 31928450 31013860 30256841 29428932 28807948
7170 28807948 28360998 27652311 26684790 26193928 25556258 24899468 24620133 23989655 23804350
7161 23804350 23302388 22986866 22581018 21729453 21624289 21170768 20684922 20317712 19839415
7152 19839415 19678851 19620452 19285866 18684418 18277263 17983641 17533695 17263723 16947665 16660869
7142 16660869 16097801 15652634 15111197 14810664 14278862 13872242 13579261 13394318 13254903
7133 13254903 12954356 12624711 12493913 12280077 11924784 11595647 11234222 11244254 11060036 10810523
7123 10810523 10709162 10432863 10159026 10027467 9950213 9526017 9370931 9316496 9303622 9411225
7113I411225k21174k76011k19148n3695M8188n7091j90378j5807j69466l3497
7103H223146m6238j65736j61644j20245k39772j5165K3094k6300j63224j04057
7093G203859j78188l29134Q9087O0427k41867o4466l25980L77145L39208m15466
7083F514625l00593p901j70283L6706P4767j45627k87149m906J20484L31309r9302
7072F062130j43270p2382q3009M2253K3672j32194j96378m7584J64262q1147k2741
7061E513612J45509J66051n9828m6982k61794j63308P5038Q7714k9511k93882
7051E132619K54961P8507p71K19050J3205M8691J34773K02881K07781k09212J68964
7040F251449L17323k51578k00839k4817n4199k47506P3386P7353J28301K52489
$$ plain form
7113 9411225 9190051 8914040 8694892 8641197 8689385 8632294 8441916 8426109 8256643 8223146
7103 8223146 8176908 8011172 7849528 7729283 7489511 7474346 7497440 7471140 7307916 7203859
7093 7203859 7025671 6696537 6785624 6846051 6604184 6539718 6213738 6590883 6930091 6514625
7083 6514625 6214032 6206131 6035848 6072554 6147321 6001694 5714545 5709639 5830123 6161432 6062130
7072 6062130 5918860 5846478 5763469 5805722 5829394 5697200 5500822 5453238 5617500 5536353 5513612
7061 5513612 5659121 5825172 5765344 5718362 5456568 5293260 5368298 5456012 5426501 5132619
7051 5132619 5387580 5466087 5465316 5684366 5697571 5746262 5881035 6083916 6291697 6082485 6251449
7040 6251449 6568772 6317194 6116355 6091538 6037339 5789833 5863219 5940572 6068873 6321362
7030F321362J42960R0429J1452K67753L29015K6552k22813O3919m12679p8454
7020F539496k68297j85093l30614j60180k78842j02151k10886j77705J3881k18011
7010D621598k25970k0341l4286L8424Q7338l38503K9697l2870k06425J69923j51146
6999C937439J47051k29321j23884j12047J5255p7460l8142J46968j06837j00631
6989C458391M3260m7246J61714m9074j10318J49489J19927q9451M5859K16240
6979C898791l1769j26135m7084Q2161n1118q9669m1168J53027O4886m3807o9454
6968C698661J28202O4607J13544q1160P6759j38392l901j45756M05545r1675k28470
6957C797964Q5079r2637K1799K20223q9441J63694j26528j32998j19396n5007
$$ plain form
7030 6321362 6464322 6554751 6566203 6833956 7162971 7189523 6966710 7030629 6617950 6539496
7020 6539496 6271199 6086106 5755492 5595312 5316470 5214319 5003433 4825728 4839609 4621598
7010 4621598 4395628 4375287 4341001 4379425 4466763 4128260 4157957 4125087 3918662 4088585 3937439
6999 3937439 4084490 3855169 3731285 3619238 3634493 3557033 3518891 3665859 3559022 3458391
6989 3458391 3501651 3454405 3616119 3567045 3456727 3606216 3726143 3636692 3682551 3898791
6979 3898791 3867022 3740887 3693803 3775964 3724846 3635177 3594009 3747036 3811922 3768115 3698661
6968 3698661 3826863 3891470 4005014 3923854 4000613 3862221 3858320 3712564 4118109 4026434 3797964
6957 3797964 3883043 3790406 3812205 4032428 3942987 4106681 3980153 3847155 3727759 3672752
6947C672752P0352J68092J49254j40464J71830N1637P2648n7087q767J4740J38578
6936D303565L25087J10854J23709P6965J19428O6270m5301J06909J04058J27670
6926E419214j13006L44901O1860R2727J58409m8172K17880K18664J45663J20995
6916F619135M5735R0095K73833j77529K99072J75924Q8904J58657L80323J30631
6906H084780J82699K59774K51426L12835K06655J92198N05149L09866J97031K12517
6896A0714930K08551K96637K41803N81297N29902L76217M0190L40538P49733P75378
6886A4855176P83563N20054N37800P47005P61081P88451O53712P42030Q76027
6877B1264899P95685J207035J693653J851942K096671K542238K742695L035744
$$ plain form
6947 3672752 3743104 3911196 4060450 3919986 4091816 4143453 4216101 4159014 4150247 4164987 4303565
6936 4303565 4628652 4739506 4863215 4940180 5059608 5125878 5080577 5187486 5291544 5419214
6926 5419214 5306208 5651109 5712969 5805696 5964105 5915933 6133813 6352477 6498140 6619135
6916 6619135 6664870 6754965 7028798 6851269 7150341 7326265 7415169 7573826 7954149 8084780
6906 8084780 8267479 8527253 8778679 9091514 9298169 9490367 9995516 10305382 10502413 10714930
6896 10714930 10923481 11220118 11461921 12043218 12573120 12949337 12989527 13330065 14079798 14855176
6886 14855176 15638739 16158793 16696593 17443598 18204679 18993130 19646842 20388872 21264899
6877 21264899 22060584 23267619 24961272 26813214 28909885 31452123 34194818 37230562
6869C7230562L601584M441558N074217N759386P061335Q208860R677473J1137558
6861I2192533J2414594J0588138K869084n457601p475457q068813q959702j1073455
6853G7029321j1530101q982453o546674m883813m320608l770296l375490l188162
6845C0431724k562092k297684j848671k048693j662057j440037r29105q35812
6837A6807573q59045p92178r85781r19227m65110l85392l23618m36359n73459
6828A1067404m60826m59816m36429k46348k84744m59120l91726k77502k35329
6819G815564l31688k64050o6958j43099m85698m12491j70623p8457k14222k93162
6809E355116J65294j07780n59272o2375k21443L820m0221p7305j95114j13060
$$ plain form
6869 37230562 40832146 45273704 50347921 56107307 63168642 71377502 81054975 92192533
6861 92192533 104607127 115195265 118064349 112606748 105131291 97062478 88102776 77029321
6853 77029321 65499220 56516767 49970093 45086280 40765672 36995376 33619886 30431724
6845 30431724 27869632 25571948 23723277 21674584 20012527 18572490 17643385 16807573
6837 16807573 15948528 15156350 14170569 13251342 12786232 12400840 12077222 11640863 11067404
6828 11067404 10606578 10146762 9710333 9463985 9179241 8720121 8328395 8050893 7815564
6819 7815564 7483876 7219826 7152868 7009769 6524071 6111580 5940957 5862500 5648278 5355116
6809 5355116 5520410 5412630 4853358 4790983 4569540 4573360 4533139 4455834 4260720 4147660
6799D147660O0315q4335j41874j00343j31137J3572k78632M8379J86203J04813
6789C824621j84506J669k2605J39261j79917j66278k38080j64478r633L3052L2308
6778C065414j60111J56121j52238J47637N594j98843P1508j50301J08939k50676
6768B643044p0190J32361l8376m4749L7461j34451m9838K55836j72388k72183
6758B286527n599j64186L0701J63957r4249j73236Q0583l49107M3270j4825J32605
6747A936441o1638k46882j3445j1264J32278J15726Q7188j38616J63782k22415
6737A741155N4967J04815p8101r708Q2790m6704o4117R5263J02367n4069J06131
6726B034789L7931j66033K3334J68415N8692l0905J2948q9694n6841K120j56082
$$ plain form
6799 4147660 4207975 4123640 3981766 3881423 3750286 3763858 3485226 3533605 3719808 3824621
6789 3824621 3640115 3641784 3619179 3758440 3578523 3412245 3174165 3009687 3000054 3033106 3065414
6778 3065414 2905303 3061424 2909186 3056823 3062417 2863574 2935082 2784781 2893720 2643044
6768 2643044 2572854 2705215 2666839 2622090 2659551 2525100 2475262 2731098 2558710 2286527
6758 2286527 2280928 2116742 2147443 2311400 2217151 2043915 2124498 1775391 1818661 1803836 1936441
6747 1936441 1874803 1627921 1614476 1603212 1735490 1851216 1938404 1799788 1963570 1741155
6737 1741155 1796122 1900937 1822836 1813128 1895918 1849214 1785097 1880360 1982727 1928658 2034789
6726 2034789 2072720 1906687 1930021 2098436 2157128 2126223 2139171 2049477 1992636 1994756 1838674
6715A838674P0739j06096j12019J37371l7922R8233R9397j60573R980k32580R8530
6704A703734Q0584j67844j42301J02815j23046k4906L75422j15313j82070j94842
6694A312233J34905K6635J0481j31028K8130Q9299o1142j51362l9542J2424N2524
6683A283557L3801j34558K13804j9517J589q3089o3598j19536N1694L6047p4961
6672A125233J73554j27554k52712J83118K38350K223m2514P6753j21666r2829
6662A161956j30100P6518K6314N252r9193N6545l3468r4627N2227J50934r3906
6651A078452P4792J33183K7829k5735m8272j38135p1087J28445j0094k08212N8941
6640A000107R7757J12838n9769J85658P6112l807o1708k25299J61485r839J42025
$$ plain form
6715 1838674 1909413 1803317 1691298 1828669 1790747 1888980 1988377 1827804 1837784 1605204 1703734
6704 1703734 1784318 1616474 1474173 1576988 1453942 1429036 1804458 1689145 1507075 1312233
6694 1312233 1447138 1473773 1484254 1353226 1381356 1470655 1409513 1258151 1218609 1231033 1283557
6683 1283557 1317358 1182800 1396604 1377087 1378676 1295587 1231989 1112453 1164147 1200194 1125233
6672 1125233 1298787 1171233 918521 1101639 1339989 1342212 1299698 1376451 1254785 1161956
6662 1161956 1031856 1108374 1134688 1139940 1040747 1097292 1063824 969197 1021424 1172358 1078452
6651 1078452 1153244 1286427 1314256 1288521 1240249 1102114 1031027 1159472 1149378 941166 1000107
6640 1000107 1097864 1210702 1150933 1336591 1412703 1408896 1347188 1121889 1283374 1273535 1415560
6629A415560j6435K840J14951k11735k88008Q0072p0057O0029j09617J6308M8390
6618A042298J11556N7419r018j3748J2065P4360m2786p5492N6595P3445O5875
6607A352569J4467J32591J2169j86185N7477L8542k83878L1080O8365J38500j50459
6596A225238J87119K0735L9353K7114m8594L60p8932Q6833j05885R696j7730J5392
6584A360699J28972J28633k04844j23889K14146R1917j26492O9272q3301R0785
6574A545898j05298p7428k2880L4903L45468N5956j24319j22092J4063L4498K3989
6563A602758Q3478J62557J87966j96163q2986J74317Q0967o9144Q3068J80754
6553B207572k3060k0257J26781j09385J12345J41886J95958K72690q4193K9333
$$ plain form
6629 1415560 1399125 1401965 1516916 1305181 1017173 1097245 1027188 1087217 977600 993908 1042298
6618 1042298 1153854 1211273 1202255 1188507 1200572 1274932 1232146 1156654 1213249 1286694 1352569
6607 1352569 1367036 1499627 1511796 1325611 1383088 1421630 1137752 1168832 1237197 1375697 1225238
6596 1225238 1412357 1433092 1472445 1499559 1450965 1451325 1372393 1459226 1353341 1363037 1345307 1360699
6584 1360699 1489671 1618304 1413460 1289571 1503717 1595634 1469142 1538414 1455113 1545898
6574 1545898 1440600 1363172 1340292 1375195 1720663 1776619 1652300 1530208 1544271 1578769 1602758
6563 1602758 1686236 1848793 2036759 1840596 1757610 1931927 2012894 1943750 2026818 2207572
6553 2207572 2184512 2164255 2291036 2181651 2293996 2435882 2631840 2904530 2820337 2849670
6543B849670j82875J48858k8798j55617m2323k7355J5275N6488l10350m3072q7482
6532B192419J08790K19678k99736j01202J73780m9537R500K5719N3519r4736K5006
6521B263200J09542J48817l5427r5913K80323J63404k68331j69467L5556n2904
6511B378800K11330J86072J86632K237J7804J1380J1029N7324o3365m2971m9954
6500B906318L7252q417M2871L52475N528k17028o4881J83790K9601J49590N4046
6489C471145J49807r5201J31155J34778J62067j6138N0267N6948o2380J56759
6479D139207R4003o83K08673K29370M13518P9684k25636J17572L00596n1534J81511
6468E486281J17903J05737J68380K07514J27560J78491M06947K26016j8490O9270
$$ plain form
6543 2849670 2666795 2815653 2786855 2631238 2588915 2561560 2576835 2633323 2322973 2279901 2192419
6532 2192419 2301209 2520887 2221151 2119949 2293729 2244192 2253692 2279411 2332930 2238194 2263200
6521 2263200 2372742 2521559 2486132 2390219 2670542 2833946 2565615 2396148 2431704 2378800
6511 2378800 2590130 2776202 2962834 2965071 2982875 2994255 3005284 3062608 2999243 2956272 2906318
6500 2906318 2943570 2935153 2978024 3330499 3336027 3118999 3054118 3237908 3267509 3417099 3471145
6489 3471145 3620952 3525751 3656906 3791684 3953751 3937613 3987880 4044828 3982448 4139207
6479 4139207 4233210 4232527 4441200 4670570 5084088 5163772 4938136 5055708 5356304 5304770 5486281
6468 5486281 5604184 5709921 5878301 6085815 6213375 6391866 6798813 7024829 7006339 7075609
6458G075609K69501J60249K08731J6522M25498M61104K30083J09710L36011J67380
6448I460398L02208K36022L85018L51162K43151J78778M42089N50357O03898J63065
6438A2916146M10576L69080M07033P58278N70891O04156P29114R06338N01358
6429A8172970R39507J052434P60119J147818J506299J620417J399079J768962
6421B8367605K274134K711987K844947K988088L150112K882879K841333K807746
6413E0868831K782373K849445L463245L693540L616310L731263L112988J812945
6405G5930940J522870J890986J995365J906063K058380K117312J153499m26816
6397H8148599r83578j892228j917724j974030k004783j916414j858486k535721
$$ plain form
6458 7075609 7345110 7505359 7714090 7730612 8156110 8617214 8847297 8957007 9293018 9460398
6448 9460398 9762606 9998628 10383646 10734808 10977959 11156737 11598826 12149183 12753081 12916146
6438 12916146 13326722 13695802 14102835 14861113 15432004 16036160 16765274 17671612 18172970
6429 18172970 19112477 20164911 20925030 22072848 23579147 25199564 26598643 28367605
6421 28367605 30641739 33353726 36198673 39186761 42336873 45219752 48061085 50868831
6413 50868831 53651204 56500649 59963894 63657434 67273744 71005007 74117995 75930940
6405 75930940 77453810 79344796 81340161 83246224 85304604 87421916 88575415 88148599
6397 88148599 87165021 85272793 83355069 81381039 79376256 77459842 75601356 73065635
6389G3065635l153538l587262l734862l418917l371397l155028l172813k937924
6381D6533894l019166l177019l264666k776957k610909k861976k569695k040025
6373B4213481j353167j401786j707242j083509j088883q88086r18300q32939n74283
6364A4365286p16216o31709o50309m70726l09942l38443k98781o85475j59065
6355A0104620k17003m81951m27694l35911j04808m42579j08362n425j65156n09256
6345G306475n5898J72668n6908l22383l98377r2955l4888j73349j77065J97455
6335F364775o6319r0246j15109j72545k74022J42951J84547k98342j28559J96373
6325E743504p9255m4295m9595k3396J01344k468j36537J17608J71599Q2416j06330
$$ plain form
6389 73065635 69912097 66324835 62589973 59171056 55799659 52644631 49471818 46533894
6381 46533894 43514728 40337709 37073043 34296086 31685177 28823201 26253506 24213481
6373 24213481 22860314 21458528 19751286 18667777 17578894 16690808 15772508 14939569 14365286
6364 14365286 13649070 13017361 12367052 11896326 11586384 11247941 10949160 10263685 10104620
6355 10104620 9887617 9405666 8977972 8642061 8537253 8094674 7986312 7980887 7815731 7306475
6345 7306475 7250577 7423245 7366337 7043954 6645577 6552622 6517734 6344385 6167320 6364775
6335 6364775 6298456 6208210 6093101 5920556 5646534 5789485 5974032 5675690 5547131 5743504
6325 5743504 5664249 5619954 5570359 5546963 5648307 5645839 5509302 5626910 5798509 5880925 5774595
6314E774595p3974K91333J10421J71631O1571j22969R5987o4852j02404O4567
6304F205906J38214m9610q5502J81750J42472R5542J51572L0609k1294j6635K66044
6293G039068J63293K52389p4258J21328K89261J1043L16727L93525J03569K85644
6283H901589J55821J77506L18455K16248M64290J78969P8604K23349L30974K33003
6273A1278808N65704M75060L15760O46686O33023O06222N65807N84423J121455
6264A6792948J089129J243886J364846J863417J822706J783793K727145K783568
6256C1471438L371087L848985M717446N833508P010831Q333489R800121J2080962
6248H6467867J2127716M155177o846687p659570p138348p329096j0204082j1701188
$$ plain form
6314 5774595 5700621 5991954 6102375 6274006 6335577 6212608 6308595 6243743 6141339 6205906
6304 6205906 6344120 6294510 6209008 6390758 6533230 6628772 6780344 6810953 6789659 6773024 7039068
6293 7039068 7202361 7454750 7380492 7501820 7791081 7802124 8118851 8512376 8615945 8901589
6283 8901589 9057410 9234916 9553371 9769619 10233909 10412878 10491482 10714831 11045805 11278808
6273 11278808 11844512 12319572 12635332 13282018 13915041 14521263 15087070 15671493 16792948
6264 16792948 17882077 19125963 20490809 22354226 24176932 25960725 28687870 31471438
6256 31471438 34842525 38691510 43408956 49242464 56253295 64586784 74386905 86467867
6248 86467867 98595583 102750760 95904073 88244503 81106155 73777059 63572977 51871789
6240E1871789q155479n429267l941405l697948l119877k852748k159157j984721
6232B0531187j652496j469859j307910j073908j015036p62119p27023o44490n70084
6223A1308262n68083m05021o68264m79327k29863l77875j40186j94327m50022
6214G795294m72569j60766l61838l55591k00104l01140l58991j63788n8096j07397
6204E255014k62864m5556k56750k24916j79213j53356N4766k69738j65197o1471
6194C690719k2126q6931j95008m7632j47873n4073l046l27650k4167j34837K82544
6183B929920J54158r4306j61747n4842k37022j01472j968M51044k86303j77119
6173B420343K79586j23191j30342q755N8314j83050j02269j93086R2204M8935
$$ plain form
6240 51871789 43716310 38287043 34345638 30647690 27527813 24675065 22515908 20531187
6232 20531187 18878691 17408832 16100922 15027014 14011978 13249859 12522836 11878346 11308262
6223 11308262 10740179 10335158 9666894 9187567 8957704 8579829 8439643 8245316 7795294
6214 7795294 7322725 7161959 6800121 6444530 6244426 5943286 5584295 5420507 5362411 5255014
6204 5255014 4992150 4946594 4689844 4464928 4285715 4132359 4187125 3917387 3752190 3690719
6194 3690719 3668593 3581662 3386654 3339022 3191149 3137076 3134030 2806380 2782213 2647376 2929920
6183 2929920 3084078 2989772 2828025 2773183 2536161 2434689 2432721 2883765 2597462 2420343
6173 2420343 2699929 2576738 2446396 2437641 2495955 2312905 2210636 2017550 2109754 2158689
6163B158689M0693j11991J14187P7j35542k3965N2133l5032k25125k49552j43426
6152A441146J33996J34275m6919j03439l0081p7288r2494O5140j96244j06770
6142A121322L3463N2403M7881K3448k8587k16012J8139J59659J974k3398j37580
6131A052712o5983O5199p124m1048p4061q2516n5242J24271N6348j07656j22890
6120G42010M8887J13395J31237L0081j24564k14377k61530J82430L29576J03632
6110A080777O1772q8060k6385k74441K62234p3631j12355k9516K7601J48517R0391
6099A066904M5948L3311j68982L2856K9242j77294O1030O5418O895N4577J03943
6088A153848K0169L9844J53248l985j1415k04484j01233J95984j85278J90750
$$ plain form
6163 2158689 2199382 2087391 2201578 2201655 2066113 2042148 2094281 2059249 1834124 1584572 1441146
6152 1441146 1575142 1709417 1662498 1559059 1528978 1451690 1359196 1424336 1228092 1121322
6142 1121322 1154785 1207188 1255069 1278517 1249930 1033918 1052057 1211716 1213690 1190292 1052712
6131 1052712 986729 1051928 1044804 1003756 929695 847179 791937 916208 972556 864900 742010
6120 742010 790897 904292 1035529 1065610 941046 726669 465139 647569 977145 1080777
6110 1080777 1142549 1054489 1028104 753663 1015897 942266 829911 800395 827996 976513 1066904
6099 1066904 1112852 1146163 977181 1010037 1039279 861985 923015 988433 995328 1049905 1153848
6088 1153848 1174017 1213861 1367109 1363124 1351709 1147225 1045992 1241976 1056698 1247448
6078A247448j19860m2537P8390j47465q8008J95640j38204k41898N1583j61856
6068F33233j9452J68490J06435n3559j60293j11935k7296O395K54372r6659j25954
6057E73777J70724m2789O3968k0731q3447j28487N6716K6313O7590N2565m6812
6046F89387K29258j30846J16777Q3448j50141k25140l54377J17551o7930J72286
6036D80273J7958O4537m926J37786J40788J34579l2742j70777k9390O8710J16194
6025I22990k19856j00782J25674o3508L53610K49723j08426J60567j17021J35758
6015A338729K05794j40996j73178M5084n1916j73100M2547j50565k44118J93373
6005H91654J33533j72233J6139l57124K70286j7315K4601j60120k5661k3940P656
$$ plain form
6078 1247448 1127588 1085051 1163441 1015976 927968 1123608 985404 743506 795089 633233
6068 633233 613781 782271 888706 835147 674854 562919 535623 542018 796390 699731 573777
6057 573777 744501 701712 765680 744949 661502 533015 589731 616044 683634 736199 689387
6046 689387 918645 787799 904576 988024 837883 612743 258366 375917 307987 480273
6036 480273 498231 562768 557842 695628 836416 970995 938253 767476 738086 806796 922990
6025 922990 703134 602352 728026 664518 1018128 1267851 1159425 1319992 1202971 1338729
6015 1338729 1544523 1403527 1230349 1275433 1223517 1050417 1092964 942399 698281 891654
6005 891654 1025187 852954 869093 511969 782255 764940 789541 629421 603760 579820 587476
5994E87476L29417o0234J04188j51040K0086k9968o1854j68664M3533K8536Q0405
5983G21881j27471p1734J73401J3209l35493n105J74830j01535m5254l2325J5634
5972C80038J80832J67663j6900j8921J20030j05388j16895J22833J45869R9696
5962I58857j23514l2607j04378N0529p9790J45587L62030j63408k47017K15983
5952I82272J83305l42061J48507K2712m8777J22743L51826J68888j74884l39490
5942A075041l8174k4142J10096j58239p0559P2068L6884p9321j51520M1489L8053
5931H51676L0295n2114J24182m7236k01286K18163N8486q6587m3292j56065J81300
5920H77522J55069j27812j93825j70200l8065J70531O7166r3485K20308N2414
$$ plain form
5994 587476 916893 856659 960847 809807 829893 799925 738071 569407 612940 641476 721881
5983 721881 594410 522676 696077 709286 373793 368688 543518 441983 396729 364404 380038
5972 380038 560870 728533 711633 692712 812742 707354 590459 713292 859161 958857
5962 958857 835343 802736 698358 748887 669097 814684 1176714 1013306 766289 982272
5952 982272 1165577 823516 972023 994735 945958 1068701 1420527 1589415 1414531 1075041
5942 1075041 1036867 1012725 1122821 964582 894023 966091 1002975 923654 772134 813623 851676
5931 851676 881971 829857 954039 906803 705517 923680 982166 895579 852287 696222 877522
5920 877522 1032591 904779 710954 540754 502689 673220 740386 646901 867209 919623
5910I19623k31976j03308j27960O7408O6764L7286Q8979K5058j32225J22499O9190
5899H01338k17725J63618o553j37813J847n5032m7936j71568R9918J53099p2935
5888E10258m143J9764Q4403p2250j61767L01135k2021l93437J5813K17592K41772
5877G37119j81122p2429J94888j41170o7491k06424J7776L00035l3320j24936
5867D22926J46166j9445J38818j66652n9686Q3866j69902M0613R2058q9828N560
5856D24494P298M3077j05576O5938R6179m1295J29370j07244K8869K0665j26240
5845D35535q0701J12147j91752k69639M97014J79405k01344K93907r8823l22504
5835C53245O4047p9560N779n338J05822L36844n2078j62081p5360P8341K02778
$$ plain form
5910 919623 687647 584339 456379 523787 590551 627837 716816 741874 609649 732148 801338
5899 801338 583613 747231 740678 602865 604712 549680 501744 330176 430094 583193 510258
5888 510258 506115 525879 610282 538032 376265 677400 655379 261942 277755 495347 737119
5877 737119 555997 483568 678456 537286 469795 263371 281147 581182 547862 422926
5867 422926 569092 549647 688465 521813 462127 545993 376091 416704 508762 418934 424494
5856 424494 431792 474869 369293 435231 531410 490115 619485 512241 541110 561775 435535
5845 435535 354834 466981 275229 5590 502604 682009 480665 774572 675749 353245
5835 353245 417292 337732 343511 338173 443995 780839 728761 566680 491320 569661 772439
5824G72439l06254p8306p136k73905K38662J04613j35473M4878K7154l5739n0562
5813C00371Q368J53370K47442R5267j63301r2692p29L97720l44803n7001L6508
5802E80520j37568M154j15095P9673N1234J07500j6037k0199n4090n8298m0959
5791C80835J86800k6331r4953J22523J95417o144j33135k11286J87095N7650J00598
5780G59069R1152p8433J10271J92907k08395Q7555p7837J5916K93108L1879O6446
5769A283638O9588J49662L9041J06377o1775j36722p0545j3299j3214j50770l24273
5758H77708j42288k1966M6132N9901M0031J2078j03832L8528k09037R884J84355
5747G91494J6739j54334J58626L20665j32643O3554O0737k28367j37113j50920
$$ plain form
5824 772439 466185 387879 380743 106838 345500 450113 314640 359518 386672 350933 300371
5813 300371 308739 462109 709551 804818 641517 548825 548096 945816 601013 544012 580520
5802 580520 442952 447106 332011 411684 462918 570418 554381 534182 480092 421794 380835
5791 380835 567635 541304 446351 568874 764291 758147 625012 413726 600821 658471 759069
5780 759069 850221 771788 882059 1074966 866571 954126 876289 892205 1185313 1217192 1283638
5769 1283638 1353226 1502888 1541929 1648306 1586531 1449809 1379264 1365965 1352751 1201981 877708
5758 877708 735420 713454 759586 819487 859518 871596 767764 806292 597255 607139 791494
5747 791494 808233 653899 812525 1133190 1000547 1064101 1124838 896471 759358 608438
5737F08438j1055J27244r257J19964j55684K87477R5244k36504J24095J77732
5727A127694l2866r432j48926r6338K37547q3398j39008K86661J964K9200j5448
5716A157650j1520K12892j14707j68940K31468L1654j73437r928J02325q4007
5706A173450K0843j48126J300J72362Q3011J08662j78170m51514N1509m1178N5274
5695H47423m9980n7293J59372O4912k34544J12267K66955k00901K42136j61492
5685I88855k15895K867P0524M0866r6326O9991K1721j95599L7490Q090J15020
5674H47604p717j42583r8712j9930K12986Q9424m6651n0358q5500J83295j26239
5663G55619K2883N3124o9670Q321r1730q2475K67097l0877j40473M2933J96334
$$ plain form
5737 608438 597383 724627 715370 835334 679650 967127 1062371 825867 949962 1127694
5727 1127694 1094828 1085396 936470 840132 1077679 994281 855273 1141934 1143898 1173098 1157650
5716 1157650 1146130 1359022 1244315 1075375 1306843 1338497 1165060 1155132 1257457 1173450
5706 1173450 1194293 1046167 1047467 1219829 1302840 1411502 1233332 781818 833327 792149 847423
5695 847423 797443 740150 899522 964434 729890 842157 1109112 908211 1150347 988855
5685 988855 772960 775827 846351 887217 790891 860882 882603 687004 724494 732584 847604
5674 847604 839887 697304 598592 578662 791648 881072 834421 784063 698563 881858 755619
5663 755619 778502 831626 761956 770277 678547 596072 863169 832292 691819 734752 931086
5652I31086J39657k7699j37845j44712M8418K13466P2847J76380j15652j07073
5642A048873K50330M5173K9398J71567l0407K11276J89838L08362J40250k63706
5632B100954k43934J15248K6177j12844m0491k29922l6679r3088j48139l07943
5622A029339J22463q7349J03973j23109j84011J87701N371j40725j8572r5376
5612G99705K19364L8215j47521j0020j33314o1938N4388J05007R1479J45388j07212
5601I93541j87292J87898j00246k17662J94803J38630k95197n7009K77990N31
5591I35987J1787J02991j25451R5756k8033j24199j28648P2495K57838j16401
5581I54122M2048J36536K3163j81960n3713J16564k8781L0136k23952L5551l5594
$$ plain form
5652 931086 1070743 1043044 905199 760487 808905 1022371 1095218 1271598 1155946 1048873
5642 1048873 1299203 1344376 1373774 1545341 1514934 1726210 1916048 2224410 2364660 2100954
5632 2100954 1857020 1972268 1998445 1885601 1845110 1615188 1578509 1485421 1337282 1029339
5622 1029339 1151802 1064453 1168426 1045317 861306 1049007 1054378 913653 895081 799705
5612 799705 1019069 1057284 909763 899743 766429 704491 758879 863886 955365 1100753 993541
5601 993541 806249 994147 893901 676239 871042 1009672 714475 657466 935456 935987
5591 935987 947774 1050765 925314 1021070 993037 868838 740190 812685 1070523 954122
5581 954122 996170 1132706 1155869 973909 920196 1036760 1007979 1038115 814163 849714 814120
5570H14120J7018J3118j63421J44465j5829K46775K1834k50678J30628J44774
5560A102804j72198O8410J68051j31250j3232j3331j9593J31528k00025N2123
5550I73287J11368r7719j35564L63433M1507j04994j36841l00283l3396L34596
5540A015394J93768Q1716k14206n0965n7705m4162J46053K7744K6216J97613j37790
5529A183676k26311j9623k8121L5900J49483q064k6332J38845m36343Q9640J68130
5518A020880q3862j20634j09499Q9188R4980o7117J2323l18836J6644J99709K56632
5507I90408j69396j89785J86033O8307l2519j33082J93863j86054m009J71965
5497H95731k29257n1895O4588L33457p4145j4436K2400j40756J03199K5988j28427
$$ plain form
5570 814120 831138 844256 680835 825300 809471 1056246 1078080 827402 958030 1102804
5560 1102804 930606 999016 1167067 1035817 1022585 1009254 989661 1121189 921164 973287
5550 973287 1084655 986936 851372 1214805 1256312 1151318 1014477 714194 680798 1015394
5540 1015394 1209162 1290878 1076672 1025707 968002 923840 1069893 1097637 1123853 1321466 1183676
5529 1183676 957365 937742 909621 945521 1095004 1086940 1060608 1199453 763110 852750 1020880
5518 1020880 937018 816384 706885 796073 891053 823936 836259 517423 534067 733776 990408
5507 990408 821012 631227 817260 885567 853048 719966 913829 727775 723766 895731
5497 895731 666474 614579 679167 1012624 938479 924043 946443 805687 908886 934874 806447
5486H06447O0940l4486o340J93278M470N332r842M0783N9549K8295k03599K1588
5474I66415j11829j93053j5351J49299K55994Q2091j57485J642m3403J59215M5713
5463A139248J880J71034J8922k37706j04684n6298R4084Q4877m3021J53335j28891
5452A092780J54254n3182J71241k13271J7227m4078o9105L3746R604m9241r5411
5441I54564J32348p4234N136M3035J2363l3320P1243l2203J23551j01237l3962
5430A067284K23938K20059M0065l15093k80230J15824L3624m4857N4784J02786
5420A218184q6759Q3064J30134q9493l9798k01359J66395J18808k96112J21516
5410A124580J72751k5370j7345L9531j01622p8657J22309k823J0900o0918J25767
$$ plain form
5486 806447 867387 832901 826561 1019839 1024309 1029641 1019799 1060582 1120131 1148426 944827 966415
5474 966415 854586 661533 646182 795481 1051475 1133566 976081 977723 934320 1093535 1139248
5463 1139248 1141128 1312162 1331084 1093378 988694 932396 1026480 1111357 1068336 1221671 1092780
5452 1092780 1247034 1193852 1365093 1151822 1169049 1124971 1055866 1089612 1099216 1049975 954564
5441 954564 1086912 1012678 1017814 1060849 1073212 1039892 1111135 1078932 1202483 1101246 1067284
5430 1067284 1291222 1511281 1551346 1236253 956023 1071847 1105471 1060614 1115398 1218184
5420 1218184 1131425 1214489 1344623 1255130 1215332 1013973 1180368 1299176 1003064 1124580
5410 1124580 1297331 1271961 1254616 1294147 1192525 1113868 1236177 1233354 1244254 1183336 1309103
5399A309103j7133p6244q0641J28068M8021q156m570j30154J77940M5938M6102
5388A438274K9591p4946n6872R76J85215J76109J60j54142r8013j14801m0569
5377A290982R5358j0296j11743M2940o7358n7538K5417L2417K72471j49611l05516
5366A057523k872N1873j9083J64117J59635L0244j16293J1246J3299j2960K68586
5355A605315o190j90408P7212L8284q5956L9094J56725k81485O2303j7256Q7529
5344A485167N4824k45745j28315J00082J52937J86311j65050k2464J41636n6049
5334A503334k3638J63257J12510l62090k2942J07493r1541J66198J31599K7569
5324A711749J40712j19390k27569J98074K55473K1589j75920q422K36323j42386
$$ plain form
5399 1309103 1291970 1215726 1135085 1263153 1311174 1303018 1298448 1168294 1346234 1392172 1438274
5388 1438274 1467865 1392919 1336047 1337023 1522238 1698347 1698507 1544365 1446352 1331551 1290982
5377 1290982 1386340 1376044 1264301 1307241 1239883 1182345 1207762 1240179 1512650 1363039 1057523
5366 1057523 1054651 1106524 1087441 1251558 1411193 1441437 1325144 1336390 1349689 1336729 1605315
5355 1605315 1599125 1408717 1485929 1524213 1438257 1477351 1634076 1352591 1414894 1397638 1485167
5344 1485167 1539991 1294246 1165931 1266013 1418950 1605261 1440211 1417747 1559383 1503334
5334 1503334 1479696 1642953 1755463 1393373 1370431 1477924 1386383 1552581 1684180 1711749
5324 1711749 1852461 1733071 1505502 1703576 1959049 1980638 1804718 1796296 2032619 1890233
5314A890233K2479j63251M9136J45973M2146J48114o7550j85355l6235J9701K8064
5303A893455J06837k3102j5352N8946J10927J22982m9617k30940p0187J1491J24518
5292B039958q3688K140K90367J4005J1223R3782j20355M3772J64522J4508J21749
5281B591983l4896l8987l51473J16829J61010L23048j07836O9441j12464P6108
5271B692763Q6235l05274K70643n9481J27933O1438j72988J47011N9420K4863
5261B932563J08730O4708M2586q961o9327J29909L47240k15402K11878J00923
5251C644847r5749k5706Q6622m5256J23058J7097P8015J47736J05368M5271m3095
5240D038208o4995J35483J79987j1064m2634M3199K75025q5871K07133N4861j45648
$$ plain form
5314 1890233 1912712 1749461 1798597 1944570 1986716 2134830 2067280 1881925 1845690 1865391 1893455
5303 1893455 2000292 1977190 1961838 2020784 2131711 2254693 2205076 1974136 1903949 1915440 2039958
5292 2039958 1956270 1958410 2248777 2262782 2274005 2367787 2247432 2291204 2455726 2470234 2591983
5281 2591983 2557087 2518100 2166627 2283456 2444466 2767514 2659678 2729119 2616655 2692763
5271 2692763 2778998 2473724 2744367 2684886 2812819 2874257 2701269 2848280 2907700 2932563
5261 2932563 3041293 3106001 3148587 3139626 3070299 3200208 3547448 3332046 3543924 3644847
5251 3644847 3549098 3523392 3610014 3564758 3687816 3704913 3782928 3930664 4036032 4081303 4038208
5240 4038208 3973213 4108696 4288683 4277619 4234985 4278184 4553209 4467338 4674471 4729332 4583684
5229D583684m8941J15673J37373L4969M6665J834J88537R4482o5835P7858p3956
5218E092343K35359l9227K68685r7293P2870p3247j33122O8045n2023M892j21764
5207E225518P7654j71191K1588J38172l26809m7500J26486o1045Q8374M4886n9833
5196E056300j63630Q9635m5951K10871k98368J4356K58442O4252k90558o4073
5186D831276J80084n068k25790R8727J5902l22749L4082k3239r066j63708M9486
5175D459937l76959p3411J37564L7033R6835J38884q6701n2535k29345p3183J19791
5164D097910o0090K50365l1705n319l9193P3492k05856k36508n7283n5300L9633
5153C770146J25606p9994m0704k52446n760R9758m1221l11592l8822J0794m4827
$$ plain form
5229 4583684 4534743 4650416 4787789 4822758 4869423 4871257 5059794 5154276 5088441 5166299 5092343
5218 5092343 5327702 5288475 5557160 5459867 5532737 5459490 5326368 5394413 5342390 5347282 5225518
5207 5225518 5303172 5131981 5153569 5291741 4964932 4917432 5043918 4982873 5071247 5116133 5056300
5196 5056300 4892670 4982305 4936354 5147225 4848857 4863213 5121655 5185907 4895349 4831276
5186 4831276 5011360 5006292 4780502 4879229 4895131 4572382 4606464 4583225 4574159 4410451 4459937
5175 4459937 4082978 4009567 4147131 4184164 4280999 4419883 4333182 4280647 4051302 3978119 4097910
5164 4097910 4037820 4288185 4256480 4251161 4211968 4285460 4079604 3843096 3785813 3730513 3770146
5153 3770146 3895752 3815758 3775054 3522608 3516848 3616606 3575385 3263793 3224971 3235765 3190938
5142C190938J86003P9055K2288j71686l43286q1988K35119J53972j18667j13540
5132C038208j39201j16007o0302M8737J44291p6293k412m5235r2336L7412O4946
5121B801808J2521J45188J15991j69421j2730j62454o342p0510j47375R9805p9753
5110B526728o2784j10029J44745j68982j09594L70994j50887j14923j2635J8113
5100B330746q950k30427L01620k6456J00106k9373p8552k926k75344K20076L812
5089B304332j34522m6292j13430N9746j89069K16064K41780n6434j82352j02704
5079A997119J13249L8633R0861j07101J60673j21968j19650J8785j50016j01693
5069A818892J3392P8938r9208m1896j07360q689j18898M9945N0588K23041J24081
$$ plain form
5142 3190938 3376941 3455996 3478284 3306598 2963312 2881324 3116443 3270415 3151748 3038208
5132 3038208 2899007 2783000 2722698 2771435 2915726 2839433 2837021 2791786 2699450 2736862 2801808
5121 2801808 2814329 2959517 3075508 2906087 2893357 2730903 2724561 2654051 2506676 2606481 2526728
5110 2526728 2463944 2353915 2498660 2329678 2220084 2591078 2440191 2325268 2312633 2330746
5100 2330746 2321796 2091369 2392989 2366533 2466639 2437266 2358714 2355788 2080444 2300520 2304332
5089 2304332 2169810 2123518 2010088 2069834 1880765 2096829 2338609 2282175 2099823 1997119
5079 1997119 2110368 2149001 2239862 2132761 2293434 2171466 2051816 2070601 1920585 1818892
5069 1818892 1832284 1911222 1812014 1770118 1662758 1654069 1535171 1585116 1635704 1858745 1982826
5058A982826r8267j7488j14152j10770M0733k758R8187r9001Q428O6750l3309
5047A721179M3462q04R1392R1664j49451p2727j1128J8543R9873n6095k12776
5036A563132K0172R3369j6996R5364o458L8164q0012k71379M741J57547J14904
5025A712548j11201r2951o0002J33440K7363k22446K58124k6181k25939J50317
5015A543072M8990N9128j14682L3551J05096k38881K616J85861j89151M2804p0426
5004A407978J58235l3705O4901R2437K6327K770J35307j71989o9047L0046k7504
4993A615756j11976K5717p6591M9954J21280j90047K66106k67402q3438J35770
4983A485129K25119j27724j63948j33010R7298j8620J71410R609K30029l5909
$$ plain form
5058 1982826 1884559 1867071 1752919 1642149 1682882 1680124 1778311 1679310 1687738 1754488 1721179
5047 1721179 1764641 1763837 1855229 1946893 1797442 1724715 1713587 1732130 1832003 1775908 1563132
5036 1563132 1583304 1676673 1659677 1755041 1748583 1786747 1706735 1435356 1440097 1597644 1712548
5025 1712548 1601347 1508396 1448394 1581834 1609197 1386751 1644875 1618694 1392755 1543072
5015 1543072 1592062 1651190 1536508 1570059 1675155 1436274 1438890 1624751 1435600 1478404 1407978
5004 1407978 1566213 1532508 1597409 1689846 1716173 1718943 1854250 1682261 1613214 1643260 1615756
4993 1615756 1503780 1529497 1452906 1502860 1624140 1434093 1700199 1432797 1349359 1485129
4983 1485129 1710248 1582524 1418576 1285566 1382864 1364244 1535654 1545263 1775292 1739383
4973A739383j19617j09167P0208o2657J6993Q7277K6199J15200l4095j10114K00735
4962A820345j25618r4805J6438m8738j9946P8799l3530J49440J05065r0044k28493
4951A528913K21359j18240j10505Q1698n2831K03291j37225j32482J51220o2725
4941A572473K644r3392o0683J24052p158R3540Q0919J408M6390J87026P2631j8299
4929B001551j96294j04190O0041J76335J32167Q3048k11791P9038J57243l2471
4919B144677L6460J21041o6619M1012Q9742m2018j38377R5427j38960k757J12097
4908B251725j06399J38163O3590p1942k8008j3647K23411K7173K7719K481J830
4897B516096P6021L4179l26675J60112J03865P15Q2230L26715j86626J58511L63106
$$ plain form
4973 1739383 1619766 1510599 1580807 1518150 1535143 1622420 1648619 1763819 1729724 1619610 1820345
4962 1820345 1694727 1599922 1616360 1567622 1547676 1626475 1592945 1742385 1847450 1757406 1528913
4951 1528913 1750272 1632032 1521527 1603225 1550394 1753685 1616460 1483978 1635198 1572473
4941 1572473 1575117 1481725 1421042 1545094 1537936 1631476 1712395 1713803 1760193 1947219 2019850 2001551
4929 2001551 1805257 1701067 1761108 1937443 2069610 2152658 1940867 2019905 2177148 2144677
4919 2144677 2181137 2302178 2235559 2276571 2366313 2324295 2185918 2281345 2142385 2139628 2251725
4908 2251725 2145326 2283489 2347079 2275137 2247129 2233482 2456893 2484066 2511785 2514266 2516096
4897 2516096 2592117 2626296 2299621 2459733 2563598 2564313 2646543 2973258 2786632 2945143 3308249
4886C308249j51295O7214k12127J10178j63541j0332l1730j34368j33787O4369
4876B712830J036k8857M040o9176J6553j51469J50540J6153M8311j30971Q7697
4865B656687J24174j63038o0444J99532J9747J58026o68o7717J45516k24766p4238
4854B712811J71214j72529q119J3818k58541k02057P0257K39958K4222N9210n0561
4843B599683j26345j69881L8555J49922J1972q2399j9245q4709l9853j49306j08790
4832B019604K19049j07344r0372O6154K61506q7353P4830M4323j07665r262q6615
4821B196855j89056L8952J89773j58157q3285q7675k3270J25065k81704k58629
4811A468869K31992K0669K55422M0169O3037N6189k17225p6173k48216J73483
$$ plain form
4886 3308249 3156954 3224168 3012041 3122219 2958678 2948346 2916616 2782248 2648461 2712830
4876 2712830 2713866 2685009 2689049 2619873 2636426 2484957 2635497 2651650 2699961 2568990 2656687
4865 2656687 2780861 2617823 2557379 2756911 2776658 2934684 2934016 2866299 3011815 2787049 2712811
4854 2712811 2884025 2711496 2703377 2717195 2458654 2256597 2326854 2566812 2591034 2650244 2599683
4843 2599683 2473338 2303457 2342012 2491934 2503906 2421507 2402262 2317553 2277700 2128394 2019604
4832 2019604 2238653 2131309 2040937 2107091 2368597 2281244 2356074 2400397 2292732 2283470 2196855
4821 2196855 2007799 2046751 2236524 2078367 1995082 1907407 1884137 2009202 1727498 1468869
4811 1468869 1700861 1721530 1976952 2017121 2080158 2136347 1919122 1842949 1594733 1768216
4801A768216R5653j08641K66022m6324K7321j77468j69562j25423M4991J63451
4791A738236j42195m9864J20996j8910L4201j12258K0677r837J3101j52310J12793
4780A554630K9333j41753M8602K9699J88039Q779j42405j48177L7398j2108q0869
4769A371168o056l3643N3637q792r1346m3068o3015J93339P6622k07712j00618
4758A140516r4784K56499k38684j31654N8439j32890M7522k0654N2988j17991
4748H19307M770J93368K2013K65552N6186O7909j51075l98566j33405J30792L68204
4737A245055k52056j97976R6085J61607N2248q9572o1126j8748J63252j67823
4727I30946o1566n1582k97012J38671K50969J24871j6371j10973m8648l346k21655
$$ plain form
4801 1768216 1863869 1755228 2021250 1974926 2002247 1824779 1655217 1529794 1574785 1738236
4791 1738236 1596041 1546177 1667173 1648263 1682464 1570206 1590883 1581046 1594147 1441837 1554630
4780 1554630 1583963 1442210 1490812 1520511 1708550 1717329 1574924 1426747 1464145 1452037 1371168
4769 1371168 1365112 1331469 1385106 1376314 1284968 1241900 1178885 1372224 1448846 1241134 1140516
4758 1140516 1045732 1302231 1063547 931893 990332 857442 904964 884310 937298 819307
4748 819307 824077 1017445 1039458 1305010 1361196 1429105 1278030 879464 746059 876851 1245055
4737 1245055 992999 795023 891108 1052715 1104963 1015391 954265 935517 1098769 930946
4727 930946 869380 817798 520786 659457 910426 1035297 1018926 907953 859305 855959 634304
4716F34304j45167L2162K14600N8885J20834P2043k78978j3769J9461J82696R2946
4705I90017k2295J5757Q1024j16210J80555k41312n0941k1131O3438N2998n9714
4694H72186M9572k47715P7948q3284O6454j96197m7795J25678r6109k25791J89890
4683D84837P9592k13066K006K29982j74500P8990l1339J0752L2788o0947j03641
4672C35454J12943j7504N3448R2740P5548p3986l3842j11873k55057K64001J66908
4661F08780m4423k01057O922J07943K9806J89230k412n7824k57950q3912Q7060
4650C82163k0744J00239K4554j19652K10194M0701L0690J54122j12392k00646
4640D89229j78609q786P9067J10146o3709j37949J23767q2213r6623m9425J05568
$$ plain form
4716 634304 489137 521299 735899 794784 915618 987661 708683 694914 714375 897071 990017
4705 990017 967722 983479 1064503 948293 1128848 887536 836595 815464 878902 931900 872186
4694 872186 921758 674043 751991 668707 735161 538964 491169 616847 520738 294947 484837
4683 484837 564429 351363 353369 583351 408851 487841 456502 467254 500042 439095 335454
4672 335454 448397 430893 484341 577081 652629 578643 544801 432928 177871 441872 608780
4661 608780 564357 363300 370222 478165 507971 697201 694789 636965 379015 295103 382163
4650 382163 361419 461658 486212 366560 576754 617455 648145 802267 689875 489229
4640 489229 310620 301834 380901 491047 427338 289389 413156 330943 234320 184895 290463
4629B90463J08402o8058o2365k9294J45219K1174J38266k07293R5421p1904J71971
4618E32002L4690m3086j77979M4293J89898j63829r0191K14189j10042m6575j2247
4607C71123J39076N8885q7112p3417o8107J71073j70042O2447P2718R0228j51589
4596D15283J16035l900r9479m9006j93282J04493P6161l7338J3619o5593l4576
4585B42417M7416J98142k7315k38670j75888J63052j99265N2183L44528N0798
4575D57398r6849J81605K45479j83622q7088N4566j60378k30096r7253J19447
4565B03209J15461P7037K1734P4360p0056Q8539k5254l05212r4689n4173L47614
4554C78570o2883k36887K3469R3160J34916k2001j19126P1061J11526Q506k24323
$$ plain form
4629 290463 398865 330807 268442 239148 384367 405541 543807 336514 431935 360031 532002
4618 532002 566692 523606 345627 389920 579818 415989 325798 539987 429945 383370 371123
4607 371123 510199 569084 481972 408555 340448 511521 341479 403926 476644 566872 415283
4596 415283 531318 527418 427939 378933 185651 290144 366305 328967 342586 276993 242417
4585 242417 289833 487975 460660 221990 46102 209154 9889 62072 406600 457398
4575 457398 360549 542154 787633 604011 516923 571489 411111 181015 83762 203209
4565 203209 318670 395707 417441 491801 421745 510284 485030 179818 85129 30956 378570
4554 378570 315687 78800 102269 195429 330345 308344 189218 260279 371805 380311 155988
4543A55988J58181q930N0628j96270J03395J9756l7551J62560N926j1674l8141
4532C63868n9567J06956j14326J42672n2232K22P4462K417j21162k19399j46700
4521b2789K51305K20235K881p000n1604J2818k3985q6225N6290J91080J1647q3038
4509D71615k07351Q756k6499p3317o3325J12094p2491K76312K8782k43257j10636
4498A00683J23600K032O9209K0744k07779K5471k80628J56079K54184K9311k5422
4487B67484l29539L2866J20051L14872r060J7022O6476p5256J34050j29079j19328
4476B90559j24048j32906J34750J05748j30463n1472R337p945N8018M3864J66761
4465C62203q4799J30468K6225l80570k12589N7152J02895L8726K7539J75819m5411
$$ plain form
4543 155988 314169 305239 355867 159597 262992 282748 245197 407757 413683 402009 363868
4532 363868 304301 411257 296931 439603 387371 387593 462055 464472 343310 123911 -22789
4521 -22789 228516 448751 451632 444632 393028 405846 381861 295636 351926 543006 554653 471615
4509 471615 264264 273020 246521 173204 109879 221973 149482 425794 454576 211319 100683
4498 100683 224283 226315 295524 316268 108489 133960 -146668 9411 263595 292906 267484
4487 267484 -62055 -29189 90862 405734 396674 413696 480172 404916 538966 409887 290559
4476 290559 166511 33605 168355 274103 143640 92168 101505 93560 151578 195442 362203
4465 362203 277404 407872 434097 53527 -159062 -101910 985 39711 67250 243069 197658
4454A97658N8671J76326l5344k28361p8878j23382J19668n1347l7560L086J01170
4443A01707j99935L3569J62538k2971P5251O0257k4163o7132j16714l0208J19095
4432I1294P7539K11645j46852j14183O4375j3139O1247l4341q0619J1913L43618
4421D72497j06374j53050k3246O1181l855J05833k54201n3629J08386N1025j06137
4410I8430k535K5454l3219p5937R9355R0250j57453J66704j61665R7128j3573
4399A32939J42996j40471P4635j43205n2134N699J5258l1514J81604L7171p7959
4388A45019j2859l179j14278J60264J3629j9058L6309P3045L2595n3686J4914
4377B72715m2015Q3808N0230k29620P8779p0242M757O1431J39196k28810j37599
$$ plain form
4454 197658 256329 432655 397311 168950 90072 -33310 86358 35011 -2549 537 101707
4443 101707 -98228 -64659 97879 74908 150159 210416 186253 119121 2407 -27801 91294
4432 91294 168833 380478 233626 119443 183818 170679 231926 197585 116966 128879 472497
4421 472497 366123 213073 189827 251008 247153 352986 98785 45156 153542 204567 98430
4410 98430 95895 121349 88130 12193 111548 201798 44345 211049 49384 146512 132939
4399 132939 275935 135464 210099 66894 14760 20459 35717 4203 185807 222978 145019
4388 145019 132160 128981 14703 174967 188596 169538 205847 278892 311487 257801 272715
4377 272715 230700 314508 364738 135118 213897 143655 148412 209843 349039 120229 -17370
4366a7370J63594o7317o2500J07014O9999J2323j07882m1931L5814J5609J3916
4355A21269n3538o3954N6900q9356p7958M4194m7826K18423l4376J0736m7344
4344C7170J55309j1272q4211j23604j63872M1858K59954J43564N130p022r2338
4333A60666R8647l7023O1217k74115j66612Q3671K36719J09528j39911j1714J2528
4322A33601J31991M1369j90633o1901q1065K146L17129m45320L8637M5266J35837
4311F7057K959l37360K50258J73977L8724J0598p7867o7529Q7766m9153m3187
4300E6243L70020r6889K6289j96693m7224J54942j87666j97471q985J40168K19988
4289B32722k21177J3802m8251R3039N1397p388Q1889k21718k7447J18192R5478
$$ plain form
4366 -17370 146224 78907 16407 123421 193420 205743 97861 55930 91744 107353 121269
4355 121269 67731 3777 60677 -28679 -106637 -62443 -110269 108154 73778 84514 37170
4344 37170 192479 181207 96996 -26608 -190480 -148622 111332 254896 260026 253004 160666
4333 160666 259313 222290 283507 9392 -157220 -73549 163170 272698 132787 121073 133601
4322 133601 265592 306961 116328 54427 -26638 -24492 292637 -152683 -114046 -68780 67057
4311 67057 70016 -267344 -17086 156891 195615 206213 128346 60817 148583 99430 56243
4300 56243 426263 329374 355663 158970 111746 266688 79022 -118449 -127434 12734 232722
4289 232722 11545 25347 -22904 70135 121532 114144 196033 -25685 -53132 65060 160538
4278A60538r1872k2040Q302M4717m4344K4227j19777J43127M6755o5779r1503
4267g649K7560j14620L4283R6504J90828j00115j59323o3576J71442P7755n2978
4256A00111n3495m3199N3242k0455k23276R3227m3365r8575K63626K06550J35987
4245C70378j35631N3779k62364L1951j33627L0866J1760j5144J53439J4837j45011
4234b4767K947K13736j47712n8233J15444J34363m0954j74042J26619J34731J4068
$$ plain form
4278 160538 68666 46626 54928 99645 55301 79528 -40249 102878 149633 83854 -7649
4267 -7649 19911 -94709 -60426 36078 226906 126791 -32532 -96108 75334 153089 100111
4256 100111 46616 3417 56659 36204 -187072 -93845 -137210 -235785 27841 234391 370378
4245 370378 234747 288526 26162 58113 -75514 -44648 -32888 -48032 105407 120244 -24767
4234 -24767 -21820 191916 44204 -14029 101415 235778 194824 20782 147401 282132 296200
$$ [...]
##END NTUPLES=NMR SPECTRUM
##END=
