##TITLE=1H_CG-1184
 CDCl3
 8 sc, 
 11.1.2024
##JCAMPDX= 6.0         $$ Bruker NMR JCAMP-DX V2.0
##DATA TYPE= NMR SPECTRUM
##DATA CLASS= NTUPLES
##ORIGIN= UXNMR, Bruker Analytische Messtechnik GmbH
##OWNER= root
$$ XWIN-NMR		Version 3.5
$$ Thu Jan 11 14:01:01 2024 Russian Standard Time (UT+4h)  she@DPX200
##.OBSERVE FREQUENCY= 200.1313
##.OBSERVE NUCLEUS= ^1H
##.ACQUISITION MODE= SIMULTANEOUS
##.ACQUISITION SCHEME= undefined
##.AVERAGES= 8
##.DIGITISER RES= 18
##SPECTROMETER/DATA SYSTEM= spect
##.PULSE SEQUENCE= zg30
##.SOLVENT NAME= CDCl3
##.SHIFT REFERENCE= (INTERNAL, CDCl3, 0, 15.4692)
##AUDIT TRAIL= $$ (NUMBER, WHEN, WHO, WHERE, WHAT)
$$ ##TITLE= Audit trail, XWIN-NMR		Version 3.5
$$ ##JCAMPDX= 5.01
$$ ##ORIGIN= Bruker BioSpin GmbH
$$ ##OWNER= she
$$ F:/spectra/data/she/nmr/H-F/1/pdata/1/auditp.txt
$$ ##AUDIT TRAIL=  $$ (NUMBER, WHEN, WHO, WHERE, WHAT)
(   1,<2024-01-11 13:59:52.04 +0400>,<she>,<DPX200>,
      <created by zg, POWCHK disabled, PULCHK disabled
       configuration hash MD5:
       00 E9 B6 7A A2 85 ED C7 34 08 36 98 17 FE 4E 26
       data hash MD5: 16K
       2C 2F 95 D9 79 B1 E5 4C 6E CD 75 90 10 30 CD 12>)
(   2,<2024-01-11 13:59:54.10 +0400>,<she>,<DPX200>,
      <Start of raw data processing
       efp BC_mod = 2 LB = 0.24 FT_mod = 6 PKNL = 1 PHC0 = -24589.43 PHC1 = 8.252729 SI = 16K 
       data hash MD5: 16K
       DE CD 56 9C FE 8D 47 13 DC D0 2C 5C 7A AB 84 F2>)
(   3,<2024-01-11 14:00:09.92 +0400>,<she>,<DPX200>,
      <pk PHC0 = 0.7302278 PHC1 = 0 
       data hash MD5: 16K
       FF E4 08 C0 5C F0 D4 8A 1B 60 AF 69 89 F1 9D 03>)
(   4,<2024-01-11 14:00:13.35 +0400>,<she>,<DPX200>,
      <abs ABSG = 5 
       data hash MD5: 16K
       51 4D 82 20 E9 80 57 24 DF 6D E5 5A BF 66 91 EB>)
$$ ##END=
$$ 
$$ hash MD5
$$ 07 D0 A4 06 68 E3 36 62 B6 F4 E9 8C 10 2E F0 82
##$RELAX= 
##$RELAX= 
##$RELAX= 
##$RELAX= 
##$RELAX= 
##$RELAX= 
$$ Bruker specific parameters
$$ --------------------------
##$DU= <F:/spectra>
##$EXPNO= 1
##$NAME= <H-F>
##$PROCNO= 1
##$TYPE= <nmr>
##$USER= <she>
##$AMP= (0..31)
100 100 100 100 100 100 100 100 100 100 100 100 100 100 100 100 100 100 
100 100 100 100 100 100 100 100 100 100 100 100 100 100 
##$AQSEQ= 0
##$AQ_mod= 1
##$AUNM= <au_zg>
##$AUTOPOS= <>
##$BF1= 200.13
##$BF2= 200.13
##$BF3= 200.13
##$BF4= 200.13
##$BF5= 200.13
##$BF6= 200.13
##$BF7= 200.13
##$BF8= 200.13
##$BYTORDA= 1
##$CFDGTYP= 0
##$CFRGTYP= 5
##$CHEMSTR= <none>
##$CNST= (0..31)
1 1 145 1 1 1 1 1 1 1 1 1 1 1 1 1 1 1 1 1 1 1 1 1 1 1 1 1 1 1 1 1 
##$CPDPRG= <>
##$CPDPRG1= <>
##$CPDPRG2= <>
##$CPDPRG3= <>
##$CPDPRG4= <mlev>
##$CPDPRG5= <mlev>
##$CPDPRG6= <mlev>
##$CPDPRG7= <mlev>
##$CPDPRG8= <mlev>
##$CPDPRGB= <>
##$CPDPRGT= <>
##$D= (0..31)
0 1.2 0 0 0 0 0 0 0 0.06 0 0.03 0 0 0 0 0.0002 0 0 0 0 0 0 0 0 0 0 0 0 
0 0 0 
##$DATE= 1704967191
##$DBL= (0..7)
120 120 120 120 120 120 120 120 
##$DBP= (0..7)
150 150 150 150 150 150 150 150 
##$DBP07= 0
##$DBPNAM0= <>
##$DBPNAM1= <>
##$DBPNAM2= <>
##$DBPNAM3= <>
##$DBPNAM4= <>
##$DBPNAM5= <>
$$ [...]
##$SUBNAM3= <"">
##$SUBNAM4= <"">
##$SUBNAM5= <"">
##$SUBNAM6= <"">
##$SUBNAM7= <"">
##$SUBNAM8= <"">
##$SUBNAM9= <"">
##$SW= 18.0517328524113
##$SWIBOX= (0..15)
0 0 2 0 0 0 0 0 0 0 0 0 0 0 0 0 
##$SW_h= 3612.71676300578
##$TD= 16384
##$TD0= 1
##$TE= 0
##$TE2= 300
##$TE3= 300
##$TEG= 300
##$TL= (0..7)
0 120 120 120 120 120 120 120 
##$TP= (0..7)
150 150 150 150 150 150 150 150 
##$TP07= 0
##$TPNAME0= <>
##$TPNAME1= <>
##$TPNAME2= <>
##$TPNAME3= <>
##$TPNAME4= <>
##$TPNAME5= <>
##$TPNAME6= <>
##$TPNAME7= <>
##$TPOAL= (0..7)
0.5 0.5 0.5 0.5 0.5 0.5 0.5 0.5 
##$TPOFFS= (0..7)
0 0 0 0 0 0 0 0 
##$TUNHIN= 0
##$TUNHOUT= 0
##$TUNXOUT= 0
##$USERA1= <user>
##$USERA2= <user>
##$USERA3= <user>
##$USERA4= <user>
##$USERA5= <user>
##$V9= 5
##$VALIST= <valist>
##$VCLIST= <CCCCCCCCCCCCCCC>
##$VD= 0
##$VDLIST= <DDDDDDDDDDDDDDD>
##$VPLIST= <PPPPPPPPPPPPPPP>
##$VTLIST= <TTTTTTTTTTTTTTT>
##$WBST= 1024
##$WBSW= 4
##$XGAIN= (0..3)
0 0 0 0 
##$XL= 0
##$YL= 0
##$YMAX_a= 101258
##$YMIN_a= -152297
##$ZGOPTNS= <>
##$ZL1= 120
##$ZL2= 120
##$ZL3= 120
##$ZL4= 120
##$ABSF1= 15.53644
##$ABSF2= -2.515411
##$ABSG= 5
##$ABSL= 3
##$ALPHA= 0
##$AQORDER= 0
##$ASSFAC= 0
##$ASSFACI= 0
##$ASSFACX= 0
##$ASSWID= 0
##$AUNMP= <proc_1d>
##$AZFE= 0.1
##$AZFW= 0.1
##$BCFW= 0
##$BC_mod= 2
##$BYTORDP= 0
##$COROFFS= 0
##$CY= -3
##$DATMOD= 1
##$DC= 0
##$DFILT= <>
##$DTYPP= 0
##$F1P= 0
##$F2P= 0
##$FCOR= 1
##$FTSIZE= 16384
##$FT_mod= 6
##$GAMMA= 0
##$GB= 0
##$INTBC= 1
##$INTSCL= 3.70164e-10
##$ISEN= 128
##$LB= 0.24
##$LEV0= 0
##$LPBIN= 0
##$MAXI= 10000
##$MC2= 0
##$MEAN= 0
##$ME_mod= 0
##$MI= 1.114404
##$NCOEF= 0
##$NC_proc= -8
##$NLEV= 6
##$NOISF1= 3.799351
##$NOISF2= 2.8
##$NSP= 0
##$NTH_PI= 0
##$NZP= 0
##$OFFSET= 15.46924
##$PC= 1
##$PHC0= -24588.7
##$PHC1= 8.252729
##$PH_mod= 1
##$PKNL= yes
##$PPARMOD= 0
##$PSCAL= 0
##$PSIGN= 0
##$REVERSE= no
##$SF= 200.130010499145
##$SI= 16384
##$SIGF1= 3
##$SIGF2= 2
##$SINO= 5.538805
##$SIOLD= 16384
##$SREGLST= <1H.CDCl3>
##$SSB= 0
##$STSI= 16384
##$STSR= 0
##$SW_p= 3612.71676300578
##$SYMM= 0
##$S_DEV= 0
##$TDeff= 16384
##$TDoff= 0
##$TI= <>
##$TILT= no
##$TM1= 0
##$TM2= 0
##$TOPLEV= 0
##$USERP1= <user>
##$USERP2= <user>
##$USERP3= <user>
##$USERP4= <user>
##$USERP5= <user>
##$WDW= 1
##$XDIM= 16384
##$YMAX_p= 310616275
##$YMIN_p= -1052294
$$ End of Bruker specific parameters
$$ ---------------------------------
##NTUPLES= NMR SPECTRUM
##VAR_NAME=  FREQUENCY,     SPECTRUM/REAL,   SPECTRUM/IMAG
##SYMBOL=    X,             R,               I
##VAR_TYPE=  INDEPENDENT,   DEPENDENT,       DEPENDENT
##VAR_FORM=  AFFN,          ASDF,            ASDF
##VAR_DIM=   16384,         16384,           16384
##UNITS=     HZ,            ARBITRARY UNITS, ARBITRARY UNITS
##FACTOR=    0.220516191357247, 1,           1
##FIRST=     3095.85920135804, 0,            0
##LAST=      -516.85756164774, 0,            0
##MIN=       -516.85756164774, -1052294,     0
##MAX=       3095.85920135804, 310616275,    0
$$ Real data points
##PAGE= N=1
##DATA TABLE= (X++(R..R)), XYDATA
$$ [...]
6281F455123L97048j63495J87020O15505j78556m9740k90204n21997J7437m48966
$$ 6455123 6852171 6688676 6875696 7491201 7312645 7262905 6972701 6450704 6468141 6019175
6271F019175l24074K30563m30866M04035J47680k0197L47585M31823P6948J85241
$$ 6019175 5695101 5925664 5494798 5898833 6046513 6026316 6373901 6805724 6882672 7067913
6261G067913K16972j08705k94590J47744M99398J9682j81356p8505J22966L51433
$$ 7067913 7284885 7176180 6881590 7029334 7528732 7548414 7367058 7288553 7411519 7762952
6251G762952j954Q8919l50105k17001O95n11565q99480Q4022K32702M94204K20322
$$ 7762952 7760998 7849917 7499812 7282811 7283506 6771941 5872461 5956483 6189185 6683389 6903711
6240F903711J2449k48902M87254K48579k3334J24166j72621o8237J51908K30122
$$ 6903711 6916160 6667258 7154512 7403091 7379757 7503923 7331302 7263065 7414973 7645095
6230G645095j87525m3914K00065J42545j16338j02562m42045m81656k31627O1726
$$ 7645095 7457570 7413656 7613721 7756266 7639928 7537366 7095321 6613665 6382038 6443764
6220F443764J17714Q3446K00184k93366Q7143j38745K60884R1232J53712M23777
$$ 6443764 6561478 6644924 6845108 6551742 6638885 6500140 6761024 6852256 7005968 7429745
6210G429745L04205J32645k66717k36512J07549M70870J51317k93862l63455j0422
$$ 7429745 7733950 7866595 7599878 7363366 7470915 7941785 8093102 7799240 7435785 7425363
6200G425363k0839M394L01341k12970j66547L43196L73885l17961J47484K04855
$$ 7425363 7404524 7408918 7710259 7497289 7330742 7673938 8047823 7729862 7877346 8082201
6190H082201K93008L81867M08806J13029J35828q7419K33368L84795K67331K29041
$$ 8082201 8375209 8757076 9165882 9278911 9414739 9327320 9560688 9945483 10212814 10441855
6180A0441855q0455M97502L12552Q3636K26595M19213P54857L54253M81669M95437
$$ 10441855 10361400 10858902 11171454 11255090 11481685 11900898 12655755 13010008 13491677 13987114
6170A3987114N46453O34169K85322Q11906R40664Q38793P71000P83828J045947
$$ 13987114 14533567 15167736 15453058 16264964 17205628 18044421 18815421 19599249 20645196
6161B0645196J438876J507048K065985K087568K717581L655471M835027N437149
$$ 20645196 22084072 23591120 25657105 27744673 30462254 34117725 38952752 44389901
6153D4389901O157508O821571N235225P72202l341185n177226m804583l955470
$$ 44389901 50547409 57368980 62604205 63376407 60035222 54857996 50053413 46097943
6145D6097943k202201k4962J316643J941381L778082M576666L633151J177941
$$ 46097943 43895742 43870780 45187423 47128804 50906886 55483552 59116703 60294644
6137F0294644r05532j111660Q14415K727783M156892M010093J938253j545235
$$ 60294644 59389112 58277452 59091867 61819650 65976542 69986635 71924888 70379653
6129G0379653m883020n540331l903776k565435n44096J469271K209886J146561
$$ 70379653 65496633 59956302 56052526 53487091 52942995 54412266 56622152 57768713
6121E7768713j902069l710023l817866k888511p90019O72529K276528L995103
$$ 57768713 55866644 52156621 48338755 45450244 44660225 45332754 47609282 51604385
6113E1604385N378572N578650L376905j764439p452593q727105q104777o921801
$$ 51604385 56982957 62561607 65938512 64174073 56721480 47994375 39889598 32967797
6105C2967797m677716l119939k596682k508913k382428j821055r06656m92239
$$ 32967797 28290081 25170142 22573460 20064547 17682119 15861064 14954408 14462169
6097A4462169j274089p52634k50586k88821o82648o19511p55069j54656j56291
$$ 14462169 13188080 12435446 12184860 11896039 11213391 10593880 9838811 9684155 9527864
6088I527864r3406o08557r32942l08412n26523L92023k00066o78195l21334k93357
$$ 9527864 9434458 8825901 7892959 7584547 7058024 7450047 7249981 6571786 6250452 5957095
6078E957095J23350K97945m18792j1844k91269j85418n03648J95029k10721L09237
$$ 5957095 6080445 6378390 5959598 5947754 5656485 5471067 4967419 5162448 4951727 5260964
6068E260964m74758j43811L796k39784J27228l55250l5665M3190k72637m13403
$$ 5260964 4786206 4642395 4646191 4406407 4533635 4178385 4142720 4185910 3913273 3499870
6058C499870J75296R4266Q1506l16178J72611P9125O0963O0365o6759k06970l26717
$$ 3499870 3675166 3769432 3850938 3534760 3707371 3786496 3847459 3907824 3841065 3634095 3307378
6047C307378L39278Q7812k51773N3315j83668L10704m47019O95899j4450l85138
$$ 3307378 3646656 3734468 3482695 3536010 3352342 3663046 3216027 3911926 3897476 3512338
6037C512338j73913n01507o6256L1120K30027M16149N32515k3352l64903J15199
$$ 3512338 3338425 2836918 2770662 2801782 3031809 3447958 3980473 3957121 3592218 3707417
6027C707417l0983M08373K36130p0492j32474K37625L2723m59548L02716J30330
$$ 3707417 3676434 4084807 4320937 4250445 4117971 4355596 4388319 3928771 4231487 4361817
6017D361817l62024N89262r225k99994L50560K81508k26279M8767k2500P6543
$$ 4361817 3999793 4589055 4579830 4279836 4630396 4911904 4685625 4734392 4711892 4788435
6007D788435O4138k85958J0704n5462K08559K03566j152j33905J81893J52738
$$ 4788435 4852573 4566615 4577319 4521857 4730416 4933982 4932830 4798925 4980818 5133556
5997E133556K68555n5969n8766J52975l51612L66812O25327J37377K54825P2000
$$ 5133556 5402111 5346142 5287376 5440351 5088739 5455551 6080878 6218255 6473080 6545080
5987F545080j3918O5791R5471O98939k83377K71179J47084K12061L58628L85728
$$ 6545080 6531162 6596953 6692424 7391363 7107986 7379165 7526249 7738310 8096938 8482666
5977H482666L20722n8595k2793K76324K67658m75540J38821K2019k02339J0354
$$ 8482666 8803388 8744793 8722000 8998324 9265982 8790442 8929263 8951282 8748943 8759297
5967H759297J99970J58771j31191L13003O05875L5686J74401K24531L51676k17788
$$ 8759297 8959267 9118038 8986847 9299850 9905725 9941411 10115812 10340343 10692019 10474231
5957A0474231Q3638J80042M26343O64034M73109N9094K74331L29490N64812j5969
$$ 10474231 10557869 10737911 11164254 11828288 12301397 12360491 12634822 12964312 13529124 13513155
5947A3513155P9747M64827R66457J308462M7614Q44092M56965n0321L90028M51713
$$ 13513155 13592902 14057729 15024186 16332648 16380262 17224354 17681319 17630998 18021026 18472739
5937A8472739N63098M59465O75345Q28646N55504M66022R30974J080584J274629
$$ 18472739 19035837 19495302 20170647 20999293 21554797 22020819 22951793 24032377 25307006
5928B5307006J509838J660997K451628J979549K878325M045476M081501N069701
$$ 25307006 26816844 28477841 30929469 32909018 35787343 39832819 43914320 48984021
5920D8984021O116684O788801M749617J161910k980046m993648n765999n400706
$$ 48984021 55100705 61889506 66639123 67801033 64820987 59827339 54061340 48660634
5912D8660634l770227k983258k717976r39108p39087j81687J84221O93428J094703
$$ 48660634 44890407 41907149 39189173 38250065 37510978 37329291 37513512 38206940 39301643
5903C9301643J649840K063130K530683L358291M373369N583254P095125Q650930
$$ 39301643 40951483 43014613 45545296 48903587 53276956 58860210 65955335 74606265
5895G4606265J0755449J1409980Q456602J122243o949504j1568946j2968321j1158236
$$ 74606265 85361714 96771694 105228296 106350539 99401035 87832089 74863768 63705532
5887F3705532r053856o707950m712378l689099k616679j603748j649011j096419
$$ 63705532 54651676 47943726 43231348 39542249 36925570 35321822 33672811 32576392
5879C2576392p73330k88831N3529M11116M09529J317464K143912K312871L453783
$$ 32576392 31803062 31514231 31567760 31978876 32388405 33705869 35849781 38162652 41616435
5870D1616435L985735M109657L154127Q79011k544090n425548o282052n550827
$$ 41616435 45602170 49711827 52865954 53744965 51200875 45775327 39493275 33942448
5862C3942448m469173l679025k785474k375732j394533j719988j114399j121660
$$ 33942448 29473275 25794250 23008776 20633044 19238511 17518523 16404124 15282464
5854A5282464q89079o82822l53306m54725k93472m98302n47739l32133n68370
$$ 15282464 14393385 13710563 13357257 12902532 12609060 12110758 11563019 11230886 10662516
5845A0662516m46589J4310N7691o29388k29655J13913j84769n63742n41015j35718
$$ 10662516 10215927 10230237 10287928 9658540 9428885 9542798 9358029 8794287 8253272 8117554
5835H117554O750m45600k152j73013l87242o01786K09470P0749j61926j13337
$$ 8117554 8124304 7678704 7676552 7503539 7116297 6514511 6723981 6794730 6632804 6519467
5825F519467P4575j99142L24549m85206l90983k20666R2279K37205n17693K92441
$$ 6519467 6594042 6394900 6719449 6234243 5843260 5622594 5714873 5952078 5434385 5726826
5815E726826R407j95518k03634J49015Q36611J24074J46006l22680k10784p1606
$$ 5726826 5736233 5540715 5337081 5486096 6322707 6446781 6592787 6270107 6059323 5987717
5805E987717p9753k5753k2785J06784l12355j65431j15097L80195q1503j79663
$$ 5987717 5907964 5882211 5859426 5966210 5653855 5488424 5373327 5753522 5672019 5492356
5795E492356j4312o3484m9698Q5337q2389J65937l16571q8918K0520K15223L07640
$$ 5492356 5478044 5414560 5364862 5450199 5367810 5533747 5217176 5128258 5148778 5364001 5671641
5784E671641M0805j96398K72189K62507m5874L10140N83015K40789n6817l01145
$$ 5671641 5712446 5516048 5788237 6050744 6004870 6315010 6898025 7138814 7081997 6780852
5774F780852m23166l1370J34384k09994k45628m29324K01583o821j532j70941
$$ 6780852 6357686 6326316 6460700 6250706 6005078 5575754 5777337 5770516 5768984 5598043
5764E598043k50595r0069n3096J62416l48843L8678J9906L3549L25509R4835L84330
$$ 5598043 5347448 5257379 5204283 5366699 5017856 5056534 5076440 5109989 5435498 5530333 5914663
5753E914663L47222M6934l26035K4450J53966L20940J50092J62929K81927J53211
$$ 5914663 6261885 6308819 5982784 6007234 6161200 6482140 6632232 6795161 7077088 7230299
5743G230299j60716l87501k87347m78216p6286N09918k16152N20235K8533k59799
$$ 7230299 7069583 6682082 6394735 5916519 5840233 6350151 6133999 6654234 6682767 6422968
5733F422968L35112J70564l55109l51562j01354K71676K88568m49277J91059L53674
$$ 6422968 6758080 6928644 6573535 6221973 6120619 6392295 6680863 6231586 6422645 6776319
5723F776319o21980L5340K76647k13442j16303k27475J59368M35285K3394k05683
$$ 6776319 6154339 6189679 6466326 6252884 6136581 5909106 6068474 6503759 6527153 6321470
5713F321470k86248J59301M06737J66050N4381K63218M98493K15576M38941k69533
$$ 6321470 6035222 6194523 6601260 6767310 6821691 7084909 7583402 7798978 8237919 7968386
5703G968386j33550o69047k10338l55593J43505J22763k74160j26472M51800k18826
$$ 7968386 7834836 7165789 6955451 6599858 6743363 6866126 6591966 6465494 6917294 6698468
5693F698468p1631j62337O6856Q3847J34410J15721K41884k4418L49265K15658
$$ 6698468 6626837 6464500 6531356 6615203 6749613 6865334 7107218 7082800 7432065 7647723
5683G647723J94723O8123J18586N74645m4589J08822l51036j49721k77222l11002
$$ 7647723 7842446 7910569 8029155 8603800 8559211 8668033 8316997 8167276 7890054 7579052
5673G579052L6037o9565Q2690J53117k66497j90904M20394K74006L25783P5039
$$ 7579052 7615089 7545524 7628214 7781331 7514834 7323930 7744324 8018330 8344113 8419152
5663H419152j59040l58490K63773K89442J61875j7574j16667L49976N51160J21800
$$ 8419152 8260112 7901622 8165395 8454837 8616712 8599138 8482471 8832447 9383607 9505407
5653I505407K99459J81481J69499N78300J9219J59221K48421P8312K47556J69714
$$ 9505407 9804866 9986347 10155846 10734146 10753365 10912586 11161007 11239319 11486875 11656589
5643A1656589O38300L67481J96226k36070P20117M96788M46135L20106J79789
$$ 11656589 12294889 12662370 12858596 12622526 13342643 13839431 14285566 14605672 14785461
5634A4785461R04656N23189L31813M76629R62011P51284J238048N99211R32230
$$ 14785461 15690117 16213306 16545119 17021748 17983759 18735043 19973091 20572302 21504532
5625B1504532J324920J751277J746305K545265J973874K852147L937077M788743
$$ 21504532 22829452 24580729 26327034 28872299 30846173 33698320 37635397 42424140
5617D2424140O030436O963280P794835P045649K171720l441093o338731o139334
$$ 42424140 48454576 55417856 63212691 70258340 72430060 68988967 62650236 56510902
5609E6510902m585220k502298o85326L91511K279639L755200M009068J774624
$$ 56510902 51925682 49423384 48738058 49129569 51409208 55164408 59173476 60948100
5601F0948100r77137j925851j584640L48178J926048L751476N091417M208202
$$ 60948100 59970963 58045112 56460472 56808650 58734698 62486174 67577591 71785793
5593G1785793J832234k311846m506403m814416l827069j838102O1799O60808o54508
$$ 71785793 73618027 71306181 66799778 61985362 58158293 56320191 56381990 57042798 56388290
5584E6388290l036836m738099l552922k549194q61508N66269J538986L338731
$$ 56388290 53351454 48613355 45060433 42511239 41649731 42216000 43754986 47093717
5576D7093717M351126M548944L154628j125607n247770o777957o698250o133687
$$ 47093717 51444843 55993787 59148415 58022808 52775038 45997081 39298831 33165144
5568C3165144m412044l545603l106478j884880j680874j545735j024834j161082
$$ 33165144 28753100 25207497 22101019 20216139 18535265 16989530 15964696 14803614
5560A4803614q72660k27059p15314p44078o91073n76799k79578k81727M2050m75794
$$ 14803614 13930954 13703895 12988581 12244503 11553430 10976631 10697053 10415326 10457376 9981582
5550I981582m64521n2510M0383o55543l0270p11716l11385K33587m25024o92338
$$ 9981582 9517061 9464551 9504934 8849391 8819121 8107405 7796020 8029607 7604583 6912245
5540F912245J47976j06521l48412k14532l7225J54850N7254o3908k77899j69155
$$ 6912245 7060221 6953700 6605288 6390756 6353531 6508381 6565635 6501727 6223828 6054673
5530F054673j91865P8101J4174l61481q12082J31073J25982k94074k36187J82172
$$ 6054673 5862808 5940909 5955083 5593602 4781520 4912593 5038575 4744501 4508314 4690486
5520D690486K18075n9842n6329l3683n12051L14725L79556k59959m06002p2169
$$ 4690486 4908561 4848719 4792390 4758707 4246656 4561381 4940937 4680978 4274976 4202807
5510D202807J68338k69573J09552L31284m84795L13308J32061n96709K33590J30119
$$ 4202807 4371145 4101572 4211124 4542408 4057613 4370921 4502982 3906273 4139863 4269982
5500D269982p51057K93673K11217K6169k82828m02807L35452K58843l05503k5540
$$ 4269982 3518925 3812598 4023815 4049984 3767156 3364349 3699801 3958644 3653141 3627601
5490C627601l18873l31045K45650k95445j87831O02732l346M7346K6889M74307
$$ 3627601 3308728 2977683 3223333 2927888 2740057 3342789 3339443 3386789 3413678 3887985
5480C887985q8401m32676j46530k60525j44397q126o0045J8655j93383L33593
$$ 3887985 3799584 3366908 3220378 2959853 2815456 2807330 2747285 2765940 2572557 2906150
5470B906150J36994J22263p0529L3951J60054P9943M7997L1726J52798J71451
$$ 2906150 3043144 3165407 3094878 3128829 3288883 3368826 3416823 3448549 3601347 3772798
5460C772798L43930l05334L49814l16308m55091N0751p9104j71990l69972L39152
$$ 3772798 4116728 3811394 4161208 3844900 3389809 3440560 3361456 3189466 2819494 3158646
5450C158646l5549K90089k89850j31244K87045L4548M34003p0896l03969J18903
$$ 3158646 3123097 3413186 3123336 2992092 3279137 3313685 3747688 3676792 3372823 3491726
5440C491726L43638J13J0054j0549J23770k03189R424l01729p14497N1396Q8004
$$ 3491726 3835364 3835477 3845531 3834982 3958752 3755563 3764987 3463258 2748761 2800157 2888161
5429B888161M0414J04816j58077J22925j23295L643P8491k9979r8204L22378j06503
$$ 2888161 2928575 3033391 2875314 2998239 2874944 2878587 2957078 2927099 2828895 3151273 3044770
5418C044770j94109K61687j71976m29560J66642J44157J14578K48507n18708O0655
$$ 3044770 2850661 3112348 2940372 2510812 2677454 2821611 2936189 3184696 2665988 2726643
5408B726643J18542k80585L83817j09569L04038P2991m00140j28904j48207M52732
$$ 2726643 2845185 2564600 2948417 2838848 3142886 3215877 2815737 2686833 2538626 2991358
5398B991358L86154l38829j24070J22621M14313r7742L15607M55182p2294J4194
$$ 2991358 3377512 3038683 2914613 3037234 3451547 3353805 3669412 4124594 4052300 4066494
5388D066494p1658L6749M85038K32837K37746K20236p4953J42550j31471p36266
$$ 4066494 3994836 4031585 4516623 4749460 4987206 5207442 5132489 5275039 5143568 4407302
5378D407302n02612Q7779m19390n06647m8622N4934L22123j67411r6206n47051
$$ 4407302 3904690 3992469 3573079 3066432 3017810 3072744 3394867 3227456 3131250 2584199
5368B584199j89444K93794j52885m80263J24323Q1711K224n1406j73921K19835
$$ 2584199 2394755 2688549 2535664 2055401 2179724 2261435 2263659 2212253 2038332 2258167
5358B258167J45009k43583j10331m90788M5382J19051J54147j00198j48151n522
$$ 2258167 2403176 2159593 2049262 1558474 1603856 1722907 1877054 1776856 1628705 1623183
5348A623183K95825J8721j29194K18427k38506L5313P0271l9376j21929j40768
$$ 1623183 1919008 1937729 1808535 2026962 1788456 1823769 1894040 1854664 1732735 1591967
5338A591967J98305J68516j3880j87689j58755K23086j45437o4489O9313J35097
$$ 1591967 1790272 1958788 1944908 1757219 1598464 1821550 1676113 1611624 1680937 1816034
5328A816034n65M0496j20201k08850K35651K87181j01452o48699l86437N66427
$$ 1816034 1815469 1855965 1735764 1526914 1762565 2049746 1948294 1299595 913158 1479585
5318A479585k6747J25087j52317M1432p6628J96734j37508j50767Q5913K8571
$$ 1479585 1452838 1577925 1425608 1467040 1390412 1587146 1449638 1298871 1384784 1413355
5308A413355N7180m9086Q0320J45276M79884j84400j44208L85139l60932P9785
$$ 1413355 1470535 1421449 1501769 1647045 2126929 1942529 1798321 2183460 1822528 1902313
5298A902313j30772n5681K63010j53883m55393R8936Q716J94157j93197J33689
$$ 1902313 1771541 1715860 1978870 1824987 1369594 1468530 1477246 1671403 1478206 1611895
5288A611895m5009O1243K18890j52510l29901J24296j91497l14019K21926N8296
$$ 1611895 1566886 1628129 1847019 1694509 1364608 1488904 1297407 983388 1205314 1263610
5278A263610l8166M026K00830l09031M02220K49306q8697m60263L571M7882L3869
$$ 1263610 1225444 1229470 1430300 1121269 1523489 1772795 1684098 1223835 1227406 1275288 1309157
5267A309157K89424k04940L6864j3179J36007P7469K22775k7565k91134l69544
$$ 1309157 1598581 1393641 1430505 1417326 1553333 1630802 1853577 1826012 1534878 1165334
5257A165334K66545k03309J1007O08418k94597J16838m3180j50389N4558M53604
$$ 1165334 1431879 1228570 1239577 1847995 1553398 1670236 1627056 1476667 1531225 1984829
5247A984829n04199q0456J79717m38971J36765J03284J10590m8756r3631J7784
$$ 1984829 1480630 1400174 1579891 1140920 1277685 1380969 1491559 1442803 1349172 1366956
5237A366956J48743Q2910j5816K76925r5216m1495j49551j49480k85654L12985
$$ 1366956 1515699 1598609 1582793 1859718 1764502 1723007 1573456 1423976 1138322 1451307
5227A451307O3968m74481K27773K62039R3817j06483j06555Q2672m5533Q1041
$$ 1451307 1515275 1040794 1268567 1530606 1624423 1517940 1411385 1494057 1448524 1529565
5217A529565j84763P9784K9544l0004J09463j77031O7113J98344l21910J14113
$$ 1529565 1344802 1424586 1454130 1424126 1533589 1356558 1423671 1622015 1300105 1414218
5207A414218J8064R6664O60388n6462j90110q2058J0451j01911l85835n0065K87745
$$ 1414218 1432282 1528946 2189334 2132872 1942762 1860704 1871155 1769244 1383409 1333344 1621089
5196A621089J04288J34237k29356J62787N2270Q2148k51282k52507O65090J19724
$$ 1621089 1725377 1859614 1630258 1793045 1845315 1927463 1676181 1423674 2088764 2208488
5186B208488K65453m89664l07705j48307M2905O3644R5223J93690Q8659N6574
$$ 2208488 2473941 1984277 1676572 1528265 1571170 1634814 1730037 1923727 2012386 2068960
5176B068960j29170k44026j04859L20389J51392J38492k3511j26255j07114k62899
$$ 2068960 1939790 1695764 1590905 1911294 2062686 2201178 2177667 2051412 1944298 1681399
5166A681399J72921M6709M2917M50447o8134n81179j5318N28666j29105J252j62286
$$ 1681399 1854320 1901029 1943946 2394393 2326259 1745080 1729762 2258428 2129323 2130575 1968289
5155A968289P5409P2642k95138L31458L24783m02837l21299J11428J18878J60297
$$ 1968289 2043698 2116340 1821202 2152660 2477443 2074606 1753307 1864735 1983613 2143910
5145B143910l720J09138K53458l60234k55431J27044P2420O7077N7624M26970
$$ 2143910 2140190 2249328 2502786 2142552 1887121 2014165 2086585 2153662 2211286 2638256
5135B638256p7964K6872K6538P8594j16589q1564j2920J0088L96509J15109l10537
$$ 2638256 2560292 2587164 2613702 2692296 2575707 2494143 2481223 2491311 2887820 3002929 2692392
5124B692392l77021o23250J07272J45596J49665j07520J39475J69849q8220M99229
$$ 2692392 2315371 1692121 1799393 1944989 2094654 1987134 2126609 2296458 2208238 2707467
5114B707467l13398k06854O0769m8607J92153Q9707o99197N95498L30206l80037
$$ 2707467 2394069 2187215 2247984 2199377 2391530 2481237 1782040 2377538 2707744 2327707
5104B327707K95455K19826m44835M17512k79251j66510k28179J89239n8909m4539
$$ 2327707 2623162 2842988 2398153 2815665 2536414 2369904 2141725 2330964 2272055 2227516
5094B227516K97346J13161m5520k2792R2724J03693l14269k97344M38528K68387
$$ 2227516 2524862 2638023 2592503 2569711 2662435 2766128 2451859 2154515 2593043 2861430
5084B861430m3265k16264M1486J61062L79146m2723l1030j30610j74439K03426
$$ 2861430 2818165 2601901 2643387 2804449 3183595 3140872 3109842 2979232 2804793 3008219
5074C008219O30343q8305k32401K61466k13017J55309k22753K07148J78985l22360
$$ 3008219 3638562 3550257 3317856 3579322 3366305 3521614 3298861 3506009 3684994 3362634
5064C362634j9180k30582J41248r2733K43037l68982m78509L34039K42127k11422
$$ 3362634 3343454 3112872 3254120 3161387 3404424 3035442 2556933 2890972 3133099 2921677
5054B921677k33678p7737q15K73633k2472j62059L62862j4028r1889o9690K5062
$$ 2921677 2687999 2610262 2609447 2883080 2860608 2698549 3061411 3047383 2955494 2885804 2910866
5043B910866j9644p5175k418N6612j28682l3221J95187r7192J78809M25468M4461
$$ 2910866 2891222 2816047 2813629 2870241 2741559 2708338 2903525 2806333 2985142 3410610 3455071
5032C455071k9990J95012Q5921l91995J7520j59456q7787j6122K02292M22089
$$ 3455071 3425081 3620093 3706014 3314019 3331539 3172083 3084296 3068174 3270466 3692555
5022C692555j69836O8618j34996l2457N3764k43916L65522k86214k85499Q783
$$ 3692555 3522719 3591337 3456341 3423884 3477648 3233732 3599254 3313040 3027541 3036324
5012C036324J22100k8008L60146k6149L52898p0813k92041K25118j56641k37125
$$ 3036324 3158424 3130416 3490562 3464413 3817311 3746498 3454457 3679575 3522934 3285809
5002C285809P0680K2592j6500J11258m06963L0455M26306L7617l00845K76706
$$ 3285809 3356489 3379081 3362581 3473839 3066876 3097331 3523637 3561254 3260409 3537115
4992C537115L0893J75551r5242l96650k05692M4333n9090k31688K63717J26492
$$ 3537115 3568008 3743559 3648317 3251667 3045975 3090308 3031218 2799530 3063247 3189739
4982C189739J15783j19802l50612K12739K2102l816J12877M87227k39089k27285
$$ 3189739 3305522 3185720 2835108 3047847 3069949 3066133 3179010 3666237 3427148 3199863
4972C199863Q4131p5192k18235L708J68258K2743n0072L63387k23419j67939L21938
$$ 3199863 3283994 3208802 2990567 2994275 3162533 3185276 3135204 3498591 3275172 3107233 3429171
4961C429171m5680j09706R5980k15976j12465O46371L04315j21239K08052Q570
$$ 3429171 3383491 3273785 3369765 3153789 3041324 3687695 3992010 3870771 4078823 4087393
4951D087393j26856l17844J67703J06812k09031m24387K55368O29774J79109J46243
$$ 4087393 3960537 3642693 3810396 3917208 3708177 3283790 3539158 4168932 4348041 4494284
4941D494284j0116l10413j37720O13614N5002l14601j1948k54264P0057M42470
$$ 4494284 4484168 4173755 4036035 4649649 4704651 4390050 4378102 4123838 4193895 4636365
4931D636365J50021j06516J23015J70301m06415J44102J9713K0306k0474j21489
$$ 4636365 4786386 4679870 4802885 4973186 4566771 4710873 4730586 4750892 4730418 4608929
4921D608929j20651r0550o1834J57884J06950K72653K89510m4558k15330J60149
$$ 4608929 4488278 4397728 4335894 4493778 4600728 4873381 5162891 5118333 4903003 5063152
4911E063152j04860K440J7661o0149P625J76517j02062j90162l9920J21257L32879
$$ 5063152 4958292 4960732 4978393 4918244 4925869 5102386 5000324 4810162 4770242 4891499 5224378
4900E224378J56967l0956l74583J45269K27867J8664k20141J88139L40382j15040
$$ 5224378 5381345 5350389 4975806 5121075 5348942 5367606 5147465 5335604 5675986 5560946
4890E560946J5260k0235K35912J02372q1188M4606r537l08870p7387K68659n092
$$ 5560946 5576206 5555971 5791883 5894255 5813067 5857673 5848136 5539266 5461879 5730538 5725446
4879E725446J1936p6423N58283N88549k10841M5556L81481o76725k34093M1229
$$ 5725446 5737382 5660959 6219242 6807791 6596950 6642506 7023987 6347262 6113169 6154398
4869F154398J20758R7297k85487N44439J88283Q6782k6202k04946m43874M8182
$$ 6154398 6275156 6372453 6086966 6631405 6819688 6906470 6880268 6675322 6231448 6279630
4859F279630K22740K97822m39305K63151J38614O9641L61294n6493k37802k04043
$$ 6279630 6502370 6800192 6360887 6624038 6762652 6832293 7193587 7137094 6899292 6695249
4849F695249J71789L48233R5409K26887K99039j28980J96221k12974J57974j08329
$$ 6695249 6867038 7215271 7310680 7537567 7836606 7707626 7903847 7690873 7848847 7740518
4839G740518L83888J02856r2966p4495M37381q7067k3234j4874J09306J97155
$$ 7740518 8124406 8227262 8134296 8059801 8497182 8410115 8386881 8372007 8481313 8678468
4829H678468M41325L57656j50154j27634n4669N95933K93883Q1342L4150J44899
$$ 8678468 9119793 9477449 9327295 9199661 9144992 9740925 10034808 10116150 10150300 10295199
4819A0295199K35835Q1594M2688j18322J55430p3696k4620p3852M09847M03785
$$ 10295199 10531034 10612628 10655316 10536994 10692424 10618728 10594108 10520256 10930103 11333888
4809A1333888M19006m54344J92465O06840J461k28749m4373M26025l5640N05109
$$ 11333888 11752894 11298550 11491015 12097855 12099316 11870567 11826194 12252219 12216579 12721688
4799A2721688K07051Q2642j17726J27294M26368N63800j87965L4383L89181M1408
$$ 12721688 12928739 13011381 12893655 13020949 13447317 14011117 13823152 13857535 14246716 14288124
4789A4288124R564j4762k41513J58677M35376L2143J88093N4791m63771K68306
$$ 14288124 14297688 14282926 14041413 14200090 14635466 14667609 14855702 14910493 14446722 14715028
4779A4715028L42272K25770l32392K39538L22394k76391M85451J09968K81183
$$ 14715028 15057300 15283070 14950678 15190216 15512610 15236219 15721670 15831638 16112821
4770A6112821N60228j48498K06491m5350Q8112K03599N36223M77037j57097L46930
$$ 16112821 16673049 16524551 16731042 16685692 16773804 16977403 17513626 17990663 17833566 18180496
4760A8180496N69973j00957J07964J69988P05641J83626J81330N87095L15471
$$ 18180496 18750469 18649512 18757476 18927464 19633105 19816731 19998061 20585156 20900627
4751B0900627J25568J16244M15490j19881L72762Q34015j77829O02320M88161
$$ 20900627 21026195 21142439 21557929 21438048 21810810 22644825 22466996 23069316 23557477
4742B3557477Q70489P90100J05621J006694N98307N30791J259935Q71170M23820
$$ 23557477 24427966 25218066 25323687 26330381 26928688 27459479 28719414 29590584 30014404
4733C0014404J691824J435141J806592J611927K205878K286005L320637L704375
$$ 30014404 31706228 33141369 34947961 36559888 38765766 41051771 44372408 48076783
4725D8076783M324053O073351P706171J0061672J2809111J7409079K0820077J5279697
$$ 48076783 52400836 58474187 66180358 76242030 89051141 106460220 127280297 142559994
4717A42559994p93743j3316947j5332460j4289664j1214694p785051n352025j964483
$$ 142559994 141766251 128449304 113116844 98827180 87612486 79827435 74475410 72510927
4709G2510927Q5789J070370J032971j146095l288288m134621l934414k545153
$$ 72510927 72596716 73667086 74700057 73553962 70265674 66131053 62196639 59651486
4701E9651486p85710J65363Q89593M14493j588818l803082m921151m636707m588500
$$ 59651486 58865776 59031139 59920732 60335225 58746407 54943325 50022174 45385467 40796967
4692D0796967l505321k649827j447505j199412j643606j225337r92519j090347
$$ 40796967 37291646 34641819 33194314 31994902 30351296 29125959 28133440 27043093
4684B7043093j779040j112620j202193o68125k91138r26402m18542m16878o10159
$$ 27043093 25264053 24151433 22949240 22281115 21989977 21063575 20645033 20228155 19617996
4675A9617996l64834n29868m15083p59346j78307n35882o88056q9959k8433p88165
$$ 19617996 19253162 18723294 18308211 17548865 17370558 16834676 16146620 16056661 16028228 15240063
4665A5240063M4141K81686J00842q9781k3645q1930L0001J58834k58283n07839
$$ 15240063 15284204 15565890 15666732 15576951 15553306 15471376 15501377 15660211 15401928 14894089
4655A4894089n70736L96787k38330k34933k66632k75784p5970Q8895K39653l58506
$$ 14894089 14323353 14720140 14481810 14246877 13980245 13704461 13628491 13717386 13957039 13598533
4645A3598533j70009j67861q4674J43384j98048l0278r8353J54684J68064J76078
$$ 13598533 13428524 13260663 13175989 13319373 13121325 13091047 12992694 13147378 13315442 13491520
4635A3491520J30307L36048l98454L5293M3959j4140l61962L6332o3271N45645
$$ 13491520 13621827 13957875 13559421 13594714 13638673 13624533 13262571 13298903 13235632 13781277
4625A3781277L7481P8445L29435j01933J15486L9575M99595J41435l21264k27629
$$ 13781277 13818758 13897203 14226638 14124705 14240191 14279766 14779361 14920796 14599532 14371903
4615A4371903J82860n9898k67670q1904R3381K71570L34979j0500l38387L46209
$$ 14371903 14554763 14494865 14227195 14145291 14238672 14510242 14845221 14834721 14496334 14842543
4605A4842543M55475k86964o2413K81115K00106J47858j15230N14503l4483j32297
$$ 14842543 15298018 15011054 14948641 15229756 15429862 15577720 15462490 15976993 15942510 15810213
4595A5810213M51702M45713K04117j57260M68577L68884O9049q0238k93259m5616
$$ 15810213 16261915 16707628 16911745 16754485 17223062 17591946 17660995 17580757 17287498 17241882
4585A7241882K98190P7686J03141k09253j97105J69849P21674O7244K16095P3127
$$ 17241882 17540072 17617758 17720899 17511646 17314541 17484390 18206064 18273308 18489403 18562530
4575A8562530n7563J73726K78192O59580P29420K20244k71236O94757M59220L96558
$$ 18562530 18504967 18678693 18956885 19616465 20345885 20566129 20294893 20989650 21448870 21845428
4565B1845428L76550K29453P09084O45895O50005P88403K04581O94898M09618
$$ 21845428 22221978 22451431 23160515 23806410 24456415 25244818 25449399 26144297 26553915
4556B6553915M09049J259284Q10659R05148R12554N69883K84904p6579q87894
$$ 26553915 26962964 28222248 29032907 29938055 30850609 31420492 31705396 31628817 30740923
4547C0740923j049491r22139j284974j284444r88247m33814q88830n35144L49158
$$ 30740923 29691432 28769293 27484319 26199875 25211628 24777814 23888984 23353840 23702998
4538B3702998K26633j98082O0024j3568o3199N33233l61931K04122N42994K98558
$$ 23702998 23929631 23731549 23791573 23778005 23714806 24248039 23886108 24090230 24633224 24931782
4528B4931782Q0525L05108N70765r7162j85891L81275M25198Q74817k10010N46389
$$ 24931782 25012307 25317415 25888180 25791018 25605127 25986402 26411600 27286417 27076407 27622796
4518B7622796M41056R78288J385467J443282P23288N66609N10461K02421J19339
$$ 27622796 28063852 29042140 30427607 31870889 32594177 33160786 33671247 33873668 33993007
4509C3993007J20180l86834m57598J08866L79954Q23006K03019K37600J83998
$$ 33993007 34113187 33726353 33268755 33377621 33757575 34580581 34783600 35021200 35205198
4500C5205198K18954o33697l14769p23255j071069j043905j158686p32606l81856
$$ 35205198 35424152 34790455 34475686 33752431 32681362 31637457 30478771 29746165 29364309
4491B9364309k26853n63058p61513l18255k33057j58396K1641k1396p0576m53718
$$ 29364309 29137456 28574398 27812885 27494630 27261573 27103177 27124818 27103422 27032846 26579128
4481B6579128n27923k83310p03697r18236k48476j50608k50743J11154q738k66426
$$ 26579128 26051205 25767895 25064198 24145962 23897486 23746878 23496135 23607289 23598551 23332125
4471B3332125l91953j49841o07096m1180j29029K2069J23977j56061k5083J80174
$$ 23332125 22940172 22790331 22183235 22142055 22013026 22035095 22159072 22003011 21977928 22158102
4461B2158102J48836j94593P8683j36423K33028K08070m11832J55286k37281J73623
$$ 22158102 22306938 22112345 22191028 22054605 22287633 22495703 22083871 22239157 22001876 22175499
4451B2175499K71435p8521k27928k17104o0278K50583k68774k57325r3439k7688
$$ 22175499 22446934 22368413 22140485 21923381 21863103 22113686 21844912 21587587 21494148 21466460
4441B1466460j18958j51959J60825k34492l27622l509l17558l62108m87317K30489
$$ 21466460 21347502 21195543 21356368 21121876 20794254 20790745 20473187 20111079 19623762 19854251
4431A9854251j32386r5101M53845l69516j95748N03400L69973r6256O0412m91926
$$ 19854251 19721865 19626764 20080609 19711093 19515345 20018745 20388718 20292462 20352874 19860948
4421A9860948m57875j92672k14401l0401p66565m17425L85179j27284J3543L7761
$$ 19860948 19403073 19210401 18996000 18965599 18199034 17781609 18166788 18039504 18053047 18090808
4411A8090808j02554J22116m28111l85539k45333n141N92609K20736K41638O5628
$$ 18090808 17988254 18110370 17682259 17296720 17051387 17046246 17638855 17859591 18101229 18166857
4401A8166857r823O42288O73060k59125L44168k1801p43235j013843m02539l16047
$$ 18166857 18157034 18799322 19472382 19213257 19557425 19535624 18792389 17778546 17376007 17059960
4391A7059960k24606K23283m34503j22148k75949J4894j48142M9897M82544l66758
$$ 17059960 16835354 17058637 16624134 16501986 16226037 16240931 16092789 16142686 16625230 16258472
4381A6258472j09851j42481m56775k43976L89608j61808J26270l46081Q6001k31913
$$ 16258472 16148621 16006140 15549365 15305389 15694997 15533189 15659459 15313378 15399379 15167466
4371A5167466j21658Q2068l63275o108K623R6127R74J33783l30749M99744l3863
$$ 15167466 15045808 15127876 14764601 14758493 14761116 14857243 14858217 14992000 14661251 15160995 15127132
4360A5127132l95016J86462l49660p4675L91527l49621O3763p92853j93032O41249
$$ 15127132 14732116 14918578 14568918 14494243 14885770 14536149 14599912 13807059 13614027 14255276
4350A4255276n9868k98853r8310K08356N5290J65583m26484k7081K02787K25129
$$ 14255276 14195408 13896555 13798245 14006601 14061891 14227474 13800990 13773909 13976696 14201825
4340A4201825l21484N5976j83254K23674q4565l59951L24629L4918p4824J78427
$$ 14201825 13880341 13936317 13753063 13976737 13892172 13532221 13856850 13891768 13816944 13995371
4330A3995371J75605j9147J13099J0209l11782j38457J33297k00075k43234J53723
$$ 13995371 14170976 14151829 14264928 14275137 13963355 13824898 13958195 13758120 13514886 13668609
4320A3668609J63016l76188K39995K38736O5467K50950Q9001k31546n1257k30235
$$ 13668609 13831625 13455437 13695432 13934168 13999635 14250585 14339586 14108040 14056783 13826548
4310A3826548K7048L99754l23643o14164r1005K03251j60915K0372j14375R7419
$$ 13826548 13853596 14253350 13929707 13315543 13224538 13427789 13266874 13287246 13172871 13270290
4300A3270290K81791j32515M10432j28623j64269J49976n2083R7381L30176Q3958
$$ 13270290 13552081 13419566 13829998 13701375 13537106 13687082 13634999 13732380 14062556 14146514
4290A4146514k90228m50302k29210N6517j40014l45204O55170J04931o05704o0250
$$ 14146514 13856286 13405984 13176774 13233291 13093277 12748073 13403243 13508174 12902470 12842220
4280A2842220L4436O4163K19644J5073l71802M8009j9501j08462P1750L0827L2356
$$ 12842220 12876656 12940819 13160463 13175536 12803734 12851743 12832242 12723780 12795530 12826357 12858713
4269A2858713K8989J26211N29665o8623K62787N13381K23156j79703j83362J33489
$$ 12858713 12887702 13013913 13543578 13474955 13737742 14251123 14474279 14294576 14111214 14244703
4259A4244703Q2092j40239k23566N2677J80042J31774K1029J66462J67326l81673
$$ 14244703 14326795 14186556 13962990 14015667 14195709 14327483 14348512 14514974 14682300 14300627
4249A4300627J02584j267k70529j45527j16773L23898k94725R3103L82585Q4423
$$ 14300627 14403211 14401944 14131415 13985888 13869115 14193013 13898288 13991391 14373976 14458399
4239A4458399N5673L63990J96624K54961p4799J27283M48462k35265k45083L17060
$$ 14458399 14514072 14878062 15074686 15329647 15254848 15382131 15830593 15595328 15350245 15667305
4229A5667305L5158j8098L94082J07016L16339K58961l9639k13747m48571k09060
$$ 15667305 15702463 15684365 16078447 16185463 16501802 16760763 16721124 16507377 16058806 15849746
4219A5849746J36743L97792J29054J20298k43958l41908J49784o1613j55081L24691
$$ 15849746 15986489 16384281 16513335 16633633 16389675 16047767 16197551 16135938 15980857 16305548
4209A6305548N02070M26431K80697K77109j38171M30543n07148l09455k09755
$$ 16305548 16807618 17234049 17514746 17791855 17653684 18084227 17577079 17267624 17057869
4200A7057869L75883N68320r7895K6162N2816O06324k28049j17060r1750K66199
$$ 17057869 17433752 18002072 17904177 17930339 17983155 18589479 18361430 18244370 18152620 18418819
4190A8418819O1380K11709k92631l67386k75980J33471m03720P8552O16729K81163
$$ 18418819 18480199 18691908 18399277 18031891 17755911 17889382 17485662 17564214 18180943 18462106
4180A8462106J6275l70103k14711j94412j58271q0705L69546l88367j68495J33448
$$ 18462106 18478381 18108278 17893567 17699155 17540884 17460179 17829725 17441358 17272863 17406311
4170A7406311O98801O46977L17138J085108M91927K34117J32870K35058O9198
$$ 17406311 18105112 18752089 19069227 20154335 20646262 20880379 21013249 21248307 21317505
4161B1317505J14250K42146l5038o57147q83286n75848n88956k24156j39100k16582
$$ 21317505 21431755 21673901 21638863 20981716 20098430 19522582 18933626 18709470 18570370 18353788
4151A8353788k88711k26722o847J10322l0932M3075L5954J28192N05355J2600
$$ 18353788 18065077 17838355 17831508 17941830 17910898 17953973 17989927 18118119 18623474 18636074
4141A8636074J13774Q1834j00320J96757j08666N00431N88656k63415k08402l62206
$$ 18636074 18749848 18831682 18731362 18928119 18819453 19319884 19908540 19645125 19436723 19074517
4131A9074517j71901k44341K61341K33453l35532j16679j32612K27287p4374l64709
$$ 19074517 18902616 18658275 18919616 19153069 18817537 18700858 18568246 18795533 18721159 18356450
4121A8356450J10138J81336j61813k13519K22593K74332k05483k41311Q2979k5834
$$ 18356450 18466588 18647924 18486111 18272592 18495185 18769517 18564034 18322723 18405702 18379868
4111A8379868K30124m2467j90114l2704j2641M33111L36501J71380k00353j4812
$$ 18379868 18609992 18567525 18377411 18344707 18332066 18765177 19101678 19273058 19072705 19057893
4101A9057893j94693m4511k95115k93680l98113R3765Q1907j28536K04107L46695
$$ 19057893 18863200 18818689 18523574 18229894 17831781 17925546 18007453 17878917 18083024 18429719
4091A8429719k81104j37501J81159o0473L45883O72500l68186n3894K35893M43922
$$ 18429719 18148615 18011114 18192273 18131800 18477683 19150183 18781997 18728103 18963996 19407918
4081A9407918J13138j55593k00914l40061O659L74895M90274l76333m04688j30936
$$ 19407918 19521056 19365463 19164549 18824488 18831147 19206042 19696316 19319983 18915295 18784359
4071A8784359j020L0350N24809j31681K21820l34593L16305L12590j85193j66002
$$ 18784359 18783339 18813689 19338498 19206817 19428637 19094044 19410349 19722939 19537746 19371744
4061A9371744j00253m0439M63783J87280R9410K26467N83607j78442K62340J8712
$$ 19371744 19271491 19231052 19694835 19882115 19981525 20207992 20791599 20613157 20875497 20894209
4051B0894209J00584L05633k27873K14304k40248L18209k72472J64642K6410k17468
$$ 20894209 20994793 21300426 21072553 21286857 21046609 21364818 21092346 21256988 21283398 21065930
4041B1065930Q7322K21865J50687k9466N0808m3031L46187L07967n56051j46399
$$ 21065930 21153252 21375117 21525804 21496338 21547146 21504115 21850302 22158269 21602218 21455819
4031B1455819j46732N98869L03096K90919M73140l36091l03320L54306M59444
$$ 21455819 21309087 21907956 22211052 22501971 22975111 22639020 22335700 22690006 23149450
4022B3149450m17795K74995K22490j32300j96534k62198l9368l76372l23862K02438
$$ 23149450 22731655 23006650 23229140 23096840 22900306 22638108 22598740 22222368 21898506 22100944
4012B2100944K02870l4868l63429k83813J67680J14196k15933K0157L58133k97128
$$ 22100944 22303814 22268946 21905517 21621704 21789384 21903580 21687647 21707804 22065937 21768809
4002B1768809l29179j50514o5739J62041K00234M1712O7951j53884j26955M31842
$$ 21768809 21439630 21289116 21223377 21385418 21585652 21627364 21695315 21541431 21414476 21846318
3992B1846318L1979k93542n17755l63647n3442k18524M549O726k96001k74321
$$ 21846318 21878297 21584755 21067000 20703353 20649911 20431387 20435936 20442662 20146661 19872340
3982A9872340k34733J22185M88840O4327Q4443m25315P5990p7102l31755M29080
$$ 19872340 19637607 19759792 20248632 20312959 20397402 19972087 20048077 19970975 19639220 20068300
3972B0068300l43197n69884R9575J21136L0009k7975k7477J75312J53455q678
$$ 20068300 19725103 19155219 19254794 19375930 19405939 19377964 19350487 19525799 19679254 19670576
3962A9670576J37508L07022k28518n8067K33667J04648K6810k28646O3912L91270
$$ 19670576 19808084 20115106 19886588 19828521 20062188 20166836 20193646 19965000 20028912 20420182
3952B0420182K22021J06212L97459m34605n36733o143L66184L51656l0193j31318
$$ 20420182 20642203 20748415 21145874 20711269 20174536 20168393 20534577 20886233 20856040 20724722
3942B0724722j13469j98782K64536K43031k79855M02463K77232L4017K010L75209
$$ 20724722 20611253 20412471 20677007 20920038 20640183 21042646 21319878 21353895 21355905 21731114
3932B1731114J65646m39442p3760K49718K82M7895L77460k46474n095J90551L83001
$$ 21731114 21896760 21457318 21383558 21633276 21633558 21681453 22058913 21812439 21807344 21997895 22380896
3921B2380896K08894n5574m70315J6412K18995j84189K73575k76308J23062J47275
$$ 22380896 22589790 22534216 22063901 22080313 22299308 22115119 22388694 22112386 22235448 22382723
3911B2382723o6532K71420j54955R1235L57494J11998k11289l24455M39738j81333
$$ 22382723 22316191 22587611 22432656 22523891 22881385 22993383 22782094 22457639 22897377 22716044
3901B2716044K2466J0283K13085l88328j41624j85000L7423L9302J01613L25902
$$ 22716044 22738510 22748793 22961878 22573550 22431926 22246926 22284349 22323651 22425264 22751166
3891B2751166L12428j54531l47190R2509j24936j68948q0650L8740R3011m3486
$$ 22751166 23063594 22909063 22561873 22654382 22529446 22360498 22279848 22318588 22411599 22368113
3881B2368113m50793r0205k43512o4801K65212Q217J1012K4219k28067j53499
$$ 22368113 21917320 21827115 21583603 21518802 21784014 21792231 21803243 21827462 21599395 21445896
3871B1445896J05269K94738k8722j40589o9560o36642q2652K23046l01474j84620
$$ 21445896 21551165 21845903 21817181 21676592 21607032 20970390 20887738 21110784 20809310 20624690
3861B0624690J6410k05345o6370L19238n13101P1115p5427K58971k70181K4902
$$ 20624690 20641100 20435755 20369385 20688623 20175522 20246637 20171210 20430181 20160000 20184902
3851B0184902M49784Q3286N055Q2240m06172L39M45066K1066J49654k49987M29177
$$ 20184902 20634686 20717972 20723027 20805267 20399095 20399434 20844500 20865566 21015220 20765233 21194410
3840B1194410P18298p4019l88418p9538l93099M78909j19261r4192m50240k61241
$$ 21194410 21912708 21838689 21450271 21370733 20977634 21456543 21337282 21243090 20792850 20531609
3830B0531609L10692m25261q2214j84326n60942J16897k46089r4568J59162J2272
$$ 20531609 20842301 20417040 20334826 20150500 19589558 19706455 19460366 19365798 19524960 19537232
3820A9537232m01982p145J23353j15731r4472N47508l12194p04558J63372K35579
$$ 19537232 19135250 19128105 19251458 19135727 19041255 19588763 19276569 18572011 18735383 18970962
3810A8970962k00639L9054l41405m48493j04488k39812L07117k02968p9306o9462
$$ 18970962 18770323 18809377 18467972 18019479 17914991 17675179 17982296 17779328 17700022 17630560
3800A7630560K72116k85690j3240P2520L61300n1243j72302r7233L977k63348
$$ 17630560 17902676 17616986 17603746 17676266 18037566 17986323 17814021 17716788 17720765 17457417
3790A7457417L72014l76141j02396K36663L77057m79817k60674J15037L13526
$$ 17457417 17829431 17453290 17350894 17587557 17964614 17484797 17224123 17339160 17652686
3781A7652686j9644p4499L74729O0418J84005p5502n59225o5811L89364k30134
$$ 17652686 17633042 17558543 17933272 17993690 18177695 18102193 17542968 17477157 17866521 17636387
3771A7636387l69287L26358K93496j55764K1331L2208o2260k05814j87580K65121
$$ 17636387 17267100 17593458 17886954 17731190 17752521 17784729 17722469 17516655 17329075 17594196
3761A7594196L53762k57714L18772K59062L77293k22159Q7836K96254k47082K5151
$$ 17594196 17947958 17690244 18009016 18268078 18645371 18423212 18511048 18807302 18560220 18585371
3751A8585371N3295k44119L62506j49700m69293K8564q4661O3644N3263m710R4929
$$ 18585371 18638666 18394547 18757053 18607353 18138060 18166624 18081963 18145607 18198870 18194160 18289089
3740A8289089J48230l33968k1116O22213J08195m7135p8284O6052r8280R3389
$$ 18289089 18437319 18103351 18082235 18704448 18812643 18765508 18687224 18753276 18654996 18748385
3730A8748385J42090J2312L79177J87176k39029j45805O4829l14554L80795n1855
$$ 18748385 18890475 18902787 19281964 19469140 19230111 19084306 19149135 18834581 19215376 19163521
3720A9163521k38994K20465k78817J00352k04099J1453p6325L76242J87081J0437
$$ 19163521 18924527 19144992 18866175 18966527 18762428 18773881 18697556 19073798 19260879 19271316
3710A9271316l74625K80061p0957J01496M24562o09535j37306J77641L83067m9361
$$ 19271316 18896691 19176752 19105795 19207291 19631853 19022318 18885012 19062653 19445720 19396359
3700A9396359j38457N17673K30534n89846Q6084N59991m06222N9499K69172k0073
$$ 19396359 19257902 19775575 20006109 19416263 19502347 20062338 19656116 19715615 19984787 19964714
3690A9964714j21783J10970L67851Q7838l63556J30793R5958p6279J43377J30081
$$ 19964714 19842931 19953901 20321752 20409590 20046034 20176827 20272785 20196506 20339883 20469964
3680B0469964N5570K51669M39128l7370l29951M856k73219L48920K16234J56165
$$ 20469964 20525534 20777203 21216331 21178961 20849010 20853866 20580647 20929567 21145801 21301966
3670B1301966J09988o03182L71201L76778J44215J19000m10569J42938J1769j8738
$$ 21301966 21411954 20808772 21179973 21556751 21700966 21819966 21409397 21552335 21564104 21545366
3660B1545366k70329o9362r6876M01081N30736o6292K84048K41892K04323J61953
$$ 21545366 21275037 21205675 21108799 21509880 22040616 21974324 22258372 22500264 22704587 22866540
3650B2866540j07926m07496L00712M84189J57195L96885O76587J41828m05577
$$ 22866540 22758614 22351118 22651830 23136019 23293214 23690099 24366686 24508514 24102937
3641B4102937m75361L22557l21663Q17099J39394k70425K42140M10966J87414
$$ 24102937 23627576 23950133 23628470 24445569 24584963 24314538 24556678 24967644 25155058
3632B5155058J68352K83740N31401k53626j18583J42143j56385K03390j84767
$$ 25155058 25323410 25607150 26138551 25884925 25766342 25908485 25752100 25955490 25770723
3623B5770723n6220K61289l0350J96265M38856J34585Q0048L32859M31928L31629
$$ 25770723 25714503 25975792 25945442 26141707 26580563 26715148 26795196 27128055 27559983 27891612
3613B7891612p071P1762N48926M44206k44808K91538N55745P9623K3742J43561
$$ 27891612 27884541 27956303 28505229 28949435 28704627 28996165 29551910 29631533 29655275 29798836
3603B9798836J0670J85311M83026L75075M36176M61661K15479J08696L60721M20533
$$ 29798836 29809506 29994817 30477843 30852918 31289094 31750755 31966234 32074930 32435651 32856184
3593C2856184J87301L95761N17196K05128L70446N46624N61421J61863q1589N40388
$$ 32856184 33043485 33439246 33956442 34161570 34532016 35078640 35640061 35801924 35720335 36260723
3583C6260723M88762j32851R30210N00956N8643M46450O29160O09232N36559L83577
$$ 36260723 36749485 36616634 37546844 38047800 38106443 38552893 39182053 39791285 40327844 40711421
3573D0711421K4682N47707N69990L28132J010503K69187J94483N85295N35384
$$ 40711421 40736103 41283810 41853800 42181932 43192435 43461622 43656105 44241400 44776784
3564D4776784O58818P70817P05133L95972P85220P52795J66771O94984R68672
$$ 44776784 45435602 46206419 46911552 47307524 48092744 48845539 49012310 49707294 50675966
3555E0675966Q35909P39809O45651J023335M71722O07904O76841J056007N49078
$$ 50675966 51511875 52251684 52897335 53920670 54392392 55000296 55677137 56733144 57282222
3546E7282222M57376J038823J244117Q12659Q21763P57241J131922R66403J407456
$$ 57282222 57739598 58778421 60022538 60835197 61656960 62414201 63546123 64512526 65919982
3537F5919982J719798R19076J664815J495707J102639J199399J491939J271484
$$ 65919982 67639780 68558856 70223671 71719378 72822017 74021416 75513355 76784839
3529G6784839J318518J231725J564083J272676J318834J377655J462957J543723
$$ 76784839 78103357 79335082 80899165 82171841 83490675 84868330 86331287 87875010
3521H7875010J867133J863892J506326J635849J736318J705502K096745K037258
$$ 87875010 89742143 91606035 93112361 94748210 96484528 98190030 100286775 102324033
3513A02324033K015851J905065K362348K838259K308037K324592K815287L035002
$$ 102324033 104339884 106244949 108607297 111445556 113753593 116078185 118893472 121928474
3505A21928474L066191L398900M076640M267183M999115N552285N847713O312227
$$ 121928474 124994665 128393565 132470205 136737388 141736503 147288788 153136501 159448728
3497A59448728P052734Q306985Q493901R090734J0113494J0607253J1823190J1854097
$$ 159448728 166501462 174808447 183302348 192393082 202506576 213113829 224937019 236791116
3489B36791116J2001225J1570148J0754088R560691O256340K455207j715116o715863
$$ 236791116 248792341 260362489 271116577 280677268 286933608 289388815 287673699 280957836
3481B80957836j0810155j3759958j4488686j4257585j3302572j1629936r737522
$$ 280957836 270147681 256387723 241899037 227641452 214338880 202708944 192971422
3474A92971422q801681p850354o651372n949688n303456m912226m475039l977807
$$ 192971422 184169741 176319387 169668015 163718327 158414871 153502645 149027606 145049799
3466A45049799m044676l572652k921342k509489k311643k364294k279979k183061
$$ 145049799 141005123 137432471 134511129 132001640 129689997 127325703 125045724 122862663
3458A22862663k143144j731632j566994j907560j664846j864259j833458k054114
$$ 122862663 120719519 118987887 117420893 115513333 113848487 111984228 110150770 108096656
3450A08096656j604002k278719k048133k160616j762534k335590k231432j783579
$$ 108096656 106492654 104213935 102165802 100005186 98242652 95907062 93675630 91892051
3442I1892051k224864j730395j982329j924727k040303j963503k162938j677602
$$ 91892051 89667187 87936792 85954463 84029736 81989433 80025930 77862992 76185390
3434G6185390j661424j421177r61356j509690j368299j476981j133603j418930
$$ 76185390 74523966 73102789 72141433 70631743 69263444 67786463 66652860 65233930
3426F5233930j292835r97241o11019n62086j312662j245447q50741r44903q45010
$$ 65233930 63941095 62943854 62332835 61770749 60458087 59212640 58361899 57416996 56571986
3417E6571986m03216p64729q12830q17879j056456p75686l73312m84499p87054
$$ 56571986 56168770 55404041 54591211 53773332 52716876 51941190 51567878 51083379 50296325
3408E0296325o48528m90002p59380p02829n60080o51165l82496n72911m48357
$$ 50296325 49647797 49157795 48398415 47695586 47135506 46484341 46101845 45528934 45080577
3399D5080577m99637n65138n51053k61178m70949k04885l68693o31123l63414
$$ 45080577 44580940 44015802 43464749 43203571 42732622 42527737 42159044 41527921 41164507
3390D1164507n14139o06182k01804o49079k60423j05825j7984l72545n92518n22639
$$ 41164507 40650368 40044186 39842382 39193303 38932880 38827055 38809071 38436526 37844008 37321369
3380C7321369n49185o57220k12059M671k21893j16078l73091m39219n2727J673
$$ 37321369 36772184 36114964 35902905 35907576 35685683 35569605 35196514 34757295 34704568 34706241
3370C4706241p67751j12768J30873p30682R9l95683m91823l09095k47045J48141
$$ 34706241 33938490 33825722 33956595 33225913 33226012 32830329 32338506 32029411 31782366 31930507
3360C1930507k79079m68652j27191R7022m45222k93508o3041L76057k5906k14809
$$ 31930507 31651428 31182776 31055585 31152607 30707385 30413877 30350836 30726893 30700987 30486178
3350C0486178m88239k32852n58203O1779n72736k5018N18699k78675k7954L49374
$$ 30486178 29997939 29765087 29206884 29268663 28695927 28670909 29189608 28910933 28882979 29232353
3340B9232353m12556j0903j95720n11873q6148j74800K64643n59008k20819l03502
$$ 29232353 28819797 28808894 28613174 28101301 28015153 27840353 28104996 27545988 27325169 27021667
3330B7021667n8230J44004l72122k14100K98640k97498K68597L8813l02923o8124
$$ 27021667 26963437 27107441 26735319 26521219 26819859 26522361 26790958 26829771 26526848 26458724
3320B6458724m77332k1480k5565O3076j13093P6080k61934N0796j96453m66869
$$ 26458724 25981392 25959912 25934347 25997423 25884330 25960410 25698476 25749272 25552819 25085950
3310B5085950l76360l2190M337j62449j83136k118k32149k46243m37302K25529
$$ 25085950 24709590 24677400 24681737 24519288 24336152 24334034 24101885 23855642 23418340 23643869
3300B3643869j43311l5618L20508l76548m4321j11506Q1553k12877l67508Q1972
$$ 23643869 23500558 23464940 23785448 23408900 23364579 23253073 23334626 23121749 22754241 22836213
3290B2836213R8385R188p4589j97631n28319j99318o1090L16371l01320l04416
$$ 22836213 22934598 22943786 22869197 22671566 22143247 21943929 21882839 22199210 21897890 21593474
3280B1593474p8096k24494m46165J55162j46854n68576j02935J26533J90832l83465
$$ 21593474 21515378 21290884 20844719 20999881 20853027 20284451 20181516 20308049 20498881 20115416
3270B0115416k94409r0369Q4824j0548J81755l10184K51358L221r365k13195M0339
$$ 20115416 19821007 19730638 19815462 19804914 19986669 19676485 19927843 19931064 19921699 19708504 19748843
3259A9748843J39686j28161K53704J50245j34093R5115J90686K78137J06035K80675
$$ 19748843 19888529 19760368 20014072 20164317 20030224 20125339 20316025 20594162 20700197 20980872
3249B0980872l11418j67291K04252M13265j1176k43265J38627l09121p0947K05493
$$ 20980872 20669454 20502163 20706415 21119680 21108504 20865239 21003866 20694745 20623798 20829291
3239B0829291K61535J70952K52387j82433P8307K24152K05616n9744K45179K57616
$$ 20829291 21090826 21261778 21514165 21331732 21410039 21634191 21839807 21780063 22025242 22282858
3229B2282858M55903K42659J56815L25388l7947Q8895L10121N41594Q44874Q5991
$$ 22282858 22738761 22981420 23138235 23463623 23425676 23514571 23824692 24366286 25211160 25297151
3219B5297151K88380P67474q0007K91929M09663L13990K17221k33355j97318J57093
$$ 25297151 25585531 26353005 26272998 26564927 26974590 27288580 27505801 27272446 27075128 27232221
3209B7232221M28952J84528K01288K83631L62516J6313N1504N54933K05711N67526
$$ 27232221 27661173 27845701 28046989 28330620 28693136 28709449 28760953 29315886 29521597 30089123
3199C0089123N25883M64753L55876O06987K6639P92994M74325Q26397R39245P86379
$$ 30089123 30615006 31079759 31435635 32042622 32069261 32862255 33336580 34162977 35102222 35888601
3189C5888601N01489J017469R83464M06266R17399J145138J265385P98551R41058
$$ 35888601 36390090 37407559 38391023 38797289 39714688 40859826 42125211 42923762 43864820
3180D3864820J468009J126272Q79498J402287J077468J154949J358690J430635
$$ 43864820 45332829 46459101 47338599 48740886 49818354 50973303 52331993 53762628
3172E3762628J132623M37131N77582N29377K50052M06818P06592M71780O71962
$$ 53762628 54895251 55332382 55909964 56439341 56689393 57096211 57802803 58274583 58946545
3163E8946545N58187N30996J336174J139696R50207J105163J189271J820780J575585
$$ 58946545 59504732 60035728 61371902 62511598 63461805 64566968 65756239 67577019 69152604
3154F9152604K124856K802712J904069L324762L728199L216811K916613L814639
$$ 69152604 71277460 74080172 75984241 79309003 83037202 86254013 89170626 92985265
3146I2985265L875034K973323K157616R49959m45347j776923l046070m159924
$$ 92985265 96860299 99833622 101991238 102941197 102495850 100718927 97672857 93512933
3138I3512933l388327l284054k316495k026665j542865o08670J96380j00722N23427
$$ 93512933 90124606 86840552 84524057 82497392 80954527 80345857 80542237 80441515 80964942
3129H0964942J518349J364082J982542K078458K257014K139299K184760K346029
$$ 80964942 82483291 83847373 85829915 87908373 90165387 92304686 94489446 96835475
3121I6835475K802751J750805K242514J818120J395488J81528n90199j676969
$$ 96835475 99638226 101389031 103631545 105449665 106845153 107026681 106436482 104759513
3113A04759513k534597l259612l543720l641324m493908l714278l500049k854900
$$ 104759513 102224916 98965304 95421584 91780260 87286352 83572074 80072025 77217125
3105G7217125k439020j939073j106233j055055m72361l76190K17054K27261L95074
$$ 77217125 74778105 72839032 71732799 70677744 70205383 69829193 70046247 70273508 70668582
3096G0668582M80004K46655L20320k83451o00514p89982j283845j733979j825784
$$ 70668582 71148586 71395241 71715561 71432110 70831596 70041614 68757769 67023790 65198006
3087F5198006k225630l325689l241798k653144k680167k501203k322839k286686
$$ 65198006 62972376 59646687 56404889 53751745 51071578 48570375 46247536 43960850
3079D3960850k119844j529163j513027j177355j121812j391767j051389p68651
$$ 43960850 41841006 40311843 38798816 37621461 36499649 35107882 34056493 33287842
3071C3287842j046744m73641r41697p42439n43703q15821r7032l83945o61845
$$ 33287842 32241098 31767457 30825760 30083321 29539618 28723797 28626765 28242820 27580975
3062B7580975q66992p14734p69721j009960p13580n37603o14845p36384o94971
$$ 27580975 26713983 25999249 25229528 24219568 23505988 22968385 22353540 21617156 20922185
3053B0922185p39721q01127k63623j83701n48364l93438m47646m21577n55628
$$ 20922185 20182464 19381337 19117714 18934013 18385649 17992211 17544565 17122988 16567360
3044A6567360k71407q50238n16528k87251k53366n8694L0347K69010r60587o51952
$$ 16567360 16295953 15445715 14929187 14641936 14388570 14329876 14360223 14629233 13668646 13016694
3034A3016694J51774K58064k50641l59774P3145K35817j88035m61837p8820k34461
$$ 13016694 13168468 13426532 13175891 12816117 12889262 13125079 12937044 12475207 12396387 12161926
3024A2161926J55361j82489o35445j79925l5319k88568o80467R9525k55811k45939
$$ 12161926 12317287 12134798 11499353 11319428 11284109 10995541 10315074 10414599 10158788 9912849
3014I912849l29940q36390m48317K60260L58206j14116p83770l48581L56814j71176
$$ 9912849 9582909 8746519 8298202 8558462 8916668 8802552 8018782 7670201 8027015 7855839
3004G855839M5276q6976n9124j28334L78836q7361m20415m64885J61894j11278
$$ 7855839 7901115 7814139 7755015 7626681 8005517 7918156 7497741 7032856 7194750 7083472
2994G083472j00890j42484j54944l08798k0053j93624m6470n1581k82373J52465
$$ 7083472 6982582 6840098 6685154 6376356 6356303 6162679 6116209 6064628 5782255 5934720
2984E934720k65978n60033n2854R14981q94513n28556K99626N41397K07800n08665
$$ 5934720 5668742 5108709 5055855 5970836 5076323 4547767 4847393 5388790 5596590 5087925
2974E087925J0275J78604m4562n06232k65623k60400k56375M13133k0930q9749
$$ 5087925 5098200 5276804 5232242 4726010 4460387 4199987 3943612 4356745 4335815 4246066
2964D246066q573K8140Q1476O9366n4768O0705k66122k55788m3477j69715J17706
$$ 4246066 4237493 4265633 4347109 4416475 4361707 4422412 4156290 3900502 3857025 3687310 3805016
2953C805016N4192J95000P3665M1491l12977p9097J69085J49620M8757n42917
$$ 3805016 3859208 4054208 4127873 4169364 3856387 3777290 3946375 4095995 4144752 3601835
2943C601835l37339J14071N0263Q6863k47746P0002k47208L06826L42135o0817
$$ 3601835 3264496 3378567 3428830 3515693 3267947 3337949 3090741 3397567 3739702 3678885
2933C678885k58906p9568R8876k31272j49542K6277l0871L53706o41689k87835
$$ 3678885 3419979 3340411 3439287 3208015 3058473 3084750 3053879 3407585 2765896 2478061
2923B478061N60908k8208j92224Q9472j56598K25242O4908k2924K87058k66329
$$ 2478061 3038969 3010761 2818537 2908009 2751411 2976653 3041561 3018637 3305695 3039366
2913C039366p2872p3203J10496L19595o5866k24591k35926J2116L18625n82757
$$ 3039366 2966494 2893291 3003787 3323382 3257516 3032925 2796999 2809115 3127740 2544983
2903B544983o1103r3755K64699O8686l88549k8214J83748o9565M58469j12880
$$ 2544983 2483880 2390125 2654824 2723510 2334961 2306747 2490495 2420930 2879399 2766519
2893B766519j02406j58846J91678K4023k16217L0913m19188k78597R3859M88187
$$ 2766519 2664113 2505267 2696945 2720968 2504751 2535664 2116476 1837879 1931738 2419925
2883B419925o6908j84021O0477n6483r9876p4124O2989j25575J34750L12802l4482
$$ 2419925 2353017 2168996 2229473 2172990 2073114 1998990 2061979 1936404 2071154 2383956 2349474
2872B349474r8865J77124j20084l17279M25516o1728j83826K31772j63282L02892
$$ 2349474 2250609 2427733 2307649 1990370 2415886 2354158 2170332 2402104 2238822 2541714
2862B541714j79331l66477K01296J44636j51465P8740L01469l87528j45644K76305
$$ 2541714 2362383 1995906 2197202 2341838 2190373 2269113 2570582 2183054 2037410 2313715
2852B313715R1733j8676j6549K00885k89696j45735k43363k16628M50431K23432
$$ 2313715 2405448 2386772 2370223 2571108 2281412 2135677 1892314 1675686 2126117 2349549
2842B349549L7520k82544J42685j42755k92502O7435l47448J90645K03793O6556
$$ 2349549 2387069 2104525 2247210 2104455 1811953 1879388 1531940 1722585 1926378 1992934
2832A992934J03881k12998l25299M72515J07741l51849o7956J73761k40046j6929
$$ 1992934 2096815 1883817 1558518 2031033 2138774 1786925 1718969 1892730 1652684 1635755
2822A635755K1589m31976k43772K6268N73433j3199l6985L54597l51347L02051
$$ 1635755 1657344 1225368 981596 1007864 1581297 1568098 1531113 1885710 1534363 1836414
2812A836414K64193M368o0247l20178K1293m32181J77215J80769o4888k10932
$$ 1836414 2100607 2104975 2044728 1724550 1745843 1313662 1490877 1671646 1606758 1395826
2802A395826K23902k03670m03888q2724l3885L68006L69009n7128l41985J741
$$ 1395826 1619728 1416058 1012170 929446 895561 1263567 1632576 1575448 1233463 1235204
2792A235204p5957J69995N6774j27509K7207l14840j09966N8497J05691q2165
$$ 1235204 1159247 1329242 1386016 1258507 1285714 970874 860908 919405 1025096 942931
2782I42931K70264J87321j50091l38498L08056K1230l66161K17729p796L59503
$$ 942931 1213195 1400516 1250425 911927 1219983 1241213 875052 1092781 1084985 1444488
2772A444488O1179k79108N0249j46196K42005m03237k55252J16651M59968M53684
$$ 1444488 1505667 1226559 1276808 1130612 1372617 969380 714128 830779 1290747 1744431
2762A744431j25892n21441J60039l15425K63840o0372j34464j65561K66781J2897
$$ 1744431 1618539 1097098 1257137 941712 1205552 1145180 1010716 845155 1111936 1124833
2752A124833p5095j22258l88575L30914k16180K11701j53336L6979K63114K32275
$$ 1124833 1049738 927480 538905 869819 653639 865340 712004 748983 1012097 1244372
2742A244372m90971m01889q1428L53434N20725J55361k63832j04636l32218J52740
$$ 1244372 753401 351512 270084 623518 1144243 1299604 1035772 931136 598918 751658
2732G51658L01880j87226n2576P8874l8371O4369m8487j96652J95536K78787J23123
$$ 751658 1053538 866312 813736 892610 854239 918608 870121 673469 869005 1147792 1270915
2721A270915n0308l00047j86184k4418L2542J61446l28597k34344J75343l0933
$$ 1270915 1220607 920560 734376 709958 742500 903946 575349 341005 516348 485415
2711D85415j16328L65391L5486J1770j1248O7109q9551K39789j12778l49541L6493
$$ 485415 369087 734478 769964 781734 770486 837595 748044 987833 875055 525514 562007
2700E62007l4415J02830K11976n27835K79276J20817k72266K9111K72167K04695
$$ 562007 527592 630422 842398 314563 593839 714656 442390 471501 743668 948363
2690I48363l08061p2647l26149L69484j55688m9477l12689K50828K59180k8903
$$ 948363 640302 567655 241506 610990 455302 405825 93136 343964 603144 574241
2680E74241j81095M5847k56595j27706K38219L72352l66645O5807K51613k09874
$$ 574241 393146 438993 182398 54692 292911 665263 298618 364425 616038 406164
2670D06164n1256j70662l88288M72980K20379o4639J16229k39266J16248k46266
$$ 406164 354908 184246 -204042 268938 489317 424678 540907 301641 417889 171623
2660A71623k6872J29634j4216M35367K89322O3023p6490l58958m4850k61944K98009
$$ 171623 144751 274385 260169 695536 984858 1047881 971391 612433 567583 305639 603648
2649F03648J89084m6275j72015l42591K01872j47422m09363J31879N46351J68663
$$ 603648 792732 746457 574442 231851 433723 286301 -123062 8817 555168 723831
2639G23831J5436K73200p5447n98693K2316M1126K22766L04990k04065J86190
$$ 723831 739267 1012467 937020 338327 360643 401769 624535 929525 725460 911650
2629I11650j4449o20177J58176J34816L7559L50541r5420j8596j84254j29464
$$ 911650 897201 277024 435200 570016 607575 958116 862696 844100 659846 530382
2619E30382K27030N03162K01799j87430k79636P9234L54937J96017K32665K86906
$$ 530382 757412 1260574 1462373 1274943 995307 1074541 1429478 1625495 1858160 2145066
2609B145066k86659m51357j34211m99638P9092J90472J29877j28459o94824K33714
$$ 2145066 1858407 1407050 1272839 773201 852293 1042765 1172642 1044183 349359 583073
2599E83073j54164L77933j48076j17013j0340l11977O3623j32818M25993M8004
$$ 583073 428909 806842 658766 541753 531413 219436 283059 150241 576234 624238
2589F24238l63058j06930K86399K6706J42774K49398J69293r8272j69625J738
$$ 624238 261180 154250 440649 467355 610129 859527 1028820 930548 760923 762661
2579G62661n45137J98250n3249K17168J90550j54360k25223L7328O27816K9821
$$ 762661 217524 415774 362525 579693 770243 615883 390660 427988 1055804 1085625
2569A085625k00162Q5807J25865m65213n6299K33219j1029J17849J14371k94018
$$ 1085625 885463 971270 1097135 631922 575623 808842 797813 915662 1030033 736015
2559G36015l49754J57700K97288j52285j12260J28130M989o3816K4674k64741
$$ 736015 386261 543961 841249 688964 576704 704834 709823 646007 670681 405940
2549D05940n79422M52922L91800J63512j0242J79475j07157R1514J64198j37894
$$ 405940 -173482 279440 671240 834752 824510 1003985 896828 988342 1152540 1014646
2539A014646Q0746j58639J9782m19973J20885K825m272j49093J241M80197K82869
$$ 1014646 1095392 936753 956535 536562 657447 660272 656000 506907 508148 988345 1271214
2528A271214L3501l36897J2487l12011M59833m90597J98212O3117r5567M2621
$$ 1271214 1304715 967818 980305 668294 1128127 637530 835742 898859 803292 845913
2518H45913j43068K08225L39166j0926l89591L53032k64734J07022J28603J67423
$$ 845913 702845 911070 1250236 1239310 849719 1202751 938017 1045039 1173642 1341065
2508A341065j18773J37259j0387K62511J11867k35915k75006j08174j95159J19257
$$ 1341065 1222292 1359551 1349164 1611675 1723542 1487627 1212621 1104447 909288 1028545
2498A028545L31148k39734p9146L06974J33883L96274P999m84297j74776O4429
$$ 1028545 1359693 1119959 1040813 1347787 1481670 1877944 1885943 1401646 1226870 1291299
2488A291299K80109l20241j11121j06374n6491K64830j3657J75444L98081k42038
$$ 1291299 1571408 1251167 1140046 1033672 977181 1242011 1228354 1403798 1801879 1559841
2478A559841J21891M51499j63186n88069q0007K40537m8363Q5761M27964Q8866
$$ 1559841 1681732 2133231 1970045 1381976 1301969 1542506 1494143 1579904 2007868 2096734
2468B096734l48453j96715K04956O77651M5687m9502k96009J00848k37965N4420
$$ 2096734 1748281 1551566 1756522 2434173 2479860 2430358 2134349 2235197 1997232 2051652
2458B051652j27417k03235M21604n8952n7229o6529K64778N50465K66252p8880
$$ 2051652 1924235 1721000 2142604 2083652 2026423 1959894 2224672 2775137 3041389 2962509
2448B962509P52023P3948M37777k9055k74483M46687J49383k73322O0720O25720
$$ 2962509 3714532 3788480 4226257 4197202 3922719 4369406 4518789 4245467 4306187 4931907
2438D931907l52313j45090J77428J41779k05711N5453J16056k6484L28489k62349
$$ 4931907 4579594 4434504 4611932 4753711 4548000 4603453 4719509 4693025 5021514 4759165
2428D759165L07996M99018k4486l31561j80483L66239L12809K46748k32488L40317
$$ 4759165 5067161 5566179 5541693 5210132 5029649 5395888 5708697 5955445 5722957 6063274
2418F063274L6371O9750k04097K12440M78999l15789J82490K33386N4596J68411
$$ 6063274 6099645 6169395 5965298 6177738 6656737 6340948 6523438 6756824 6811420 6979831
2408F979831N19M56431j13633o6803L10508M15697k86999J5463P58783L74278
$$ 6979831 6980350 7436781 7323148 7256345 7566853 7982550 7695551 7711014 8469797 8844075
2398H844075J77900J84348p0705K42275O23448N60164M30550M08729O29607K94601
$$ 8844075 9021975 9206323 9135618 9377893 10001341 10561505 10992055 11400784 12030391 12324992
2388A2324992L36484O52172N42787N42128Q60781J37784O53327Q80596N5768O68183
$$ 12324992 12661476 13313648 13856435 14398563 15259344 15397128 16050455 16931051 16986819 17655002
2378A7655002O36563O39035M00698P37032J142734O54758K97345N88358R47415
$$ 17655002 18291565 18930600 19331298 20068330 21211064 21865822 22163167 22751525 23698940
2369B3698940R13441J100119J073123J114675J469576J486290J517736K619365
$$ 23698940 24612381 25712500 26785623 27900298 29369874 30856164 32373900 34993265
2361C4993265K814887L461850L394061K082169K466486K565527L729269M969014
$$ 34993265 37808152 41270002 44664063 46746232 49212718 51778245 55507514 60476528
2353F0476528O399885Q642234J1047818J3518822J8732330K6312575L4508615
$$ 60476528 66876413 75518647 86566465 100085287 118817617 145130192 179638807
2346A79638807M8016695N8403820K4556953m0186675n8557145m8800600l9369799
$$ 179638807 227655502 286059322 310616275 270429600 211872455 163071855 123702056
2339A23702056k6596194j8346225j3541674r088049o831874n466790l720675k717504
$$ 123702056 97105862 78759637 65217963 56129914 49298040 43831250 40110575 37393071
2331C7393071j809618o79066j109242k503483k900593k281772k212531k358085
$$ 37393071 35583453 34904387 33795145 31291662 28391069 26109297 23896766 21538681
2323B1538681j783988j635357j096145r47589m76686l39812l54143r37378j063239
$$ 21538681 19754693 18119336 17023191 16075602 15598916 15259104 14904961 13967583 12904344
2314A2904344m69057p94124o53531p19288p30704n02845l12997J81675m23759
$$ 12904344 12435287 11641163 10987632 10268344 9537640 9034795 8721798 8903473 8479714
2305H479714j0987l33076n94983n7975m17049k54587m69203R1733l15745j17286
$$ 8479714 8468727 8135651 7540668 7482693 7065644 6811057 6341854 6433587 6117842 6000556
2295F000556L76261j04256o21937r7270J20067p12184k54793q806K90881o73282
$$ 6000556 6376817 6272561 5650624 5553354 5673421 4961237 4706444 4697638 4988519 4315237
2285D315237l82184J64222j43307l28808O723o3729O1336n8608m43546l7473k28217
$$ 4315237 3933053 4097275 3953968 3625160 3631883 3568154 3629490 3570882 3127336 3089863 2861646
2274B861646k64918l5460L72124K6149l85132j19894J13817K11435n40266m89818
$$ 2861646 2596728 2561268 2933392 2959541 2574409 2454515 2568332 2779767 2239501 1749683
2264A749683L83494K25905l5684k36024k17425j40768j28387J85647K38728l15515
$$ 1749683 2133177 2359082 2323398 2087374 1869949 1729181 1600794 1786441 2025169 1709654
2254A709654l24408l0507o28787L04051l46291k47312O1338M75009L28520j05321
$$ 1709654 1385246 1354739 725952 1030003 683712 436400 497738 972747 1301267 1195946
2244A195946K42306o39466q1627M77877o1298K35575q9090m982p6133J3651R1650
$$ 1195946 1438252 798786 717159 1195036 1133738 1369313 1280223 1275241 1199108 1212759 1304409
2233A304409n38465J2305J34309J74798k80496M0170M49299L9969m7258k64395
$$ 1304409 765944 778249 912558 1087356 806860 847030 1296329 1336298 1289040 1024645
2223A024645j23449j96492J81255l80315K00485J3659j66658J60389n7618p2385
$$ 1024645 901196 704704 885959 505644 706129 719788 553130 713519 655901 583516
2213E83516k90680j03709N44601J77397j59122j21135k35232J96854m2331j71191
$$ 583516 292836 189127 733728 911125 752003 630868 395636 592490 550159 378968
2203C78968K68724L13200q1634l32861j7882J29791r6184j76876P9960j8178q1797
$$ 378968 647692 960892 879258 546397 528515 658306 562122 385246 465206 447028 365231
2192C65231L9604l9258k32678L00163P6721k42046L39103k12208L23785n52025
$$ 365231 404835 365577 132899 433062 509783 267737 606840 394632 718417 166392
2182A66392k10128M67579K69861k02929l68034J32883J57693K41361l29376l33041
$$ 166392 -43736 423843 693704 490775 122741 255624 413317 654678 325302 -7739
2172g739J09853K14671l08892K47190q6691O983r5758k35612L30952j88359J81160
$$ -7739 102114 316785 7893 255083 168392 175375 79617 -155995 174957 -13402 167758
2161A67758O57089R6962r1193l98006k53508J55289j16022N24698j76508l57769
$$ 167758 824847 921809 830616 432610 179102 334391 218369 743067 566559 208790
2151B08790k03172Q1703k07200K1992J70006K11958K32939k28736k43085K79152
$$ 208790 5618 87321 -119879 -97887 72119 284077 517016 288280 45195 324347
2141C24347j89256N7240O3951j3490K89398k06118L899q8362j68462J0568l8392
$$ 324347 135091 192331 256282 242792 532190 326072 329971 241609 73147 83715 45323
2130D5323M61214J49585m17763k3909L41934J5309k83991j13058K42188j90709
$$ 45323 506537 656122 238359 214450 556384 571693 287702 174644 416832 226123
2120B26123L75604k94971k44803J44135K3111R1827J46000k55308o6841J64121
$$ 226123 601727 306756 61953 206088 229199 321026 467026 211718 144877 308998
2110C08998k71841P2545J06589m49683L6047M44504k38531k76633L14063J11210
$$ 308998 37157 109702 216291 -233392 -197345 247159 8628 -268005 46058 157268
2100A57268k53756L9393J42445M82507j76552j1420J7430k04691n73332J32755
$$ 157268 -96488 -57095 85350 567857 391305 379885 397315 192624 -380708 -247953
2090b47953J65641m88040K48329K04304K14429L49450l46319l2619J00389O09167
$$ -247953 -82312 -570352 -322023 -117719 96710 446160 99841 67222 167611 776778
2080G76778O9573n414M00472m8811j64353N41699l9781J5730m2622k53749J707
$$ 776778 846351 840937 1241409 1192598 1028245 1569944 1530163 1545893 1503271 1249522 1251229
2069A251229m36811n75613j55919J01665k06748J42698L57201J87037o8432k16236
$$ 1251229 814418 238805 82886 184551 -22197 120501 477702 664739 596307 380071
2059C80071m99126M264L29324o7950k02861j89757K48237J91829m55687l2333
$$ 380071 -119055 -114791 214533 146583 -56278 -246035 2202 194031 -261656 -293989
2049b93989L63113K9958k93148J78652k20062l50651K40037Q1677k17655P1440
$$ -293989 69124 99082 -194066 -15414 -235476 -586127 -346090 -264413 -482068 -410628
2039d10628L14132O1960O28139m31307k89358M31163p7769k5303K08023l82479
$$ -410628 -96496 -34536 593603 162296 -127062 304101 226332 201029 409052 26573
2029B6573L93622p2579m87529k73468L19725K61797k627l88516m57586L43361
$$ 26573 420195 347616 -139913 -413381 -93656 168141 165514 -223002 -680588 -337227
2019c37227K34217K43665m04200L54399j18317k15883J06604J65348J03313K73462
$$ -337227 -103010 140655 -263545 90854 -27463 -243346 -136742 28606 131919 405381
2009D05381n10928k81053J86116k8874R5781m6585n1957l68206q8911K78172j13560
$$ 405381 -105547 -386600 -200484 -229358 -133577 -180162 -232119 -600325 -689236 -411064 -524624
1998e24624j90284N54879j47712M02378L60231l50154j82958p8741K39301k35335
$$ -524624 -714908 -160029 -307741 94637 454868 104714 -78244 -156985 82316 -153019
1988a53019P5357n1588M37365m0625q940r5271k50786j52719M34609l36152k10178
$$ -153019 -77662 -129250 308115 267490 258550 163279 -87507 -240226 194383 -141769 -351947
1977c51947n7485q5935M18626K5672K5700l52841P1580J4943M109M1407M71647
$$ -351947 -409432 -495367 -76741 -51069 -25369 -378210 -306630 -291687 -287578 -246171 225476
1966B25476J80345M3934o10767j83848j04593j64110J01173K92118k90562J3122
$$ 225476 405821 449755 -161012 -344860 -449453 -613563 -512390 -220272 -510834 -497712
1956d97712o959M07927L33764j87216j21240J07459K50111k48614j04440L68202
$$ -497712 -504671 -96744 237020 49804 -71436 36023 286134 37520 -66920 301282
1946C01282k13819k28973k2929q2818L45835k79398L2474R4997J99470m27649
$$ 301282 87463 -141510 -164439 -247257 98578 -180820 -148346 -53349 146121 -281528
1936b81528K6580K10254j73167P8078l76675j06976J49576J04735K80766k31647
$$ -281528 -254948 -44694 -217861 -139783 -516458 -623434 -473858 -369123 -88357 -320004
1926c20004L8138J11671j17699L9407L58020l77096P0610K88243k56218K19032
$$ -320004 -281866 -170195 -287894 -248487 109533 -267563 -196953 91290 -164928 54104
1916E4104m30491R7922J47317N5875j49286L11474j47830Q6772K52357l1880k6938
$$ 54104 -376387 -278465 -131148 -75273 -224559 86915 -60915 25857 278214 246334 219396
1905B19396k33046k21948M9469l2304N8797j2685m3041J92833J70640l1383l38176
$$ 219396 -13650 -235598 -186129 -218433 -159636 -172321 -215362 -22529 148111 116728 -221448
1894b21448j54232n4226K59522m16162M37367K48047r1007k32716Q1734K95004
$$ -221448 -375680 -429906 -170384 -586546 -149179 98868 7861 -224855 -143121 151883
1884A51883p6727P1455n0893o68263J63749M20691k47997n2209M35264k04667
$$ 151883 75156 146611 95718 -572545 -408796 11895 -236102 -288311 146953 -57714
1874e7714K8537J81698o6825l09220K97030j40524k83309j4420j25473K75892
$$ -57714 -29177 152521 85696 -223524 73506 -67018 -350327 -364747 -490220 -214328
1864b14328J59066q0302n0126p2469m00841M6946M06131J92835K85598m27756
$$ -214328 -55262 -135564 -185690 -258159 -659000 -612054 -205923 -13088 272510 -155246
1854a55246O5097n4066J10814J5543l97758k97914K67512K47240l17634L0864
$$ -155246 -90149 -144215 -33401 -17858 -415616 -713530 -446018 -198778 -516412 -485548
1844d85548k41040O04157p0343k90083j08472L74247K36865r5109J70271n9291
$$ -485548 -726588 -122431 -192774 -482857 -591329 -217082 19783 -75326 94945 35654
1834C5654m4334l4137k76131K00545L42135m34617R5641j89300Q4919L54406j49753
$$ 35654 -8680 -42817 -318948 -118403 223732 -210885 -115244 -304544 -219625 134781 -14972
1823a4972l08840m2595m9910j59455N56722k1990J38281j1841j89972k05041M40883
$$ -14972 -323812 -366407 -416317 -575772 -19050 -41040 97241 85400 -104572 -309613 131270
1812A31270m18677O8413j5517L8273n76050J84243O12533N4702j86661l65749
$$ 131270 -287407 -218994 -234511 -196238 -772288 -588045 24488 79190 -107471 -473220
1802d73220M41498Q1581j47556J2937n0167K05372j650j53962l67542J79406J77338
$$ -473220 -31722 49859 -97697 -84760 -134927 70445 68795 -85167 -452709 -273303 -95965
1791i5965l39487j04459L94355J8236k27219K9895J01850M55599k36198Q9531
$$ -95965 -435452 -539911 -145556 -127320 -354539 -324644 -222794 232805 -3393 86138
1781H6138j6948K22179k14000l55013K94614l6108K23923j15604k08928K72108
$$ 86138 69190 291369 77369 -277644 16970 -19138 204785 89181 -119747 152361
1771A52361N1060K09141j94666L9116l58798l40822J76587Q1731J44272m45110
$$ 152361 203421 412562 217896 257012 -101786 -442608 -266021 -184290 -40018 -485128
1761d85128j01465k9468N42918k59550J88038M88344j94578N4979j71002J066
$$ -485128 -586593 -616061 -73143 -332693 -144655 343689 149111 204090 33088 34154
1751C4154J0277L37879k07860n1922j51931j38233k9670l48727j91947L63089
$$ 34154 44431 382310 174450 122528 -29403 -167636 -197306 -546033 -737980 -374891
1741c74891J28870j77970K41194L6048k40705L68025k8436j91612j07900M71335
$$ -374891 -246021 -423991 -182797 -146749 -387454 -19429 -47865 -239477 -347377 123958
1731A23958j43149j59064J98776k13342P2506k97062n9712J36638J68070L86532
$$ 123958 -19191 -178255 20521 -192821 -120315 -417377 -477089 -340451 -172381 214151
1721B14151m25272p6183K03791r2099J61792K11499j41068k55372J31737J64621
$$ 214151 -211121 -287304 -83513 -175612 -13820 197679 56611 -198761 -67024 97597
1711I7597j80906m11975k1422K42794j11834q7263L89333L34414k43982L33957
$$ 97597 -83309 -495284 -516706 -273912 -385746 -473009 -83676 250738 6756 340713
1701C40713k52551k3777J59338m9123k79802J11031k5790j49536N2942j868O2458
$$ 340713 88162 64385 223723 174600 -105202 5829 -19961 -169497 -116555 -118423 -55965
1690e5965J01957r8425m7123J76815l09628k48395N8454N48144J05448k66206
$$ -55965 45992 -52433 -99556 77259 -232369 -480764 -422310 125834 231282 -34924
1680c4924k71368J89869k48653J4527r699K89757P8715k58619j74072L10751L04261
$$ -34924 -306292 -116423 -365076 -350549 -360248 -70491 8224 -250395 -424467 -113716 190545
1669A90545K9135N8293l59847r0412l3769k57068k99368L37444K18709K15379
$$ 190545 219680 277973 -81874 -172286 -206055 -463123 -762491 -425047 -206338 9041
1659I041L07670l23824k29155J62859Q9801l14196J56966J16239R4037k76019
$$ 9041 316711 -7113 -236268 -73409 16392 -297804 -140838 -24599 69438 -206581
1649b06581j18704K50571L62985k11268j89327j97488L70294L88272n97271r1511
$$ -206581 -325285 -74714 288271 77003 -112324 -309812 60482 448754 -148517 -240028
1639b40028R8920K61944j32633m702K17602l18584j69783M1090K67321J31989
$$ -240028 -141108 120836 -11797 -16499 201103 -117481 -287264 -246174 21147 153136
1629A53136o13348l01994L29720j39606M95624n0748j96171j318K73374M04281
$$ 153136 -460212 -762206 -432486 -572092 -76468 -127216 -323387 -324705 -51331 352950
1619C52950j1787k36566n81193j00948j56946M01502N28308o4237n02562K96612
$$ 352950 341163 104597 -476596 -577544 -734490 -332988 195320 131083 -371479 -74867
1609g4867k92931J58899J7294j8177L45757J406M6713J85690l85330J40492p3179
$$ -74867 -367798 -208899 -191605 -209782 135975 137381 184094 369784 -15546 124946 51767
1598E1767l14686j9556j67846K53820K15865j50618l22459Q3308M67430M6213
$$ 51767 -262919 -282475 -450321 -196501 19364 -131254 -453713 -370405 97025 143238
1588A43238M2916J01524n10494n8449k83098j9374L45741J03643l10555p747L53424
$$ 143238 186154 287678 -222816 -281265 -564363 -583737 -237996 -134353 -444908 -452655 -99231
1577i9231N78315j86057J14620o7813n38161K09066M03076j48186J78021p5889
$$ -99231 479084 293027 407647 339834 -198327 10739 413815 265629 443650 367761
1567C67761o29256N322Q4158L72707M1856j62793L12408o77525K16756M40107
$$ 367761 -261495 -256173 -172015 200692 242548 79755 392163 -285362 -68606 371501
1557C71501j77844l40414j60193J02994J40890L38607j70407p2907k64273M2362
$$ 371501 193657 -146757 -306950 -203956 -63066 275541 105134 32227 -232046 -189684
1547a89684k85028l62223J81869N02397k00246L5244J41501L43665j72839R7153
$$ -189684 -474712 -836935 -655066 -152669 -352915 -317671 -176170 167495 -5344 91809
1537I1809L08661m24076k58987q7365J36331k80917J73284K68522K39191m66621
$$ 91809 400470 -23606 -282593 -369958 -233627 -514544 -341260 -72738 166453 -300168
1527c00168k55137O993j9316M16173K19430j38346n3898j523o2228p2236J49883
$$ -300168 -555305 -548312 -567628 -151455 67975 -70371 -124269 -125792 -188020 -260256 -110373
1516a10373K07666j34285j35382j41504Q6877K8613M54581J78644j75639n7582
$$ -110373 97293 -36992 -172374 -313878 -227001 -198388 256193 434837 259198 201616
1506B01616L2953m17247p3259L06842m16398k22659J04642M00279j95068K3518
$$ 201616 234569 -182678 -255937 50905 -365493 -588152 -483510 -83231 -278299 -254781
1496b54781K96817L5865J54343K66964l4241l37655J16228K88934M18945n67924
$$ -254781 42036 77901 232244 499208 464967 127312 243540 532474 951419 383495
1486C83495k91810k3958j40156j27941J30837K06144o0052l22676J65651L10310
$$ 383495 91685 67727 -72429 -200370 -69533 136611 76559 -246117 -80466 229844
1476B29844J24952j80711m43245j80798M58982j84139q2320N97725k56684K23164
$$ 229844 354796 174085 -269160 -449958 9024 -175115 -257435 340290 83606 306770
1466C06770m68546n5660r2362Q5665m00963J09324M39423K19394j98662J70243
$$ 306770 -161776 -217436 -309798 -224133 -625096 -515772 -76349 143045 -55617 114626
1456A14626O1627q3054k75750j86437N76430k13886k92759K735M59046K09873
$$ 114626 176253 93199 -182551 -368988 207442 -6444 -299203 -296468 162578 372451
1446C72451o8348k44049Q9278n066j25335J29172N2441j19208j75604k34850N45071
$$ 372451 304103 60054 149332 144266 18931 148103 200544 81336 -94268 -329118 215953
1435B15953j1979m45812K01144M18159n59411L38729K48526m88895l66734P3310
$$ 215953 203974 -241838 -40694 377465 -181946 156783 405309 -83586 -450320 -377010
1425c77010N20359l01987l08797o7034K05744L14864K6173j04889m4530K72837
$$ -377010 143349 -158638 -467435 -534469 -328725 -13861 12312 -92577 -137107 135730
1415A35730q0400j18401R4410k0098J21572k95152K8863L03716J68962l61063
$$ 135730 55330 -63071 31339 11241 132813 -162339 -133476 170240 339202 -21861
1405b1861J39443j24807M6809l07760j61846N84338r834M17285j3410k64760l8924
$$ -21861 117582 -7225 39584 -268176 -430022 154316 144482 561767 548357 283597 244673
1394B44673K63314k06323l05749k62588j00814K09027o8094N575J72423J40624
$$ 244673 507987 301664 -4085 -266673 -367487 -158460 -226554 -220979 -48556 92068
1384I2068j20560k88739L16453j09819k79411Q206N57655l75263K12509R2202
$$ 92068 -28492 -317231 -778 -110597 -390008 -381802 175853 -199410 13099 105301
1374A05301k88204M1130l74187L40299N7021K32335k9310k94442N89015p01460
$$ 105301 -182903 -141773 -515960 -175661 -118640 113695 84385 -210057 378958 -322502
1364c22502l7525M44373M22277n9631l39561L60180k98861k2029m6902o3529n7806
$$ -322502 -360027 84346 506623 446992 107431 467611 168750 146721 99819 36290 -21516
1353b1516Q572k44515L05858l21910J30562L39658Q1960k35485o3710M64438q9267
$$ -21516 -12944 -257459 48399 -273511 -142949 196709 278669 43184 -20526 443912 354645
1342C54645l53043k93673p636j9313J47730M26529M7863r9585j6481j6536n94809
$$ 354645 1602 -292071 -299707 -319020 -171290 255239 303102 203517 187036 170500 -424309
1331d24309L34236j67110K07186m8663q536K63259k18082R1068K82671k58659
$$ -424309 -90073 -257183 -49997 -98660 -107196 156063 -62019 29049 311720 53061
1321E3061N7140M0120J9252J27714n17982k53478L58k02557L70652L36997K2834
$$ 53061 110201 150321 169573 297287 -220695 -474173 -473815 -676372 -305720 31277 54111
1310E4111n7435j37584N8954j11145r6690K8132Q1864J85319K05685J04203k38940
$$ 54111 -3324 -140908 -81954 -193099 -289789 -261657 -179793 5526 211211 315414 76474
1299G6474j74362O1924o7849K97851j11355k49874M8311K24697j9176J65852J08910
$$ 76474 -97888 -35964 -103813 194038 82683 -167191 -118880 105817 86641 252493 361403
1288C61403p0340m44248k00694L47404L7613j38739j64017l13786L11668k60773
$$ 361403 291063 -153185 -353879 -6475 31138 -107601 -271618 -585404 -273736 -534509
1278e34509j42547K62946L29151J58218k41465K993J98880j25801k73104k05866
$$ -534509 -677056 -414110 -84959 73259 -168206 -165213 33667 -92134 -365238 -571104
1268e71104K33966M89901R5940J91164j32630q7263J78820j20957j87416K86964
$$ -571104 -337138 152763 248703 439867 307237 219974 398794 277837 90421 377385
1258C77385k96297j59153J65650L14965J59343m98290l7329j42407L0793l24723
$$ 377385 81088 -78065 87585 402550 561893 63603 26274 -116133 -85340 -410063
1248d10063J64786M69323k04807l06248l0262J59285M15522J15758k36299J23811
$$ -410063 -245277 224046 19239 -287009 -317271 -157986 257536 373294 136995 260806
1238B60806j02323p5777r7365j54987J79721j27644L89140k65508K05147J1930
$$ 260806 158483 82706 -14659 -169646 10075 -117569 271571 6063 211210 223140
1228B23140N97583K10296l62024m94543l2157J03877P8350O0097q1765k85575
$$ 223140 820723 1031019 668995 174452 142295 246172 324522 384619 302854 17279
1218A7279j05210K21132N7674m8479m25130L20325j72229J15904O5176m006J56918
$$ 17279 -87931 133201 190875 142396 -282734 37591 -134638 -18734 46442 42436 199354
1207A99354l73650K91726r7677m48862R8382K19520L42474m30192K50137O00586
$$ 199354 -174296 117430 19753 -429109 -330727 -111207 231267 -198925 51212 651798
1197F51798l55848j81575m4903J9134n3486o8581N93420j09467n58277K835L98169
$$ 651798 295950 114375 69472 88606 35120 -33461 559959 450492 -107785 -104950 293219
1186B93219l07813j4140L12612m34295l54723M49943J82920K99537j92378l02343
$$ 293219 -14594 -28734 283878 -150417 -505140 -55197 127723 427260 234882 -67461
1176f7461k13805R6771J06738L33483L39836l26291j90343j34905j97539M22520
$$ -67461 -281266 -184495 -77757 255726 595562 269271 78928 -55977 -253516 169004
1166A69004N3722L5116m00161m0595M45989J13655l26321k56817K38730L45344
$$ 169004 222726 257842 -142319 -182914 263075 376730 50409 -206408 32322 377666
1156C77666j01238J06592K35727L3779l11024n96400J50008l1972j23042K05055
$$ 377666 276428 383020 618747 652526 341502 -254898 -104890 -136862 -259904 -54849
1146e4849l46133j32550J92633J5719K96926N4153J80280K52895l79843k81357
$$ -54849 -400982 -533532 -340899 -325180 -28254 25899 206179 459074 79231 -202126
1136b02126N0596P1657q7540J01806J0789N8788L90716J10063m14333n9889K7206
$$ -202126 -151530 -79873 -167413 -65607 -54818 3970 394686 504749 90416 30527 57733
1125E7733k6219k09623l45355J00083K87974j86549j63921K93199M40972p507
$$ 57733 31514 -178109 -523464 -423381 -135407 -321956 -485877 -192678 248294 240787
1115B40787p074J29667l56817k26383J674j82941L37212L49047l13152K73474
$$ 240787 233713 363380 6563 -219820 -218146 -401087 -63875 285172 -27980 245494
1105B45494j05838k72400k31287O23814o33470J76801K94712J83621l86120R3208
$$ 245494 139656 -132744 -364031 259783 -373687 -196886 97826 281447 -104673 -11465
1095a1465J91937J62024J78282k83421l2482r7838J32332L7111j36226l45072
$$ -11465 180472 342496 520778 237357 204875 107037 239369 276480 140254 -204818
1085b04818J14315j4830j95339M74251K7406j66500K78591n6021l3388j40307
$$ -204818 -90503 -105333 -300672 173579 200985 34485 313076 257055 223667 83360
1075H3360N9480m24901M7954O41340m8301k37173o2774J4020N5841p3346J17917
$$ 83360 142840 -282061 -234107 407233 358932 121759 58985 73005 128846 55500 173417
1064A73417P7725q2390k95137J1520J44390K02381j81831q6540J83981k00449
$$ 173417 251142 168752 -126385 -114865 29525 231906 50075 -36465 147516 -52933
1054e2933J5263J0602o7534p9068m870P704q7287R6858l81315L79678l6663k13535
$$ -52933 -37670 -27068 -94602 -173670 -178540 -170836 -258123 -161265 -542580 -162902 -199565 -413100
1042d13100K48291j45570n9290J56470k67717R9689k67593K18857K64773j69789
$$ -413100 -164809 -310379 -369669 -213199 -480916 -381227 -648820 -429963 -165190 -334979
1032c34979M19983k60380j97932K7812q3165p789N24639K51097j92619J57034
$$ -334979 85004 -175376 -373308 -345496 -428661 -436450 88189 339286 146667 303701
1022C03701k19430N9888l5336r1491N6012j08181N0761j24643l0208J54513j25699
$$ 303701 84271 144159 108823 17332 73344 -34837 15924 -108719 -138927 15586 -110113
1011a10113n169J84997m56196J00382K22995O28446k819j84319k73660n16011
$$ -110113 -115282 69715 -386481 -286099 -63104 565342 562523 378204 104544 -411467
1001d11467N09694L56448m03405J44324K36103o281k51167o8685J21407j63765
$$ -411467 98227 454675 51270 195594 431697 425416 174249 105564 226971 63206
991F3206j56531j04425K25774O9429J04380k94240m43936K36448L80670L46230
$$ 63206 -93325 -197750 28024 97453 201833 -92407 -536343 -299895 80775 427005
981D27005J33461j33663k69857l66859J40544L74084j93881k82276q8691K07689
$$ 427005 560466 426803 156946 -209913 -69369 304715 110834 -171442 -260133 -52444
971e2444J32362J23319L3582R7787J45191j33486k076m67354j18041N5321K03768
$$ -52444 79918 203237 236819 334606 479797 346311 344235 -123119 -241160 -185839 17929
960A7929o7407K98875P2387l38787K45840k61322K55895j00810k63764o3041N7411
$$ 17929 -49478 249397 321784 -17003 228837 -32485 223410 122600 -141164 -204205 -146794
949a46794L40141j61482J80244O7654J23147k72159k37059M7805j50083Q0267
$$ -146794 193347 31865 212109 279763 402910 130751 -106308 -58503 -208586 -128319
939a28319j00284J32617M37150j18100r286q7740j38088O4838j57575K85456L47211
$$ -128319 -228603 -95986 341164 223064 213778 126038 -12050 52788 -104787 180669 527880
928E27880J26252n23174k05404J90104j66231l27185k5349L48188R251n4535J07404
$$ 527880 654132 130958 -74446 115658 -50573 -377758 -403107 -54919 -45668 -100203 7201
917G201j86276K07434k8682O1546r9266l72936L24632j33707M39863L68933m71476
$$ 7201 -179075 28359 -323 61223 -38043 -410979 -86347 -220054 219809 588742 117266
906A17266O6157J00M2803j36014J74449r9474l55999J48862k66137m7951l3256
$$ 117266 183423 183523 226326 90312 264761 165287 -190712 -41850 -307987 -355938 -389194
895c89194j71629K35025p5099R0860K84062K46104M25879l80397j64914j57246
$$ -389194 -560823 -325798 -400897 -310037 -25975 220129 646008 265611 100697 -56549
885e6549j57886K37843j4175J5373J33920P3143k6417m22137q08799K20710M68545
$$ -56549 -214435 23408 9233 24606 158526 231669 205252 -216885 -1025684 -804974 -336429
874c36429K70720q3161J19165K82179m22697J55365j87975r8903L4123O34457
$$ -336429 -65709 -148870 -29705 252474 -170223 -14858 -202833 -301736 -267613 366844
864C66844m05159m4618L38432l25455m2079n41568r0L85391r472M53734K7734
$$ 366844 -38315 -82933 255499 -69956 -112035 -653603 -653693 -268302 -277774 175960 203694
853B03694J02952n3148l66510j95421L97098K49354l24598m36764P5918K89067
$$ 203694 306646 253498 -113012 -308433 88665 338019 13421 -423343 -347425 -58358
843e8358P4749j49785j8792j25967J54635K54686P2996q9647n56266K33447J29719
$$ -58358 16391 -133394 -152186 -278153 -123518 131168 204164 114517 -441749 -208302 -78583
832g8583j103Q9212k9156J62010J89486l50691K72256l1319o5711j91156L2205
$$ -78583 -79686 9526 -19630 142380 331866 -18825 253431 222112 156401 -34755 -2550
821b550M10843k50198l08117L0764R3222K50370K71428j94959o0950k23811j81946
$$ -2550 408293 158095 -150022 -119258 -26036 224334 495762 300803 239853 16042 -165904
810a65904P60976k26947m05279K3269l53246M7018k7848K24758M12947j67666
$$ -165904 595072 368125 -37154 -13885 -367131 -320113 -347961 -123203 289744 122078
800A22078J48772j69927J72032L075l01340L2664J86632j09468j98402K49806
$$ 122078 270850 100923 272955 276030 -25310 7354 193986 84518 -113884 135922
790A35922j64296m65343O48454q1847J11258j05277K16938J79286n43017k5569
$$ 135922 -28374 -493717 154737 72890 184148 78871 295809 475095 -67922 -93491
780i3491m8090L53935k101o5849q9145j89016m4057Q2844j84834J51330J49490
$$ -93491 -141581 212354 210253 144404 55259 -133757 -177814 -94970 -279804 -128474 21016
769B1016k36312J54243R84K55785m12559j23225J77813L46118M63537j19304m60169
$$ 21016 -215296 -61053 -60069 195716 -216843 -340068 -162255 183863 647400 528096 67927
758F7927j37092j07799L35656k17254O6777M70331n62172J84948l6335J98679
$$ 67927 -69165 -176964 158692 -58562 8215 478546 -83626 101322 64987 263666
748B63666P4727n00785J67250Q7450m52396n0409P37157k24304l94826J01560
$$ 263666 338393 -162392 4858 92308 -360088 -410497 326660 102356 -292470 -190910
738a90910m2633r0875q9799N92107k29378K79727k65409J03054p2040j07575K19811
$$ -190910 -233543 -324418 -414217 177890 -51488 228239 -37170 65884 -6156 -113731 106080
727A06080N4057J22850p8464M06366J36952m73909m64968N55901K38446o19016
$$ 106080 160137 282987 204523 610889 747841 273932 -191036 364865 603311 -15705
717a5705k99855m2701K79240L73874J78714n33420j90570K27786L94209J11334
$$ -15705 -315560 -358261 -79021 294853 473567 -59853 -250423 -22637 371572 482906
707D82906l33269k31516K85263k73696K5614n1711l6268L1277J23907j96874J61850
$$ 482906 149637 -81879 203384 -70312 -44698 -96409 -132677 -101400 22507 -174367 -12517
696a2517N02888k5308k59208j05817k29290J64411J28002j25078j08491O6445
$$ -12517 490371 465063 205855 100038 -129252 35159 163161 38083 -70408 -3963
686c963J35435j59277m90622N53093N07600l21774k29027J56741K90288Q6916
$$ -3963 131472 -27805 -518427 34666 542266 220492 -8535 148206 438494 525410
676E25410k5949k09601l00287j86163K39598j80736J97688K64276j8571J03887
$$ 525410 499461 289860 -10427 -196590 43008 -137728 59960 324236 305665 409552
666D09552R7060o05447J8344k27599O4245M33273Q7871k51777L27575L4442n53905
$$ 409552 506612 -98835 -80491 -308090 -243845 189428 277299 25522 353097 387539 -166366
655a66366k9341K11042L78812j67426l41361K84260j37585M34514j14185n26436
$$ -166366 -195707 15335 394147 226721 -114640 169620 32035 466549 352364 -174072
645a74072K64404L3125m831j10546L7953P0579M6877l90084k47517M39027J14757
$$ -174072 90332 123457 118626 8080 46033 116612 163489 -226595 -474112 -35085 79672
634G9672l8347j10570Q0388K72829j25580l78059Q0792k47171j37223K04649R1148
$$ 79672 41325 -69245 11143 283972 158392 -219667 -138875 -386046 -523269 -318620 -227472
623b27472O7164j20106M39909J37416K12787j85165n53516O8646k41088L52455
$$ -227472 -160308 -280414 159495 296911 509698 324533 -228983 -160337 -401425 -48970
613d8970M83355N9960j51266l46872l37184K34577j32978k09407L3994J87780
$$ -48970 434385 494345 343079 -3793 -340977 -106400 -239378 -448785 -414791 -227011
603b27011l9646K93379l27564K37148M08702l2150l65942Q7838p0905n6871M34587
$$ -227011 -266657 26722 -300842 -63694 345008 312858 -53084 34754 -36151 -93022 341565
592C41565l3462m03504j74811M37055m5833K52064R510l78785n91763J32944J92458
$$ 341565 308103 -95401 -270212 166843 121010 373074 382584 3799 -587964 -455020 -262562
$$ [...]
##END NTUPLES=NMR SPECTRUM
##END=
