##TITLE=1H_CG-1184-1
 CDCl3
 8 sc, 
 11.1.2024
##JCAMPDX= 6.0         $$ Bruker NMR JCAMP-DX V2.0
##DATA TYPE= NMR SPECTRUM
##DATA CLASS= NTUPLES
##ORIGIN= UXNMR, Bruker Analytische Messtechnik GmbH
##OWNER= root
$$ XWIN-NMR		Version 3.5
$$ Thu Jan 11 14:12:06 2024 Russian Standard Time (UT+4h)  she@DPX200
##.OBSERVE FREQUENCY= 200.1313
##.OBSERVE NUCLEUS= ^1H
##.ACQUISITION MODE= SIMULTANEOUS
##.ACQUISITION SCHEME= undefined
##.AVERAGES= 8
##.DIGITISER RES= 18
##SPECTROMETER/DATA SYSTEM= spect
##.PULSE SEQUENCE= zg30
##.SOLVENT NAME= CDCl3
##.SHIFT REFERENCE= (INTERNAL, CDCl3, 0, 15.4769)
##AUDIT TRAIL= $$ (NUMBER, WHEN, WHO, WHERE, WHAT)
$$ ##TITLE= Audit trail, XWIN-NMR		Version 3.5
$$ ##JCAMPDX= 5.01
$$ ##ORIGIN= Bruker BioSpin GmbH
$$ ##OWNER= she
$$ F:/spectra/data/she/nmr/H-F/1/pdata/1/auditp.txt
$$ ##AUDIT TRAIL=  $$ (NUMBER, WHEN, WHO, WHERE, WHAT)
(   1,<2024-01-11 14:10:27.81 +0400>,<she>,<DPX200>,
      <created by zg, POWCHK disabled, PULCHK disabled
       configuration hash MD5:
       00 E9 B6 7A A2 85 ED C7 34 08 36 98 17 FE 4E 26
       data hash MD5: 16K
       24 CE 33 89 34 F0 C8 76 9A 74 57 F1 C4 AE AC 0E>)
(   2,<2024-01-11 14:10:32.35 +0400>,<she>,<DPX200>,
      <Start of raw data processing
       efp BC_mod = 2 LB = 0.24 FT_mod = 6 PKNL = 1 PHC0 = -24588.7 PHC1 = 8.252729 SI = 16K 
       data hash MD5: 16K
       41 E8 D2 56 9B 51 A9 28 B6 84 9D 00 B8 06 F8 93>)
(   3,<2024-01-11 14:10:50.98 +0400>,<she>,<DPX200>,
      <pk PHC0 = -40.40946 PHC1 = 49.39999 
       data hash MD5: 16K
       B3 73 87 B8 26 A7 2F 56 15 20 B0 8F A7 6F 88 1E>)
(   4,<2024-01-11 14:10:53.93 +0400>,<she>,<DPX200>,
      <abs ABSG = 5 
       data hash MD5: 16K
       9A 98 AA 44 96 D7 EC C8 43 D3 A2 65 1C A2 4C 6A>)
(   5,<2024-01-11 14:11:35.14 +0400>,<she>,<DPX200>,
      <pk PHC0 = 11.70679 PHC1 = -14.6 
       data hash MD5: 16K
       B9 3E BD F4 6E AE 0B D5 A1 C7 B9 62 05 42 EE F9>)
$$ ##END=
$$ 
$$ hash MD5
$$ 79 51 08 E6 32 D9 46 3B DE 86 F4 3A 00 6F 4D 15
##$RELAX= 
##$RELAX= 
##$RELAX= 
##$RELAX= 
##$RELAX= 
##$RELAX= 
$$ Bruker specific parameters
$$ --------------------------
##$DU= <F:/spectra>
##$EXPNO= 1
##$NAME= <H-F>
##$PROCNO= 1
##$TYPE= <nmr>
##$USER= <she>
##$AMP= (0..31)
100 100 100 100 100 100 100 100 100 100 100 100 100 100 100 100 100 100 
100 100 100 100 100 100 100 100 100 100 100 100 100 100 
##$AQSEQ= 0
##$AQ_mod= 1
##$AUNM= <au_zg>
##$AUTOPOS= <>
##$BF1= 200.13
##$BF2= 200.13
##$BF3= 200.13
##$BF4= 200.13
##$BF5= 200.13
##$BF6= 200.13
##$BF7= 200.13
##$BF8= 200.13
##$BYTORDA= 1
##$CFDGTYP= 0
##$CFRGTYP= 5
##$CHEMSTR= <none>
##$CNST= (0..31)
1 1 145 1 1 1 1 1 1 1 1 1 1 1 1 1 1 1 1 1 1 1 1 1 1 1 1 1 1 1 1 1 
##$CPDPRG= <>
##$CPDPRG1= <>
##$CPDPRG2= <>
##$CPDPRG3= <>
##$CPDPRG4= <mlev>
##$CPDPRG5= <mlev>
##$CPDPRG6= <mlev>
##$CPDPRG7= <mlev>
##$CPDPRG8= <mlev>
##$CPDPRGB= <>
##$CPDPRGT= <>
##$D= (0..31)
0 1.2 0 0 0 0 0 0 0 0.06 0 0.03 0 0 0 0 0.0002 0 0 0 0 0 0 0 0 0 0 0 0 
0 0 0 
##$DATE= 1704967827
##$DBL= (0..7)
$$ [...]
##$SUBNAM3= <"">
##$SUBNAM4= <"">
##$SUBNAM5= <"">
##$SUBNAM6= <"">
##$SUBNAM7= <"">
##$SUBNAM8= <"">
##$SUBNAM9= <"">
##$SW= 18.0517328524113
##$SWIBOX= (0..15)
0 0 2 0 0 0 0 0 0 0 0 0 0 0 0 0 
##$SW_h= 3612.71676300578
##$TD= 16384
##$TD0= 1
##$TE= 0
##$TE2= 300
##$TE3= 300
##$TEG= 300
##$TL= (0..7)
0 120 120 120 120 120 120 120 
##$TP= (0..7)
150 150 150 150 150 150 150 150 
##$TP07= 0
##$TPNAME0= <>
##$TPNAME1= <>
##$TPNAME2= <>
##$TPNAME3= <>
##$TPNAME4= <>
##$TPNAME5= <>
##$TPNAME6= <>
##$TPNAME7= <>
##$TPOAL= (0..7)
0.5 0.5 0.5 0.5 0.5 0.5 0.5 0.5 
##$TPOFFS= (0..7)
0 0 0 0 0 0 0 0 
##$TUNHIN= 0
##$TUNHOUT= 0
##$TUNXOUT= 0
##$USERA1= <user>
##$USERA2= <user>
##$USERA3= <user>
##$USERA4= <user>
##$USERA5= <user>
##$V9= 5
##$VALIST= <valist>
##$VCLIST= <CCCCCCCCCCCCCCC>
##$VD= 0
##$VDLIST= <DDDDDDDDDDDDDDD>
##$VPLIST= <PPPPPPPPPPPPPPP>
##$VTLIST= <TTTTTTTTTTTTTTT>
##$WBST= 1024
##$WBSW= 4
##$XGAIN= (0..3)
0 0 0 0 
##$XL= 0
##$YL= 0
##$YMAX_a= 63293
##$YMIN_a= -90715
##$ZGOPTNS= <>
##$ZL1= 120
##$ZL2= 120
##$ZL3= 120
##$ZL4= 120
##$ABSF1= 15.46924
##$ABSF2= -2.582609
##$ABSG= 5
##$ABSL= 3
##$ALPHA= 0
##$AQORDER= 0
##$ASSFAC= 0
##$ASSFACI= 0
##$ASSFACX= 0
##$ASSWID= 0
##$AUNMP= <proc_1d>
##$AZFE= 0.1
##$AZFW= 0.1
##$BCFW= 0
##$BC_mod= 2
##$BYTORDP= 0
##$COROFFS= 0
##$CY= -3
##$DATMOD= 1
##$DC= 0
##$DFILT= <>
##$DTYPP= 0
##$F1P= 0
##$F2P= 0
##$FCOR= 1
##$FTSIZE= 16384
##$FT_mod= 6
##$GAMMA= 0
##$GB= 0
##$INTBC= 1
##$INTSCL= 3.70164e-10
##$ISEN= 128
##$LB= 0.24
##$LEV0= 0
##$LPBIN= 0
##$MAXI= 10000
##$MC2= 0
##$MEAN= 0
##$ME_mod= 0
##$MI= 1.114404
##$NCOEF= 0
##$NC_proc= -9
##$NLEV= 6
##$NOISF1= 3.799351
##$NOISF2= 2.8
##$NSP= 0
##$NTH_PI= 0
##$NZP= 0
##$OFFSET= 15.47695
##$PC= 1
##$PHC0= -24617.4
##$PHC1= 43.05272
##$PH_mod= 1
##$PKNL= yes
##$PPARMOD= 0
##$PSCAL= 0
##$PSIGN= 0
##$REVERSE= no
##$SF= 200.130008956468
##$SI= 16384
##$SIGF1= 3
##$SIGF2= 2
##$SINO= 5.538805
##$SIOLD= 16384
##$SREGLST= <1H.CDCl3>
##$SSB= 0
##$STSI= 16384
##$STSR= 0
##$SW_p= 3612.71676300578
##$SYMM= 0
##$S_DEV= 0
##$TDeff= 16384
##$TDoff= 0
##$TI= <>
##$TILT= no
##$TM1= 0
##$TM2= 0
##$TOPLEV= 0
##$USERP1= <user>
##$USERP2= <user>
##$USERP3= <user>
##$USERP4= <user>
##$USERP5= <user>
##$WDW= 1
##$XDIM= 16384
##$YMAX_p= 505993672
##$YMIN_p= -3850474
$$ End of Bruker specific parameters
$$ ---------------------------------
##NTUPLES= NMR SPECTRUM
##VAR_NAME=  FREQUENCY,     SPECTRUM/REAL,   SPECTRUM/IMAG
##SYMBOL=    X,             R,               I
##VAR_TYPE=  INDEPENDENT,   DEPENDENT,       DEPENDENT
##VAR_FORM=  AFFN,          ASDF,            ASDF
##VAR_DIM=   16384,         16384,           16384
##UNITS=     HZ,            ARBITRARY UNITS, ARBITRARY UNITS
##FACTOR=    0.220516191357247, 1,           1
##FIRST=     3097.40208043323, 0,            0
##LAST=      -515.314682572553, 0,           0
##MIN=       -515.314682572553, -3850474,    0
##MAX=       3097.40208043323, 505993672,    0
$$ Real data points
##PAGE= N=1
##DATA TABLE= (X++(R..R)), XYDATA
$$ [...]
7202 -1467708 -1285539 -1125699 -1753265 -1818093 -1507785 -1135156 -882614 -1069067 -831655 -955404
7192 -955404 -1298318 -565908 128638 -354247 -749249 -1503247 -1638771 -1486460 -1631984 -1263054
7182 -1263054 -1219988 -933041 -1029362 -1778970 -1493641 -1030356 -757482 -921086 -976864 -817306
7172 -817306 -933223 -575353 -1041582 -1176812 -1434243 -1414282 -1066191 -891479 -1282036 -1226999
7162 -1226999 -1034305 -860536 -497889 -655741 -819705 -1029017 -857121 -932693 -525244 -1221923
7152 -1221923 -1793849 -917561 -784950 -1145317 -1810647 -1258232 -1070086 -1276510 -1707964 -1786383
7142 -1786383 -1758668 -1480268 -362595 -251837 -1231110 -1103947 -960271 -1511073 -1597153 -1395111
7132 -1395111 -1180830 -1482700 -1513363 -2265932 -1082337 -881814 -526070 -821484 -1412591 -967412
7122 -967412 -1279189 -487117 -233533 -646701 -710613 -269791 -150521 -1082626 -1203121 -1710290
7112 -1710290 -1301244 -734150 -174166 -1153115 -1679321 -1582930 -2352926 -1836565 -1699187 -2246139
7102 -2246139 -1877736 -1644649 -2059300 -1709649 -2237933 -1530133 -1559292 -2230010 -2565107 -1165275
7092 -1165275 -1148889 -926776 -942704 -1929163 -1703276 -1827882 -1944523 -1910538 -2015917 -2312133
7082 -2312133 -1912033 -1803121 -975625 -1152816 -1208510 -562235 -395929 -1318764 -2133565 -1241102
7072 -1241102 -1141671 -2118804 -1845947 -1002076 -709522 -1399999 -1252529 -1544032 -808323 -1493684
7062 -1493684 -1503453 -848806 -862592 -1094454 -1343821 -1072408 -970399 -560544 -1285808 -1350092
7052 -1350092 -1434866 -1441254 -1560355 -1450275 -1185148 -1134502 -844441 -498777 -386627 -172652
7042 -172652 -885817 -1046140 -941666 -282236 -1323809 -2062367 -2100943 -1751585 -1313505 -1601348
7032 -1601348 -1813121 -2516570 -2375581 -1430251 -1343718 -1378043 -1085305 -1027122 -993972 -781575
7022 -781575 -324393 -675374 -777344 -863661 -1313577 -982101 -1252405 -1852159 -1892035 -1137008
7012 -1137008 -758961 -654137 -118715 -1039482 -1403495 -838641 -401159 378912 35661 -835534
7002 -835534 -909944 -263568 -843229 -1441927 -2008591 -2059291 -1807176 -1799955 -1282000 -1225129 -1042865
6991 -1042865 -951763 -1303331 -1366590 -383932 -1007406 -771214 -709800 -1575052 -1376859 -1101425
6981 -1101425 -1544240 -1362229 -956947 -1749472 -1302714 -1691551 -1104577 -907405 -1045216 -642072
6971 -642072 -110519 -867654 -1138700 -672529 -1575393 -733746 -1280075 -1974764 -1755081 -1413482
6961 -1413482 -1086777 -704782 -287663 -600743 -609833 -152452 253399 546030 -13492 -229460
6951 -229460 -365009 -793779 -851563 -299704 -86050 377847 1434091 965857 -495835 -659288
6941 -659288 -678113 -320726 -872159 -684119 -970673 -1169457 -820503 -1277377 -999773 -272578
6931 -272578 743904 633025 183221 -1056967 -1261249 -974241 -339837 596815 891126
6922 891126 187574 622338 893993 1149114 1033696 16034 -73090 336513 1282054 1025177
6912 1025177 257807 481156 369609 -383563 -436788 176182 321873 476063 374392 110036
6902 110036 1190188 817834 357777 -912634 -691677 -353337 -479042 -556090 -801854 -917164
6892 -917164 -73460 -2023 -301359 164074 383068 202567 -13670 -768026 -1605201 -1226729
6882 -1226729 -1451388 -1393485 -799186 -930484 -766974 -470349 -995685 -1079301 -943538 -1125139
6872 -1125139 -1534995 -970634 -862747 -1158008 -1011507 -1251757 -1386431 -1182580 -953114 -365652
6862 -365652 -459372 -1204599 -1813325 -1584336 -2194028 -2691373 -2578516 -1144782 -283564 487915
6852 487915 537742 227569 -448662 -329781 -531492 -398732 -486405 -483523 -649180 -1500457
6842 -1500457 -509000 -151366 -344103 57655 -254591 -459013 -265395 -349570 -643680 -452530
6832 -452530 -700002 -1020107 -136257 314634 -735470 -1408630 -1285096 -1310925 -348333 -77462
6822 -77462 -454452 -733571 -931395 -507835 -859130 -1474557 -2251322 -2462333 -2025789 -1576182
6812 -1576182 -1680385 -1412223 -1778445 -1505481 -1500089 -1978376 -930058 -703676 -953746 -1739983
6802 -1739983 -1822303 -1620234 -579694 -672805 -1128458 -611631 430704 644478 60409 -733809
6792 -733809 -1225873 -1050728 -365501 592557 123752 -1160458 -744090 -637423 -671088 -1281096
6782 -1281096 -1288577 -1154672 -535326 -1045267 -628913 -791478 -875264 -481371 -837450 -575013
6772 -575013 -1425033 -1412364 -1057978 -621144 -642218 -671983 -495552 -1603359 -714826 209843
6762 209843 -188293 -343629 -848942 -1097783 -713729 -931048 -1640911 -1540983 -1711313 -1254446
6752 -1254446 -335403 -524373 -977579 -896611 -744861 -699345 -760340 -975265 -1142395 -838335
6742 -838335 -1777494 -1783148 -1510699 -1108466 -1621538 -1147211 -443398 -26416 -259389 -628609
6732 -628609 -81062 36565 -33335 -752287 -769218 -219137 -83155 -508807 -500805 -345935
6722 -345935 -1134017 -371337 -14165 -298549 400185 514212 -112980 10121 7816 423035
6712 423035 66788 -623912 -145252 -384078 -461893 -346525 -178952 -695674 -263825 -317778
6702 -317778 -764511 -930808 -1112377 -782117 -1540755 -1692291 -990806 -1024418 -778763 -687263
6692 -687263 -532322 -40210 132085 -47884 -547213 -448641 -453351 -456419 499743 -375629 -402973
6681 -402973 -497433 -671849 -652870 -55213 196904 -788730 -905795 -535740 484225 385692
6671 385692 207150 -294601 -1010075 9503 210721 32975 -111216 562628 1073173 525539
6661 525539 1431608 1604360 829087 785413 668634 -407551 -213771 428142 256217 149221
6651 149221 -264962 -602977 -52406 -210695 -712084 -459031 -697512 -886949 -305184 -702637
6641 -702637 -170387 381113 -101041 -1066164 -800557 224648 -303268 -174446 -16691 -195201
6631 -195201 -116251 669585 312467 -251946 292227 175945 -211 -893740 -746714 -504709
6621 -504709 -169621 430870 527868 -759281 123046 678133 710373 917016 982975 -85557
6611 -85557 163298 527607 -1408 563775 983591 756463 460077 -115407 -677230 -649811
6601 -649811 -477164 -147157 -329667 1867 512908 785940 313295 -428481 -480432 530331
6591 530331 79017 -58984 317275 1055830 1663680 2142207 1352225 1093706 641796 760668
6581 760668 976738 181563 -800168 266917 -80626 -201950 -32314 -46731 443223 857387
6571 857387 348256 1101497 1311488 772955 663024 1070100 514235 293639 474048 631345
6561 631345 890184 -16870 320915 790286 661101 -168457 -107890 -474991 642606 1678443
6551 1678443 1575982 1012987 1007870 1299134 1466324 1480741 1206552 697796 798274 1887742
6541 1887742 2290234 2028003 1915392 1737707 1802610 1481599 1586911 1767471 1266598 1557694
6531 1557694 2099482 2301452 2124923 1667513 1431252 1952475 3086314 1788352 1651440
6522 1651440 2705587 2995528 3261096 3507833 3189400 3150263 2611494 2309896 2932075 2320326
6512 2320326 2533020 2784055 2755249 3500832 4250066 4274481 3655687 3431553 3494241 3168322
6502 3168322 2868157 4042075 4005531 4234816 4943277 4351174 4236907 4218667 4154274 4319363
6492 4319363 4024915 4569122 4423885 3822886 4693359 5617868 5898077 5615058 5728212 6230078
6482 6230078 6583873 6265926 7112031 8132766 7930005 8055157 8587616 9601030 10999019
6473 10999019 11997001 13245197 14675094 16036610 17973908 19554351 19607432 19581788 17814754
6464 17814754 16202229 15189085 14166992 13152086 12229974 11762062 11777025 11823991 11711287
6455 11711287 11640087 12325493 13569718 13368082 15431634 17237711 18466413 19819143 21769183
6446 21769183 23797650 26417619 30150802 32974869 33522816 32243459 30061301 26420600
6438 26420600 23769993 20330806 17423861 15162327 14169332 13511335 12470342 11336455
6430 11336455 11304125 11562344 11284707 10939936 10927468 12296955 12799980 13065453 14339423
6421 14339423 16252825 17611881 18611607 19739857 19832168 19781704 18738697 17001683 15413395
6412 15413395 13018942 11574998 10302724 8995359 7528787 7014938 6638208 6429084 6013533
6403 6013533 5910396 5639598 4785591 4055701 4507215 4503187 4919902 5188907 5213137 5009852
6393 5009852 4140082 4000749 5007876 5283962 3913900 4215250 3703119 3856762 3766854
6384 3766854 3883858 4287896 4716476 4874884 4198403 3548210 3057756 3003397 3312358 2429970
6374 2429970 1807164 2295701 2822204 2924960 3347755 3824246 2628364 2239856 2787509
6365 2787509 3600892 3276803 2865437 2881713 3407044 2955949 3718853 4441208 3408669 3134840
6355 3134840 2340407 2388472 3034915 3719502 3477283 3479586 2783192 2773896 2984404 2511034
6345 2511034 2695762 3057716 3021333 3164428 2704554 2040066 2089411 2604417 3411306 4166815
6335 4166815 4230662 4223922 3397328 3703903 4066347 4111882 3373493 3092903 3934815 3182525
6325 3182525 3442333 3536490 2999944 2649989 3299746 2995253 2662326 2675050 3358133 3248118
6315 3248118 2742776 2382588 2240076 2981120 2867730 2482726 3999490 4065575 2975660
6306 2975660 3230607 3380469 3685806 3509864 3383270 3238358 2413572 1859420 1952655 2244269
6296 2244269 2285674 2816987 2489587 2343427 2286213 1876121 2093706 2537193 3101014 2296590
6286 2296590 2750836 2187475 1050407 1871719 1822345 1902069 2504028 2293456 2334551 3111813
6276 3111813 2505930 2245187 2050982 1750950 2127600 2181050 2818879 2780092 2194016 2662939
6266 2662939 1898832 1691910 1588478 1774849 1036238 1488511 1884483 2245328 2641556 2293715
6256 2293715 1991222 2054808 2639522 2308219 2346394 2956478 3653446 3225698 3720178 3897366
6246 3897366 4155418 3956801 3020630 2232024 2100090 2416259 2834975 3002328 2174642 2948519
6236 2948519 3633555 2759392 3197716 2627545 2990747 2905127 3227807 3660527 3373187 2929955
6226 2929955 3473667 3391330 3784239 3979607 4365803 4152245 4187251 5264413 6378338 5963881
6216 5963881 5533950 5160017 4410806 5216432 4592770 4074449 3607846 4973276 5099977
6207 5099977 5447367 4293435 4718865 4975789 4666475 5078053 4635698 4521168 3770675
6198 3770675 4417717 4300495 4249147 4470117 4575393 4244303 4528358 5006581 5245985 5343862
6188 5343862 6009535 6738590 7379070 6700210 6436935 6868496 6838392 6666872 6283855 7022056
6178 7022056 7169894 6662833 6966705 6975399 6944793 7508368 7325103 7887221 8870108 8742687
6168 8742687 8897368 9328979 9152880 9271599 10290752 10789168 10963256 11194172 11932745
6159 11932745 13388306 14825148 16346161 18228631 20031567 21877828 24045793 23792104
6151 23792104 24054614 22168952 19728332 19342345 18189865 18048765 18737078 18960976 19912348
6142 19912348 20559194 21152237 22130690 22743774 22273351 23117345 24234943 25302091 25960769
6133 25960769 25703592 24782665 23610435 22317422 21139846 20314894 20887635 20559215 21107545
6124 21107545 21615659 20483015 20102938 18572271 18260887 17519801 17222628 18550516 20004309
6115 20004309 20732015 22603722 23415328 22129684 19709608 16946195 15085132 13031933
6107 13031933 11577122 10714641 10221344 9191293 8566772 7574500 8156330 8041702 7386938
6098 7386938 7514566 6827717 6876699 7467225 7474294 6151479 5912453 5525466 5820330 5952016
6088 5952016 6065561 6040312 5494036 5769546 6397924 6341676 6973624 6625564 6158568 5532547
6078 5532547 5829806 7050112 6754407 7015358 7924949 8496369 8475876 9246775 9220583 9408529
6068 9408529 9491930 10172062 10982760 10578496 10907521 11037738 11480305 11193959 11268534 11048938
6058 11048938 12717860 13942980 13778086 13930242 14211576 14664663 15805656 16331357 17305192
6049 17305192 18827803 20592113 23315696 25125847 27979789 33682180 39738477 48046405
6041 48046405 59129814 71667171 81735882 83847157 77043708 62912385 47971340
6034 47971340 36070394 28728338 23373532 19559692 18542431 17499601 17314633 16399208
6026 16399208 16031381 16828416 16760375 16600435 16680085 16585536 16173206 16616325 16907059 17910001
6016 17910001 18669746 18765869 17339103 16237401 13488152 11496586 9995046 8859266 8020236
6007 8020236 7022020 6791006 6488067 6413755 5998074 5691870 5673605 6287034 6260787 5628974
5997 5628974 5913966 5555041 4947506 4601462 3793678 3876233 4144819 3836339 4537076 4588077
5987 4588077 4264474 4606074 4274516 3364233 4141969 3231522 3696674 3808152 3919164 4714625
5977 4714625 4552865 3678714 4197465 4754116 4540750 4313424 3362774 5004198 5417947
5968 5417947 5193894 4724082 4034333 4189152 4567062 4117215 4560313 5065074 5347220 5941292
5958 5941292 6019225 5274199 5734604 5585732 5729309 6031283 6125985 6812756 7016059 6053700
5948 6053700 6423546 6971003 7553877 6879973 7530079 8607360 8700083 8459975 7713324 8210601
5938 8210601 8413523 8504704 8784287 8598635 10069627 10774962 11176654 10812061 11062394 11631527
5928 11631527 13100077 14664684 15560952 17489451 19042221 19958183 21556886 24171693
5920 24171693 24982559 24062464 22144267 20937591 18960679 17835835 15718487 15343473 14720645
5911 14720645 14740527 14630243 14924925 14974595 15218080 15846098 15750080 16855853 18701837 20209393
5901 20209393 21687437 23097570 25766956 29688724 33252145 36269189 36940385 35845162
5893 35845162 33934528 30649337 26747099 23135384 20156284 18797561 17672570 16670205
5885 16670205 15443275 14555685 14756701 15441181 15155122 14967561 15469812 15782465 16468077
5876 16468077 17017360 17879318 19137763 19942753 21137451 21960289 22839799 22571888 21038301
5867 21038301 19880195 17751453 15588623 13923456 12946437 12645137 12500547 12400469 12411971
5858 12411971 12536548 11988267 10790060 11192063 11419293 11699124 11279823 10825700 11262196
5849 11262196 10073355 10165700 11181530 11115200 11412693 10428765 10550026 11431745 11601077
5840 11601077 11769993 11628572 11950833 12544957 13106493 12643297 11846147 11992990 12971365
5831 12971365 13054530 13197237 13502942 13412655 13860938 14555010 14807554 16272977 15704077 15879152
5821 15879152 16544068 17534086 17495819 17426010 17981046 17201319 17181865 17782517 17971703 19156004
5811 19156004 20670442 20983300 21445504 23090235 23925901 24201850 26197135 27825004 28275828
5802 28275828 29666479 31911842 34265742 37443589 42086054 47084090 53228899 62371508
5794 62371508 75393617 92502523 111941020 127805510 132203858 118983626 96420201
5787 96420201 74118519 57119364 46154505 38661119 33671907 30679668 28131648 26705172
5779 26705172 25476502 24139420 22854952 21937364 22579645 21257788 21066384 21988781 21969115
5770 21969115 22214068 23684576 23161100 23175575 25520219 25772913 26626911 29027716 31321512
5761 31321512 33375717 32122063 30938013 26753306 23747148 21893208 20427869 19071995
5753 19071995 17631633 16644138 16672900 16501821 16247762 15833536 15491941 16575712 16634802
5744 16634802 16027150 15520793 15016090 16849662 17403183 16805393 16978984 16444803 16456333
5735 16456333 15636954 15321445 14174660 13589189 13416930 12959897 12095340 12354781 12739741
5726 12739741 11948705 10982436 11488417 11825814 11967149 11441486 10381227 10269035 10017832
5717 10017832 10578622 11329361 10584838 9421021 10315740 11308641 11291362 10789753 10578469
5708 10578469 10463417 10766082 10776513 10365040 10193094 9445044 9216892 8708349 8780592 9075638
5698 9075638 8527588 8896491 8744310 8675465 8646223 8168768 7792638 7254585 7162397 7473130
5688 7473130 7763239 7803186 8312813 8055187 7272187 7597206 8316824 7746077 7756634 8696238
5678 8696238 8768904 7441835 7169945 7724992 8272756 9102789 9229196 8395459 8709109 8496362
5668 8496362 8011539 8315662 9590127 10186512 9957873 9234711 9139427 9190541 9549555 9077178
5658 9077178 8503737 8688467 8532172 8431624 8394141 9597296 10101234 10418613 10120444 10014317
5648 10014317 9636077 10172166 9681330 9640593 9684071 9551980 10059513 10115905 9985991 10617972
5638 10617972 10502512 9604864 10533523 10895971 10644029 11200761 11195274 11365947 11852111 12569373
5628 12569373 11974790 12835154 14210509 14199849 15164864 17095370 19309094 20225965 22216055
5619 22216055 24664186 27110052 28544599 28329041 27251057 25101435 23426623 21966254
5611 21966254 21547756 21330162 21093614 21914470 22917833 24438990 24478903 24022817 22970123
5602 22970123 22292986 22754162 23630810 24587650 26294779 27488850 27877885 27373511 25709719
5593 25709719 23728793 23373565 23481555 23200030 23373450 22761387 20967092 20117426 18779951
5584 18779951 17744576 17597621 17862794 18394591 19681699 21209420 22011392 22356550 21690568
5575 21690568 20141195 17738387 14940307 12963619 11289198 10613295 10939472 9972634 10007636
5566 10007636 8970355 8458438 7413148 7290467 7578672 7902838 8560602 8042996 7541220
5557 7541220 6979817 7780103 7684807 7623357 7185125 7288752 7173206 6694084 7024856 7265604
5547 7265604 6762483 6456447 5890711 5472234 6626163 6849542 7162002 6435566 6186120
5538 6186120 6461785 6301538 5724064 5671114 6451012 6113439 5970517 5482260 5479906 5745987
5528 5745987 5827759 4969930 4723013 5147462 5504431 6409077 5785009 6150249 6571242 6619282
5518 6619282 7037818 7287500 6532774 5785865 5997317 6908137 6542228 6333620 6662811 6848868
5508 6848868 6860441 7442168 7743366 7512334 6573479 6602907 7202451 6275784 5685570 5093259
5498 5093259 4896651 6763793 7271909 6771309 7612898 7462375 7365129 7083543 7217659 7763483
5488 7763483 8187273 8460239 9011535 8909303 9215555 9592762 9198797 10207775 11031269
5479 11031269 11786391 11884462 12864734 15076746 17314328 20437108 23594649 25740061 25586502
5470 25586502 22867489 18877416 15438248 13199282 11212062 9809862 9777286 9352469 8315743
5461 8315743 8178924 8173442 7090881 6771799 5990535 6870112 7038615 7008673 7423024 7743873
5451 7743873 7931901 7125565 7173816 6741567 6238542 5811645 5937617 5671177 6516498 6104762
5441 6104762 5900491 5731824 6096887 6433377 6153163 6265304 6989108 7533111 6588977 5789855
5431 5789855 5588234 5702671 5349195 5374199 5622808 6078992 5215110 4893526 5341401 5577417
5421 5577417 5773996 5686322 4799365 5208821 4860807 4261096 3576352 3812979 5050452 6054428
5411 6054428 5838725 5194114 5490269 5223643 4810497 5062630 5454857 5063197 4847645 5738340
5401 5738340 5404351 5023272 5968717 6759488 6994775 6528869 6676831 7705126 6754474
5392 6754474 6550919 7035136 6937431 7077293 6098721 5723298 6167028 6059585 6000369 5387857
5382 5387857 5226134 5774251 6019681 6033782 5505845 4953206 4917237 4762055 5089789 5599155
5372 5599155 5957719 5636239 5405124 5368495 4650528 5811204 5041049 5095547 5462679 5357946
5362 5357946 5253935 5541108 6180514 5527843 4580671 4749788 5428559 5919783 6252568 6216184
5352 6216184 6626427 7083339 7977714 7955308 9144585 10544138 10498412 9931068 8378530
5343 8378530 7777813 7222721 6301837 6189181 6115454 5491490 5855615 6667326 5540432 5338067
5333 5338067 5815140 5535285 5204675 5460336 6096948 5559777 5828861 6348877 6554580 5705194
5323 5705194 5857614 5576569 5698074 5377807 5638434 5922338 5755535 5440520 6011241 6122755
5313 6122755 5958235 5894089 5856894 6114964 5315803 5513512 6028808 6479774 6237952 4877151
5303 4877151 5210787 5934336 5642771 5205737 5647911 6061070 6414648 6374056 5311908 5401876
5293 5401876 5622599 6107849 6463756 6596557 6338451 6917552 6312396 5679894 5563885 6534168
5283 6534168 6710499 6332012 5805742 6908376 7033929 5926978 5886476 5923868 6068673 6638111
5273 6638111 6577000 5791454 5976648 6397087 6391178 6379975 5928754 6145627 6505701 6281975
5263 6281975 5831707 6328411 6023156 6160177 5872508 5770300 5536305 5691077 5837146 6170044
5253 6170044 6440146 5615773 5486766 6677375 5686783 5705725 6241388 6936748 6670382 5109515
5243 5109515 5155547 5255065 5751530 6136478 6886696 5840878 6197429 6459963 6567022 6979076
5233 6979076 6398043 6122848 6745460 6927546 6687414 5519322 5757939 6218895 6079221
5224 6079221 5915771 7157496 6747599 6891529 6403524 6534920 6630359 6502196 6807394 7133892
5214 7133892 7489026 7675391 6809937 6645327 6718937 7470667 6959011 6692596 7383480 6465142
5204 6465142 6385322 7312219 7664626 7254116 7203099 6424666 6412026 6954877 6543836 6673729
5194 6673729 7327111 7582121 7616906 8192645 7862589 8378447 8227414 7198335 7280114 8348253
5184 8348253 8019922 8117019 8963867 8655134 9048665 7738091 7759783 8071387 8263410 8093658
5174 8093658 7860891 7667607 8113640 8002266 8346475 7969791 7827825 7831264 8198237 8262256
5164 8262256 8479823 8393269 8609343 8603975 8507087 8772464 9528392 10136473 9772173 9485140
5154 9485140 9220761 9590581 9958757 9431138 9200574 8846611 8623861 8375213 9135856 8911372
5144 8911372 9229714 9444844 9522161 9655942 10168453 10526322 11082154 11363580 12282888 12458723
5134 12458723 11335369 11815870 11530828 11401580 10870400 10460698 10493112 10574436 10039996 10325188
5124 10325188 10449204 10771241 10825320 10517319 10851174 10631633 10184133 10506339 10988872 10970612
5114 10970612 10021162 10462056 10609042 10687493 10852777 11055354 11136249 11499805 11184299 11240827
5104 11240827 11460824 11672453 11723504 10963466 11370568 11990776 11842334 11797883 11853542 12437614
5094 12437614 12526554 12312355 12565194 11422976 11524362 11522323 11934061 11688475 11715846 12163795
5084 12163795 13129830 13762394 13246525 12555130 12904828 12937498 13288206 13871932 13066052 13286517
5074 13286517 13757263 14061410 14176658 14037626 13195905 13096489 13978254 13731633 13927275 14173530
5064 14173530 13954925 13865560 13354485 14174700 14528690 14268556 14258747 13428575 13051742 13628420
5054 13628420 13849810 13801301 13084104 13710182 13773632 13091336 12836214 12537355 13135785 12989049
5044 12989049 13763949 13816147 13294263 12946019 12278866 12604292 12651147 12908674 13401414 14360391
5034 14360391 13808914 13893471 14371002 14850006 14446659 13827424 13172357 12978774 13505454 14663604
5024 14663604 14494912 13683506 14361566 14555556 15430697 15361332 14514389 15147785 15155938 14955679
5014 14955679 14560986 14949814 15377917 16031327 15768427 16345866 16203994 16492846 15834114
5005 15834114 16330921 16642727 16290745 16101275 16102834 16229625 15451988 15506025 15563899 15186537
4995 15186537 15218300 15490041 15077743 15611957 16757817 16052378 15422829 15353132 15354614 15380260
4985 15380260 14978875 15559302 15551824 14934706 14596140 15510610 14674660 13994003 14468463 15298679
4975 15298679 15057693 14584450 14011491 14546131 15080907 15341097 15552603 16385508 15476377
4966 15476377 15036326 14473801 15042087 14922229 15147944 15218665 15820035 14539809 14262609
4957 14262609 14395005 15082214 14892619 14854128 14950890 14865609 16233688 16602939 16999543 16485722
4947 16485722 16629087 17310331 17318992 17465153 17637450 17309717 16942668 16965684 17653048 18887205
4937 18887205 18824968 19039798 18896662 18479906 18377545 18803377 18948261 18286776 19015555 20218723
4927 20218723 19738167 18827161 18740327 19142954 20001563 19162817 18981867 18943644 19273416 18930671
4917 18930671 19328864 19426183 18843290 18465930 18845659 19575241 19217964 18499084 19491778 19270843
4907 19270843 18067824 17756118 18373410 18174167 17495170 18103023 18500829 18151495 18913856
4898 18913856 18855829 18868471 18524166 17924936 18150176 18812806 18943050 18765207 17867954 17685793
4888 17685793 18279992 18618333 18946236 19380954 19269510 19135612 18873783 18578712 19317768
4879 19317768 19906595 20228554 19997755 20831236 20990649 20410686 20896946 21146550 21223936 21982719
4869 21982719 21848634 20736199 20539984 21214416 21863982 21785899 21852497 21708615 21471600 21162982
4859 21162982 21121038 20863064 20583794 20264030 20211859 19541511 20290075 20924391 20968335 21295485
4849 21295485 20889516 21084334 19896609 19417527 19637336 20023496 19924358 19597222 19383797
4840 19383797 19674531 20037038 20100783 19923763 19802286 19427328 19518912 19746820 19418181 20336890
4830 20336890 20045469 19186682 19112339 19480944 19820135 19923361 19445940 20110741 20363370 20368219
4820 20368219 20404348 19974296 20066354 19847051 19743529 20867831 21654808 21785110 21802788 21312310
4810 21312310 20822372 21559319 20767119 21254087 21408650 21522554 21814321 21470434 22073356
4801 22073356 21816637 22302733 22368187 21905252 22271285 22475518 22286298 22666094 22603690 23375514
4791 23375514 22681533 22238060 22213778 22355658 23348458 24161317 23363749 23317237 23690042 24011816
4781 24011816 24186845 23880474 24205468 24395156 24350314 24612893 23512774 23564045 24829006
4772 24829006 24493555 24178255 24524789 24621028 24666806 24953036 25284400 25107826 25898174 25245527
4762 25245527 25807932 25474049 25467238 26042637 26404932 27762638 27472886 27365601 28038614 27592519
4752 27592519 27732387 26991477 27179798 28919157 29343784 29112099 29687535 29753347 29555202
4743 29555202 29835175 30246662 30459592 29799474 30956772 31238470 31056651 31533397 32287302
4734 32287302 33624246 33988354 33851104 34472451 34818994 35533591 36363491 37896364 38989727
4725 38989727 40949002 42821786 45013629 48240525 52288725 56944164 63384460 69000195
4717 69000195 72229700 70724888 66483860 61035923 57248031 53986304 52077842 51699587
4709 51699587 51637429 51553715 52421735 53101142 52140101 52073713 50184818 48920187 47956482 47516848
4699 47516848 47743759 47606568 46888623 45644363 44889288 43068536 41495819 40568229 39787495
4690 39787495 39012875 37350931 36884359 36679481 36893328 36401094 36681466 36082612 36180543
4681 36180543 35892627 35706504 35538688 35367532 35453408 34698555 34784823 34388669 33861416 33798275
4671 33798275 34285923 35215911 35760782 35423314 34897827 34777361 35228035 35428650 35674306
4662 35674306 35726138 35727769 36110432 36789831 37162188 37552163 38909571 39428470 39303317 40221707
4652 40221707 40784617 40863150 40961771 41081423 40974524 40598707 40107792 39360676 38755974 38958031
4642 38958031 38291361 37897301 38320051 38815105 39609851 38822682 38643534 39193786 38871165
4633 38871165 38461342 38637785 39659674 40444568 40668262 40532026 40433159 40444474 40973131 41375022
4623 41375022 41557976 42772392 43576141 43668099 43806894 43867314 43422609 43441696 43768980 43965492
4613 43965492 43805783 44579907 44942577 44598654 45451159 45736993 46088007 46695107 47285823
4604 47285823 47729466 47809592 47956463 48475639 48660102 48193695 48538366 49417901 49568556 49149382
4594 49149382 49273128 50456040 51503178 52368047 52975772 54334620 54429130 54961071 54232258
4585 54232258 54507533 54908063 54826506 54976098 54737395 54929190 55088225 55109021 55173003 55149577
4575 55149577 56269837 56755858 56906447 58243260 58746501 58937200 59100575 60082318 60895080
4566 60895080 62276912 63219922 63960904 65087908 66842619 68326999 68777521 69506000 69926445
4557 69926445 71367354 72780123 74773142 77185902 78316353 80475213 82925971 85962259
4549 85962259 89484732 92735229 95869152 97820831 99321837 98781412 96823024 94102813
4541 94102813 90677019 86838482 81925603 77980359 75126942 73349760 71043187 69341079
4533 69341079 69260995 69223816 68707279 68376563 67771082 68412534 67927973 66408949 65779293 66425178
4523 66425178 66885028 67243700 67001390 66888210 67437306 67108732 66921349 66050836 66756761
4514 66756761 68565689 69184681 69157053 69026678 69861894 69566150 69528920 69754323 70092653 69294533
4504 69294533 68644677 67819149 68695324 69327120 68977821 68640184 68089645 68590826 69020775
4495 69020775 68972590 69015316 68539003 68503200 68402545 68090421 68655830 69634658 69470902 69482386
4485 69482386 69596025 69194816 68564576 69257447 70152482 68548005 67867277 67724346 68496879
4476 68496879 68779459 68434465 68115074 66915123 66804364 67184516 66580109 67034755 66569288
4467 66569288 65257556 65054401 64929830 64613699 64240375 64403449 65113815 64196907 64260874
4458 64260874 63833100 64534547 63962525 63765283 64029784 63663906 63659961 63125147 63175410 63290004
4448 63290004 64262578 64221228 63287017 63535056 63966450 63539015 63497500 62914983 63151054 63297148
4438 63297148 62795082 62791228 62422144 61793376 61677336 60924666 60234704 60985555 59725122 58810283
4428 58810283 59595585 59648349 59361034 59445483 59152828 59652922 60198780 60193869 59687184 59148439
4418 59148439 58892845 58950023 58426378 58373843 58445729 57755806 58175215 57902608 57704474 57507632
4408 57507632 56701133 56804235 56677023 56052914 56010198 56316280 56290883 55865024 54911115 53838401
4398 53838401 53638705 54196062 54593272 54759528 54262428 54084777 54512569 54966307 54435122
4389 54435122 53922618 53616706 52794721 51926493 51289042 51622244 51059869 50654932 50731149 51060443
4379 51060443 50551029 50406038 50470864 49878728 49916728 49717095 49743798 49344027 48736834 48100319
4369 48100319 47781339 47737143 48204064 47814025 47854428 48679396 48065733 46964364 46927021 46271412
4359 46271412 47110909 47538100 47346702 46931384 47525413 46834624 46277436 46848324 46163481
4350 46163481 45294357 44388023 45140579 46090431 45215204 44849301 45543418 45063682 45240114
4341 45240114 44472320 44561963 43333473 42715191 42681710 43643661 43856637 43231313 43225928 44048207
4331 44048207 42716265 42205725 42542430 42119041 42558431 42480783 42267733 42074688 42313595
4322 42313595 42642725 42119644 41836151 41618964 41247438 41496874 42154161 42253336 42087271 41990570
4312 41990570 42585280 43052243 43847113 45065541 44383503 43686449 41959459 40721737 39849830
4303 39849830 39550277 39348242 39229929 39012431 38964872 39417691 39139463 38074828 37414119
4294 37414119 37718809 37626580 36678269 37418426 37560125 35869680 35877863 36298576 36396490 36406505
4284 36406505 36602826 37031341 37774712 36910125 36498071 36331676 36205474 36241325 35760987 36055943
4274 36055943 37186654 36370236 36046400 35992579 35351219 35649898 35347616 35242879 34812461
4265 34812461 34635443 34254609 34876246 34819193 34399911 34320354 34542624 35164172 34279033 34670044
4255 34670044 34249764 34192433 34169312 34336998 34140493 34604762 34573888 33699012 33869469 33435861
4245 33435861 33326122 33740072 33946308 34110655 33904554 34197844 34619903 34601101 34972979 34059427
4235 34059427 33684462 34079832 33660137 32573015 33163639 33693507 34069435 33895260 34326950
4226 34326950 33776690 33892856 34498106 34688825 34411553 34002631 34387259 34677892 34130391
4217 34130391 34057418 33599140 34144974 34342206 35024692 34769718 34688935 34934483 35193517 35602964
4207 35602964 35204046 35009735 34946830 34986837 34060534 33756989 32851568 34127306 34607142 34272918
4197 34272918 34666653 34112942 34310564 34354689 35154397 35174252 35676941 34881476 34559733 34265614
4187 34265614 33955887 34046130 33470391 33168055 33995676 34334357 34557739 34393320 34768530 34930759
4177 34930759 33370370 32975044 33683772 33693119 33302780 33614301 33435009 33338723 33693741 34835183
4167 34835183 33902179 33646681 33831796 34133292 34178548 34764832 35309248 35180900 35377510 35152781
4157 35152781 34154073 34838332 34665918 34590498 35009349 35147986 34830540 35534767 34466045
4148 34466045 34383609 34614562 34945267 35001232 34805854 34930256 35157363 34710332 34666785 35772958
4138 35772958 35756181 34732015 34837866 35340922 35484160 35471651 34929472 35567825 36251828 35492430
4128 35492430 34973981 35473776 35366968 36575802 36628034 36498653 36782473 36282825 35874690
4119 35874690 35620736 36527801 36137602 36796523 36920331 36606707 37407606 36962275 36539282
4110 36539282 36528281 36383576 36916059 37716539 37348562 36628610 36668277 36588504 37314985 38415737
4100 38415737 37625451 37489341 37013083 37547641 37087680 37889250 37849057 37783064 37263347 37644623
4090 37644623 38164496 38277499 37639730 37559004 37284363 38341703 37580742 37942588 37715323
4081 37715323 38589463 38186323 37844687 38321382 37142967 37354875 38064089 37889037 37322310
4072 37322310 37676797 37572649 37416540 36925856 37130873 36971160 37873382 37517929 38255300
4063 38255300 37787036 38725588 39318029 38620925 38960559 39656939 38966784 39119915 38746231
4054 38746231 39245726 39802049 39302656 39597268 40953294 41551454 42161100 41710102 41841447
4045 41841447 41323831 41292949 40857024 41507077 40635395 39465320 40613771 40122419 40785939
4036 40785939 41763604 42055169 41967874 42601829 42543215 42087099 41639670 41085033 41050872 41126125
4026 41126125 41572108 42080181 43610659 43701172 43536752 44121515 45213950 46098806 45287198
4017 45287198 46219232 45839472 44407122 43964413 43441053 42121599 41952938 41330819 41021046
4008 41021046 41281342 41178140 41248305 42429768 42127833 42226214 41783357 41568698 41725516 41173433
3998 41173433 40649139 39335749 39684764 39763730 40123693 40150074 40133287 40340427 40394629 40094014
3988 40094014 40092902 39241960 38922727 38579069 38421561 39023771 38731447 37893629 37752537 37711451
3978 37711451 37672740 37195546 37110614 36692246 37041700 37265648 37416722 37457402 37402109 37074346
3968 37074346 36318618 35948271 35561081 35513267 35910805 36805883 36904736 36494154 36351985 36855314
3958 36855314 36701831 37552440 37486362 37140437 37046985 37602045 36998102 36840777 36598981 36601667
3948 36601667 37537173 37694904 37089005 37017226 37369868 37457573 37061544 37323637 37966429 37699470
3938 37699470 36453022 36612709 36935824 37182039 37242659 38105801 38015989 37603547 36131821
3929 36131821 36232957 36630875 36681364 36785873 36731871 36820440 37501783 37498562 36107297 35834061
3919 35834061 36356903 36843591 37418210 37232776 37723899 38053189 37911049 37753432 37468985
3910 37468985 36749127 36947875 37512551 37889940 36959598 36338778 37317208 37247812 37374249 36812569
3900 36812569 36722660 36243646 36396325 36665589 36878527 35241190 35674729 35635539 35594013 35977294
3890 35977294 36142530 36249468 36019226 35659640 35087922 35208100 35698251 35908805 35930305 35035814
3880 35035814 35561310 34530716 33847528 34423612 34603292 34043353 34509509 34053005 33721975
3871 33721975 32975051 33240405 33141842 33298574 32956649 32652884 32188016 32259307 31792888 31866817
3861 31866817 32202770 32322625 32954718 32794376 31909712 31501027 32030293 31741977 32053346
3852 32053346 31259492 31983825 32496471 32537870 32650782 32573348 32897261 32841524 32404226 33118048
3842 33118048 32747980 32532130 33242732 33953379 33139904 32986429 33092293 33658279 33346888
3833 33346888 32837752 32746512 33140272 33019732 32689454 33027857 32869078 32538453 32140173 31290979
3823 31290979 31068747 31218080 30860627 31277460 31590520 31902884 31396609 31731132 32145448
3814 32145448 30520217 30571982 30940715 30604190 30117344 29834083 29486751 29903555 29798590
3805 29798590 29655949 29829834 29611626 29070822 29198258 29928034 30413599 29059889 29348022
3796 29348022 30038264 29233706 29253039 29404891 29400256 29673631 29442082 29493349 28943153 28975938
3786 28975938 29244710 29145224 29990200 29827554 29963592 28911582 29257550 29560336 28935704
3777 28935704 29275968 29558817 28439943 29507511 29317320 29499545 29321876 29045260 28696693
3768 28696693 27693234 27890083 27625769 28100685 28031745 27635045 26809695 27658216 27596528 27631554
3758 27631554 27818234 26973578 27184242 26583388 26954274 25777356 24751479 25893227 25727204
3749 25727204 25611406 25692714 26151910 25808945 25725341 25619717 25692263 25455943 25495038 25648812
3739 25648812 25632554 24836161 24549995 24843347 25856766 26014858 25636286 25480837 25393354 25403363
3729 25403363 25044220 24687686 24695021 25177738 25426113 26157554 26230304 25236644 24558763 24547980
3719 24547980 23581790 23746432 24072513 24089187 24324437 23879613 23347808 24779095 23523969
3710 23523969 23047973 23517771 23076247 23318676 22690323 23213288 24059034 23555114 22660029
3701 22660029 23364281 23366524 23208765 22022146 21577740 22033080 22742032 23384413 23803777 23506989
3691 23506989 23090674 23423386 22920120 22528041 22328150 22312350 22025161 22404338 22793377 22356125
3681 22356125 22534829 22249099 22078092 22733540 22584967 22337230 22484696 22193535 21615687
3672 21615687 21276436 21657257 21865363 22147154 22207703 22264911 22431399 21686313 22203144 21431373
3662 21431373 20631222 20207861 21122757 21436623 21370656 21098227 20990895 21703950 21053581 21001642
3652 21001642 20464883 20839991 20803782 20412104 20834774 20952202 21099913 20704725 20544076 20379061
3642 20379061 19879973 19877920 19566364 19456175 20218378 20916256 19601010 20104914 20275912 19941215
3632 19941215 20313763 19615246 20161290 20946922 21007081 20340597 20798952 21004618 20282537 19810282
3622 19810282 20149945 20548842 20749276 20390558 20474857 20223691 20578456 20548505 19795987 18942564
3612 18942564 18707709 19364215 19390779 19201299 19440341 19504367 19609802 19796054 20160655 20253419
3602 20253419 19717290 19546408 19761929 20685218 21127051 20617289 20806905 21092335 21358905
3593 21358905 20753804 21059381 21494824 21081789 21486880 21247684 20280465 20492282 20858617
3584 20858617 20482435 21458757 21209330 21543364 21623793 21463379 20863635 21113693 21887363 22023444
3574 22023444 21556783 21957059 22204937 21871613 21862105 22472619 22686868 22873264 22564363 22819015
3564 22819015 23344304 23088690 24129560 24986699 25492432 25296926 25628416 25830524 25295376
3555 25295376 25556399 25864493 26048430 26430025 25936640 26685123 26686212 26520501 26096621 26717081
3545 26717081 27099283 26758436 27200250 27618666 27903522 28193934 27133671 27911832 29073863
3536 29073863 29893561 30237847 29702909 30540480 30887402 30956466 32795706 33967893 34185489
3527 34185489 35221020 36432060 37164901 36351000 36102056 35615055 34812897 35578800 35689327
3518 35689327 35890687 35895980 35723198 36597870 36704736 38122849 38081946 38149777 38739164 39507293
3508 39507293 40188304 40969001 41056803 41921986 42565321 43309088 42733167 43389770 44138980 45529220
3498 45529220 46815110 48353091 49600209 50217672 51659912 53093566 53806710 54913854
3490 54913854 56555372 57929970 59274628 60599809 62686757 64025155 66491971 68831991
3482 68831991 71734336 75075324 78443527 81871662 85788988 89394709 91967482 95800101
3474 95800101 97686854 98427854 99211849 98207904 96360805 94808432 92691720 88909287
3466 88909287 85013817 81397237 78475744 75030499 71465724 67655530 64513735 61706607
3458 61706607 57878636 54883014 52566390 49694041 47103155 45017508 43364144 41917224
3450 41917224 40840303 39700263 37789569 36205155 34759482 34047184 33444406 31947093
3442 31947093 31150022 30229153 30204848 29661883 29229959 27796233 27099914 26490526 25941056
3433 25941056 26060770 25040210 23869344 23683025 22856486 21998179 22450495 22376955 22235843
3424 22235843 22158298 20654893 20620017 20209337 20056047 20030209 19410941 18613311 18009745 17796958
3414 17796958 18450573 18337415 18693808 18027485 17369147 17250911 16575301 17317166 16991744
3405 16991744 16726956 16874961 15896431 15498847 15029146 15750460 15581471 15170976 14598817
3396 14598817 14675781 15510636 15105444 14577431 14330813 13963379 13121293 13132570 13083654 12671227
3386 12671227 12470579 11591731 11072580 11257531 11410989 12033520 12196158 11729660 11980619
3377 11980619 12189484 10834538 11083514 10225910 9701335 10133587 10643009 10644920 10814136 11091652
3367 11091652 10809729 10677827 10760999 10302709 9769656 9669710 9864483 10082072 10191971 9946710
3357 9946710 11120956 10896551 9639062 9156888 9034653 9481885 9548285 8559674 9256832
3348 9256832 9629525 9675690 9683859 9738479 9915906 8506673 8689268 8762135 8371337 8366951 8322193
3337 8322193 8674539 7897551 7717630 7801795 9538819 8838324 8610781 9185253 9361049 8659391
3327 8659391 8047555 7930972 8034960 8012145 7979740 8076442 7978625 8049044 7586466 7973207
3317 7973207 8545534 7884933 7420767 7441161 6921384 7301139 7181162 7027406 7093679 7382116
3307 7382116 7699884 7676659 8484078 7796736 6804381 6921573 7257356 7369622 6742497 6831779
3297 6831779 6813297 7264612 7220500 6902917 6544747 6640796 6570144 6181829 6132682 6486649
3287 6486649 6921004 6962581 6834449 6634898 7392948 6940708 5971393 6852956 7283531 6773001
3277 6773001 6890725 7158349 6088665 6309390 6679832 6407117 6193279 5680826 5615823 5687084
3267 5687084 5480129 5658265 5985813 5953311 6426278 6712039 6193351 6555241 5889364 5457919
3257 5457919 5422892 5806310 5776648 6097390 5891503 5849463 5963537 6856296 5939574 5615508
3247 5615508 5678275 5255165 5032634 5501093 5357811 5513156 5629065 5287226 5573132 5609375
3237 5609375 5257814 6040805 6719469 6236423 5977119 6550264 6047449 5924914 5827537 5446725
3227 5446725 5167152 5061443 4854425 5380344 6495909 6941317 6453954 5612262 6263502
3218 6263502 6893798 6470241 5401474 6379370 5678381 5842356 5735989 6368816 6081710
3209 6081710 5945628 5634185 5645553 6330774 6369582 5660950 5373890 6232875 6941236 5765946
3199 5765946 5901372 6298896 6366831 6407880 6244643 6976447 6698579 6945143 6723314 7266026
3189 7266026 7349546 7264859 7595252 7704002 7922068 8009398 8036338 8624517 8947384 8257367
3179 8257367 7119142 7553517 7803479 7694874 8503221 8231535 7933017 7622216 7884304
3170 7884304 8268744 8495891 8788421 9342028 9597724 9756853 9558725 9721401 10109536 10365499
3160 10365499 10787691 10968761 10807032 11063714 11446337 11006169 10707937 11611932 11124397
3151 11124397 10994672 10842242 11418426 11690521 11190935 11465913 11159140 11234350 10431038 11426419
3141 11426419 12246897 11926539 12821367 13000129 13597528 14007076 13959928 13619495 13570528 14083932
3131 14083932 14130712 14324325 12889338 12043973 12411945 11732138 10294082 9858709 9363220
3122 9363220 8923463 9522087 9555740 9598615 9184030 7850539 9038872 10000081 9779459 8965458
3112 8965458 8714841 8695180 8315331 9368952 10095367 9695350 9083402 9197792 8802319 8906245
3102 8906245 9027383 9407373 8786524 8715487 8512022 8133926 7681151 7668700 7291891 7429883
3092 7429883 6730593 6414505 6033445 5944172 6171077 5826131 5970561 5423316 6220203 5684291
3082 5684291 5664713 6248782 6137288 5372448 4836909 4799914 4601855 3886525 3351161 3246099
3072 3246099 4145204 4542877 3803217 3837959 4284207 3872103 3904889 3733542 3461261 3414534
3062 3414534 2708196 2453014 3564220 2411657 2113943 2898313 2825779 2536558 2785266
3053 2785266 2435873 3053854 2328723 1443107 1947634 2109275 2194951 2771286 2546232 2166426
3043 2166426 2063027 1997737 2625794 2467890 2627998 2014180 1916664 2633818 1777840 2934406
3033 2934406 3948137 4198089 3718126 2503731 2121028 1484530 1413958 1089850 1259918
3024 1259918 1664096 2462814 1341259 1125210 1071454 1308032 1857001 474029 1234083
3015 1234083 1376077 1184999 1519494 2063768 2257768 2257123 2269926 1808658 2378320 2056981
3005 2056981 1578405 1736227 1887549 1318052 1288323 1529578 1359090 1085309 1132383 717236
2995 717236 1859689 676910 160431 1127416 1177425 1439701 1327321 1648370 1214443 654202
2985 654202 591853 291710 133190 -4706 1452293 1215476 1609264 1590460 861601 902017
2975 902017 396625 998444 1243332 919558 670318 1010974 666711 540627 1216622 78543
2965 78543 -291785 44517 118361 661268 695608 661712 936323 1400262 1195491 119748
2955 119748 -366838 67003 795053 1878935 828313 -591573 69847 1474484 1609855
2946 1609855 1101399 642874 323986 734665 1244107 1037256 1195132 519715 434401 -21716
2936 -21716 -144474 201388 508919 1067416 978611 -106997 -133649 -231648 253829 463982
2926 463982 861875 1318944 706250 -351100 -1042993 -1117461 -655364 37909 -169161 -169505
2916 -169505 -264639 40666 -134699 -658933 -235315 428576 265644 887848 849056 303920
2906 303920 -471949 -617024 -224104 963291 1062065 1297557 737332 382422 1107175 608298
2896 608298 554384 -158489 -602639 -270476 -170297 -472822 -197065 850761 1023931 965587
2886 965587 720733 158047 147854 314259 144005 165822 492666 420999 711551 441112
2876 441112 1241261 818534 153420 615604 273328 905823 1157935 390505 201764 325820
2866 325820 919162 -111744 -328280 -203041 61041 881314 702590 -411859 -921127
2857 -921127 -97634 -28818 200732 28937 -408785 -415100 -565488 -150537 -105157 -304632
2847 -304632 -240673 -159852 -432816 12880 -209512 -420052 -139170 151581 656974 414066
2837 414066 248328 102655 -27699 -826573 -783525 -901792 -481855 -309033 -703304 -576631
2827 -576631 -333154 -251487 -51652 173319 -131956 119651 670114 72033 170493 -527850
2817 -527850 -589720 -557313 -149290 -991213 -856282 -317942 -988224 -715890 -451819 -551266
2807 -551266 399554 -312451 -250325 320260 386544 24418 331769 749808 951525 1035527
2797 1035527 842393 1013856 799707 440982 -682537 -445265 -595297 365017 134462
2788 134462 64486 -78698 578026 392712 820563 633033 -1015219 -1092060 -576749 -218342
2778 -218342 81498 355431 -557673 -1144800 -185995 -123641 277273 -164277 -818540 -723712
2768 -723712 -71838 -195536 -624661 -997847 -625170 -288078 -595014 -472991 -372973 166000
2758 166000 -249951 -520817 -596131 -2066 180293 -367838 -79129 -589125 -899082 -406062
2748 -406062 -327065 -402838 -398769 513023 16484 -621864 -602720 -813424 -468249 -176692 -892578
2737 -892578 -673801 17940 -566366 -260033 367993 449709 -887594 -1482019 -1175256 -629028
2727 -629028 -804480 -881203 -529273 -665367 -478368 -671765 -724728 -452617 -101198 -88103
2717 -88103 -120561 -576769 -1453076 -681379 -590234 -824822 -1103096 -1345457 -1870760 -1076681
2707 -1076681 -771192 -1586421 -121964 -1027018 -1528306 -1339887 -1290651 -1288849 -814715 -142273
2697 -142273 -516520 -1288632 -2057677 -1310653 31790 -759206 -778654 134186 318886 -13482
2687 -13482 -368503 -269111 -466440 -1048235 -217786 605336 -820304 -1298287 21508 -109305
2677 -109305 -224368 13117 161071 -194212 344562 -470366 -1298943 -488271 -645295 -1001119
2667 -1001119 -1501380 -1357657 -1055031 -1060272 -808629 -76528 -157933 -576262 -253646 -581566
2657 -581566 -394592 -470274 -719708 -657472 -258645 -944655 -1255046 -831228 -511147 -327602
2647 -327602 -701879 -887481 -260245 -381218 -349788 -55023 -479860 -805432 -938560 -570034
2637 -570034 -705788 -342078 10363 -316842 -634583 -372635 -841597 -346660 310881 534770
2627 534770 -224448 372091 243119 -277681 95683 216197 -58778 347933 662953 366901
2617 366901 151211 493677 273639 672774 194911 -642078 -212422 -244758 274553 589862
2607 589862 912433 1103868 1119661 1509561 1910719 1393445 1695411 683818 533980 897883
2597 897883 333621 -249583 -421311 217671 41225 -699366 -702816 -384779 -475717 -1286698
2587 -1286698 -1215069 -1253516 -1919205 -865813 -998323 -351667 -644453 -1453108 -1368958 -1264987
2577 -1264987 -870618 -11530 437901 -696242 -674873 338433 319508 -536200 -99469 -216020
2567 -216020 -106949 -553319 -183110 -124284 -479165 228703 221029 636054 -500921 -3832
2557 -3832 156316 -192371 -538701 -689828 -633683 -466662 -247561 -399853 -641851 -803017
2547 -803017 -1023099 -1061010 -157245 372106 390788 195837 243017 376525 108781 73201
2537 73201 71516 -620461 -385200 -30778 132637 200421 -571405 -297429 414548 902488
2527 902488 115806 -747854 -1023629 -749246 118968 540166 -250759 -450087 -663294 -651759
2517 -651759 331620 45112 321726 209424 -41169 16941 -206309 233889 -806404 -180072
2507 -180072 699204 -432626 -1594515 -1262130 -123940 -449714 1034156 772359 310130
2498 310130 715160 250276 365613 187142 886717 930602 522962 772353 515794 677230
2488 677230 -21930 611650 1039144 1210715 647884 709925 1358547 1894136 1036654 605202
2478 605202 627828 1179946 1518032 971632 626392 556408 734502 781485 871881 1338165
2468 1338165 1047074 852650 958975 706547 286226 1034725 730308 847000 872718 816960
2458 816960 566477 544617 533263 895320 1811848 1445701 804712 745016 890637 1024289
2448 1024289 1180535 802755 1048621 1825725 1967815 1431834 1079445 1462377 1710946 2097144
2438 2097144 3229513 2701813 2861677 2911851 1947877 2282058 2616432 2053653 2219948 2474091
2428 2474091 2771808 3704704 3429753 3029893 3231863 2886282 4001717 2796793 3299506
2419 3299506 3748222 4178437 4830033 4663136 4156662 5428101 4851323 4495321 4223025
2410 4223025 5106527 6102316 5771180 5592559 5561980 5574889 6212728 7229700 7039460 6792873
2400 6792873 6699466 7105904 8101540 8749064 8520315 8549565 9173580 9179094 9680326 9101610
2390 9101610 9550678 10174827 10903153 11273198 10639393 10632758 10742299 11459433 11943049 12904156
2380 12904156 13472082 14145573 14407603 15382422 16988443 17944771 19182969 19704016 20196687
2371 20196687 21687696 22381654 22659846 23797500 25337038 25445469 27091066 28075032 28658201
2362 28658201 30071594 30689756 31736626 33685990 36064247 38380597 40985651 44303310
2354 44303310 48660664 53471519 59159017 61355946 62336053 63706641 66551931 70779205
2346 70779205 77436444 87684622 101156633 120736607 148316160 188708789 248255285
2339 248255285 328135372 430755227 505993672 469171344 369062914 274259581 206025347
2332 206025347 160134438 127919287 105728026 89654719 79205913 70620449 63565362
2325 63565362 58349313 55458052 53902206 51828916 47485054 43319751 38933075 35487998
2317 35487998 32573180 30297522 28107128 26891537 24536945 22321945 20245101 18480460
2309 18480460 17206703 15950623 13983769 13651647 13702154 13206082 11992228 11252344 10701505
2300 10701505 10639835 10773160 10170519 10303851 9715954 9358815 8163546 7616963 8193285
2291 8193285 7778024 6993119 7038036 7272441 6886618 6967066 6100009 6070173 5722171 5233126
2281 5233126 5283998 4330580 4231445 4154441 4477091 4412165 3925746 3780111 4115737 4344506
2271 4344506 3708904 2973876 2787245 3468900 2597506 2074798 2715923 3104717 3232845 2500012
2261 2500012 1748147 1910157 1687675 1645611 797893 1338849 2056872 2570337 2028131 1656010
2251 1656010 1539156 642392 998400 1352239 1406807 999031 1078306 1189003 930632 1056552
2241 1056552 719620 346124 139922 525152 564647 611479 577376 806287 787613 188367
2231 188367 949071 1402813 1226247 947858 1298793 1053283 468912 527261 -31253 -28867
2221 -28867 313973 -87942 315019 189705 -548607 -1028505 -820323 -478443 -982179 -833005
2211 -833005 -239577 -493957 -322047 -927583 -789540 -1244303 -1433149 -649487 -474193 -14026
2201 -14026 -552021 46199 862520 957652 -194360 -1094365 -954655 -305984 -191261 334980
2191 334980 -601549 -1360549 -1201048 -612657 -440601 -553764 296067 737712 407640 563332
2181 563332 701051 -117054 -569547 -735005 -728254 -38253 -14720 -1071384 -660250 -80582
2171 -80582 -456562 -411345 176639 -157823 383596 440755 -221223 -476865 -514943 -357692
2161 -357692 628341 288522 281396 192249 -771117 -1242119 -573956 -263025 159553 271404
2151 271404 -695946 -573260 -774822 -337292 -724360 -1080944 -1474813 -1288620 -446550 -889545
2141 -889545 -466964 -1108944 -1331917 -539585 -612793 -260319 -501009 -874290 119272 -116409
2131 -116409 -327827 -993888 -1298792 -806687 -112851 -568575 -1546324 -1091917 -770877 -760134
2121 -760134 -959080 -444822 -496494 -344202 -401666 -427913 -424759 -775015 -791471 -152577 50251
2110 50251 -679493 -1209296 -1114796 -846115 -1094755 -911226 -787153 -631246 -224332 544521
2100 544521 -410631 -1237398 -730975 -298362 -510061 -86715 -239196 638835 844058 -168657
2090 -168657 -228438 -315461 -420488 -997369 -580096 -1043854 -640733 -553601 -185936 138179
2080 138179 -415888 -499866 -58409 -565578 -1012420 -2219180 -1444341 465097 853383 1228332
2070 1228332 1486136 840023 1170147 950522 164912 34230 30175 553482 270796 300120
2060 300120 -235939 101173 87849 351935 83283 -600575 -1194719 -783248 -904482 -680970
2050 -680970 -372187 -114858 -68227 -1117094 -1615259 -1488389 -1006572 -1188698 -1466556 -1729404
2040 -1729404 -1285987 -1052069 -825672 -401858 -522645 -438189 -631256 -1033987 -972326 -936718
2030 -936718 -1122253 -2148278 -2143686 -2466166 -2279603 -2422572 -1409551 -1171055 -1290678 -1287437
2020 -1287437 -1696796 -1396217 -1782369 -2112609 -1612871 -1644298 -1766026 -1381680 -597421 -960891
2010 -960891 -1345188 -1160051 -1400246 -1013287 -808773 -1447689 -1530690 -1233667 -1541885 -182132
2000 -182132 -315691 -610116 -966332 -843732 -600092 -204665 -666169 -1254675 -178701 -468070
1990 -468070 -1349843 -516475 242469 557441 -456734 -499663 -936608 -1533425 -2025332 -2112436
1980 -2112436 -2076052 -2024895 -1194993 -119520 -261820 -76432 321138 -448522 -276280 -1034712
1970 -1034712 -776868 -1093495 -1085202 -393027 -834828 -1323087 -890096 -825975 -1053074 -1401882
1960 -1401882 -1208821 -1499634 -1751280 -2123777 -2363252 -2471078 -1786675 -920531 -465337 -553899
1950 -553899 -886205 -809851 -962531 -1514069 -2514954 -1687470 -1288001 -1411313 -1444669 -971122
1940 -971122 -923363 -1321810 -1862213 -1146100 -449425 -1462217 -654304 -889482 -1004813 -1298628
1930 -1298628 -951951 -690574 -332184 -847568 -1574031 -1087091 -587168 -583880 17540 870693
1920 870693 -91880 -900581 -1297767 -759596 -942025 -1289894 -1716920 -1601821 -1153719 -846165
1910 -846165 -476474 -547112 -293044 -1230901 -1557891 -1317292 -1489361 -1591758 -1567547 -1542512
1900 -1542512 -990566 -1109538 -438384 -712687 -1633073 -737192 -676804 -621581 -844298 -905032
1890 -905032 -710363 -371684 -354325 -326881 -813683 -459408 -747922 -916462 -1063233 -524947
1880 -524947 -366809 43029 -58501 -804241 -996777 -1095500 -1028339 -2158702 -1620304 -668380
1870 -668380 -382553 443303 699177 -295331 -945269 -44699 -661499 -613746 -454745 -36927
1860 -36927 198875 -849562 -658372 -712424 84698 -8554 -1289037 -1630956 -1207641 -674436
1850 -674436 -1035428 -1401980 -840329 -418553 -805974 -416148 -780771 -1055617 -923873 -749444
1840 -749444 -937672 -897510 -1640104 -1884780 -1079662 -1484006 -1646974 -1132836 -871692 -841168
1830 -841168 -973521 -1065117 -351836 -514606 -1629249 -2152096 -1340409 36079 -587347 -731974
1820 -731974 -1330127 -910907 -308554 -515335 -540225 -1094741 -75972 393351 42467 -333413
1810 -333413 -999417 -1177367 -142445 -411441 -417908 -1118956 -1204027 -977464 -963007 -611290
1800 -611290 -448274 -937084 -1522382 -1185783 -654065 -1291022 -2132736 -1820342 -1233236 -1688715
1790 -1688715 -1215339 -2093906 -1360137 -570561 -288157 -477820 -737480 -460958 -874832 -1059682
1780 -1059682 -746475 -905222 -946481 -875535 -1163042 -971589 -222989 95822 -704571 -1092763
1770 -1092763 -1121321 -1186357 -754365 -1006 -620292 -9837 -57720 -525198 -1149946 -1331076
1760 -1331076 -1310506 -902348 -917863 -1466836 -1643223 -1565964 -807974 -1257665 -1300729 -2051237
1750 -2051237 -1666756 -1181988 -1244131 -1328366 -1268845 -1118538 -753120 -780152 -604453 -420568
1740 -420568 -1173365 -559734 -137539 -639080 -846002 -1078237 -1479966 -1903039 -876765 -285487
1730 -285487 -233766 132020 -20238 -498024 -733030 -380665 -814297 -1386761 -1918387 -194500
1720 -194500 -611212 -1394338 -1089498 84404 29362 -890548 -1282502 -981617 -1534505 -1960497
1710 -1960497 -953603 19174 -283898 -504270 -468509 -1209617 -383635 -385572 -613192 -181784
1700 -181784 77612 -793111 -902040 -1517686 -1725359 -1006426 -848060 328067 -240973 -32439
1690 -32439 -317024 -776427 -960408 -256366 -320704 -675886 -415428 -889262 -98252 976068
1680 976068 25894 -597594 -156911 -562287 -1321675 -1084889 -1699392 -2074066 -1579169 -1269105
1670 -1269105 -1040762 -953084 -1010962 -1430392 -1664214 -1315668 -1497716 -1813597 -305712 -255482
1660 -255482 -462715 -633493 -313699 -199918 -820253 -651195 168070 -305821 -595445 -1553671
1650 -1553671 -1107531 -897163 -444921 -965662 -2122078 -1302252 -365307 322650 -896623
1641 -896623 -1430580 -875526 -813369 -916278 -638925 -828155 -673228 -871286 -1434470 -1019115
1631 -1019115 -920742 -209042 718278 22681 -417967 -778502 -1370161 -1034062 -605150 -379547
1621 -379547 -679957 -991452 -1269140 -921025 -251841 -463394 -1002960 -1273210 -1542424 -1679814
1611 -1679814 -1579797 -924993 -1301888 -742973 179393 -710238 -1370736 -1344714 -630866 -1263543
1601 -1263543 -967317 -439277 -651500 -869168 -877539 -499124 -521605 -759049 -1109718 -1154444
1591 -1154444 -906689 -682420 -203194 94959 117405 -791595 7116 -254864 -675285 -299141
1581 -299141 -728510 -875997 -486437 97316 -713444 -448460 -931556 -882514 -418568 -810490
1571 -810490 -1289122 -624207 -619046 -418514 -259508 47343 -218639 333806 -75322 -1204333
1561 -1204333 -747145 -870102 -517016 -510152 -903163 -1006327 -670978 -744800 -1094859 -1091116
1551 -1091116 -498163 -919569 -1444446 -612446 -671128 -652284 -805726 -650593 -611880 -929953
1541 -929953 -1151219 -1952634 -1072316 -639319 -302533 -835458 -671529 -260033 -664032 -617212
1531 -617212 -819708 -1570358 -1441326 -926842 -708596 -154094 -883239 -337551 -267839 -669608
1521 -669608 -400670 -632717 -1712821 -1006596 -1059899 -1699085 -1457497 -1266138 -616491 -648752
1511 -648752 -548190 -720409 -1282283 -798034 -602212 -1020109 -432269 -248765 -796105 -1017602
1501 -1017602 -875872 -259035 -358767 -466262 -122777 -275158 268658 161901 405614 -350782
1491 -350782 -680266 -859269 -911613 -827858 -549509 -380244 139612 -5305 -265100 -378355
1481 -378355 -204147 -275242 -798314 -971454 -692852 -338271 -511654 -286949 -1317040 -1411539
1471 -1411539 -1434344 -1624927 -925928 -512549 -290900 -822376 -186919 137083 -199983 -289167
1461 -289167 -424739 -869271 -659474 -1082641 -1006634 -691727 -1498896 -1067228 -594868 -252482
1451 -252482 265863 2468 -955928 -970560 -813055 -767334 -203163 -365108 -976952 -1120432
1441 -1120432 -906525 -577595 -648059 -703152 -1539797 -1131867 -109292 -512253 -870884 -1014053
1431 -1014053 -446397 -537563 -1322536 -1308724 -965347 -249910 -133598 -627254 -351901 -592733
1421 -592733 42769 -481676 -1781537 -1455215 -1564375 -1734960 -1303075 -408111 -972859 -713589
1411 -713589 -1336695 -623842 -41317 358671 358526 -276561 -1085519 -899652 -1245284 -1296370
1401 -1296370 -1341088 -1132823 -739153 -1155308 -561027 -681962 86221 -458128 -88853 -266569
1391 -266569 -799483 -598028 -794569 -661371 -648403 -1022043 -1528346 -1735680 -1492924 -1254798
1381 -1254798 -1195384 -860966 -861193 -1062277 -1218817 -584915 -500682 -351428 75238 -282842
1371 -282842 -448090 -694138 -422497 -504872 -558124 -1143039 -637095 91750 -970790 -1159187
1361 -1159187 -1177777 -994586 -978959 -680746 -605919 -287070 -200709 -767322 -127763 -781721
1351 -781721 -1273652 -1028308 -1087153 -988568 -736532 -944036 -1131991 -1545345 -463782 13342
1341 13342 33680 -406975 -382078 -308661 -1007991 -755120 -272424 -151373 422596 -419174
1331 -419174 -913713 -535140 100215 837093 -36301 -362632 86127 163407 -871446 -1164988
1321 -1164988 -1085739 -1096374 -264440 -43491 345824 382666 312783 563780 -1056205 -839619
1311 -839619 -1043851 -1297803 -1516686 -2017364 -1724169 -1056281 -1094890 -446776 501840 -861893
1301 -861893 -534387 -138156 160912 101606 -610462 -640124 -1136593 -955629 42264 759000
1291 759000 424101 -3737 -1431025 -1392596 -1109462 -1057766 -967628 -935899 -1016295 -559586
1281 -559586 -79276 -693472 -1112043 -1169697 -1602490 -1212055 -998641 -326567 -515550 29947
1271 29947 50959 -706542 -733054 -514375 155013 -141021 -745507 -802632 -17662 -204490
1261 -204490 -332686 -35194 -1017865 -1357411 -1324619 -775005 -263564 345434 373501 -210366
1251 -210366 154750 -570377 -656962 -415093 177146 -13830 -314985 -136113 410041 185028
1241 185028 314326 -210679 -20900 55424 -664462 -73209 -490221 -318994 -731355 -424218
1231 -424218 -368726 -1223462 -1183593 -263784 620970 130569 -295527 -180275 -280134 -614278
1221 -614278 -522937 -146319 -850868 -1942606 -1960376 -809930 -755620 -1291266 -1695012 -1932464
1211 -1932464 -1101061 -873187 -409877 -749323 -788698 -1465138 -352045 -1007580 -1198761 -307654
1201 -307654 853335 122958 -527122 -918798 -935116 -1201176 -404639 265414 -85812 -500362
1191 -500362 -390145 -467036 -983242 -851744 -91744 38640 -73653 504927 940485 25694
1181 25694 365021 518777 -183008 -507925 -1142379 -1354741 -899286 -1478448 -2090015 -1134133
1171 -1134133 -1299305 -1249588 -1946000 -1437331 -1339447 -711807 -204498 -9894 -245454 256988
1161 256988 236963 100605 -913933 -962489 225940 179952 -452229 -609637 -894707 -779855
1151 -779855 -412815 -3394 -106869 -955615 -1427875 -1221611 -571333 -439297 -951374 -522424
1141 -522424 -1330170 -1359289 -1002077 -270177 -858651 -1497497 -1429650 -814140 -989426 -863108
1131 -863108 -665936 -631703 -1070033 -942722 -852296 152052 82179 42433 156903 -664793
1121 -664793 -1009860 -651874 -824143 -835652 -1274912 -840893 -187706 -1473055 -958834 -346082
1111 -346082 -295994 -1143366 -1007075 -151050 -439669 -206036 -775659 -1315133 -1147323 -968677
1101 -968677 -175742 -972857 -407734 -1283923 -822497 -1142567 -789000 -465499 -575386 -750815
1091 -750815 -346279 -772171 -612269 -119321 -146324 -477891 -1355676 -789844 -39023 49713
1081 49713 -918127 -556180 -711883 -376405 -1238220 -872698 -25038 -657093 -602462 -722212
1071 -722212 -558354 -908601 -894558 -531894 -564481 -795650 -685693 -999505 -1397993 -577041
1061 -577041 -756375 217688 501254 -357247 -420202 96688 353983 -8423 -216638 -497214
1051 -497214 -762096 156976 510926 87155 118570 -208032 21758 48968 352584 -356793
1041 -356793 -586156 -95841 282927 -233679 -371170 363338 -159540 -976717 -1059033 -909375
1031 -909375 -551734 -600627 -545568 -398430 -1127490 -773342 -280116 -8041 -699486 -576964
1021 -576964 -167024 -218454 -340075 -379282 444663 434047 532653 975776 691500 139513
1011 139513 468418 427711 -727533 -800443 637205 1001920 -403825 -347765 331580 -12632
1001 -12632 -69922 -567747 -1820 -74791 -274035 -664385 -784321 -1108377 -209415 -902143
991 -902143 -1239947 -951083 379545 -151149 -237055 -259896 -1569507 -1228119 -1820590 -1653533
981 -1653533 -1456581 -688702 141822 -438761 285259 403342 -185423 -897150 -320594 650731
971 650731 401248 -91552 286650 237439 -614439 -483667 -310613 -263031 -92921 -172923
961 -172923 -546122 -649650 -1037194 -1376579 -1623927 -1285088 -1241743 -709900 -1233114 -1159474
951 -1159474 -1684034 -1566678 -1195263 -1504386 -1506889 -1065187 29774 -383601 -761933 -761673
941 -761673 -622110 -322795 456618 88721 -114639 -129126 -129234 -340000 -894631 -876526 -1164569
930 -1164569 -1335175 -1724549 -953740 -639157 92613 -462814 87818 -118054 -306753 -125029
920 -125029 -42781 -396329 702630 799274 -170241 -818863 -762313 -835794 -135659 101356
910 101356 -227670 -1036243 -810506 -660303 -680841 -533175 -809390 -760213 -684298 -1076459
900 -1076459 -469535 90404 -4036 -745721 -189852 519891 365070 133086 704848 783157
890 783157 172624 54484 -251155 -617611 -1540804 -721789 -610015 -1557498 -2002423 -864599
880 -864599 -759330 -651121 -637455 -665813 -752014 -879472 -591552 226983 242846 -294364 -790485
869 -790485 -280225 151777 -799497 -774960 292007 35807 558268 482751 -568116 -919596
859 -919596 -1356009 -1659995 -885912 -140171 -727119 -1163741 -513345 -138403 -303986 -856520
849 -856520 -887162 -1020892 -918633 -690661 -743443 -38305 316051 -20294 -59633 -405171
839 -405171 -56595 162629 378202 -397290 -53966 -14083 -663749 -465401 -434233 -664882
829 -664882 -89739 882810 -498581 -1289954 -827820 -879630 47443 -284339 -633833 -950222
819 -950222 -944757 -392146 454028 243049 -30968 -511171 -263044 172220 -332436 -628544
809 -628544 5053 93550 -147201 -37727 -44857 -594332 -549889 -65695 -319069 328622 -256858
798 -256858 -874993 91951 344386 -106998 -539709 17223 -425910 -527005 22753 -609575
788 -609575 -22359 -4545 -384131 -374932 -339804 -161967 -243834 27806 -3044 -640309 -570422
777 -570422 -325857 287832 465339 44594 -587515 -1361782 -1070698 -769776 -869278 -783393
767 -783393 -401673 203169 289126 -156253 75477 658440 -268575 -537097 -828129 -590968
757 -590968 340758 138599 -1052918 -1085768 -668548 -845382 -1037009 -533337 -1202997 -752927
747 -752927 -240715 174533 122612 -217723 -476405 -850029 -949394 -142431 116798 302109
737 302109 1023359 883930 -60677 -695334 140992 461670 -351402 259476 -484362 -532000
727 -532000 -582232 -828172 -622327 -407365 -552597 -598926 -829243 -859325 -175699 -758854
717 -758854 -707155 -436721 -99493 -226923 -59559 -580950 -442234 -313024 33967 -646920
707 -646920 -13620 -178816 -755052 191251 700782 910962 128645 -506987 -485875 -344542
697 -344542 -797834 -840153 -201836 46624 -19991 -518161 -1124384 -590926 222015 303073
687 303073 27406 -377670 -434801 86868 388155 -302460 -688400 -403378 -1442326 -687537
677 -687537 253072 -132212 611954 1019313 742557 6050 519525 -156924 1066 189080
667 189080 -382703 -475819 -1095617 -1209750 -1082453 -1280855 -764367 -98181 -176688 -148260
657 -148260 -838729 -434075 -1130964 -1137976 -947246 259350 480383 384264 322987 -440227
647 -440227 -167723 72046 -599237 -344236 -602792 -390637 41472 271639 -145368 -246894
637 -246894 -298745 -245051 344202 -175014 459405 958286 -30939 -380672 -640011 -1009569
627 -1009569 130951 -407682 -862960 -1069139 -411239 -519224 -1205562 -729703 -155925 589233
617 589233 765990 670642 -270921 -1025084 -456215 -1069658 -942104 -875542 29491 -16239
607 -16239 -766356 -860260 387580 -471335 -778994 268120 1058769 213733 79836 393220
597 393220 181541 -665606 222027 237925 -284085 -481605 -1125142 -223133 -180462 -16952
587 -16952 -397422 -382839 -1608165 -1109574 -615893 -658891 -612854 21814 -409879 126642
577 126642 791549 202248 318484 -340624 -248853 -102821 -291995 -970576 -1508316 -1357693
567 -1357693 -592104 -97466 718296 1073658 1207933 1482183 675885 313562 232836 551289
557 551289 354292 361945 -402790 -272553 -646203 -759730 -240158 -71358 667166 147741
547 147741 59857 -420263 -485063 -277279 -481714 -994833 -487170 -205138 75457 -110023
537 -110023 6477 643932 65499 1206917 799578 -110025 -228652 -432309 -564130 -549445
527 -549445 -64687 -264108 158004 -524799 -1215060 -908137 -417673 -797432 -378942 -297021
517 -297021 -499216 175111 463965 -156902 570596 1093586 838828 376229 81031 6320
507 6320 52655 450004 258310 -218861 -245077 -586462 -535597 -470815 -774807 -384656 -307135
496 -307135 -395538 -183499 -131331 -288386 -277872 586892 788707 337050 58797 -81315
486 -81315 743216 44809 -164365 -267665 -261230 -878461 83207 -33622 -416079 -1073754
476 -1073754 -946656 -747848 -1841 -27439 -85339 -387766 59497 499625 182415 51790
466 51790 -628299 312008 175527 -655380 -1041606 -933679 -301549 -91109 199912 -254815
456 -254815 -344607 -700065 -400329 -537593 96384 292261 131495 -257904 -59430 434547
446 434547 521277 599535 327533 402438 -457996 -610112 -433534 -147069 -532973 -593828 -1141676
435 -1141676 -757875 -532838 -757053 -153156 -756733 -81242 1403263 1820543 756039
426 756039 122196 -148969 -957110 -805090 -1096086 -1502453 -2012536 -1239293 -525826 -845126
416 -845126 -882602 -606897 306822 -606910 15733 326331 326543 294960 387682 845720 975287
405 975287 746800 -632433 -36622 -423094 -722528 -482709 -90541 -45001 91791 -915012
395 -915012 -733550 -699907 155442 -486427 -79390 -8619 -33081 448745 229563 164928 -346896
384 -346896 61810 749818 89186 -279819 468111 146277 -432553 -875606 -368169 406420
374 406420 -9269 25339 -404663 -760327 -820958 -922397 -699003 -470373 -679295 -753227
364 -753227 -620543 -362412 -643429 -474203 -244626 -499372 4887 736561 -10080 -282074
354 -282074 -410795 -138859 381440 12627 -189964 316909 129728 160188 16580 -318111
344 -318111 82554 911023 454538 -38678 205817 521439 320599 529211 367801 -595272
334 -595272 -1183058 -1146234 -643629 -642653 -249681 207078 369103 429106 259069 -402290 -439869
323 -439869 -256580 -250946 335967 -178833 -499204 -811416 -525957 -304371 -183162 -271471
313 -271471 -874339 -651095 -276368 -240428 14799 747394 41979 -184389 -333526 330692
303 330692 -210781 14449 382752 790958 733387 839952 266844 449922 649152 494765
293 494765 316438 -290994 -605672 -6959 222494 427790 -202731 -211215 -452354 -480302
283 -480302 -63362 728827 846499 564913 -802083 -685730 -145374 364077 361180 306485
273 306485 -296316 -746926 -778758 -389207 -270906 -18549 39404 -161728 -302751 -388030
263 -388030 -322377 757005 -60625 -1217909 -547827 -64557 37665 290007 187621 984983
253 984983 336543 -23994 -41481 -145873 352963 -173162 -568422 -938571 -540643 225432
243 225432 486545 -358524 -523192 -1097030 -889554 -359603 -947049 -1181919 -41394 -387339
233 -387339 521207 829775 578390 398261 741730 441171 546395 304525 -10743 349537
223 349537 759166 1008529 652909 -581207 -442287 -189650 177914 -382533 -199823 -649250
213 -649250 -380829 -351329 656669 13728 -100355 182954 -139409 -55710 -443757 -539036
203 -539036 -1062568 -353867 -948838 -438235 -138246 -188835 100070 -454531 -455251 -385538 -638015
192 -638015 -619681 165007 471447 -199743 323130 -734617 -154058 -590176 -1202311 313462
182 313462 377188 637036 450479 405274 -51547 143189 -100933 -559455 -815653 -137727
172 -137727 217083 -190886 -597515 -128304 453871 184843 -194605 372550 -87183 -140738
162 -140738 -329851 -558696 -192468 92228 -46808 -67991 49386 17991 201277 -70245
152 -70245 -1131030 -1086415 -421343 89286 239883 -591680 -94874 -57385 -6461 -252172
142 -252172 462744 291875 -252397 116684 444969 914337 195422 245237 737831 317651
132 317651 -105143 72370 65975 496565 665309 464594 -194201 -7753 -231900 -813359
122 -813359 -476854 -806344 -762886 -260017 44700 113578 382836 -135049 231233 449438
112 449438 164527 -217898 662724 1160694 646249 572342 505043 403974 1438315 404687
102 404687 91590 -4304 -407561 -398688 -191744 -35029 -415724 -162027 25212 -675567
92 -675567 -329117 161774 540828 625799 916155 935304 927814 300726 266011 -50922 238755
81 238755 397594 61098 -75633 -323941 -64674 -797116 -534495 -159074 -395205 -471954
71 -471954 -313342 -204885 -160586 432945 -63610 -16137 312825 483747 240981 496283
61 496283 677664 260888 618447 287873 402642 663855 144192 -218714 -38692 151713
51 151713 277902 -571520 -281305 620068 818543 100183 332797 408074 74124 326578
41 326578 284779 15491 600087 190069 -76443 -378791 -381368 -260924 275393 -58749 -627905
30 -627905 -593742 -322123 -233875 218932 467235 637339 883669 599233 316836 623321
20 623321 925569 916553 370316 -96858 -384981 352199 402699 -193698 55536 522135 825879
9 825879 559278 416941 427746 17073 -568921 -15688 90163 684151 336880
0 336880
$$ Imaginary data points
##PAGE= N=2
##DATA TABLE= (X++(I..I)), XYDATA
16383 -1220398 -1476811 -1178476 -1252799 -1657816 -1170013 -1366809 -1806070 -2120953 -2301156 -2135439
16373 -2135439 -1702530 -1258691 -772198 -984429 -1537866 -971215 -829765 -516606 -899776
16364 -899776 -925260 -721887 -740550 -1066786 -1328557 -1433563 -1208211 -471105 -336768 -278250
16354 -278250 130213 212697 -788838 -896431 -715559 -513097 -137172 694781 332169 -169961
16344 -169961 26752 -234985 -292414 -385031 -488265 -290159 549264 264997 -278398 -796460
16334 -796460 -462094 -137856 151579 -528187 -398960 68131 508414 362825 181914 550327
16324 550327 439541 295991 406180 297660 792122 1060600 655131 237441 823285 766309
16314 766309 467396 256771 1038990 674909 646290 447534 378990 419495 1289330 1137204
16304 1137204 381658 666422 -98964 390757 1227688 676278 181398 1387864 1241813
16295 1241813 1501984 1176899 652546 191934 1190992 1830524 1770896 1179519 1150306 1647306
16285 1647306 1266266 1086614 744109 967871 1510068 982943 1657981 1738394 1942562 2355026
16275 2355026 1734876 1037607 1655950 1739058 1626457 1427613 1896942 1644546 1395059 2127817
16265 2127817 2078406 2078809 1877551 1422124 1572018 2186606 1641545 2058865 1716139 1742876
16255 1742876 2261216 1573184 1670677 1733848 1940660 1490280 2450239 2395442 2207456 2011727
16245 2011727 2124021 2193636 2545027 2600690 1939349 2643967 3144639 2862573 2289245 2290451
16235 2290451 2479811 2581939 2233496 2112377 1668096 1882845 1867658 2487645 2219354 2519041
16225 2519041 2482574 3044974 2933331 2188152 2515673 1852729 2866058 3060539 2723535
16216 2723535 2703102 2275656 2231987 2587242 2074509 2032329 2805138 3257803 2750072 2841929
16206 2841929 2823667 2896339 2633613 2139320 2648445 3002656 3584521 3771492 2922239 2467902
16196 2467902 3337223 2982588 3541948 3544422 3887842 3397300 2620690 2828169 2864083 2740224
16186 2740224 2459393 2087965 2534974 3113451 2911028 3071338 2656964 2909181 3593864
16177 3593864 3107855 3044713 3003220 2924775 2645991 2818817 3036901 2520501 2639171 2663489
16167 2663489 2547841 2990583 3163328 3409166 3792907 2973988 2780893 3403683 3860501
16158 3860501 4399289 3779888 3484373 3677664 3565505 3319431 3475879 3845996 3147795
16149 3147795 3386178 3865606 4499887 4019848 3786941 3193722 3323604 3324682 4421647 4348442
16139 4348442 3810606 3852829 4280338 4087723 3421535 3082409 3680619 3907534 3844118 4738217
16129 4738217 3446628 3821804 3404802 3895550 3862997 4395368 3928225 3505509 3464604 3324156
16119 3324156 3266116 2384163 2067283 3239049 3860030 4359187 4249108 3575228 3792091
16110 3792091 3291663 3358736 3655911 3331836 3560955 3441012 2903937 2770704 2989718 3812571
16100 3812571 3877213 2597146 2684968 3821532 3854407 3261912 2829375 3427554 3604478 2479272
16090 2479272 2602297 3571937 3908522 3392053 2978023 3271248 3183953 3044575 3093258 3095334
16080 3095334 2956705 3142793 2679551 2621361 3083869 2930232 2736919 2927419 3107620 3713635
16070 3713635 3277776 2986263 3193430 2903825 3725964 3734252 3872981 3550933 3552852 4552694
16060 4552694 4809597 4362381 4344204 4801147 3813439 3487089 3922232 4201135 4301567 3877925
16050 3877925 3896517 4123697 3983062 3048854 2546730 3366643 3747520 3847833 4342384 4197882
16040 4197882 2878957 3225733 4022794 4516249 4144631 3165582 3722761 3941530 3204033
16031 3204033 3409049 3968350 4439233 4084567 3766664 3431996 4044195 4503808 4387678
16022 4387678 3432643 3344837 3625554 3515331 3815558 4914004 4342405 3436299 3725796
16013 3725796 3716033 3514191 3844459 3609390 3678750 3119235 3343157 3828488 3795123 4270301
16003 4270301 4054980 3815390 3857519 4080315 3676747 2672092 2803871 2693218 2736418 4041916
15993 4041916 3740799 3303761 3169685 4093450 4000358 3162246 3552711 4175339 3518662 3350744
15983 3350744 3843874 3983326 3278877 2818645 2737576 3554159 4134664 4233131 4284867 3331129
15973 3331129 2051253 1857847 2666553 2824550 2887270 3058850 3762244 3521174 3256873
15964 3256873 2902899 3487392 3935880 2969208 3410209 2760357 3434496 3732860 3627095
15955 3627095 3970676 4435698 3570130 3203583 3449985 3397835 3269419 3024147 3379499 3188170
15945 3188170 3202761 3241553 3409429 3477706 3845393 3532401 3485324 2732354 2595652 3162513
15935 3162513 4187886 4384992 3777907 4139786 3640885 4006024 4261971 3555642 3234859
15926 3234859 3783754 4900826 3815192 3595295 3899944 2953617 2913500 2718688 3334719
15917 3334719 3029513 3742169 3868168 3893661 3676466 4463510 4232140 3908210 4275235 3596377
15907 3596377 3820581 3039911 2772255 2612661 3092027 3464834 4176416 4693735 4106020
15898 4106020 3935249 3214315 2819138 3856014 3678604 2685871 3329187 3919215 3427484
15889 3427484 3408421 3423721 3189908 3764313 3922807 3377331 3378348 3598741 3885009 3072689
15879 3072689 2767457 3114324 3078847 2991379 3103502 3232025 3147211 3300054 2941453 2939479
15869 2939479 3001941 2872472 2571945 3088045 3201313 3060777 4128732 4691936 4600516 3745054
15859 3745054 3078658 3452332 3262493 3749619 4154874 3998946 3683570 3991898 4282509
15850 4282509 3755252 3553546 2884630 2929378 3643373 3851784 3087563 3304964 3715251 3375965
15840 3375965 3434744 3521649 3697358 2823955 3092461 3559304 3538024 3856581 4473904 4647626
15830 4647626 3458681 2446254 3598816 4254724 3270895 3188760 3265494 3209621 3178893 3200522
15820 3200522 3378266 3716975 3397013 3829446 3389696 3333490 3230024 3067320 2877944 3665794
15810 3665794 3863927 3786563 4034725 4275682 3830763 3943952 4008844 3573121 3420943 3877586
15800 3877586 3469353 3487472 4318248 3611483 3788178 4362681 4546481 4511171 4227364 3977488
15790 3977488 2842982 2996941 3334516 3232565 3182155 3456962 3299952 3740454 4299760
15781 4299760 3900232 2761452 3658994 3966429 3708589 3750237 2879730 3439314 3498934 3356958
15771 3356958 4286870 4350031 3230488 3423441 3692819 3863271 3241900 3414131 3333190 3317216
15761 3317216 3261337 3237923 3403689 3597953 2742143 2903050 3220061 3006466 3647773 3646035
15751 3646035 3129242 2845576 2871560 2517422 3604422 3936155 3692178 3962116 3866699 3839781
15741 3839781 2960245 2514943 2674317 3316487 3156571 3805792 3735550 3679531 3782559 3718486
15731 3718486 3606784 4147505 4127275 4244312 4127434 4024825 3359417 3449651 2563744 2914460
15721 2914460 3009549 3075939 3239014 2961324 3320857 3531167 4197009 3978537 4081802 3883317
15711 3883317 3418013 3046680 3515216 3751926 3836026 3414885 3785187 4161691 3284575 3082693
15701 3082693 3952058 3286522 3732226 3248737 3210119 3065617 3403391 4275129 3207079
15692 3207079 2992882 2942317 2865871 3351426 3401815 3459790 3867320 4302352 3169756 2879221
15682 2879221 2603940 3188407 3374553 2856281 3189480 3529881 3604163 3678220 3812474 3800660
15672 3800660 3255377 3457912 3763411 3404817 3584282 3157768 3039718 3614113 3775485
15663 3775485 3352329 3448621 3572706 4448944 3493158 2748960 3325261 3335306 3010111 3008042
15653 3008042 3104232 3341326 3395862 3663141 3797248 4205840 3792504 3706917 3643234 4485092
15643 4485092 4373815 4090815 3424831 2700172 3019447 4047552 4056457 4252092 4060555 3689279
15633 3689279 3016303 3142709 4061864 3522945 3854309 3039137 3138301 4015807 4611145 4439721
15623 4439721 3687852 2777938 2829071 2743719 3453273 4244447 4450765 4240813 4002635 3521825
15613 3521825 4408147 4518883 4345055 3770734 3676611 4056839 4791454 4916093 3871604
15604 3871604 4448705 4485592 3214830 3385054 3644615 3930587 3471694 4348732 4943034
15595 4943034 5291944 4321067 3703242 3592233 4347417 3575704 2888666 3588610 2712101
15586 2712101 4093825 3818465 3386250 3193649 3558318 3823687 4196583 4051619 4133954
15577 4133954 3793279 3687029 3660657 3911272 4098671 3701710 3729032 3569337 3616491 4313987
15567 4313987 4694553 3775432 3280591 2689822 2835126 3541334 3525075 3814671 4157295 4241487
15557 4241487 4287790 4057963 3890950 3482935 3443193 3311020 3651609 3804850 3780359 3840359
15547 3840359 4157404 4024899 2837951 3181853 4271208 4500745 4940018 4600386 4078707
15538 4078707 4534300 3757358 4108377 4139648 4244855 4086626 4241182 3631436 3282459 3098219
15528 3098219 3289960 4385733 3755492 3992789 3695272 3364130 4131924 3961823 3305456
15519 3305456 3459106 4099788 3939838 4180787 3739877 3495868 3896096 4794205 4712327 4053462
15509 4053462 4288536 4423941 4291959 4655464 4582568 4320056 4061958 3647454 3366839 3471833
15499 3471833 3615357 2807067 2719559 4188685 4235978 3898563 3584637 3090358 2770025 3208513
15489 3208513 4499286 4607247 4563274 3717098 3708031 3745255 3201124 2646567 4227625 4837049
15479 4837049 4422607 4244648 4198364 4694376 4724882 4063552 4250455 4758321 4596135 4273205
15469 4273205 4323967 4370783 4427802 4202922 4134521 4100710 4463696 4483423 3882064 3263892
15459 3263892 3770619 3176110 2900572 2996871 3026270 4304474 4640100 4555907 3069402 3296998
15449 3296998 3714383 3881960 3105650 3056005 3575088 4439376 3896574 3811054 4432342 3913090
15439 3913090 4371560 3679101 4043341 5047681 4522619 4377939 4183762 4074524 3763558
15430 3763558 3971856 4413120 4015639 3727228 4043921 4456027 4602975 4527035 3881261 3185614
15420 3185614 3843606 3942539 3879731 3922769 3665021 3905145 3366021 3639495 3753768 4040992
15410 4040992 3922193 4516169 4762909 5280431 4240392 4321938 4461750 4338836 4476076
15401 4476076 3739254 3888585 4016317 4144472 4196971 3882440 3350516 3473070 3363400 3419616
15391 3419616 3094186 4358742 3861838 3915220 4424791 4465601 4013566 3567362 3794767 3391829
15381 3391829 3943761 4119578 4839959 4195754 3638706 3562126 3659106 3694676 3835335 4600702
15371 4600702 3575938 4358857 4979641 3703781 3239178 3440624 3729033 4214743 3752373
15362 3752373 3046944 2984577 3676670 5030877 5192190 4482749 2949772 2410603 3422436
15353 3422436 3976718 4481917 3596798 2466514 2779120 2875918 3103136 3429684 3290038
15344 3290038 3507745 3319983 3589204 4268710 4053945 4629912 4521590 4857378 4193936
15335 4193936 3558579 3228359 3473061 3820501 3605880 3459136 3848972 3970783 3909687 4349529
15325 4349529 4671935 3755180 3911857 4244760 3577393 4612725 4138193 3786739 4146565
15316 4146565 4031078 3969036 4181986 4247585 4022079 3746709 3429263 3208262 3118891 3507468
15306 3507468 3501143 3849739 3686646 4477821 5623124 5019102 4515781 3955043 3795276 3871831
15296 3871831 2933399 3541793 3954254 2996802 3549750 3349319 4217383 3894162 4254569
15287 4254569 4609011 4582469 4092006 3279733 4123569 4366928 3931165 4336149 4281968 4919877
15277 4919877 4454101 3394299 3598977 4401682 4246550 4544524 4729711 3991434 3514073
15268 3514073 4310036 4058268 3517873 3331905 3850114 4911100 4986012 4867668 3996437
15259 3996437 4024999 4159988 3735770 3535753 4604633 5454253 5194285 3608461 3849147
15250 3849147 3844154 4071796 4128212 4547543 4428382 3952138 4764917 4612674 3883604 3647661
15240 3647661 4172217 4505925 3827665 3787406 4692739 4677789 3219259 3841609 3624881 3960626
15230 3960626 4001249 4597580 4991066 4485365 3746080 3339347 4180670 3841965 3507287 3820345
15220 3820345 3932098 3525397 3998252 4198476 4619627 4665182 3776088 3592098 4089610 4547709
15210 4547709 4801778 4581482 4144454 3812679 3176239 4003563 4364288 3706843 3802947 4005617
15200 4005617 4904448 4374485 4418762 4190312 3311058 3195531 3159528 3047928 3879281 3553184
15190 3553184 4103774 4897365 4935536 4612744 4378176 3697066 3962517 4154547 4082669 5166771
15180 5166771 4574726 4130951 4111382 3643822 3112497 3504430 3770437 3634155 3686234 3795449
15170 3795449 4024953 3418036 3335171 3615810 3725086 3930289 4165726 4033649 4560889 3931340
15160 3931340 3674381 3911473 4600402 4390614 3967354 3807366 3500925 3957841 3560429
15151 3560429 3028986 3066892 3877747 4300362 3919693 3737932 4392895 4032841 3480796 4071062
15141 4071062 4846940 4250068 4781844 4984593 4140678 4197221 4729224 4311515 4449754 4358849
15131 4358849 4182775 3593157 4600690 5092266 4535005 4394962 4339331 4104976 4105321 3700880
15121 3700880 4350231 4267771 4023738 4077331 4955809 3875905 3633360 4467045 4178024 3386106
15111 3386106 3562276 3904882 3138510 3220395 3390256 3699742 2985786 3875182 4399668 4849585
15101 4849585 5047189 4815702 4197334 4102474 3872735 4531099 4171099 3714208 2984009 3598993
15091 3598993 3670578 3636092 3793367 4231377 4166186 4600521 4663462 4595434 4973423 5197047
15081 5197047 4711895 5005821 4680121 3303431 3582646 3866015 3821526 3933851 4984609
15072 4984609 5150073 4657501 4123575 4317066 4420366 4674440 4098992 4959949 5021525 4734474
15062 4734474 4686846 4374883 2664015 3236277 4361657 4532290 4336281 3885730 3745598
15053 3745598 4175645 3704235 3607517 4755434 5025815 4912922 4264017 4356546 3564107 4167426
15043 4167426 5409028 5255691 4438715 3999316 4259486 4767185 3626386 3364959 3780829
15034 3780829 3981776 3398056 4128994 4269256 4389140 4332220 5021655 4698302 4452854 4359425
15024 4359425 3981195 4541110 4685198 5138066 4577973 4439186 4107309 3855437 3999122
15015 3999122 3832307 4240102 4193584 3848513 4149652 4096915 3478526 3115281 3359091 4172095
15005 4172095 4319984 3772002 4279410 3647448 3987197 4043430 3950464 4184723 4085754 4065888
14995 4065888 4495036 3804283 3898917 4238793 4553390 5059940 4955640 4135576 3764739 4473204
14985 4473204 4324699 3949701 4145123 4454410 4641327 4334387 4403842 4066579 3830902 3817221
14975 3817221 3548420 3658221 4344514 4687392 5033826 4619659 3884538 4284309 4222442 4745865
14965 4745865 5013779 4730697 3562279 4165108 4601377 3860943 3364616 3393709 3113988
14956 3113988 3468150 4164723 3898385 3993061 4042306 4442598 4199973 3554416 3420703 4031203
14946 4031203 4520502 4263995 4248967 4800035 4766074 4681245 4547451 4702001 4374476 4430718
14936 4430718 3958265 3723411 3845343 3725661 3782341 3771081 4452198 4013160 3663434 3571305
14926 3571305 3852540 4364568 4112300 3819319 3919556 4491205 4056108 4507285 3282849
14917 3282849 3231436 3958977 4487333 4209530 3955156 3396603 3120545 3382984 3091139 3489821
14907 3489821 3788590 4143185 4340940 4361287 4587874 4617850 4061845 4663343 4432745 3865479
14897 3865479 3676250 3473903 3058577 4094665 5076275 4349560 3595716 3767866 3957092
14888 3957092 4354568 2970839 3262429 3831291 3946895 4518430 4500899 4156488 4308324
14879 4308324 3499620 3651719 4158257 4711896 4468607 4805799 4526989 4692417 4775774 5141402
14869 5141402 5085895 4372805 4269985 4163254 4476289 4838056 4750051 4090166 4000567 4380397
14859 4380397 3698386 4299805 4004532 3801202 4308531 4419939 4280279 3883898 4115453
14850 4115453 4494238 4267408 4339508 4646264 4109155 3347668 3539825 3983843 3649320 3896198
14840 3896198 4140319 4213239 4594972 4478853 3863995 3642364 3656433 4590689 3985865 3743438
14830 3743438 3781779 3743451 3821238 4575763 4845547 4329071 4199156 4771348 4387067 4251559
14820 4251559 4655341 4647306 3711139 3724407 3162592 4261082 4245715 4227716 4305335 3877033
14810 3877033 3330099 3250778 3864202 4947489 5193817 5243429 4848686 4612317 4460213 3759974
14800 3759974 3890168 5233407 4379522 4918367 4785038 4517553 4864194 4348809 4139746
14791 4139746 3764909 3838091 4158008 3724635 3803775 4571779 4055181 4293271 5345356 4319261
14781 4319261 4165823 4106319 3984881 3914063 3881226 4228506 4074259 4634781 4135220 4298256
14771 4298256 4161562 3901099 3551943 3983572 4062728 5085653 4814900 4492502 4031413
14762 4031413 4060430 4013465 3108480 3179709 3651128 3782537 5220257 5220531 4872055 5325877
14752 5325877 4908922 4524223 5103342 4799937 4377941 4599752 4446665 3726442 4224925
14743 4224925 4687611 3990744 4269532 4712978 4286240 3661656 3491269 4231981 4217305 3944258
14733 3944258 3878483 4749050 4401146 4331193 4169904 4264286 4582065 4752985 4852245 4411888
14723 4411888 4684196 4199740 3478898 3740077 4290409 4100422 4033409 4018762 4620131 4783090
14713 4783090 5100098 4709484 4722630 4486408 3565468 3486168 3548418 4021386 4816862 4195551
14703 4195551 3519412 5187632 5031820 3653034 3338384 4158086 3954742 3991619 3903976
14694 3903976 4964106 4876961 4250617 3897847 3558448 3651933 3500143 4483012 4278862 4156580
14684 4156580 4226998 4382724 4664132 4854145 4323492 4516539 5131657 5553050 5338043 5320549
14674 5320549 4888117 3963981 3782437 4257280 4079595 3958470 4223804 4669759 4150744
14665 4150744 3358427 3527660 4033544 4300343 4742661 5578312 5159486 5084900 5916964 6123193
14655 6123193 5976215 5556985 4717761 4664009 4863308 4032410 3723358 4274688 5203241 4819927
14645 4819927 4129459 4172375 4448057 4130370 4227068 4918555 4673002 4858705 4901241 4641587
14635 4641587 5399281 4181046 4693810 4854269 4854603 4627873 4224958 4435658 4027680 3773410
14625 3773410 3860078 4023185 4029818 4795474 3845706 3585006 3638759 3575430 3719622 3756716
14615 3756716 3851844 3384142 3437250 4164093 4101675 3979671 4598695 5031297 3902322 3677292
14605 3677292 3443820 3908055 4396210 4041451 3678678 4452179 4721453 5015233 5259071
14596 5259071 4785191 5158908 4742429 5055219 4336232 4001721 4689445 4679056 4121335 5008978
14586 5008978 4725614 3782551 4001437 4200969 4218712 3960569 4987835 5057067 5181976 5440728
14576 5440728 5242361 5308344 4469099 4886097 4628080 3773473 4158159 4226903 4410883 4491706
14566 4491706 4485804 4399400 4107965 5029246 5992584 5197422 4694366 5342506 5162095 4983618
14556 4983618 4993254 4085607 3879619 4602215 5452747 4843099 5027093 4691589 4273252 4623481
14546 4623481 4117299 4651741 3744477 3806243 3615620 4443151 4845744 4837787 4580735 4290367
14536 4290367 4607618 4047241 4668322 3878044 3410032 3897711 4770555 4957894 4306675
14527 4306675 4096455 3860146 4530816 4737982 4477672 4243692 3700511 3089996 3997127
14518 3997127 4086431 3888960 4684375 5042092 5177600 5017863 4543841 4663984 5401813 4177949
14508 4177949 3764064 4504355 4783918 4322693 4645526 3920657 3416085 4339075 5273433
14499 5273433 5252255 4689125 4143698 5076698 5217083 5675984 5131114 4653762 5157477 5187640
14489 5187640 5780183 6136346 5712440 4838465 4646804 4958201 5109202 5183022 4958772 5604180
14479 5604180 5339862 4948605 4852313 4344520 4525297 5609380 5373275 4854401 5105202
14470 5105202 4800045 4462837 4154679 3869696 4449391 5142989 5785423 5766944 4796152 5789915
14460 5789915 5621400 4918758 5091113 5717119 5525804 5556319 5320206 5075298 5594074 4993786
14450 4993786 4621908 4875281 4678525 4033969 4806043 4243512 4591140 5113460 5046098 5366100
14440 5366100 4907038 5109646 4697487 4647635 4310794 4867329 5277556 4542681 4890209 5772727
14430 5772727 4837679 5265702 5335775 4709087 4941187 5130241 5370834 5115599 3965793
14421 3965793 4383633 3827413 4289544 4229426 3530486 3529999 4308927 4161838 4642214 4705410
14411 4705410 4349094 4095299 4250327 4202437 4328239 4763890 4299756 4958936 5476897 5456426
14401 5456426 4145749 3709721 3607464 4955554 4654215 4694836 4490683 4803256 4855842
14392 4855842 4400329 4442418 4858762 4527574 4443712 4441739 5128810 6253075 4791154 4034498
14382 4034498 4619096 3927106 4027131 4270405 4533397 4465038 4752339 5213010 4288796 4741806
14372 4741806 4856684 4220132 3394661 3756590 4521617 4975006 5431694 4996001 4852720
14363 4852720 4742635 4121213 3252592 3749147 5092911 4966933 4591464 5462329 5964460
14354 5964460 5729036 5061598 4045626 4786422 5036388 5812274 4159874 4009190 4701944
14345 4701944 5112996 5125718 5143185 5564847 4522083 5001872 5305070 5264788 4531516 4764493
14335 4764493 5116656 3807978 3650713 3338242 3083928 3500318 4153295 4763491 5115258
14326 5115258 4935704 5221940 5288673 3857593 4208213 4542262 4640108 4898687 4913515 4531191
14316 4531191 3644982 4555766 4840714 4748032 4374203 5084913 5595598 4209318 4442183
14307 4442183 4269990 4018628 4719238 4845567 4757427 4638828 4235456 4795203 4990889 4886944
14297 4886944 5076417 4992442 4279400 4265327 4704178 5123528 4808690 5181059 4556338 4927065
14287 4927065 4984565 4231812 5356123 5185661 5134965 5675973 4900030 4548326 4813319 4181776
14277 4181776 4008615 4712495 4454407 4320284 4955982 4590190 3891530 4679287 4741388 4379868
14267 4379868 4530050 4967219 5312318 5232655 4701777 4303599 4707525 4323293 4876106 4931134
14257 4931134 4820434 4513589 3892505 4110870 4411142 5339332 5073148 5092041 4939265 5092506
14247 5092506 4667114 4073185 3850684 4147254 4120660 4475791 4785438 4023086 5002437 4665287
14237 4665287 4024279 3986609 3692804 4382790 4337843 4693765 4225161 4767074 4841393 4763340
14227 4763340 4998486 4882403 4753473 4796357 5701113 4298612 4938366 5787688 5604533
14218 5604533 4379335 4300481 5318624 5271269 4958457 4999473 5575500 5126888 5093112 4912550
14208 4912550 4971964 4751318 4243162 4019061 3924716 4908379 5076554 4254023 4266822 5308127
14198 5308127 5396991 5327405 4493294 4164489 4700049 5014952 4879627 4941176 4267105 4656539
14188 4656539 4680501 4197364 4645757 4719888 4558224 4084777 4225528 4292269 4263592 4971293
14178 4971293 4425501 4332308 4630682 4989374 5088658 5311663 5104009 5118082 4740757 4438703
14168 4438703 5450802 5239875 5488920 5127269 4710944 4835719 5190692 4599832 3610648
14159 3610648 3893093 4156971 4655500 4992229 5188932 5186182 4972808 5462675 5173367 4657797
14149 4657797 4293148 4716748 5099392 5006463 4947236 4880916 4860697 4919102 4727347 4099968
14139 4099968 3699179 3741331 3913975 4831582 4387387 4029581 4088982 4268256 4990942 4986242
14129 4986242 4984853 4317245 4067997 4556731 4786848 5728235 5264758 4395427 5083790 4547255
14119 4547255 4292768 5286071 5513709 4915100 4743024 5046466 5018741 4216488 5144919 5196760
14109 5196760 4746621 5420573 5755714 5123465 4478516 4278495 4564281 4212074 4763437
14100 4763437 5394815 5296585 5924888 5863782 5513974 5191625 5195182 5273954 5267457 4873300 4492611
14089 4492611 5059066 5769035 5474753 5247925 5456467 5608530 5432145 5471296 6389762 5464796
14079 5464796 4872686 5031665 4677180 4593039 3808075 3846333 4618636 5156800 4886143 4284404
14069 4284404 4696220 4546800 3989750 3922557 5003007 5122008 5064179 5433333 4936499 4929313
14059 4929313 4856335 5102650 4786468 4433229 4451129 4806452 4861499 4026700 3867937 3683829
14049 3683829 3666344 4333925 3813026 4222909 4595655 5378760 4274834 4210410 5356628
14040 5356628 5239841 5238819 5140596 5419771 5075628 6262582 5333636 4840388 4712101 4368284
14030 4368284 5143587 5145282 5391876 4859535 5780636 4879864 4668061 4424921 4742626 5710325
14020 5710325 6055871 4780585 4845992 4743855 4766212 4206905 4474162 4585705 4436965 4426827
14010 4426827 4583182 5393099 4962117 5264498 5504560 5149966 5408834 5686031 5771893 4862798
14000 4862798 4106464 4907759 5541662 5304525 5117055 5132248 4826789 4056916 4651397 5684999
13990 5684999 4684448 4096753 4748345 5194175 4725322 4785141 4364721 4023192 4731368
13981 4731368 5475392 4760388 4378508 4077903 3841103 4634685 5470236 5217870 5037864
13972 5037864 4943010 5786504 5665962 5385501 5162966 5378824 5500408 5352849 4567706 5145299
13962 5145299 5441571 5565453 4987994 5651918 4696078 4598713 4465456 5283899 5448740 5416256
13952 5416256 5324622 4762312 4667637 5041162 5675592 5035489 4337259 4699594 5863013 5390444
13942 5390444 4935909 4338620 4275792 4900045 5279113 5160195 4207610 4135444 4784579 4816850
13932 4816850 4867489 5181677 5183185 4521826 4328563 4004574 4417527 5673526 5369086 5259579
13922 5259579 5486323 5485985 5108631 5295065 5531619 5812881 5179436 4850396 4760052 4079872
13912 4079872 4139673 4222850 4631460 5207707 4871505 4524133 4929499 4729422 4753861 4497771
13902 4497771 4491877 4252084 4465088 4693796 4906793 4640565 4812953 4632128 4563759 4262020
13892 4262020 4671956 4527854 5264799 4503509 4607233 5048749 5431725 5611966 5075228
13883 5075228 5144451 4661664 3635480 4536521 4397852 4088771 3761243 4554264 4985300
13874 4985300 4980393 5019492 4927141 5053543 4897090 5207372 5204261 5147224 5258571 4958054 4413823
13863 4413823 4193789 3900710 4688578 4884936 4486664 4279137 4345575 4473465 4772177 4949128
13853 4949128 5474333 4559088 5261708 5420279 4804141 4533582 5236247 5531219 5332620
13844 5332620 4933947 5014177 5684503 5598576 5380757 5171921 5414348 5807967 5357769 4381041
13834 4381041 4349259 4625335 4962056 4764926 5199094 5061604 4850753 5448642 5609452 5477586
13824 5477586 5370867 4907530 4777069 5214039 6199107 6206639 6187957 5852030 5629720 5393815
13814 5393815 4910224 4752719 5222362 5344019 4826390 4618252 3836006 3469442 4138119
13805 4138119 4593870 4485817 4945980 5096244 4849106 5223063 5520995 5158417 5123614 4197735
13795 4197735 4081420 5407458 6155007 6211444 5188979 4831909 5306651 4903670 5456573
13786 5456573 5727259 5705955 5791973 4894672 3971219 4393643 5452551 6232562 5640952 5635379
13776 5635379 5810895 5584539 6170063 5142620 5231226 5607572 5229500 5752766 5601203
$$ [...]
##END NTUPLES=NMR SPECTRUM
##END=
