##TITLE=1H_CG-1183
 CDCl3
 8 sc, 
 27.12.2023
##JCAMPDX= 6.0         $$ Bruker NMR JCAMP-DX V2.0
##DATA TYPE= NMR SPECTRUM
##DATA CLASS= NTUPLES
##ORIGIN= UXNMR, Bruker Analytische Messtechnik GmbH
##OWNER= root
$$ XWIN-NMR		Version 3.5
$$ Wed Dec 27 14:52:14 2023 Russian Standard Time (UT+4h)  she@DPX200
##.OBSERVE FREQUENCY= 200.1313
##.OBSERVE NUCLEUS= ^1H
##.ACQUISITION MODE= SIMULTANEOUS
##.ACQUISITION SCHEME= undefined
##.AVERAGES= 8
##.DIGITISER RES= 18
##SPECTROMETER/DATA SYSTEM= spect
##.PULSE SEQUENCE= zg30
##.SOLVENT NAME= CDCl3
##.SHIFT REFERENCE= (INTERNAL, CDCl3, 0, 15.4516)
##AUDIT TRAIL= $$ (NUMBER, WHEN, WHO, WHERE, WHAT)
$$ ##TITLE= Audit trail, XWIN-NMR		Version 3.5
$$ ##JCAMPDX= 5.01
$$ ##ORIGIN= Bruker BioSpin GmbH
$$ ##OWNER= she
$$ F:/spectra/data/she/nmr/H-F/1/pdata/1/auditp.txt
$$ ##AUDIT TRAIL=  $$ (NUMBER, WHEN, WHO, WHERE, WHAT)
(   1,<2023-12-27 14:50:59.09 +0400>,<she>,<DPX200>,
      <created by zg, POWCHK disabled, PULCHK disabled
       configuration hash MD5:
       00 E9 B6 7A A2 85 ED C7 34 08 36 98 17 FE 4E 26
       data hash MD5: 16K
       85 D6 2A CD 40 8A 6B 14 BC A8 9E C4 64 08 78 1D>)
(   2,<2023-12-27 14:51:02.10 +0400>,<she>,<DPX200>,
      <Start of raw data processing
       efp BC_mod = 2 LB = 0.24 FT_mod = 6 PKNL = 1 PHC0 = -24591.75 PHC1 = 10.85273 SI = 16K 
       data hash MD5: 16K
       06 0E 1A E0 6E 42 B3 6F 12 4B C7 7F 2E E3 13 07>)
(   3,<2023-12-27 14:51:25.82 +0400>,<she>,<DPX200>,
      <pk PHC0 = -0.5353672 PHC1 = 0.4000003 
       data hash MD5: 16K
       75 3C 6A 78 3D 66 12 74 21 62 40 53 22 05 18 62>)
(   4,<2023-12-27 14:51:28.82 +0400>,<she>,<DPX200>,
      <abs ABSG = 5 
       data hash MD5: 16K
       F3 BD FB B7 0E FF 51 CC 59 7A 9E AC 27 13 4C 89>)
$$ ##END=
$$ 
$$ hash MD5
$$ 1A 48 B6 43 6F 67 E1 BA 7D C7 C0 7A E7 68 CC 0C
##$RELAX= 
##$RELAX= 
##$RELAX= 
##$RELAX= 
##$RELAX= 
##$RELAX= 
$$ Bruker specific parameters
$$ --------------------------
##$DU= <F:/spectra>
##$EXPNO= 1
##$NAME= <H-F>
##$PROCNO= 1
##$TYPE= <nmr>
##$USER= <she>
##$AMP= (0..31)
100 100 100 100 100 100 100 100 100 100 100 100 100 100 100 100 100 100 
100 100 100 100 100 100 100 100 100 100 100 100 100 100 
##$AQSEQ= 0
##$AQ_mod= 1
##$AUNM= <au_zg>
##$AUTOPOS= <>
##$BF1= 200.13
##$BF2= 200.13
##$BF3= 200.13
##$BF4= 200.13
##$BF5= 200.13
##$BF6= 200.13
##$BF7= 200.13
##$BF8= 200.13
##$BYTORDA= 1
##$CFDGTYP= 0
##$CFRGTYP= 5
##$CHEMSTR= <none>
##$CNST= (0..31)
1 1 145 1 1 1 1 1 1 1 1 1 1 1 1 1 1 1 1 1 1 1 1 1 1 1 1 1 1 1 1 1 
##$CPDPRG= <>
##$CPDPRG1= <>
##$CPDPRG2= <>
##$CPDPRG3= <>
##$CPDPRG4= <mlev>
##$CPDPRG5= <mlev>
##$CPDPRG6= <mlev>
##$CPDPRG7= <mlev>
##$CPDPRG8= <mlev>
##$CPDPRGB= <>
##$CPDPRGT= <>
##$D= (0..31)
0 1.2 0 0 0 0 0 0 0 0.06 0 0.03 0 0 0 0 0.0002 0 0 0 0 0 0 0 0 0 0 0 0 
0 0 0 
##$DATE= 1703674258
##$DBL= (0..7)
120 120 120 120 120 120 120 120 
##$DBP= (0..7)
150 150 150 150 150 150 150 150 
##$DBP07= 0
##$DBPNAM0= <>
##$DBPNAM1= <>
##$DBPNAM2= <>
##$DBPNAM3= <>
##$DBPNAM4= <>
$$ [...]
##$SUBNAM3= <"">
##$SUBNAM4= <"">
##$SUBNAM5= <"">
##$SUBNAM6= <"">
##$SUBNAM7= <"">
##$SUBNAM8= <"">
##$SUBNAM9= <"">
##$SW= 18.0517328524113
##$SWIBOX= (0..15)
0 0 2 0 0 0 0 0 0 0 0 0 0 0 0 0 
##$SW_h= 3612.71676300578
##$TD= 16384
##$TD0= 1
##$TE= 0
##$TE2= 300
##$TE3= 300
##$TEG= 300
##$TL= (0..7)
0 120 120 120 120 120 120 120 
##$TP= (0..7)
150 150 150 150 150 150 150 150 
##$TP07= 0
##$TPNAME0= <>
##$TPNAME1= <>
##$TPNAME2= <>
##$TPNAME3= <>
##$TPNAME4= <>
##$TPNAME5= <>
##$TPNAME6= <>
##$TPNAME7= <>
##$TPOAL= (0..7)
0.5 0.5 0.5 0.5 0.5 0.5 0.5 0.5 
##$TPOFFS= (0..7)
0 0 0 0 0 0 0 0 
##$TUNHIN= 0
##$TUNHOUT= 0
##$TUNXOUT= 0
##$USERA1= <user>
##$USERA2= <user>
##$USERA3= <user>
##$USERA4= <user>
##$USERA5= <user>
##$V9= 5
##$VALIST= <valist>
##$VCLIST= <CCCCCCCCCCCCCCC>
##$VD= 0
##$VDLIST= <DDDDDDDDDDDDDDD>
##$VPLIST= <PPPPPPPPPPPPPPP>
##$VTLIST= <TTTTTTTTTTTTTTT>
##$WBST= 1024
##$WBSW= 4
##$XGAIN= (0..3)
0 0 0 0 
##$XL= 0
##$YL= 0
##$YMAX_a= 203710
##$YMIN_a= -247481
##$ZGOPTNS= <>
##$ZL1= 120
##$ZL2= 120
##$ZL3= 120
##$ZL4= 120
##$ABSF1= 15.45492
##$ABSF2= -2.59693
##$ABSG= 5
##$ABSL= 3
##$ALPHA= 0
##$AQORDER= 0
##$ASSFAC= 0
##$ASSFACI= 0
##$ASSFACX= 0
##$ASSWID= 0
##$AUNMP= <proc_1d>
##$AZFE= 0.1
##$AZFW= 0.1
##$BCFW= 0
##$BC_mod= 2
##$BYTORDP= 0
##$COROFFS= 0
##$CY= -3
##$DATMOD= 1
##$DC= 0
##$DFILT= <>
##$DTYPP= 0
##$F1P= 0
##$F2P= 0
##$FCOR= 1
##$FTSIZE= 16384
##$FT_mod= 6
##$GAMMA= 0
##$GB= 0
##$INTBC= 1
##$INTSCL= 3.70164e-10
##$ISEN= 128
##$LB= 0.24
##$LEV0= 0
##$LPBIN= 0
##$MAXI= 10000
##$MC2= 0
##$MEAN= 0
##$ME_mod= 0
##$MI= 1.114404
##$NCOEF= 0
##$NC_proc= -7
##$NLEV= 6
##$NOISF1= 3.799351
##$NOISF2= 2.8
##$NSP= 0
##$NTH_PI= 0
##$NZP= 0
##$OFFSET= 15.45161
##$PC= 1
##$PHC0= -24592.29
##$PHC1= 11.25273
##$PH_mod= 1
##$PKNL= yes
##$PPARMOD= 0
##$PSCAL= 0
##$PSIGN= 0
##$REVERSE= no
##$SF= 200.130014028747
##$SI= 16384
##$SIGF1= 3
##$SIGF2= 2
##$SINO= 5.538805
##$SIOLD= 16384
##$SREGLST= <1H.CDCl3>
##$SSB= 0
##$STSI= 16384
##$STSR= 0
##$SW_p= 3612.71676300578
##$SYMM= 0
##$S_DEV= 0
##$TDeff= 16384
##$TDoff= 0
##$TI= <>
##$TILT= no
##$TM1= 0
##$TM2= 0
##$TOPLEV= 0
##$USERP1= <user>
##$USERP2= <user>
##$USERP3= <user>
##$USERP4= <user>
##$USERP5= <user>
##$WDW= 1
##$XDIM= 16384
##$YMAX_p= 447233697
##$YMIN_p= -568856
$$ End of Bruker specific parameters
$$ ---------------------------------
##NTUPLES= NMR SPECTRUM
##VAR_NAME=  FREQUENCY,     SPECTRUM/REAL,   SPECTRUM/IMAG
##SYMBOL=    X,             R,               I
##VAR_TYPE=  INDEPENDENT,   DEPENDENT,       DEPENDENT
##VAR_FORM=  AFFN,          ASDF,            ASDF
##VAR_DIM=   16384,         16384,           16384
##UNITS=     HZ,            ARBITRARY UNITS, ARBITRARY UNITS
##FACTOR=    0.220516191357247, 1,           1
##FIRST=     3092.33084831846, 0,            0
##LAST=      -520.385914687316, 0,           0
##MIN=       -520.385914687316, -568856,     0
##MAX=       3092.33084831846, 447233697,    0
$$ Real data points
##PAGE= N=1
##DATA TABLE= (X++(R..R)), XYDATA
$$ [...]
9847 1545953 1634892 1643791 1645081 1681898 1670035 1613407 1852336 1862354 1701667 1626057 1609962
9836 1609962 1852685 1833554 1805272 1860143 1923275 1884598 1967967 2043429 1946328 1852991 1837757
9825 1837757 1900012 1939527 1996913 2353985 2167632 2252922 2345786 2478858 2392263 2539174 2634576
9814 2634576 2570842 2582754 2374166 2452076 2429206 2521480 2609059 2678698 2588118 2805962 3144235
9803 3144235 3040491 3164263 3300727 2951953 2824372 3294631 3653670 3650821 3634598 3438067
9793 3438067 3580774 3779224 3843212 3971251 4078678 4171923 4194482 4308041 4482731 4642788
9783 4642788 4838013 4802678 4837013 5020708 4977062 4842246 4985863 5178243 5225095 5247050
9773 5247050 5471906 5558049 5566963 5556565 5649577 5709472 5844752 6125785 6411405 6500672 6671968
9762 6671968 6877766 7100931 7436456 7656961 7814178 7827055 8023103 8196156 8472269 8931345
9752 8931345 9224853 9627957 9932482 10270710 10696027 10815758 11115068 11636901 11967896 12380845
9742 12380845 12639151 12854014 13394574 13972188 14184527 14437947 14845675 15184503 15744205
9733 15744205 16134801 16797727 17574294 18507628 19302579 20017670 20751794 21559854 22382836
9724 22382836 23274246 24825029 26049663 27318585 28986733 30955968 33299665 36376201
9716 36376201 39938901 43782883 48338372 53609305 60301294 68320531 77692366 86591898
9708 86591898 92523113 96778278 101419787 106062365 107746299 103868420 96211046 89604168
9700 89604168 84363694 77188605 68056285 59273289 52299815 47626135 44651274 42570319
9692 42570319 41162849 40259351 39675728 38978678 38874278 39185045 39479942 40155585 41160469
9683 41160469 42614868 44668046 47238881 50331418 53953671 58872067 64661612 71740293
9675 71740293 80767712 90252438 96841721 100889149 105188910 111712127 115201093 109678769
9667 109678769 99286012 90202526 83919344 76076395 65607801 55072347 46660034 40539778
9659 40539778 36040813 32544224 29912857 27760935 25923096 24312974 22964209 21749857
9651 21749857 20746804 19722634 18653393 17735496 17021230 15953565 14910311 14204195 13349990
9642 13349990 12555203 11985774 11377330 10672214 10091931 9353008 8954248 8848473 8506567
9633 8506567 7857493 7550639 7448720 7131151 6935771 6740420 6256159 6050815 5780298 5788411
9623 5788411 5729578 5437263 5367711 5195739 5043734 5023862 5023549 4845442 4676229 4486506 4269167
9612 4269167 4337627 4206580 4194220 4128721 4146368 4045836 3964923 3735119 3621839 3547821 3257427
9601 3257427 3481343 3498763 3262792 3138746 3130085 3070393 2804869 2737722 2666263 2694683 2627708
9590 2627708 2411838 2531567 2494270 2432805 2432559 2435330 2514889 2431257 2445416 2675030 2523094
9579 2523094 2417535 2326756 2160738 2056088 1947056 1921293 1974766 1867021 1843023 1764402
9569 1764402 1759296 1826273 1884827 1769316 1771808 2008944 1946607 1852625 1720938 1663826 1488895
9558 1488895 1604933 1629155 1710295 1769050 1523200 1439334 1717280 1791334 1667446 1451369
9548 1451369 1404957 1239086 1278790 1375108 1310803 1564444 1676702 1841764 1746785 1623272
9538 1623272 1673388 1685914 1639648 1749444 1613125 1513209 1408933 1506449 1570884 1655476 1657273
9527 1657273 1654538 1624737 1791020 1841914 1773673 1611620 1724249 1851178 2006128 1946511 1840272
9516 1840272 1697200 1677886 1752523 1713673 1646972 1699409 1841695 1865542 1756061 1820284 1914535
9505 1914535 2000477 2021791 1967806 2065148 2091671 1901337 1966651 2040360 2008435 1914472 1820760
9494 1820760 1874865 2047894 2208195 1969875 1895988 2037648 2223305 2033794 2362129 2536052
9484 2536052 2440795 2341595 2268834 2219119 2164963 1982051 1952951 1940331 1798874 1820583 1739599
9473 1739599 1794492 1650653 1767321 1802606 1726856 1587119 1594276 1553873 1482713 1492670 1518251
9462 1518251 1652499 1395437 1522162 1586362 1762365 1754305 1640161 1580503 1879168 1860264
9452 1860264 1879063 2006264 2134558 2192135 2130218 2100061 2321947 2372649 2294299 2219812 2203496
9441 2203496 2238475 2208224 1973129 1814424 1966858 1843797 2005902 1927969 1678984 1666729
9431 1666729 1621917 1593844 1734392 1939597 2195814 2215459 2118385 2175072 2042722 1928189
9421 1928189 1853958 1835426 1764674 1768308 1770271 1725246 1728640 1945373 1921027 1814013 1940200
9410 1940200 1871828 1726311 1867373 1872321 1987658 1940851 2053917 2200163 2393545 2342750
9400 2342750 2378097 2702884 2833425 2845209 2711815 2571763 2314815 2314289 2396270 2345386 2163930
9389 2163930 2105314 2017161 2028034 2061332 2065693 2264687 2303010 2175054 2369992 2426819 2417261
9378 2417261 2206175 2414347 2289802 2443293 2435773 2377369 2484342 2642648 2680754 2409222
9368 2409222 2424794 2479222 2483764 2705138 2803615 2833707 2824063 2771212 2857239 3015227 2886474
9357 2886474 2940123 2968648 2805521 2888046 2891227 3131249 3003406 3096415 3270456 3178193 3198829
9346 3198829 3627738 3543745 3406765 3388132 3075104 3223562 3448400 3634619 3631949 3604887
9336 3604887 3678750 3631695 3463873 3584437 3531860 3544964 3506373 3444994 3511186 3618259 3614940
9325 3614940 3638133 3887533 3839537 3775009 4089362 4240818 4343265 4338735 4387960 4313485 4345852
9314 4345852 4411205 4519635 4761587 4857062 4842640 4786820 4958005 4944208 4948577 5095772 5144417
9303 5144417 5086262 5078639 5092439 4991255 4999585 5019727 4981809 5186213 5096947 5119057 5091170
9292 5091170 5199375 5193699 5335706 5578589 5504582 5331875 5485262 5645033 5421632 5544121
9282 5544121 5701200 5581714 5588958 5440542 5360110 5194500 5330427 5460043 5322845 5348762
9272 5348762 5346830 5370132 5325704 5528181 5614482 5605678 5574856 5539692 5566805 5677157 5578181
9261 5578181 5335331 5392086 5232359 5169177 5263370 5333839 5342638 5391676 5161605 5229767 5303341
9250 5303341 5280995 5583701 5710067 5861143 5688765 5594032 5698662 5738045 5593665 5817401
9240 5817401 5874885 6003556 5912882 5841195 5743102 5870406 6061358 6144960 6497815 6648776
9230 6648776 6523839 6441222 6699501 6749957 6797050 6826489 7245115 7512252 7427119 7769303
9220 7769303 7880546 7993047 8007046 8026552 8303808 8525666 8652750 8791323 8993605 9093144
9210 9093144 9182279 9481861 9796341 9952149 10050971 10224141 10352677 10438692 10705463 11063904
9200 11063904 11433410 11728912 11895732 12272976 12557295 12622275 12844865 13155062 13519205 13813112
9190 13813112 14494792 14979161 15125717 15142609 15437684 15795060 16320265 16759151 17223314 17617299
9180 17617299 17996864 18759989 19370554 20074520 21042059 21851453 23057470 24465917 26526992
9171 26526992 28653512 29814818 29993461 29919728 30238216 31229737 31843021 31466759 30332867
9162 30332867 29633883 29315790 29368702 29679431 30059583 30508941 31493944 32360696 33260163 34321866
9152 34321866 35476762 36645439 37961212 39521815 41242543 43254017 45351472 47764997
9144 47764997 49825625 52074228 54704726 57486591 61004577 65115907 69951753 76132224
9136 76132224 83920075 94281909 106195250 114932450 116930981 115667021 116268884 121009905
9128 121009905 125907042 125042382 118659278 112223065 109090283 110093390 114845929 123493119
9120 123493119 135157182 147109955 155673861 161228435 166166571 169921864 169994548 168423397
9112 168423397 169816748 177686836 193805179 218330204 244065774 258320335 257093654
9105 257093654 250452726 247874525 244144289 225982208 194396686 160972177 133716810
9098 133716810 114276339 100323466 90115111 82244969 75873439 70647588 66513889 63206088
9090 63206088 60432960 57926695 55738511 54191494 53369719 53422036 53899528 54946150 56523197
9081 56523197 57484031 57512511 57199176 56653957 55196608 52574193 48775110 45184830 42392909
9072 42392909 40389039 39163664 37637447 35260334 33186248 31427905 30006382 28954233
9064 28954233 28243385 27393540 26503262 25846174 25331879 24937256 24713940 24689306 24553557 24501518
9054 24501518 24217496 23809343 23513370 23172417 22793694 22323510 21605152 20904980 20652722
9045 20652722 20629413 20472115 20222081 20312254 20561928 20866348 21186171 21573022 22492284 23390734
9035 23390734 23855299 24075418 24840941 25529051 25644400 25353401 24573432 23950014 23115980
9026 23115980 21832540 20488179 19004141 17714472 17031199 16663537 16372693 16191598 15873415
9017 15873415 15831679 16038888 15914552 15958637 15922007 15894518 15839282 16009427 16255776 16558741
9007 16558741 16932620 17243175 17445671 17863475 18498337 19204984 19964848 21000732 22083317
8998 22083317 22880032 23426275 23908242 24311980 24587072 24667596 24431537 24020787 23757989 23544671
8988 23544671 23121106 22639785 22696111 22860986 23349998 23997810 24914393 25345632 24957342 24518504
8978 24518504 24261027 24321761 24750425 25266730 26089001 26501740 27086346 27995399 28804075 29823745
8968 29823745 30869083 31923416 32986070 34539427 36480890 38635440 41323046 44204824
8960 44204824 48062609 53268004 59379469 66999437 75771646 81541019 80695204 75487827
8952 75487827 69482096 65496090 63747673 63357844 64271582 66001415 68939058 72995716
8944 72995716 77091223 79101086 77382425 72771010 68631623 66065101 65423952 66150959
8936 66150959 68324753 72040309 77242488 84474815 94020264 106212537 118907851 131058014
8928 131058014 145433260 167374902 194767728 204062294 186358894 161605174 143187676
8921 143187676 136177991 134416663 131044479 123531469 111868687 99098065 88490734 80712578
8913 80712578 75081728 71130602 68861458 68545564 69888602 71507379 71019859 66935537
8905 66935537 61162355 55585421 51522073 48988204 47963741 47551646 48221856 49784020
8897 49784020 52763638 56624544 58127843 55403845 50489319 46240765 43516270 41896371
8889 41896371 41338800 41316182 41687703 43021246 45377177 48973307 51374736 49644366 44130761
8880 44130761 37907032 32722875 28849748 25905155 23800974 22529043 21556014 20762047
8872 20762047 20077141 19166062 18182792 17487878 16887269 16222698 15632577 15181071 14946295
8863 14946295 14542222 13974984 13776362 13622117 13574901 13557240 13517568 13168534 12510037 12181344
8853 12181344 11988279 12005520 12029636 11923726 11888208 12225816 12307980 12241784 11903728 11455477
8843 11455477 10782747 10001708 9502497 9287814 9106204 8984306 8917764 8941933 8975112 9222421
8833 9222421 9523980 9801275 9878398 10139817 10375671 10571246 10803642 10832124 10424772 10053117
8823 10053117 9748963 9435753 9220008 9106467 9166630 9231214 9357544 9531848 9651360 10272284
8813 10272284 10922865 11525420 12493038 13329350 14111482 14868955 15165982 15009086 14510673
8804 14510673 13992882 13733511 13448010 13290166 13097785 12994439 12798424 12629136 12620206 12374461
8794 12374461 12218653 12364363 12457921 12807167 12941858 12972864 12884758 12194633 11610856 10649643
8784 10649643 9677171 9003132 8381024 7963001 7726276 7570165 7491081 7401336 7279614 7057521
8774 7057521 6983462 7287071 7537892 7486395 7506902 7949419 8567439 9003822 9418818 9773278
8764 9773278 10118564 10190770 10388269 10414121 10589377 10845839 11248259 11368307 11261016 11001185
8754 11001185 10675540 10399209 10390385 9835357 9343302 9147452 9038695 8813622 8329790 7770086
8744 7770086 6812610 6221672 5886939 5948498 5689448 5235490 5082637 5194995 5268488 5593695
8734 5593695 5768509 5824832 6006069 5980162 5827922 5935764 5811844 5540159 5208489 4934827
8724 4934827 4845986 4753296 4543717 4583196 4661410 4527430 4545091 4710220 4541137 4561385 4665297
8713 4665297 5055863 5268747 5272367 5451156 5141862 4815114 4429156 3956193 3818289 3695829
8703 3695829 3783769 3617650 3474723 3454002 3493596 3523889 3797394 4129698 4516785 4788125
8693 4788125 5092957 5624050 5779386 6048330 5840370 5372960 4709282 4125202 3918726 3790124
8683 3790124 3748654 3460542 3445633 3402438 3720174 3762911 3714768 3669024 4010307 4410855 4851144
8672 4851144 5237312 5443118 5412702 5171736 4730554 4144287 3536577 3319457 3036955 2689178
8662 2689178 2638427 2528098 2448115 2370141 2231031 1839407 1898854 2042495 2016112 1847464
8652 1847464 1715829 1966335 2107030 2202406 2203532 1841912 1857020 1838238 1806240 1710518 2062587
8641 2062587 1983644 1998057 1902276 1935034 1933290 1877103 2099328 1925049 1940075 2285287 2070201
8630 2070201 2098600 2054020 1893526 1854218 1838884 1968559 1923122 1875357 1795406 1910453 1784977
8619 1784977 1805253 1840636 1880817 1946290 2033816 2062439 2293187 2413769 2146777 1976988 1917483
8608 1917483 1924334 2013253 2307081 2588201 2444804 2453194 2733947 2893399 2952587 2889727 3155815
8597 3155815 3375078 3762691 4205499 4541942 4792272 4856644 4810304 4534436 4316308 4592458
8587 4592458 4926250 5333716 5551722 5859673 6281099 6667147 6474453 5793743 5039861 4687812
8577 4687812 4573578 4504861 4523143 4708803 4808993 4821756 4652785 4350346 4235365 4113432
8567 4113432 4080681 3723209 3551216 3586146 3681077 3692397 3971549 3851361 3854135 4170948 4515948
8556 4515948 5105824 5757689 6094390 6390232 6508199 6557323 6638420 6528112 6521856 6522519 6788470
8545 6788470 7187566 7570112 8155431 8467599 8471482 8082284 7468114 6920101 6406483 5800935
8535 5800935 5533037 5654353 5752155 5950736 5813252 5434238 4977085 4607711 4045220 3811390
8525 3811390 3672389 3544963 3491771 3356582 3310767 3566541 3834393 3812947 3966188 4060928
8515 4060928 4261610 4292685 4256955 4316933 4374326 4287208 4158133 3893081 3652618 3602446 4005685
8504 4005685 4445117 4662079 5153597 5495968 5775712 5456172 5153544 4771112 4298106 4015049
8494 4015049 3570635 3454580 3513635 3273474 3205224 3166530 3012154 2861630 2438819 2294832
8484 2294832 2192849 2117525 2042685 2063876 2265500 2522908 2398436 2428718 2368594 2436807 2339428
8473 2339428 2116233 1924553 1754134 1827557 1739115 1660880 1465635 1586295 1652984 1699307
8463 1699307 1770107 2125752 2112508 2204271 2373846 2189568 2270644 2150753 1981228 1899496
8453 1899496 1943252 1782894 1799817 1770269 1903560 1800838 1615757 1776659 1491470 1138570
8443 1138570 946261 1091465 1238756 982409 709375 676406 666545 609750 770270 829928
8433 829928 856131 761083 514292 609403 541134 452200 403452 124900 226404 590822 754636
8422 754636 750873 651321 646983 468477 331483 299851 398326 569017 526131 482181 547638
8411 547638 640247 642960 501139 550327 636338 454048 353333 480732 258968 325600 375836
8400 375836 275147 490353 365909 177705 430817 560704 604055 394766 352343 291295
8390 291295 176305 170479 88972 154760 218282 271502 29112 309651 375469 62278 -56183
8379 -56183 189100 55300 106068 57587 121127 179419 270895 373713 185922 102344 -2848
8368 -2848 -43035 -40221 9837 120932 250097 371761 342502 430433 274641 76483 119696
8357 119696 103367 340811 412563 283028 73161 101381 119824 63133 69440 274642 336313
8346 336313 274321 338414 428400 222963 131960 269233 263054 247345 136077 31649 15521
8335 15521 99947 401591 514706 270036 319169 471063 362772 488310 425533 159322
8325 159322 98083 35114 181260 268232 172138 252767 225631 115570 178992 379015 417654
8314 417654 419102 347201 330280 275276 251332 98164 99196 317487 400791 118796 302475
8303 302475 213864 295684 377263 329136 240707 227317 255406 189199 94176 260093 116231
8292 116231 110219 327833 244663 228393 17729 27784 102509 346215 388116 390089 476384
8281 476384 366890 216567 401761 347220 228272 129274 280523 311096 323735 316129 246524
8270 246524 185047 283297 338613 256181 126182 -33708 -4192 -169032 -123529 -112118 -39163
8259 -39163 185463 121232 85955 -133667 -153589 -222299 -241000 -117302 -122243 -262628 -215406
8248 -215406 -135932 -87245 -160670 -15004 5430 222674 253874 327486 463897 566275 361006
8237 361006 300495 487871 486468 427453 128402 118321 174612 281612 422934 491111 441071
8226 441071 316524 249773 225244 -6830 224828 307217 226680 139385 66965 28323 192618
8215 192618 139161 40245 -100628 78578 243038 300893 176152 46472 274697 202092
8205 202092 252468 328253 263326 432307 320308 249210 55150 -43055 153801 94496 340604
8194 340604 487033 168639 -77636 115159 77484 500765 660264 449986 514190 468066
8184 468066 406759 558638 485018 501320 593481 702773 694980 636909 576712 495730 614102
8173 614102 717510 564101 596102 592829 460997 450493 466712 518400 423700 229716 334196
8162 334196 473924 290710 380575 425200 368173 345023 402146 260632 297047 379118 355693
8151 355693 493277 443881 251639 316817 263818 199408 499533 537212 513072 517251 305427
8140 305427 488696 667037 424375 234221 196609 33027 -17158 177440 283029 241593
8130 241593 276282 145254 202995 332342 210823 303028 159784 180342 440522 333219
8120 333219 142631 128940 -102612 145237 176685 64054 111946 141015 182308 160358 223540
8109 223540 365681 312990 37409 24076 57223 129680 121066 95835 137107 -20412 59333
8098 59333 199944 28618 194261 313676 291771 310441 387501 330404 281479 124016 210483
8087 210483 333411 295851 169965 175429 55707 17386 204674 182886 -72371 -2658 48261
8076 48261 273230 303605 118662 124565 -21815 -172233 -101660 64152 175939 174078 261895
8065 261895 397162 299176 -11378 97309 -5606 -2967 -6277 -148187 -36691 126342 221419
8054 221419 239496 -45488 -37282 527 86740 -131983 -153579 76984 4544 203427 186231
8043 186231 194169 -12967 -7780 43015 -48348 13749 130018 142810 277599 227309 256985
8032 256985 118656 255064 76332 -124632 192453 46506 -33739 127426 -126759 -67460
8022 -67460 -199090 -24268 195535 147070 -284 -125392 -288367 -243491 -233916 -214130 -131204
8011 -131204 -107636 -111160 -124883 -117773 -176967 -172578 -369045 -234980 -121694 -256034 -298494
8000 -298494 -69796 -114623 -73998 20335 55312 -131550 -255444 -204857 -58481 138053 65699
7989 65699 96007 209767 84930 -252457 -95831 -92485 -11694 -90842 22251 54884 1350
7978 1350 -16391 -178050 -79434 -137285 -121576 -73066 -100533 -108990 -148461 -153655 -113055 -79437
7966 -79437 64420 -15236 -168165 -272722 -435918 -319719 -307346 -352531 -390680 -289262 -121680
7955 -121680 -124950 -198607 -201201 -3570 116654 -113429 -120646 -149420 48399 23481 48305
7944 48305 -20486 -133919 -271571 -174797 -21354 -25232 2654 -162980 -229561 -426012 -259537
7933 -259537 -219140 -288730 -187000 -104599 -88423 -232697 -53503 -173302 -105522 123917 67123
7922 67123 27764 -293463 -77254 -7988 80158 107683 156619 136851 121887 132704 176191
7911 176191 150287 276514 223133 205375 274709 378697 278935 395027 191644 106467 132497
7900 132497 255519 355453 311625 289913 386930 192566 265119 374117 247064 152757 176392
7889 176392 200309 270170 136418 -138447 -69136 -20662 175604 159783 126802 158580 -50541
7878 -50541 -205674 -208810 232924 225093 151811 434856 333866 350111 337466 318992 364177
7867 364177 328572 655390 716275 479120 309990 387506 427046 224864 291792 203112 204945
7856 204945 183365 286640 376154 411463 258233 315292 559368 520094 307678 256857 142760
7845 142760 324245 351603 279525 230833 433644 356284 309682 366179 467587 237652 97397
7834 97397 291277 297541 68194 34153 51182 86938 169333 183803 367587 363845 158009
7823 158009 179242 230435 87309 45242 101147 142136 178716 281871 182263 191159 106162
7812 106162 283720 212387 130228 50807 -28658 52142 163279 28325 -185639 -12733 67508
7801 67508 -89651 -21141 343642 48589 -157782 -94987 123840 226846 298296 325771 344360
7790 344360 37066 -148098 -187118 -210023 94776 -75874 -185225 50304 189219 266497
7780 266497 120437 193245 80583 156933 54594 -137955 87506 261397 321803 179748
7770 179748 -3328 34282 -34118 -114014 -43927 -40711 -100918 -384865 -404394 -262429 -161236
7759 -161236 -32347 -49160 39231 172623 224162 158177 233882 228396 224911 101356 9810
7748 9810 35515 -118626 38065 134177 -52399 -234454 -153492 -106694 112963 234178 42486
7737 42486 -205969 -87454 -66455 159525 94251 -7336 83024 66031 -170211 -39507 -89541
7726 -89541 -111654 -198386 -176423 -121188 -36532 -91723 -34084 132711 5016 42745 249940
7715 249940 238397 176967 19909 -34565 -7872 -96535 42505 -84673 9877 133715 82962
7704 82962 223067 124109 -13140 6232 240694 178016 21438 148175 107406 12256 -61955
7693 -61955 242201 236742 218508 288371 235932 283707 361687 214580 144232 -129350 62409
7682 62409 212364 263541 96501 -148231 165027 162678 39151 42816 -32510 -41467 -180878
7671 -180878 -158702 -68818 56359 -20775 -211893 -83109 -132048 9573 145847 45231
7661 45231 -34769 18956 194474 245539 -9480 42435 69859 -25478 -150655 -95803 -84462
7650 -84462 106031 189216 32353 -22115 -96299 -2202 -107183 -212582 -327982 -235800 -62963
7639 -62963 102174 44433 -73091 8555 223051 85321 -29021 11250 86610 95181 113804
7628 113804 159753 -13128 -86568 -20483 31930 166468 77151 92506 -59929 -38329 64323
7617 64323 52507 -108362 20425 48898 -122696 175646 615 -115884 -182213 -79497
7607 -79497 -7097 -124991 21894 96774 123993 90052 -142209 -80684 189941 82410 -91367
7596 -91367 -28139 -74446 -75210 52934 5611 -53634 166697 170530 110075 26714 131054 2758
7584 2758 -268853 -234869 -123366 66493 140949 51851 31346 100369 266814 271728 53717
7573 53717 -64897 -59827 -20127 -3902 -56238 103697 134046 74712 45811 5878 -27536 -7527
7561 -7527 -87946 93145 218096 60885 22699 37703 -35187 -55794 -126832 -149517 37030
7550 37030 83197 -97167 -37522 85386 151720 200701 -18572 42245 27969 -33312 10022
7539 10022 -115585 -325878 -183781 92925 14878 -98447 -212873 -281884 -240091 -143920 -115039
7528 -115039 -60545 32191 146198 72438 -62069 142687 71923 58590 -81747 -63304 -34095
7517 -34095 82983 161737 25726 60733 -11213 -69575 -27074 -102733 9339 119157 134310
7506 134310 -29382 -137828 -81279 -42894 -104069 -105697 -131208 -80091 29996 -213544 -322866
7495 -322866 -61602 104936 -80937 -14872 62931 -91548 -89099 -111146 -28355 -104012 -109227
7484 -109227 -159530 -301779 -280371 -125775 -85650 -267902 -187818 58795 173148 49495
7474 49495 -71910 27152 -16239 -162702 -153111 -69002 -152738 18657 187363 68610 136823
7463 136823 46253 -82260 -124251 140000 -17787 -58372 -149366 -156161 9163 322704 295840
7452 295840 178710 177378 199919 130134 1316 95862 90483 219602 -28057 -61735 2349
7441 2349 -36951 108781 156040 125051 248989 186186 145046 203686 337552 342764 300171 98132
7429 98132 -42103 164896 152001 215352 234910 330290 151824 -21449 101179 152061 56152
7418 56152 165581 274598 208917 299049 408559 226097 307238 314920 108298 226021 183695
7407 183695 276351 210692 110840 196416 112800 25808 230804 234294 103338 189812 134510
7396 134510 162936 173759 59144 65971 314547 326276 377265 284066 181833 160380 78598
7385 78598 175029 252658 314950 343623 280776 183910 349301 356016 170289 66094 117173
7374 117173 125317 -49904 -200155 45559 135686 246232 353386 177987 235697 446067
7364 446067 382601 443500 325291 203666 112808 -79221 -210196 -96521 83555 -214647
7354 -214647 -226661 121572 169733 252543 289755 200667 -146032 -87374 -84738 -90832 99685
7343 99685 63906 122060 20736 -27585 -60229 77622 225647 219508 216716 117108 168739 287360
7331 287360 -28527 -117964 -78123 -131903 -102879 111204 50297 17389 -56149 -40208 -105710
7320 -105710 -277524 45696 200516 99635 -64308 -120906 -237946 -145778 -23418 92922
7310 92922 -40503 -212852 -182076 174066 135678 -22044 152034 -97688 -216102 -295734
7300 -295734 -136316 -421391 -278500 27032 12281 7542 86833 114736 192779 84835 81751
7289 81751 117564 -21739 -91209 -244064 -194888 -83134 -138688 -35634 166334 157160 38127
7278 38127 -51510 95768 279067 292398 -172849 -183020 -236811 -217671 -5552 -166630 -270847
7267 -270847 1746 -819 -20074 -124088 -122269 52532 21054 60823 67230 157387 -42424
7256 -42424 -192231 -65835 32786 39133 117663 76816 167816 42004 157381 151500 85399
7245 85399 39203 -61559 -93423 -150335 -181226 -206536 -85409 159901 119826 -73573 -7481
7234 -7481 -87787 84738 46465 -167096 -80404 -45142 72780 43787 -72017 2499 -77544
7223 -77544 -145244 -125658 1785 -277618 -126744 30087 -79260 -82444 -89655 -145554 -47419
7212 -47419 -70353 -93871 -139701 -47722 -31716 -111951 -104730 -69412 -96842 31137 -105755 -194443
7200 -194443 -71954 -77879 -398496 -326937 -56102 -112745 -106660 -41221 -12947 -288138 -219915
7189 -219915 162832 150915 -122949 -71004 -57811 -55668 116872 290185 156209 -107080 -88306
7178 -88306 -131133 -158005 -30046 -56867 -108660 -87485 -59836 -39406 -57679 -17580 -132068
7167 -132068 -138081 58234 -86510 -226882 -236243 -22567 -76010 51773 -4467 100415 131801
7156 131801 66784 -99424 -54221 44799 -14385 82090 178604 421753 386565 163151 370177
7145 370177 441250 366550 259848 112109 -107659 -167511 -105076 -166420 -131620 99152 31757
7134 31757 9445 -39183 -81951 7396 135803 -142891 -259245 -91559 -137429 -100596 -63224
7123 -63224 -127921 -179646 10732 -103811 -14296 22336 -176336 -321803 -295647 -323519 -346383
7112 -346383 -99517 28405 31052 63162 -81167 -67877 -26971 -225805 -177987 -189799 -358687
7101 -358687 -83929 -15324 -61012 102221 -43919 -6370 -134998 -336066 -229037 -142782
7091 -142782 -81144 8951 33648 -79110 61392 276332 192109 73383 -21003 -55878 -221548
7080 -221548 -267835 44013 22112 264394 232641 122784 51040 30158 45872 -66806 58342
7069 58342 138584 25110 -193142 -339733 -105520 -197134 -75957 -51126 -268049 -207017 46478
7058 46478 149526 21586 47192 69239 -54456 -91112 -140157 -69049 5089 -19525 -1459
7047 -1459 141457 109551 197983 -138175 -139380 -78604 -160969 -65801 -55348 34866 -52419 -75471
7035 -75471 61371 196980 29737 81568 35317 -15695 -5816 66551 329107 163383 -84209
7024 -84209 85563 191956 176407 40392 192971 57884 88752 -77377 -182506 -189822 -102332
7013 -102332 -115859 -78399 -190097 -22424 89382 -28690 -66543 -173391 32754 52527
7003 52527 61693 -52571 26458 120065 365955 332407 276659 -64014 -169307 -50127 -112315
6992 -112315 -205892 -235206 -146635 -176403 -84008 -113711 58745 209341 309872 138087 67107
6981 67107 192458 124731 -11723 -49709 13857 160344 86482 -54104 -31031 5943 102763
6970 102763 76294 -152142 -50483 182934 88296 -78021 28523 30785 -18651 -74910 10551
6959 10551 59073 123719 95139 -18837 -143837 -95935 -3817 -326916 -72991 78860 34019
6948 34019 -3168 231219 215202 -28644 197764 204927 113429 26659 17275 -87653 4564
6937 4564 -174421 -92410 106537 158774 247496 105444 123827 -9114 -120290 -28033 55010
6926 55010 106276 80584 -38130 21382 -58246 10687 213437 59709 -3315 67212 85404
6915 85404 -29881 42641 35959 4894 92757 316592 264347 -143568 -135116 -146550 157023
6904 157023 96532 104816 54343 36786 191981 270352 203980 23283 -60424 18214 132381
6893 132381 31313 15079 -111496 -162422 28740 173601 179120 51535 97628 31367 22312
6882 22312 89079 59265 44463 -9077 246834 271800 101711 27192 73882 39944 67147
6871 67147 169394 235519 357127 329335 373597 264220 -37387 62526 198888 211914 254072
6860 254072 133737 354114 478255 257505 291441 391416 568450 553855 307525 255214
6850 255214 234222 318458 735400 849325 872999 849204 989499 1319548 1094881 881789
6840 881789 897392 836302 1033552 1126455 932027 810504 651923 455811 435074 334771
6830 334771 396609 423328 430945 472742 364967 245056 340461 362664 289312 84047 52110
6819 52110 292613 522829 407755 461120 546554 595006 510290 354669 301042 -91184 53313
6808 53313 211324 408985 376508 464165 267461 83960 267367 89096 259719 372568
6798 372568 261670 278646 306245 229395 252364 333493 244721 179837 379392 465516 100182
6787 100182 44741 72855 157558 -2145 86365 292997 234072 277261 303076 300353 469918
6776 469918 251900 146952 194811 335769 631824 677623 611948 519798 664963 766380
6766 766380 628191 654142 599966 507260 488161 449766 559941 672303 455152 450775 580656
6755 580656 390335 604085 590541 423853 387842 596673 740042 594108 491360 594263
6745 594263 539328 510963 395847 571347 812383 1011366 895459 796341 727912 704879 705461
6734 705461 549350 383791 521405 681343 397553 597451 627735 453485 369689 397643
6724 397643 576093 607565 625886 757636 853304 692758 586176 707064 693235 878859
6714 878859 878082 815474 811083 625397 739710 936827 849481 832851 747025 663060 781720
6703 781720 715240 596908 672984 622808 444231 156207 225176 478546 518481 414519 503845
6692 503845 580053 419441 290048 237192 572404 553669 573551 663733 540758 590669 586301
6681 586301 429422 394161 656944 635760 612802 463986 430259 657239 578310 593798 545252
6670 545252 619288 637154 679041 837397 757314 809076 908649 664309 832381 778956 779300
6659 779300 710813 616973 736864 806789 877184 902053 978588 1051242 1112669 1113882 959738
6648 959738 988445 1039306 760372 720092 842998 874548 1037274 1122311 1170255 1087325 1049758
6637 1049758 886532 743104 771050 720643 969867 911910 1094752 978744 926259 1040999
6627 1040999 1088935 997186 1099967 1347082 1369283 1410224 1318985 1238617 1025663 926102 1258204
6616 1258204 1408188 1361513 1427562 1389759 1362292 1102424 1188566 1320385 1528443 1710609
6606 1710609 1697011 1648433 1586477 1329095 1303827 1366044 1268451 1257153 1403829 1361829 1386954
6595 1386954 1496306 1648956 1735013 1556507 1727724 1640834 1716752 1761271 1825649 1739642 1860978
6584 1860978 2021686 2095641 2005091 1885033 1840734 1790804 1681365 1714658 1947145 1954880 2057037
6573 2057037 2039340 2034559 2123944 2172874 2294454 2317340 2303783 2357395 2405245 2207649 2298583
6562 2298583 2429344 2475624 2590301 2657930 2656709 2752185 2767791 2920803 3007190 3162877 3169643
6551 3169643 3156971 3014097 2968250 3182479 3325965 3416425 3435514 3663128 3658003 3801314 3960821
6540 3960821 4155103 4137801 3890097 4012164 4179561 4382409 4624783 4721729 4913356 4946665
6530 4946665 4807147 4961383 5001628 5054705 5225860 5313032 5279232 5321175 5431379 5450402 5553905
6519 5553905 5821671 5851619 5639077 5840975 6154140 6100577 6261233 6467445 6581518 6671401
6509 6671401 6606271 6607715 6852389 6897196 6918377 7243308 7282388 7381244 7361391 7686843 7922862
6498 7922862 7996220 8179405 8556063 8598258 8661893 8898614 9240394 9437146 9751718 9881811
6488 9881811 10061869 10306539 10506533 10734853 11029804 11378212 11731259 12090658 12523579 13082033
6478 13082033 13398680 13933392 14630523 14991822 15526206 15982458 16706166 17615665 18449843
6469 18449843 19273675 20382950 21724723 23480786 25011122 26880335 29118048 31681074
6461 31681074 34801701 38802546 43560037 49172985 55658544 61396053 64992737 65165335
6453 65165335 61728919 55911809 50173847 45377691 41867648 39343557 37686363 37069798
6445 37069798 36929558 37013750 37556345 38869605 40651789 43084032 46389087 50250629 54763055
6436 54763055 60525713 67773742 76605549 87681445 100448334 113251532 121641446 121747550
6428 121747550 112772948 98446692 83331288 70391480 60436691 53386120 48250209 44449637
6420 44449637 41575515 39408604 37849368 37089192 36664305 36821208 37506548 38746197 40326713
6411 40326713 42747113 46168157 50222069 55657744 61973560 68332593 72185422 71765286
6403 71765286 66702447 58582099 50279766 42657330 36789760 32224482 28619697 25953022
6395 25953022 23776761 21819158 20319014 19017858 17770196 16621190 15926234 15152329
6387 15152329 14479873 14022369 13475950 12908775 12621807 12352031 12140786 11948392 11711722
6378 11711722 11604237 11384719 11513867 11541432 11465788 11236470 10874563 10352210 9886839 9599036
6368 9599036 9229391 8995737 9127318 9042282 8845870 8817827 8452165 8132359 7949624 7883105
6358 7883105 8132454 8173114 8151174 8335095 8330381 8135943 8377089 8758897 9152741 9181478
6348 9181478 9612863 10018304 10753838 11154221 11293192 11187294 10908494 10260322 9676153 9276690
6338 9276690 9079612 8724056 8311328 8054288 8323529 8501009 8288254 8252508 8293772 8555333
6328 8555333 8826775 8937042 9003751 9278215 9630664 10079112 10612911 11496817 12579440 13489746
6318 13489746 14291139 14813531 14533865 13728996 12697171 11477693 10250364 9530007 8954001
6309 8954001 8443010 7824060 7772318 7575265 7761010 8010267 8054663 8285290 8727235 8981073
6299 8981073 9321047 9649647 10020632 10513569 11043198 11356712 11627223 12021819 11834788 11246883
6289 11246883 10479904 9673384 8886518 8210551 7435203 6994580 6966986 6784680 6560049 6486297
6279 6486297 6492212 6631792 6735636 6661981 6772038 7065960 7111022 7181737 7477085 7468511 7568490
6268 7568490 7931886 8389372 8720109 8895063 8899714 8271119 7503584 6841968 6484506 5946626
6258 5946626 5641867 5452095 5244439 5244232 5235417 5165897 5119822 5206911 5395764 5439552 5428778
6247 5428778 5551018 5504773 5406594 5522173 5679054 5981079 5823574 5825052 6043149 6112948
6237 6112948 5785457 5746533 5888836 5757653 6009508 6131891 5948406 5684183 5594696 5685560
6227 5685560 5590507 5561413 5452044 5506603 5392779 5176417 5135671 5292607 5368600 5184995
6217 5184995 5238003 5362292 5558944 5483901 5455261 5189004 5366864 5689538 5654122 5828722
6207 5828722 5975559 6069342 5983114 6242983 6435173 6566292 6871367 7124578 7089239 6958573
6197 6958573 7086227 6910043 7055313 7224936 7539056 7530599 7409475 7342148 7571637 7748774
6187 7748774 7926308 8238647 8394605 8500506 8876831 8929408 9273802 9790375 9805308 10080251
6177 10080251 10150299 10531470 10996584 11334989 11597252 11845114 12059205 12186440 12409306 12602962
6167 12602962 12994460 13702591 14038215 14441607 15145510 15645704 16199105 16716073 17063109
6158 17063109 17537076 18275587 18970660 19822786 20925161 22211936 23766202 25362768 27328552
6149 27328552 29508434 32252084 35588695 39394876 44579429 50891732 58943857 67949712
6141 67949712 75508969 77941664 74514487 67613768 60585725 55550064 52905156 52145179
6133 52145179 52710942 55302699 59638546 65543890 71103886 73541831 72245117 70341556
6125 70341556 70166025 73230803 78621758 84625302 88341889 87543478 82048872 74856749
6117 74856749 68602537 64549337 63638147 64836103 67657714 70295963 69356893 64650657
6109 64650657 59289110 55457514 53878612 54381696 57048332 61644620 68529408 76144494
6101 76144494 81512231 80498964 72324285 61010321 50159328 41917305 35834903 31216455
6093 31216455 27624207 24823421 22687014 20889113 19508920 18323854 16988403 15816694
6085 15816694 15049507 14325201 13518333 12896039 12488580 11873721 11490454 11253588 10517447
6076 10517447 10118066 9728863 9245530 9046532 8728234 8372733 7955350 7707191 7448692
6067 7448692 7340835 7323616 7186121 7070107 7024875 6547120 6241181 6240684 6352051 6163017
6057 6163017 6048233 6081621 5936571 5502816 5532005 5482429 5445865 5498867 5444501 5267487 5107612
6046 5107612 5059319 5058260 5126239 5197091 5262514 5050646 4972744 4931646 4862266 4799234 5019268
6035 5019268 4981748 4891507 4793798 4916127 4920316 4919223 4997500 4826303 4948727 5052169 5028676
6024 5028676 5047795 5125530 5190127 4966572 4968711 4947735 5078593 5300327 5397860 5291577 5394828
6013 5394828 5484700 5465426 5299395 5184837 5112140 5149202 5252236 5440485 5684222 5643986
6003 5643986 5652522 5821709 5700683 5740844 5709893 5881173 5891510 6021236 6277772 6310712 6433296
5992 6433296 6431969 6576508 6921822 7246533 7721586 8000320 8261482 8629479 9008498 9675356
5982 9675356 10174793 10430890 10543355 10392971 10003093 9628692 9445475 9221471 8889881 8945084
5972 8945084 8891211 8994714 9274733 9268588 9217165 9550993 9928202 10313493 10562108 11004569
5962 11004569 11439095 12292249 13138632 13954870 14792121 15821966 16983230 18144403 18662426
5953 18662426 18564724 17871621 16591248 15476710 14809594 14200364 13486875 13393715 13424279 13344237
5943 13344237 13596910 13654425 13809260 14073050 14369012 14720232 15020471 15354751 15824917 16452515
5933 16452515 17083914 18025326 18704940 19640236 20669844 21296824 21587703 21884071 21970995
5924 21970995 22024314 22046443 22471894 23050419 23780438 24790835 25982665 27630123 29335707
5915 29335707 31361615 34115578 37199810 41065838 45875245 51853448 59219994 66944282
5907 66944282 73983865 77981232 76503208 70505185 62771342 55263878 49593384 45493422
5899 45493422 42631895 40668390 39367152 38627897 38525151 39105612 40257164 41819115 44499482
5890 44499482 47602169 51457335 56207781 62364130 70106616 80186371 93052831 107228317
5882 107228317 120240621 126420529 122521186 109926087 93694827 78525846 66662088
5875 66662088 57527913 50677329 45632842 41903019 39143098 36998606 35568720 34728453
5867 34728453 34236542 34257967 34616609 35403365 36723704 38683647 41403152 45220211 50039418
5858 50039418 55399345 60317438 63036741 61783822 56055911 48269134 40848904 34853743
5850 34853743 30206645 26491919 23771940 21539165 19653798 18139457 16931383 15925855
5842 15925855 15073575 14257194 13381673 12833286 12099163 11860620 11413338 10990114 10546219
5833 10546219 10063407 9824530 9568182 9359124 9100803 8960006 8510979 8136331 7886702
5824 7886702 7927171 7826642 7504796 7506750 7553260 7354932 7213866 6904411 6801735 6945087
5814 6945087 6811448 6628321 6597411 6684436 6903901 6896405 7024678 7237244 7360123 7383590
5804 7383590 7059386 7095844 6982838 6945269 6794653 6631874 6733765 6760484 6640893 6488724
5794 6488724 6510302 6695006 6889962 7094538 7164150 7424541 7787735 7828353 8253076 8594648
5784 8594648 8918204 8836937 8963828 9073636 9233352 9468232 9539085 9405455 9175267 9043783
5774 9043783 8821361 8624229 8565660 8336967 8250641 8390785 8532572 8763530 8975474 8911788
5764 8911788 8747553 8919934 9210374 9584508 9691037 9963683 10538425 11083521 11651215 12028156
5754 12028156 11943162 11749127 11542318 11454545 11493893 11576997 11602362 11611912 11863616 12205223 12494107
5743 12494107 13099168 13702131 13797119 13432216 12910137 12171115 11491480 11047932 10353539 10112943
5733 10112943 9933880 9840461 9802462 9791449 9898461 10234678 10640084 11028542 11539148 11773568
5723 11773568 12190459 12646633 13135560 13851933 14423080 15223323 16022452 16888646 17661597
5714 17661597 17398997 16092329 14434518 13136320 12193918 11300711 10745360 10284090 9956980
5705 9956980 9778272 9426625 9516768 9600695 9690617 9631049 9783734 10085657 10379803 10818790
5695 10818790 11352765 11768395 11983123 12192414 12226960 12216966 12305600 12096922 11808635 11283159
5685 11283159 10635846 10002160 9504985 9297390 8995391 8882719 8795078 8798235 8839681 8692160
5675 8692160 8705240 8552156 8306306 8189780 8449396 8488869 8487188 8564443 8765852 8582371
5665 8582371 8449625 8121944 7900078 7899861 7962302 7965630 7992781 8114019 8336625 8394328 8512427
5654 8512427 8559040 8553289 8675826 8808846 9068341 9286106 9290715 9226463 9375579 9619925 9691538
5643 9691538 9827900 10018124 10114233 10354067 10352940 10702624 10921368 11231849 11644583 11873992
5633 11873992 12221761 12451651 12478544 12949356 13382139 13704903 14193880 14706094 14972039 15381365
5623 15381365 15731376 16343829 16959677 17713750 18458014 18988089 19455374 20217568 21107628
5614 21107628 22078966 23422327 24518673 26290434 28350683 30633370 33452719 36350657
5606 36350657 40264443 45007118 50930243 58691882 67888156 77657820 85262084 87168959
5598 87168959 82449604 74013781 66471886 61070683 58198524 57461971 59047941 62600574
5590 62600574 67178040 71947092 74351284 72755032 69419125 67320142 67899950 71211485
5582 71211485 76764996 83260714 88770872 90390716 87066909 80747521 74433028 70309107
5574 70309107 69133827 69806802 70964736 70003879 65427793 60102331 55873530 53355531
5566 53355531 52441859 53348870 56041082 60292388 65875042 72262713 76177602 74370668
5558 74370668 67424533 58354094 49788274 43368539 38888121 35664408 32926465 30376367
5550 30376367 27981355 26022720 24285673 22416711 21038984 19680902 18561101 17819295
5542 17819295 17450532 16512506 15692531 15177574 14797080 14604758 14409814 14436978 14361392 14575963
5532 14575963 14941403 15360434 15955637 16989099 17639671 18290416 18551301 17994102 16757656
5523 16757656 15252088 13821465 12688264 11685266 10724371 10022959 9625728 9246670 8902997
5514 8902997 8627553 8504739 8206146 7927915 7861776 7918957 7692287 7524384 7585242 7626136
5504 7626136 7916618 8121646 8471999 8750074 8893880 9026366 8569739 7986766 7485092 7001335
5494 7001335 6228902 5995123 5640040 5236211 4995009 4656911 4443909 4208807 4232567 4135386
5484 4135386 3957980 3859812 3746627 3640776 3493885 3525965 3318591 3266267 3232930 3190656
5474 3190656 3266783 3266591 3338431 3259547 3140193 2975701 2810631 2663393 2836228 3076727 3014357
5463 3014357 2939461 2776479 2686122 2785968 2680038 2706151 2586410 2319496 2156738 2410501
5453 2410501 2256894 2188150 2232594 2235554 2302399 2240978 2189206 2312928 2381785 2337041 2239089
5442 2239089 2357467 2485092 2689490 2513272 2468296 2425027 2470780 2597174 2722657 2728985
5432 2728985 2817003 2545900 2617841 2593990 2298912 2568501 2672119 2492842 2427145 2472401
5422 2472401 2454559 2495406 2571576 2692247 2875909 2578299 2673987 3070261 3008015 3122305
5412 3122305 2969761 3040397 2919416 2854388 2966741 3171856 3189656 3251644 3222787 3276801 3456157
5401 3456157 3642137 3824434 3862877 3889456 3855950 4049699 4455838 4589848 4748813 4787415
5391 4787415 4912011 4772533 4699576 4713029 4452381 4404381 4596427 4945125 5094222 5123156
5381 5123156 5293829 5604024 5872861 5896421 5825098 5379693 4668779 4261437 4041340 3484956
5371 3484956 3300751 3095417 2868078 2871957 2606836 2268203 2315170 2222703 2335572 2284624
5361 2284624 2282000 2193912 2105255 1944830 1627889 1764480 1721760 1859997 1695203 1779354 1805088
5350 1805088 1605343 1758357 1741748 1607056 1549968 1432314 1256148 1115755 1314111 1351757
5340 1351757 1307517 1320539 1222770 1251096 1257713 1069125 1352686 1385383 1271118 1147383 1141379
5329 1141379 1245935 1176133 981168 881647 1010818 1024164 922189 809631 882069 920819
5319 920819 871001 893514 729494 765623 900865 1074478 950190 680669 679747 766667 712982
5308 712982 824176 822720 839943 861527 1102783 1296116 1086595 1085259 1092225 1049469 802229
5297 802229 901478 1009341 1074227 1003745 1025607 1204560 1082398 1009592 803467 807064 754303
5286 754303 845191 999184 1039919 853761 972350 980804 915477 832299 839581 853706 970735
5275 970735 1057435 993171 978493 882719 870117 730310 977246 1066732 884239 822990 946641
5264 946641 840723 1084763 1293632 1365610 1180789 1008130 928529 968917 942473 958599 823499
5253 823499 889578 953316 940604 745929 486451 486734 653196 684419 868285 911310 798906
5242 798906 834462 782048 951042 1003052 918641 997257 937295 840948 870181 949761 917860
5231 917860 760452 670069 743900 871342 875480 802297 906287 695923 600363 629509 642506
5220 642506 662787 649060 544878 706770 737548 517766 626421 757598 589025 434635
5210 434635 536205 498765 742647 758484 733896 693891 710402 853617 961316 869282 702507
5199 702507 931603 948707 477827 602836 760436 777189 559701 638852 867842 954239
5189 954239 801803 846498 745714 585247 549460 539846 534618 554932 639715 537113 547926
5178 547926 398836 644888 561436 654328 812763 771557 741737 684405 538387 653829 751888
5167 751888 730863 714437 594857 843236 705232 703121 554787 504898 522628 513014 689435
5156 689435 686449 841429 944762 815106 856707 595986 552609 755093 655463 800680 689889
5145 689889 556264 715586 907384 873656 716786 865027 898001 759172 886529 981396
5135 981396 769381 822759 787523 750916 1018161 1144803 1244541 921579 821971 920177 1034177
5124 1034177 933198 956373 1138676 1164134 1248239 1293369 1272475 1232151 1452554 1617041 2011328
5113 2011328 2149645 2084007 1836605 1671672 1298553 1131127 1090446 1117827 1261736 1219160
5103 1219160 1166883 1092122 1387894 1318825 1164115 1275967 1276547 1359260 1264448 1108369 1331267
5092 1331267 1217197 1126971 1297092 1257528 1510241 1532580 1543955 1323346 1386064 1603716
5082 1603716 1565192 1689020 1917236 1667995 1602887 1759794 1512274 1556587 1578911 1744664
5072 1744664 1706992 1909658 2102513 2200095 2242245 2289732 2394160 2914586 3377612 4255503
5062 4255503 4808296 4746165 4267806 3410944 2714529 2472660 2255037 2070535 2061436 2188396
5052 2188396 2178073 2081527 2003312 1951521 2024594 2018709 2036264 2142941 2170462 2188140 2456593
5041 2456593 2154116 2288352 2272659 2287982 2356965 2578645 2626813 2879211 3050792 3320078
5031 3320078 3739354 3909144 3957721 3541891 3063660 2855736 2517812 2404433 2390183 2383959
5021 2383959 2266964 2119151 2321302 2237434 2130683 2106549 2112383 2214951 2235645 1975012
5011 1975012 1808402 1866837 2161392 2025263 1737047 2012406 2213600 2125552 2062916 2006180
5001 2006180 2250238 2317834 2144377 2160158 2262604 2072944 2172221 2102047 2272691 2289409
4991 2289409 2343437 2296484 2409886 2372849 2312565 2174963 2189353 2387856 2452043 2407638 2338426
4980 2338426 2209588 2308790 2502742 2546734 2497904 2461321 2335233 2347149 2217896 2402959
4970 2402959 2626408 2461965 2490380 2389486 2553251 2694604 2682360 2420535 2298315 2461769
4960 2461769 2428648 2342536 2503610 2336817 2370752 2637269 2684300 2515346 2428764 2444244 2567128
4949 2567128 2605128 2616312 2608001 2717258 2695868 2743544 2786025 2852758 2687519 2824247 2687685
4938 2687685 2712604 2869504 2738009 2902456 2935186 2978578 3063693 3163614 3211174 3135832 3186818
4927 3186818 3273016 3523327 3508981 3331392 3425142 3504958 3298028 3411039 3346951 3405772 3612604
4916 3612604 3607209 3614269 3673496 3802023 3900830 3915722 3931305 3859229 4042101 4124412 4146736
4905 4146736 4148607 4115164 4267534 4183204 4132698 4202085 4245947 4137130 4045025 4146904 4240422
4894 4240422 4188105 3981308 4033902 4172618 4267433 4008311 3777004 3778051 3976292 4194683
4884 4194683 4186709 4367615 4458881 4790464 4618307 4456356 4677092 4754062 4665502 4638621 4637436
4873 4637436 4774914 4695041 4630953 4776559 4859455 4869893 4918067 4915148 4900092 4861882 4943221
4862 4943221 5196913 5374473 5357590 5396653 5460107 5499046 5443868 5481131 5519258 5755193 5942529
4851 5942529 6132258 6210449 6337479 6628067 6501340 6607332 6534983 6779734 7061660 6981559
4841 6981559 6787659 6981826 7203755 7345429 7501411 7551495 7730898 7908778 8116960 8271180
4831 8271180 8452914 8707308 8773910 9012182 9157568 9423664 9696852 9858851 10019940 10377844
4821 10377844 10821074 11039891 11289974 11575406 11667625 11964234 12578852 13006074 13383850 13736846
4811 13736846 14201897 14616374 14915934 15099338 15269740 15432515 15422447 15684615 15956203 16323380
4801 16323380 16666973 16811084 17445374 17841428 18340334 18727288 19350843 19671571 20280583
4792 20280583 20623514 21133252 21871767 22617467 23158572 23373038 23760171 24306132 24533131
4783 24533131 24779631 24971677 24915645 24836341 24546457 24339104 24217795 23890276 24185010 24270270
4773 24270270 24190236 24502376 25045578 25307382 25962012 26435752 27041817 28021352 29143762
4764 29143762 29926239 30667898 31881082 33348105 34732394 35967620 37251786 38236833 38969001
4755 38969001 39507484 39941335 40340790 41031039 41559395 41990873 42339640 42778267 43150499
4746 43150499 43424907 43779728 44178830 44773755 45534115 46413669 47668950 49005560 50662240
4737 50662240 52370964 54311928 55797132 57885069 60246571 62978716 65780782 68800667
4729 68800667 72791861 77868071 84326522 93149409 103449144 115556462 129954628 148217439
4721 148217439 172417867 205681902 251904929 317584050 398051395 447233697 416342831
4714 416342831 336021772 254799530 194620834 155563675 127957966 108701774 94492326
4707 94492326 84144785 75909885 69531335 63909315 59158492 54296599 50329485 46934743
4699 46934743 44040862 41575533 39492456 37183100 35010037 33154930 31636011 30205719
4691 30205719 28868613 27570171 26391994 24930829 23608649 22111524 20891824 19991175
4683 19991175 19285399 18796139 18125419 17560839 17022369 16309766 15969748 15292948 14618973
4674 14618973 14171919 13930598 13328700 13035138 12859294 12502078 12158595 11963319 11859066
4665 11859066 11641971 11465452 11419738 11255571 10961254 10815303 10843217 10713478 10400402 10262734
4655 10262734 10262218 10171059 10114687 9913248 10090919 9939677 9940801 9976995 9915989 9966194 9912493
4644 9912493 9877337 10010393 10031736 9868996 10015084 9967165 9695963 9470753 9407548 9399699 9451917
4633 9451917 9255665 9230238 9113608 9371606 9547279 9884459 10099332 10240373 10530251 10463210
4623 10463210 10498570 10540643 10814881 10951069 11217791 11416600 11308503 10964072 10772417 10736568
4613 10736568 10895096 10756268 10564170 10430262 10119589 9764886 9050315 8300930 7958284
4604 7958284 7764602 7594282 7451188 7290555 7219040 7312629 7261656 7268671 7262454 6915004 7042543
4593 7042543 7165443 7017540 7025174 6791078 6423106 6018953 5898022 5879549 5774715 5861663
4583 5861663 5476221 5127871 4947077 4746824 4505108 4220194 4183960 4191530 4048917 3907593
4573 3907593 3860370 3666600 3476584 3597723 3425158 3220586 3089054 2960717 3061347 3056967
4563 3056967 3009463 2970835 2828710 2849388 2909809 2900593 2787694 2921475 2692687 2688954 2482015
4552 2482015 2532794 2608914 2561370 2558155 2527099 2474234 2499676 2513871 2515814 2754388 2623348
4541 2623348 2433398 2225782 1878813 1953086 2169923 2118822 2065565 2150219 2167671 2314094
4531 2314094 2194418 1972390 1907558 1845929 2014922 1998000 1926712 2245214 2094373 1887856
4521 1887856 2039085 2026473 1824084 1900920 1907620 1772858 1813417 1658257 1913187 1814351 1685309
4510 1685309 1729348 1702124 1642677 1636817 1554356 1758918 1788703 1825086 1741947 1754450 2021267
4499 2021267 2128774 1960193 2084525 2019071 1978571 1768879 1558745 1559104 1681871 1972091
4489 1972091 2035913 1833691 1857952 2021654 2011852 1959574 1823368 1879269 1885727 1998432 1715401
4478 1715401 1574743 1592106 1658500 1781495 1812498 1696592 1668092 1671109 1560803 1446830 1584523
4467 1584523 1854109 1905179 1926183 1802994 1985066 1964753 1839743 1874506 1842079 2074685
4457 2074685 2104005 2092473 1905527 1690083 1871086 2123299 2041582 2067057 1931418 1916708
4447 1916708 2096238 1937437 1982840 2132058 2241435 2184097 2152108 2144725 2090023 2057472 2103143
4436 2103143 1962400 1781213 1922249 2002420 2152109 2183745 2338295 2266035 2182069 2185436 2141041
4425 2141041 2373027 2253098 2421515 2561940 2442526 2500048 2565601 2568242 2767172 2651814
4415 2651814 2717628 2778413 2839840 2945093 3141938 3732361 4000599 4195772 4373054 4434134
4405 4434134 3995209 3844854 3697104 3862575 4007574 4505719 4691849 4461852 4322053 3942002
4395 3942002 3464448 3278080 2856644 2704678 2787300 2735478 2889271 2794788 2657568 2528420
4385 2528420 2634783 2639870 2535361 2503687 2259566 2032529 2321314 2251760 2284532 2419908
4375 2419908 2478236 2500811 2495164 2413672 2200275 2212222 2261288 2150335 2239360 2317159 2471992
4364 2471992 2494668 2319859 2396019 2482878 2378566 2547076 2418909 2480922 2669717 2640336
4354 2640336 2652753 2700428 2535056 2525973 2586998 2619906 2637940 2775093 2764720 2644632 2381384
4343 2381384 2311616 2322558 2370386 2536245 2597597 2734987 2548653 2665442 2968597 2682281
4333 2682281 2775373 2565348 2487653 2543307 2538564 2607854 2508983 2498822 2590904 2771051 2695710
4322 2695710 2733438 2714540 2699048 2600582 2759162 2774073 2803905 2714897 2695927 2676369 2789180
4311 2789180 2724789 2516543 2279079 2559506 3005825 2952922 2872616 2823206 2850726 2978556
4301 2978556 2702816 2563971 2685966 2819524 2920182 2815414 2795781 2755847 2828959 3006422
4291 3006422 3022478 2871577 2781158 2849193 2881301 2959836 3058350 2991188 3033090 3230374 3266032
4280 3266032 3035447 2989457 3090460 3007497 3082674 3227067 3172379 3261503 3350271 3349218 3698752
4269 3698752 3597230 3601791 3764621 3591231 3720472 3796172 3697382 3891669 3916542 3813589
4259 3813589 3732239 3787406 3714652 3873257 3964985 3917330 4032370 4103653 3924070 3902185 3962522
4248 3962522 3964313 3978887 3959593 4072096 4194244 4232947 4361252 4351747 4265672 4276249 4304092
4237 4304092 4509772 4682250 4797413 4896125 4921603 4902232 5002015 5122238 5251568 5151774
4227 5151774 5181918 4992622 5013519 4991245 5085431 5206244 5204288 5265140 5062016 5007473 5136600
4216 5136600 5001546 4908008 4933609 5103028 5179431 5084974 5246725 5252894 5254226 5458923 5540083
4205 5540083 5448210 5661025 5579583 5427559 5410787 5391363 5544639 5529420 5731919 5857827
4195 5857827 5870962 5823280 5904181 5945605 6013003 6135599 6189156 6081624 6172530 6405727 6579031
4184 6579031 6528585 6595222 6641197 6705138 6779488 6723874 6772080 6741669 6595423 6604622 6600602 6654014
4172 6654014 6896416 7037854 6944767 6923706 7004697 6942401 6845494 6888366 6953291 6777254 6617026
4161 6617026 6573848 6615490 6698548 6648748 6559196 6639976 6828537 6798929 6867640 7033119 6987038
4150 6987038 7081511 7071647 7040457 7089433 7129985 7122782 7356734 7405512 7493925 7754804 7778895
4139 7778895 7921275 8003859 7997463 8246019 8345529 8315295 8484917 8453401 8403489 8484435 8563653
4128 8563653 8420844 8459035 8731101 8784761 8729254 8656004 8861008 8921137 9035956 9134758 9184312
4117 9184312 9215822 9570986 9818868 9960542 10256052 10290195 10302815 10082079 9856542 9886177
4107 9886177 10148578 10181345 10480372 10453139 10553703 10802924 10648091 10847675 11073311 11154750
4097 11154750 11374940 11664079 11787297 11942326 12152477 12341765 12600493 12863139 13185526
4088 13185526 13421668 13799776 14235164 14363614 14532892 14661494 14994673 14998474 15094140 15074188
4078 15074188 15388462 15809450 16112591 16457198 16756833 17244576 17503102 18104993 18797503
4069 18797503 19140900 19900383 21005680 21926447 22713133 23285456 23531002 23548116 23435118
4060 23435118 23356631 23374145 23328882 23433143 23537392 23753305 24092865 24543809 24768374 24690134
4050 24690134 24742002 25047065 25490247 25665111 25426230 25113924 25146056 25043160 24933447 24829004
4040 24829004 24889445 25044523 25223615 25692353 26151763 26309486 26251518 26436805 26366356 25197243
4030 25197243 24296024 23513713 23122365 22809784 22474798 22216419 22151206 22091430 21814431 21779399
4020 21779399 21552237 21716107 21444951 21523973 21667470 21305821 21053578 20822084 20536906 20326461
4010 20326461 20061141 20192119 20462167 20747497 21232921 21865167 22243025 22684856 22770150 22620740
4000 22620740 22592274 22330697 22225589 21701006 21115422 21005861 20932215 20930788 20879340 20685328
3990 20685328 20752343 20637987 20565241 20559823 20403613 20189961 20070566 19875003 19731370 19612535
3980 19612535 19431938 19311556 19111015 19243197 19112544 19073041 18889090 18614948 18333556 17895889
3970 17895889 17302915 16679894 16376579 16038865 15772138 15515325 15173975 15043349 14730296
3961 14730296 14557096 14643073 14469811 14115098 13966637 14234270 14010716 13852510 13723479 13790457
3951 13790457 14017366 14045750 13991692 13846498 13671059 13416252 13117649 12904337 12796193 12837299
3941 12837299 12694631 12513725 12490565 12407583 12537689 12545470 12779338 12877885 12593930 12550600
3931 12550600 12589967 12389169 12279937 12164620 12521138 12567708 12603032 12550128 12592359 12569426
3921 12569426 12586540 12612896 12302642 12242172 12045965 11864703 11830980 11959038 11701324 11534357
3911 11534357 11522225 11686187 11589868 11509561 11318197 11058684 11190270 11142043 11061984 10921146
3901 10921146 10798834 10773652 10968412 10959062 10693481 10554414 10674410 10586976 10655570 10804892
3891 10804892 10771916 10838676 10817114 11088412 11128657 11111515 11072166 11143589 11010410 10961561 11052033
3880 11052033 11263923 11164659 10990014 10866733 10672760 10463175 10485458 10538064 10572488 10559530
3870 10559530 10425955 10369804 10329463 10461426 10509173 10576992 10535958 10555571 10388115 10479532 10435276
3859 10435276 10245014 10227223 10444781 10393597 10203769 10208962 10124321 10202600 10108665 10150754 10211497
3848 10211497 10129848 10047854 9847238 9892770 9823146 9689779 9810485 9869866 9839974 9919214 9917922
3837 9917922 9760243 9716378 9641782 9512322 9502608 9630059 9742186 9913265 9984619 9903221 9845762
3826 9845762 9984108 9843038 9782627 9804850 10115159 10186728 10148294 9959792 9948366 10073469
3816 10073469 10267740 10504228 10478599 10679243 10732982 10641903 10701263 10850391 10796707 11144538
3806 11144538 11353840 11408927 11423749 11819332 11991399 12013122 12298218 12604279 12781747 13152074
3796 13152074 13518441 13805015 14100270 14585938 15292422 15800106 16471962 17528146 18798025
3787 18798025 19539778 20601653 21663012 22521506 23355462 23730142 23436416 22772926 21833858
3778 21833858 20739274 19567310 18520617 17555079 16678156 16118088 15773343 15187324 14732106
3769 14732106 14389232 14110494 13860670 13547947 13292979 13099051 13067985 12786994 12598999 12497350
3759 12497350 12411327 12397006 12348879 12008566 12172511 12233121 12213046 12101111 11856114 11776928
3749 11776928 11661085 11826984 11897661 11892057 11856939 11884878 12005485 11985765 11948803 11986810 11865096
3738 11865096 11738147 11861516 11995774 12064030 11929999 11964365 12021200 12035698 12002177 11946895
3728 11946895 11721943 11885632 12126726 12075914 11869379 11811102 11826569 11981696 11994535 12159030
3718 12159030 12258387 12198410 12123167 12327318 12314212 12279302 12530553 12531756 12509649 12411808 12497252
3707 12497252 12609855 12666188 12596418 12634810 12431074 12458944 12610011 12634992 12636763 12518182 12658039
3696 12658039 12716099 12809501 12992873 13023663 13080725 13166689 13404096 13440073 13392043 13292483 13580214
3685 13580214 13645134 13828139 14213923 14586351 14709802 14823555 15058854 15073661 15031210 14920146
3675 14920146 14989730 15012739 14967173 14944231 15000305 14937262 14854862 14985290 15071364 15331543 15691036
3664 15691036 15872610 15860424 15827413 15754057 15835098 15898874 16065863 16165592 16148409 16327197 16553461
3653 16553461 16837238 16951601 17130798 17549230 17736751 18179362 18829578 19074321 19160691 18975763
3643 18975763 18858644 18836222 18697148 18725708 18633939 18629598 18726881 18673751 18913753 19281230 19793042
3632 19793042 20059478 20259866 20216363 20019149 20152988 20303151 20341668 20243812 20416526 20664844
3622 20664844 20709572 20831570 20997694 21323077 21571678 21881478 22253221 22810564 23161784 23297134
3612 23297134 23412433 23431536 23564557 23663855 24088984 24217126 24484994 24688321 25036300 25479642
3602 25479642 25777378 26212883 26535479 26670179 26801269 27168702 27353611 27688332 28174666
3593 28174666 28381288 28685317 29038396 29357213 29694138 30294834 30712628 31143764 31369062
3584 31369062 31630348 32269008 32659801 33193954 33568729 34224257 34775759 35196617 35567558
3575 35567558 36137651 36775829 37238398 37800248 37976609 38579908 39215178 39763008 40512856
3566 40512856 41117954 41503131 42197011 42873272 43380970 44284305 45219608 46077964 46949259
3557 46949259 47453883 48609270 49571341 50452925 51411328 52531560 53692982 54539163 55601113
3548 55601113 56620834 57838277 59032456 60337485 61374886 62485271 63561469 64748914
3540 64748914 65969897 67316488 68653227 70331557 71669820 72981412 74487706 75911266
3532 75911266 77594159 79263278 80753316 82604675 84365545 86210421 88131655 89948084
3524 89948084 92125971 94386502 96672840 99355594 102418110 105969950 109597449 113562602
3516 113562602 117865666 122853937 128337426 134446019 140880495 148090197 156117524 164743443
3508 164743443 174102835 184021884 194379826 205225418 216302087 226720001 236287971
3501 236287971 243952984 248888837 250194312 247144212 239771010 229137253 216732886 204177402
3493 204177402 192221436 181346616 172071720 163788888 156350754 150001984 144149363 139020840
3485 139020840 134474206 130242521 126389528 122985956 119908625 117145383 114440359 112102850
3477 112102850 109713801 107652278 105867439 104071128 102046119 100157948 98392614 96975489
3469 96975489 95288815 93432356 91875390 89912836 88141997 86589890 84618535 82593765
3461 82593765 80722818 78700119 76480981 74687933 72756437 70808883 69180352 67529398
3453 67529398 65975168 64395389 63034787 61590699 60487869 59478371 58387376 57370077
3445 57370077 56233373 55124563 54161873 53319657 52285277 51140511 50282739 49301251 48235398
3436 48235398 47310723 46594721 45976055 45065239 44268457 43652269 43043988 42318059 41822654
3427 41822654 41400151 40829622 40235725 39852420 39208475 38856330 38312188 37706315 37322398
3418 37322398 36927111 36552992 36053099 35749914 35196409 34859749 34674152 34289487 33853706
3409 33853706 33744378 33311349 32681827 32325015 32086984 31865577 31678432 31242878 30819032
3400 30819032 30547569 30222515 29998835 29708501 29497328 29368402 28947097 28711578 28404355
3391 28404355 28235850 27856486 27890827 27780620 27457009 27317580 26854666 26658067 26436743 26330374
3381 26330374 26179623 25925547 25766987 25567476 25343260 25214405 24995832 25038673 24825807 24729548
3371 24729548 24542670 24299572 24288638 23972062 23781485 23816762 23616745 23413464 23572809 23333872
3361 23333872 23201478 23237745 23011891 22921573 22778407 22771963 22660326 22690049 22848268 22709324
3351 22709324 22566111 22396344 22148650 21984634 22002652 21793930 21802371 21740701 21538620 21442909
3341 21442909 21469122 21446234 21348515 21384886 21301699 21184116 20837854 20873188 20755380 20525851
3331 20525851 20425204 20267086 20313891 20196048 20160745 20052196 19899456 19755696 19437835 19239436
3321 19239436 19118670 19006527 18894777 18798948 18641902 18351697 18184680 18128712 18105348 18072183
3311 18072183 18100823 18032948 18095214 18033930 18138024 18078842 18062269 17949998 17697145 17519616
3301 17519616 17259850 17163416 17057196 16740280 16462165 16488210 16258022 16215670 16056712 15969562
3291 15969562 15946600 15829230 15695263 15579070 15478493 15618982 15394734 15073716 14827311 14980847
3281 14980847 15080986 14982553 15052830 15083260 15306892 15259631 15396636 15281584 15215544 15208982 15175206
3270 15175206 15344833 15509818 15422950 15431612 15275428 15415091 15666546 15864790 16014924 15910274
3260 15910274 15891027 16008880 16191044 16199929 16294728 16463687 16338997 16215109 16247757 16436209
3250 16436209 16506838 16546486 16642414 16736265 16697820 16796188 16932935 17109472 17370496 17561551
3240 17561551 17714597 18050579 18479909 18656460 18852400 19201365 19338215 19528763 19890558
3231 19890558 20205410 20743172 21111101 21209854 21577979 21866914 21985725 21979023 21890500 22142597
3221 22142597 21993092 22186149 22232559 22360066 22707265 22949179 23144333 23259235 23602032 23934748
3211 23934748 24472812 24990269 25421265 25890760 26338957 27112096 27816617 28614935 29154503
3202 29154503 29951194 30881737 31741278 32500111 33314271 34489975 35387869 36547004 37902156
3193 37902156 38798124 40041919 40923996 41736898 42862413 43824431 44495483 44965488 45638899
3184 45638899 46075963 46355241 46582792 46886584 47368011 47768629 48546691 49100946 49748742
3175 49748742 50376133 51489635 52616581 54081549 55742076 57642591 59781555 62047056
3167 62047056 64566627 67265385 69930050 72820436 76169728 79203569 82080887 84234656
3159 84234656 85559241 85642157 84516921 82099928 79059289 75769415 72770455 70274484
3151 70274484 68560348 67308731 66736579 66524621 66854407 67444495 68336892 69238045 70721397
3142 70721397 72526652 74769251 76811604 78753418 80632682 82666976 84596476 86589768
3134 86589768 88051739 89143881 89735038 89248297 88010739 86017872 83519011 81158080
3126 81158080 78139783 74424943 71282934 68291850 65589409 63599561 61996388 60988781
3118 60988781 60177384 59568768 59411506 59505740 59813612 60023028 60490179 60566357 60611435 60433290
3108 60433290 59817755 58971929 57962436 56862307 55168908 53070012 50722219 48389387
3100 48389387 45848976 43008917 40972460 39115060 37355713 35745724 34432048 33184252
3092 33184252 31874181 30703858 29782355 28838637 27917257 26953659 26484469 26051943 25390515
3083 25390515 24913416 24204709 23962917 23618532 23114065 22453220 21604626 21009129 20347706
3074 20347706 19813404 19001709 18514410 17982599 17522853 17096834 16585383 15978172 15522340
3065 15522340 15370828 14977327 14402298 14195291 13718483 13337900 12961970 12625001 12562640 12285068
3055 12285068 12003134 11888512 11555696 11322233 11179071 11154334 11014495 10692373 10510783 10710719
3045 10710719 10476371 10242814 10079094 10106724 10003091 9690407 9309894 9105968 9008864 8859598
3035 8859598 8861489 8707716 8887649 8503957 8126106 7829325 7639228 7481850 7109869 6966781
3025 6966781 6919935 6891285 6809200 6739383 6667462 6539921 6755898 6495228 6396672 6418782 6429492
3014 6429492 6245514 6184821 6182232 5916116 5815148 5789931 5611268 5633492 5438909 5156081
3004 5156081 5178318 4937410 4724274 4796150 4771356 4867837 4670957 4553301 4383684 4424933
2994 4424933 4505945 4291785 4022965 3859430 3732154 3633454 3585722 3646349 3794207 3809975
2984 3809975 3732859 3721495 3623302 3531284 3452305 3423456 3405166 3352409 3338891 3327659 3258245
2973 3258245 3134718 3203669 3220239 3169170 3020406 2939939 3225641 3204325 3163657 2781556 2683997
2962 2683997 2774315 2707899 2830258 2768497 2907773 2819199 2841083 2744441 2694587 2642786 2559342
2951 2559342 2694998 2709831 2675615 2547784 2351270 2332246 2434521 2408542 2575486 2463248
2941 2463248 2429260 2316413 2356513 2395566 2454115 2476672 2320719 2400364 2346014 2132353 2007542
2930 2007542 2024899 2058343 2136614 2324178 2391957 2357786 2331808 1961299 2056930 1952518 1961122
2919 1961122 1871100 1812723 1915376 2176148 2068447 2152683 1927106 1968642 1874494 1881602 1703080
2908 1703080 1862876 1924720 1825432 1998184 1874277 1852157 1896323 1771343 1613928 1634505
2898 1634505 1679425 1760426 1556335 1645853 2171446 2038301 1712649 1560809 1593792 1699840
2888 1699840 1735700 1672999 1689543 1793992 1648242 1497898 1556915 1843725 1726613 1871101
2878 1871101 1869916 1866667 1834135 1619532 1455402 1525196 1857516 1777946 1634658 1708854 1505804
2867 1505804 1564629 1527251 1475771 1389164 1523907 1719927 1811940 1711458 1580184 1657054 1649571
2856 1649571 1651509 1542411 1498514 1743811 1536717 1579568 1627221 1480293 1506423 1528767 1469861
2845 1469861 1667159 1649391 1412507 1362545 1397045 1519496 1525791 1551691 1611721 1514203 1448821
2834 1448821 1347938 1309823 1318276 1403939 1296271 1197739 1361192 1379991 1241032 1106464 1151201
2823 1151201 1197190 1159466 1237565 1233728 1159184 1130114 1131542 1252085 1223066 1408620 1418863
2812 1418863 1330494 1257326 1184049 1073354 1021930 945033 826042 1011379 1078390 1002552 987406
2801 987406 914312 1072539 1070348 941038 952102 830202 840854 818235 941480 895518 696078
2790 696078 740043 1058331 1100187 962242 883938 952242 939653 1116055 963962 925641 831957
2779 831957 667202 812450 810842 720636 728538 751005 890542 916345 727403 726776 721019 707729
2767 707729 755360 642814 660809 648884 770761 798488 608009 647865 571981 691537 829047
2756 829047 877537 920883 794785 443376 546189 621086 847612 860675 602669 602667 572928
2745 572928 571633 571206 589228 626527 451091 578737 828110 900725 719360 562610 385292
2734 385292 528129 509566 485099 574685 390667 476365 710794 742526 725109 545210 381514
2723 381514 534908 631773 556147 615683 543253 497878 393028 353697 414688 432789 598946
2712 598946 713441 631078 397534 356384 558928 621583 431531 433820 540852 624514 452681
2701 452681 342047 613992 508117 548707 541550 431036 400254 478069 474871 582073 467065
2690 467065 258854 279058 553616 491315 278480 313511 350093 204920 219436 181469 433002
2679 433002 455154 234439 194798 389647 378086 431449 543802 606845 550436 390692 451107
2668 451107 387503 405483 350777 172303 206985 308160 154222 288868 216405 390590 418065
2657 418065 344289 312456 416590 501769 683800 399811 208339 130246 161682 270659 330075
2646 330075 250383 270318 295213 297523 419674 595188 359765 382346 324719 466964 501796
2635 501796 368867 506944 436875 705997 764162 656797 961115 980008 940117 1085788
2625 1085788 1014786 856299 900865 541954 264306 265138 301032 321967 564939 380377 355895
2614 355895 373720 282340 318943 429151 615992 548601 332898 350680 433869 247569 155020
2603 155020 392920 325255 108122 302603 409819 505232 423213 411153 354842 562085 686790
2592 686790 693589 575723 455463 248842 171814 129076 80284 202435 368083 418695 437126
2581 437126 528253 525798 479212 323042 218979 216912 68690 305063 346839 423054 424527
2570 424527 369732 403726 289228 177334 267787 412022 527087 449965 408079 525034 419006
2559 419006 388330 498376 578824 541566 445322 342063 428968 493939 509584 322373 208861
2548 208861 465941 495735 502980 496023 188720 216780 499713 752364 601052 497212 543838
2537 543838 463865 411441 445279 646960 627238 466692 656197 596143 487701 591230 295869
2526 295869 418853 420329 735808 759515 618801 465043 429971 558444 491895 480984 577406
2515 577406 540049 415303 559885 519554 605972 710672 602549 813396 957008 697313
2505 697313 656599 807909 746485 667125 578660 775285 800307 862104 780894 745105 1007245
2494 1007245 826492 745403 697589 843797 1046502 879829 986639 984085 1118515 1255854
2484 1255854 1121229 901065 951403 900480 971147 994191 982196 990176 980821 907182 852572
2473 852572 1149216 1191585 1298102 1350604 1334209 1367907 1234031 1096598 1142491 1078669 1322130
2462 1322130 1320148 1204813 1294734 1615001 1461944 1431126 1868736 1794180 1760266 2208247 2199876
2451 2199876 1919280 1983330 2041248 2128122 2086996 2439543 2503601 2429321 2676957 2656928 2667126
2440 2667126 2789119 2833313 2802094 2794611 2893993 2953330 2935030 2935802 2896700 3007330 3041733 3120472
2428 3120472 3240474 3293598 3265747 3451423 3244678 3219875 3282315 3681346 3674331 3865628 3642923
2417 3642923 3927707 4081438 4124856 4307576 4444316 4808814 4977442 5312464 5392160 5666884
2407 5666884 5735089 5804639 6031943 6264096 6599601 7091030 7339481 7559130 7730215 7977018
2397 7977018 8452898 8784281 9056163 9277542 9618759 9785704 10259798 10551326 10655269 11021533
2387 11021533 11482324 11935370 12462221 13103239 13914431 14484461 14966321 15753317 16740969
2378 16740969 17805796 19241392 21020380 22305043 23135758 24236394 25702420 27956443
2370 27956443 31272417 35407320 39849138 45805758 53811729 64261691 78106776 97558485
2362 97558485 124454219 154533170 167592715 150504347 118568552 88449686 68926922
2355 68926922 55751186 46077382 38763770 33490346 29807839 27201727 25155051 23502121
2347 23502121 22322612 21665322 20514287 18872769 17026216 15274637 14117291 13214585
2339 13214585 12067050 11524556 11060636 10394323 9964382 9314713 8909689 8430173 7992843
2330 7992843 7413674 6766024 6470172 6266809 5914162 5786870 5595773 5393636 5158945 4798388
2320 4798388 4423562 4120513 4170649 4181514 4019054 4011624 3655430 3476460 3247442 3293747
2310 3293747 3356423 3201342 3154725 3051596 3080811 3119220 2985850 2968380 3012940 2962645 2556774
2299 2556774 2467374 2151527 2230013 2151993 1902805 1998373 1903742 1790603 1553130 1598205 1679557
2288 1679557 1510276 1725799 1747667 1593262 1357457 1328163 1378554 1222458 1208277 1298946
2278 1298946 1320163 1325128 1145716 1161743 1061733 1007405 956276 984166 1204279 1270021 1029502
2267 1029502 1025271 979528 877427 772940 876156 867241 739620 915642 876219 789135 900348
2256 900348 929349 753997 772489 757841 829709 839514 706897 736388 856573 821923 765672
2245 765672 883104 799577 599530 644921 410531 570680 526739 540295 701486 408995
2235 408995 395498 230299 253415 557195 494264 669459 658411 638302 768826 773540 602748
2224 602748 609770 554453 464990 355921 508654 463611 478106 376161 182721 204388 170176
2213 170176 401630 642050 475523 325794 272758 395156 260126 309541 367877 419878
2203 419878 426649 313013 623310 690225 521707 305454 257462 326345 520278 452420 346306
2192 346306 311569 472033 284215 293931 320009 271060 346543 294329 431214 458690 469952
2181 469952 321983 241558 261247 115711 15436 212656 354382 269062 340050 250769 404046
2170 404046 192430 481874 546086 602414 535886 324895 136113 27500 20008 149251 233187
2159 233187 314063 299788 443285 179771 -29962 15351 -3003 11286 82758 376401 266217
2148 266217 289654 272515 313351 88062 88701 127902 37527 137528 224998 248549 33807
2137 33807 -71831 -151996 40954 -93665 -59350 14712 68461 366442 65130 100823 40964
2126 40964 193133 -22392 121932 163896 172435 141775 141314 235354 321346 214184 186443 123943
2114 123943 -26568 1004 -36628 21088 4413 108909 273464 44373 40577 203172 311093
2103 311093 291232 246296 229012 183566 261361 438802 396668 458381 361400 232024 512679
2092 512679 726974 807722 876885 817803 699563 695561 410925 218570 317817 204813 185454
2081 185454 123315 -78817 247970 244835 68145 34570 45529 15625 35327 203750 242407
2070 242407 335345 254485 94672 38953 179271 157675 217787 351485 373507 391758 180673
2059 180673 101107 -106501 -254481 -262967 -104148 63172 63747 166223 304376 215815 -50535
2048 -50535 -128091 5038 159160 159066 45052 157227 176864 99739 281234 83486 -100312
2037 -100312 -19289 91625 171121 -10518 14950 74287 -11301 -151469 -146156 -64780 159850
2026 159850 -36087 -175474 -77232 -101463 15216 -53241 -122291 -138733 -39737 -97445 -108863
2015 -108863 34037 -43135 -88420 -34896 24014 -12112 -694 131901 112897 60466 -111337
2004 -111337 52066 144438 144793 112297 -134882 -94566 -7967 298879 172073 176614 81472
1993 81472 -184576 -84827 98684 -13313 12267 -54460 -6288 51572 -7055 -46362 -168763
1982 -168763 -103292 -54205 -249687 -225841 -225062 -91109 -266090 -188049 -150286 -106257 -151713
1971 -151713 -57630 -46920 -232933 -135177 2979 27673 -131308 -44589 -35250 149345 261072
1960 261072 153427 -16313 -33885 77954 70593 11407 23962 138723 97357 31617 44394
1949 44394 80964 36755 33995 239363 94449 48779 -4082 -87518 14777 63263 -41168
1938 -41168 76692 53925 120026 -31348 61566 166789 279307 171847 -97024 -107283 -82488
1927 -82488 -73945 -123237 -56001 122980 -89820 -123905 32498 -68624 -48973 -19019 103663
1916 103663 185642 -226909 -252935 -155932 -68639 -109075 -106801 77756 137489 -63692 -107425
1905 -107425 -89880 46151 67357 -177371 -75910 15837 22398 73862 54124 -56376 76340
1894 76340 32626 1483 3640 253 -161457 4163 97647 -11283 -68134 -173930 -80879
1883 -80879 -195892 -228810 -213364 -68440 -87630 -176515 -335138 -205650 -215742 7218 132678
1872 132678 171063 101345 -43445 86076 155967 66222 99237 191688 71090 -6903 101207
1861 101207 77191 -95605 -176818 -142132 -189974 -244307 -119483 86668 158475 65722 128776
1850 128776 -74308 -88240 -97038 261102 223413 96873 32313 4662 -121117 -136990 -44985
1839 -44985 -118817 -272246 -135762 -48762 -82596 -118240 124089 162675 4947 -69440 -58724
1828 -58724 174453 190017 151484 3200 -13154 37614 39895 132621 137141 181574 151794 -119260
1816 -119260 1199 62368 16338 6061 -159909 -149218 -207516 -206310 -225560 14929 33662
1805 33662 -128692 -13039 122341 -206337 -145653 -81761 -74210 -116954 -46957 57849 -88143
1794 -88143 -9637 118789 220091 320621 191292 -37994 114443 149235 124070 96559 -141289
1783 -141289 58068 116390 117445 247284 100778 79612 164305 5423 -78355 46360 4432
1772 4432 -144536 -107519 -61285 -103490 -41656 -93463 -57125 -83617 -29371 -178164 -139808 15014
1760 15014 146889 -83884 -57601 -167929 -270136 -224984 -92932 -84985 -39989 -254441 -219145
1749 -219145 -134744 -59503 63268 -46670 54303 231971 52931 -80697 7717 125080
1739 125080 70069 106260 204388 -66132 38324 -80874 -99765 14469 22905 66866 -51290
1728 -51290 -112099 -86882 -248209 -348974 -253493 -42722 -169777 53608 21016 -6651 39398
1717 39398 59263 68384 84709 162940 113911 142231 94824 151847 62802 176702 113066 -1735
1705 -1735 14582 58564 26537 121622 199728 78733 -8719 77063 -113147 -129292 -15043
1694 -15043 98066 46894 134685 277996 216010 74157 -53744 73751 344251 82091
1684 82091 -155666 32700 21401 -142882 -203009 99372 185596 170690 37553 -123717 -122976
1673 -122976 -84889 -153307 -110545 92081 53856 -22998 20538 -72683 34736 5159 -176920
1662 -176920 -130318 -176197 -176131 -18043 202737 192179 82739 117186 76012 345491 278183
1651 278183 227613 22132 -288823 -22178 189913 150796 28648 67882 -42235 -69386
1641 -69386 -107699 -48609 -98540 -175623 -123771 -80032 -49841 -338815 -321024 -142815 -20624
1630 -20624 83762 135028 204647 268918 65666 -49520 -102956 -181900 -183144 -208549 -321668
1619 -321668 -138309 -173125 -217021 26334 225645 225821 90134 -198559 -314303 -160266 193393
1608 193393 67632 57410 -9806 118130 68480 -166874 105479 45956 22031 195385 228361
1597 228361 103183 -36913 141751 123601 147044 236553 27518 98681 128315 137079 48461
1586 48461 50638 -77101 66796 -49989 12157 23157 27012 -3878 13295 -16372 -42127 -89236
1574 -89236 -54815 -7423 80401 41353 69144 121409 -38698 58303 176295 65512 65098 28159
1562 28159 -65887 24114 -26258 -94415 -181667 42734 35093 82298 -43213 -101588 -117208 -37646
1550 -37646 -72918 -190403 43279 228083 102224 -68817 15842 169575 57762 -2523
1540 -2523 202301 276917 98371 6730 323847 205686 86569 91026 54459 -42541 -267390
1529 -267390 -303998 2813 59801 178623 48962 -46415 -136479 -150311 -29317 7995 -95966
1518 -95966 -171078 62255 178909 2031 -301336 -80779 -74352 -140925 33808 30028 -119055
1507 -119055 8921 129455 144624 150248 145496 -85249 -10408 27113 219591 239978 -195963
1496 -195963 -296428 -60304 -76282 43527 341419 127054 -125715 -94830 -180850 -207574
1486 -207574 -124612 57659 263971 82071 -71297 5482 127952 84842 137694 -88899
1476 -88899 -41039 97259 105290 34389 -107241 8513 -85907 24943 -55756 -227288 -97900
1465 -97900 -133718 -54216 -203843 5647 11526 -112625 -129623 -158677 -94938 27913 70611
1454 70611 -120656 -48305 54691 2167 -22562 -25700 -204335 -233765 -95402 -369079 -166405
1443 -166405 -204955 -475744 -344031 -201013 -147056 -189717 -116760 57430 159213 162790 356971
1432 356971 74253 -212030 -386979 -309499 -76547 29877 28563 -110488 -290155 32451
1422 32451 93273 55934 -16722 -20672 -40948 -96207 -117776 -1087 -59375 -153267 -100656 -72647
1410 -72647 -130206 -144051 -140164 -75495 125395 -105211 -129491 54058 8628 -56949 22176
1399 22176 -47319 -145350 -161879 -64033 -94510 50163 -94697 -155531 -186762 -267425 -46592
1388 -46592 -44980 62291 125708 80964 -44433 -109845 -47868 -94990 -52294 -11513 132619
1377 132619 282576 192282 201389 183765 178416 119923 -93954 -60922 -155352 -280913 7233
1366 7233 -38408 16495 170167 163734 198495 213163 202478 25186 103819 137474 -33588 -27537
1354 -27537 37720 11924 -159668 -119728 -96448 -87401 -118457 -224486 -124034 -261798 -204652
1343 -204652 -1389 24881 -11192 -9159 -10900 -52204 -84990 113131 21952 -144225 -123396
1332 -123396 -123734 -44314 -31502 195449 258257 214127 151600 -49366 -53532 -10066 -122604 54871
1320 54871 121361 49380 -60012 -3222 245525 114765 18224 -78370 18027 -9870 -174975
1309 -174975 -161260 -271711 -159297 23848 148423 -62051 -215677 -50344 -44220 19463
1299 19463 90567 52945 -41376 84687 -255146 49018 130548 -88128 -98533 30805 41197
1288 41197 149798 142808 36429 101561 90190 -68352 -72311 259967 99568 -49832 102060
1277 102060 138260 164500 239255 -10979 88783 147231 62182 -24679 -65305 -90119 -113616
1266 -113616 -63425 -53393 6761 50307 10303 111666 67670 -70486 -90980 -354771 -376088
1255 -376088 -224381 24350 -132404 -290658 74772 14687 -111546 -110792 -155485 -264132 -81869
1244 -81869 -172998 -103090 -198600 -165173 12190 -138947 -230041 -69811 175497 117757 61823
1233 61823 160184 64020 -73034 -41487 59269 55037 90136 43558 371092 144393 148533
1222 148533 165051 241652 75510 -41473 25398 -125905 76287 146807 -30220 -255719
1212 -255719 -237197 -170609 -183537 -38889 184537 118254 144021 71264 239621 236739 198831
1201 198831 194 -20401 -247653 -285882 -36791 202555 247099 96463 -45412 49644
1191 49644 40845 128407 67673 -65641 109476 27277 92688 22478 -47100 184193 9442
1180 9442 -132636 -129073 -188304 -233928 -112345 85902 113156 148306 106725 68195 158515 84758
1168 84758 22407 42316 80937 101287 -123106 -226532 -30783 -122382 24202 47123 136041
1157 136041 198213 159392 15113 -245038 -41723 -66612 -146769 -147849 -105986 65910 122130
1146 122130 140889 256352 144494 -104872 -2044 73351 168994 210734 180295 182819 97358
1135 97358 56451 21314 -11884 -38978 -187103 -271086 20541 101760 7245 -58720 -15025
1124 -15025 -223324 -85377 132776 283986 190675 127939 105983 188609 208055 -3468 -20564
1113 -20564 -72590 -76094 56229 228185 266802 79231 -168747 7585 97004 55728 -38316
1102 -38316 -6139 162424 152919 182382 113832 149947 -9983 85765 139381 142532 -154729 -65107
1090 -65107 101493 -44162 217258 383641 170170 81794 21102 240362 228555 54752
1080 54752 -19588 -63448 22233 -123648 -188056 -137435 -87359 -66881 -19024 -62650 -147978 -72871
1068 -72871 -87556 -204352 -58743 -29664 177228 78006 -43358 -366674 -242573 -30643
1058 -30643 -54368 -229971 -220129 -302014 -210649 -99828 131036 -5462 -65245 91024 75210
1047 75210 62924 64756 -17858 -68429 -37390 18034 117877 131935 -82998 -48549 -100259 -22473
1035 -22473 110411 90970 77863 35427 31087 -91915 -45856 112841 108564 -22671 -51453
1024 -51453 -134219 -127371 -11494 -19922 227504 96738 -54828 124064 -28128 -114740 -185832
1013 -185832 47608 -86617 201971 106971 158064 -106161 -130473 -118883 -140947 12292 132573
1002 132573 74185 193743 194797 41873 -68783 -3087 138777 160616 57437 16608 -43979
991 -43979 -183840 -123633 -247202 -208424 -86597 -17273 -94505 -16278 25260 67130 -61344
980 -61344 79719 -41433 50853 118608 -9975 -110690 -81754 -14615 101299 228482 -63463
969 -63463 -106664 -28655 187444 42029 -1484 -65149 -218487 6827 205465 9753 -54474
958 -54474 22722 -126726 -91582 45625 -139974 -447100 -342819 4669 93124 105614 55420
947 55420 -82176 -150581 -133520 -68600 -129090 -94578 -254101 -251438 -17506 -7625 -190582 -75769
935 -75769 -66015 -154466 -164682 -269388 -77204 69953 87320 146465 55067 -179358 -89804
924 -89804 -122415 155201 319792 244113 212894 290502 249153 73869 62229 -47132 -46397 -275213
912 -275213 -295150 -382066 -171683 -184856 -207286 -115144 4580 89944 90868 -94238 14202
901 14202 266861 141730 60861 -3406 -43749 2164 -210764 -131419 -121019 -65531 -53471
890 -53471 70652 245563 247700 87509 -59767 37642 292779 275647 -106162 -64354 -305284
879 -305284 -188857 132202 -58459 -22915 99807 124108 198440 175252 242580 226117 39202
868 39202 111429 26683 -220742 -224301 4628 27985 57479 6038 113636 249228 144910
857 144910 215371 87598 21402 144896 157600 349580 183845 195932 331467 217541 130280
846 130280 61197 -61600 21742 67790 153664 346118 175440 10309 -377723 -286024 -314138
835 -314138 -229292 -305391 -141104 -16081 -89638 -312328 -138698 -169395 -283798 -122324 60350
824 60350 -10690 40653 -4025 4927 213752 99616 -159806 -22263 -149526 -287272 -176386
813 -176386 -188179 -201799 -260097 -137196 -164798 -48315 71312 89970 115928 -153065 -29624
802 -29624 -86634 -85149 -151110 60074 307338 149645 161184 31620 16218 25463 146676
791 146676 41389 40469 235215 409621 386816 153562 -135159 214041 142982 826 -28041
780 -28041 -38610 -264036 -180687 -162910 -219607 -10938 5760 -83638 -122431 -22078 104601
769 104601 86917 -20353 -98368 -141393 -51067 73021 83200 33236 187921 87182 -41012
758 -41012 -12433 -65883 -137940 158506 -3566 -324752 -138665 11773 58743 -59680 -130943
747 -130943 -126482 125332 141573 -4163 55694 -46606 -141264 -254179 -231318 -343975 -330903
736 -330903 -225135 -215460 -217347 -218943 -111949 -100191 -162816 -251591 -170574 -190862 80144 49357
724 49357 -66172 127694 156311 -75167 125293 78630 -28531 -146799 -179501 -174408 -9428
713 -9428 43664 -129016 -130272 -143632 -48313 174489 155200 28568 -124673 -105793 57224
702 57224 129447 -138582 -6633 -35521 -76424 21974 -60487 -9373 -21910 211320 79334
691 79334 -119254 -79687 48411 41307 95978 -7651 -14868 13933 76458 -43780 93463
680 93463 68161 17672 147674 122783 86647 -20767 -52443 -182686 -105508 144635 -26746
669 -26746 -77200 27576 194405 168000 139742 175076 234669 286830 237407 60657 27580
658 27580 -107692 -112398 -134468 -150233 33699 139904 184252 217047 201572 174205 -103300
647 -103300 -28416 48064 69647 136467 104530 -100620 28834 64362 104702 180116 254938
636 254938 216207 78288 89320 66239 9281 -55556 -2559 96162 91908 -169979 -52620
625 -52620 59561 -49570 -173096 -151264 -306007 -284966 -232030 -89546 -101305 -223722 -127116
614 -127116 -152340 -382542 -209662 -167556 -109364 114065 107353 125892 -10225 22145 38159
603 38159 -35248 -116253 -187473 -265857 -80966 -40746 125611 -10186 -114635 -73238 -189120
592 -189120 -113178 -229526 -68815 -291024 -229845 -10036 23497 -83275 -199501 -152803 -104584
581 -104584 -27743 164303 123143 -42479 -114476 -60074 73090 111448 81117 124079 -51224
570 -51224 -98529 -90754 -41018 13100 259828 49493 -157018 -223642 -318040 -470225 -241821
559 -241821 -8599 27929 69483 108298 138531 78683 83387 -104754 -222630 -47668 -36797
548 -36797 -86294 84866 -6651 27866 -107304 -91890 -213079 -105696 -58662 32853 -14695
537 -14695 11645 86423 -87933 10889 -44887 -32584 11618 -37138 -157965 -128516 -196837 -90363
525 -90363 101328 132141 36990 -72265 -47507 61283 -25742 -23546 127091 36905 -22470
514 -22470 -5356 97298 116033 46960 -304020 -227847 -249221 -195368 52031 88201 178778
503 178778 152017 40129 182467 181790 5948 -190421 -141769 -14855 -139211 -193981 -165956
492 -165956 -120776 33650 108093 -60492 -37818 112971 84896 229238 135671 -8392 16443
481 16443 -235568 -142982 -66585 53460 -1804 -50626 14143 60034 100507 -6583 47067
470 47067 72504 167444 5560 -45541 -183088 -178126 -54597 -44652 -128463 -168153 -217077 -72321
458 -72321 -34419 4572 65845 24532 173723 -5774 -19967 16469 113660 -53041 -52595 65635
446 65635 -53526 -161593 -195888 -72102 -47781 46472 -2522 147260 275503 282861 205865
435 205865 -67759 -55674 -115193 -260530 -186893 -195652 -191366 -12328 216772 -51437 -154368
424 -154368 -13741 -3457 135405 220804 110728 56451 177895 75994 -12305 78202 194118
413 194118 292346 297253 68940 -31590 62129 33312 -12584 17886 95331 446238 336397
402 336397 184976 80514 113042 143076 75188 14764 166561 67408 -50148 127574 168142
391 168142 211200 212423 16080 -72723 6439 106820 126213 75911 -14110 87725 28628
380 28628 53885 232551 182174 141716 -3000 26913 87092 247461 76507 111049 146781
369 146781 194789 269384 243539 225730 173257 590 109571 145456 121391 183464 192025 163869
357 163869 136534 64863 14605 -17824 -32758 -24183 93791 279621 149490 206910 139578
346 139578 100511 -21870 202901 249719 267693 176336 182299 154534 91669 35995 -103076
335 -103076 -104688 111745 124100 104167 61551 161345 197870 32964 245032 111713 -107585
324 -107585 -74866 142220 152448 5094 136272 182703 -165641 -31110 235441 186440 232237
313 232237 295420 104558 58193 313073 341471 211830 255440 39410 -63418 54683 79106
302 79106 140651 151692 147166 158377 78969 103446 47089 177260 197882 158013 230910 14386
290 14386 40414 53425 60759 12892 44331 233448 157427 20930 -23247 -13296 161214 238180
278 238180 26340 113926 100987 10246 21473 160805 193200 139191 24964 112195 168377
267 168377 23728 8094 207816 260823 122208 112494 24682 137797 232851 264180 169242
256 169242 187564 -134840 -206913 109274 120074 199213 93703 110531 114636 47149 197315
245 197315 294039 57782 249629 173619 164323 206000 272768 177923 115188 26392 -28839 57882
233 57882 76390 -12708 138209 227836 9218 97539 125981 195793 113898 22396 99709 120445
221 120445 120983 187348 33015 -80229 -73209 -24689 -14025 194649 169056 247510 389430 358743
209 358743 118752 6829 184968 252064 158859 62444 7189 -36557 -46700 -48605 58459
198 58459 116799 67655 247436 264411 196854 266448 245582 169008 47720 39402 354087 254019
186 254019 120664 189324 166731 81102 174203 213445 81512 -27376 45447 139256 120335
175 120335 165984 101469 130637 266639 257676 126962 -34309 -139399 -215293 -25533 179640
164 179640 -15830 74201 183886 -118717 3080 64707 85226 127272 115273 145866 270332
153 270332 125009 61619 198768 284338 117797 285887 289672 97355 183532 180429 273974
142 273974 312583 157156 109572 226403 109441 132603 4510 145568 113943 129935 192938
131 192938 128010 112539 -17967 -88611 75357 10735 17210 162104 223792 223267 249266 258888
119 258888 207845 27862 62137 128744 131957 225875 118186 88789 89286 74060 125199 248506
107 248506 251194 56690 33032 -147054 -4784 68084 101717 196137 77338 56662 54469
96 54469 98936 -18245 8700 101409 208814 315462 203603 172628 105477 8730 -118204
85 -118204 -5748 224810 191839 333196 371211 464629 404852 272394 224086 222855 202215
74 202215 222149 133285 92527 264807 369668 137781 39716 134405 246693 325622 229090
63 229090 134566 -27275 -42641 -31070 -13494 -4210 61686 35910 81066 -36168 48302 150753
51 150753 175153 155121 -20410 22657 10903 161136 138322 111589 128233 39790 134378 39709
39 39709 66265 87480 125942 106244 159205 92275 11663 87961 93020 164467 40898 60241
27 60241 127314 64810 52587 153755 326773 181173 8698 150832 195629 290087 206971
16 206971 212523 261438 169822 187476 226579 189139 196605 266854 248991 183430 206519 105060
4 105060 -95586 -57394 62542 130381
0 130381
$$ Imaginary data points
##PAGE= N=2
##DATA TABLE= (X++(I..I)), XYDATA
16383 -1608109 -1664267 -1561480 -1502710 -1480579 -1544392 -1443248 -1424871 -1500361 -1310045 -1335437 -1404617
16372 -1404617 -1428608 -1380513 -1296214 -1162686 -1228328 -1219352 -1235563 -1179382 -1182758 -1041686 -933866
16361 -933866 -929262 -708853 -733552 -678218 -526359 -630826 -650361 -556878 -559736 -704026 -590104
16350 -590104 -613613 -669727 -447362 -403627 -438030 -432927 -390466 -354041 -373594 -309443 -263987
16339 -263987 -220317 -198600 -84181 -116526 -32391 -44224 -21128 168586 44416 52012 68328
16328 68328 52951 128247 231177 196088 288584 288936 357930 231535 91901 241492 149552
16317 149552 331597 360670 304190 381295 512786 573306 538177 596718 692767 783224 584412
16306 584412 587314 521787 559179 583853 782641 905861 913685 915792 967971 995880 787086
16295 787086 731407 941441 982985 938978 1062229 1048980 1073997 1122423 1135285 1300139 1284131
16284 1284131 1319924 1487105 1428480 1233345 1227366 1385959 1505736 1482081 1462614 1445889 1574240
16273 1574240 1683186 1743790 1666762 1596247 1626794 1742162 1539368 1650395 1666570 1503432
16263 1503432 1939993 1830180 1750893 1822571 1765852 1725419 1661612 1664955 1779525 1876840 1933809
16252 1933809 2061045 2211128 2160006 1974441 1976436 2082730 2237030 2089754 2086425 2115311
16242 2115311 2155916 2243659 2132452 2288567 2315571 2341211 2224444 2207866 2301391 2364052 2347082
16231 2347082 2514865 2279587 2231119 2488826 2548460 2443887 2247693 2197364 2336200 2503772
16221 2503772 2403984 2427117 2426497 2591726 2633609 2472671 2341374 2440457 2466075 2607676 2769176
16210 2769176 2822136 2811189 2779445 2727326 2555194 2612307 2676266 2512137 2749125 2749103 2781765
16199 2781765 2782947 2621155 2757220 2671900 2874262 3027859 3164993 3090074 2926482 2937602
16189 2937602 2868830 3056850 3210270 3093656 2999341 2922086 2989090 2864473 2999948 3019652
16179 3019652 2893734 2905010 2885308 2896000 2965436 2988160 3020926 2865210 2949730 2997943 2867327
16168 2867327 2899232 2739507 3050611 3107935 2891868 2932024 2998642 3152896 3181571 3102883
16158 3102883 3207279 3233987 3039370 3034855 3176418 3281181 3195852 3042207 3171287 3145566
16148 3145566 2986595 3168775 3020200 3061536 3058229 3153291 3180735 2987183 3142869 3211089
16138 3211089 3114125 3238748 3260139 3169913 3108464 3023225 3315792 3437712 3385991 3472873 3404512
16127 3404512 3289922 3262106 3185890 3200307 3276742 3240080 3182331 3360006 3403922 3332449 3454103
16116 3454103 3492071 3232793 3188328 3147787 3405459 3224707 3159488 3315221 3363853 3277548
16106 3277548 3091591 3355634 3507693 3578093 3470524 3463632 3720727 3609731 3523073 3201078
16096 3201078 3548554 3563134 3315147 3211119 3195764 3091667 3026271 3153590 3416300 3739084
16086 3739084 3500361 3572573 3601395 3514522 3513168 3531645 3361458 3503958 3407608 3586718 3357494
16075 3357494 3349576 3386857 3316398 3464400 3340515 3517364 3465666 3410280 3529923 3478380 3559109
16064 3559109 3574595 3375688 3167309 3345568 3400780 3490943 3304967 3258398 3228778 3270543
16054 3270543 3296152 3304935 3295018 3490239 3748483 3611400 3625155 3527659 3466124 3506685 3537039
16043 3537039 3517802 3376334 3201375 3429473 3582438 3509435 3399198 3615145 3525968 3495131
16033 3495131 3548099 3633050 3542485 3744017 3846743 3537584 3603497 3579092 3617276 3742379
16023 3742379 3635967 3786933 3632131 3557951 3496260 3490411 3553807 3636910 3385597 3419936 3782515
16012 3782515 3785652 3741747 3514252 3423425 3467845 3390834 3238473 3337617 3401361 3357410 3390866
16001 3390866 3396736 3520285 3483406 3342471 3308805 3488125 3442481 3438765 3489027 3444083 3674541
15990 3674541 3698819 3546098 3193700 3394332 3464844 3463230 3362344 3484749 3680684 3660466
15980 3660466 3528023 3350689 3571996 3578983 3580982 3514332 3487973 3291170 3281666 3640092 3670304
15969 3670304 3478093 3389113 3378166 3372933 3296091 3138758 3291756 3487080 3481411 3732848 3884798
15958 3884798 3536738 3670093 3985747 3634690 3499663 3471879 3393681 3574155 3615770 3364740
15948 3364740 3326381 3542961 3460871 3561171 3678733 3648958 3656149 3568158 3549837 3607059 3578767
15937 3578767 3497104 3729831 3877403 3684074 3647529 3428642 3524928 3482105 3378878 3339267
15927 3339267 3483314 3642666 3746657 3876327 3707604 3721944 3653594 3465137 3629401 3666982
15917 3666982 3639172 3578029 3405193 3446918 3486832 3465703 3593096 3389133 3531200 3658142
15907 3658142 3623261 3490210 3433017 3558444 3593047 3484690 3459905 3568142 3451797 3435371
15897 3435371 3488872 3540151 3617558 3735893 3593381 3781575 3726817 3765633 3789968 3700069 3634341
15886 3634341 3543552 3361408 3404491 3488642 3535495 3631906 3695032 3590218 3539351 3597666 3642003
15875 3642003 3729161 3562461 3571884 3707020 3775042 3637383 3498807 3664066 3602618 3653499
15865 3653499 3490443 3340708 3482610 3594085 3653456 3540738 3477788 3379454 3581689 3540357
15855 3540357 3593390 3578981 3452068 3609035 3561908 3374224 3505356 3574654 3590186 3696935
15845 3696935 3615653 3664006 3719394 3649747 3778056 3548081 3493439 3423803 3299981 3382981 3475457
15834 3475457 3541839 3737754 3733493 3675649 3631076 3478976 3591982 3664379 3671746 3687019 3863011
15823 3863011 3657902 3524031 3545499 3419883 3583535 3716735 3638128 3760579 3719980 3721749
15813 3721749 3715709 3682423 3601154 3527078 3608853 3867955 3705795 3679648 3689642 3641920 3608550
$$ [...]
##END NTUPLES=NMR SPECTRUM
##END=
