##TITLE=1H_CG-1183-1
 CDCl3
 8 sc, 
 9.1.2024
##JCAMPDX= 6.0         $$ Bruker NMR JCAMP-DX V2.0
##DATA TYPE= NMR SPECTRUM
##DATA CLASS= NTUPLES
##ORIGIN= UXNMR, Bruker Analytische Messtechnik GmbH
##OWNER= root
$$ XWIN-NMR		Version 3.5
$$ Tue Jan  9 14:16:49 2024 Russian Standard Time (UT+4h)  she@DPX200
##.OBSERVE FREQUENCY= 200.1313
##.OBSERVE NUCLEUS= ^1H
##.ACQUISITION MODE= SIMULTANEOUS
##.ACQUISITION SCHEME= undefined
##.AVERAGES= 8
##.DIGITISER RES= 18
##SPECTROMETER/DATA SYSTEM= spect
##.PULSE SEQUENCE= zg30
##.SOLVENT NAME= CDCl3
##.SHIFT REFERENCE= (INTERNAL, CDCl3, 0, 15.4659)
##AUDIT TRAIL= $$ (NUMBER, WHEN, WHO, WHERE, WHAT)
$$ ##TITLE= Audit trail, XWIN-NMR		Version 3.5
$$ ##JCAMPDX= 5.01
$$ ##ORIGIN= Bruker BioSpin GmbH
$$ ##OWNER= she
$$ F:/spectra/data/she/nmr/H-F/1/pdata/1/auditp.txt
$$ ##AUDIT TRAIL=  $$ (NUMBER, WHEN, WHO, WHERE, WHAT)
(   1,<2024-01-09 14:15:40.37 +0400>,<she>,<DPX200>,
      <created by zg, POWCHK disabled, PULCHK disabled
       configuration hash MD5:
       00 E9 B6 7A A2 85 ED C7 34 08 36 98 17 FE 4E 26
       data hash MD5: 16K
       EF 78 AE 08 1C AA CB 08 04 69 F9 38 BD A5 E8 D8>)
(   2,<2024-01-09 14:15:42.81 +0400>,<she>,<DPX200>,
      <Start of raw data processing
       efp BC_mod = 2 LB = 0.24 FT_mod = 6 PKNL = 1 PHC0 = -24591.53 PHC1 = 14.25273 SI = 16K 
       data hash MD5: 16K
       FF 96 DB FE CE 5E E7 2A 5D E6 C0 30 F6 09 F0 A9>)
(   3,<2024-01-09 14:15:59.85 +0400>,<she>,<DPX200>,
      <pk PHC0 = -0.4107052 PHC1 = -0.5999995 
       data hash MD5: 16K
       7E 46 B0 79 DF B7 28 B9 74 21 F8 D7 23 AC 72 EC>)
(   4,<2024-01-09 14:16:03.15 +0400>,<she>,<DPX200>,
      <abs ABSG = 5 
       data hash MD5: 16K
       82 A7 3C 12 13 C1 84 2D C4 A2 21 A0 60 A5 99 0D>)
$$ ##END=
$$ 
$$ hash MD5
$$ 5E 51 8A A4 9F 0D 70 0D 65 DB F5 D0 0F 25 8D 08
##$RELAX= 
##$RELAX= 
##$RELAX= 
##$RELAX= 
##$RELAX= 
##$RELAX= 
$$ Bruker specific parameters
$$ --------------------------
##$DU= <F:/spectra>
##$EXPNO= 1
##$NAME= <H-F>
##$PROCNO= 1
##$TYPE= <nmr>
##$USER= <she>
##$AMP= (0..31)
100 100 100 100 100 100 100 100 100 100 100 100 100 100 100 100 100 100 
100 100 100 100 100 100 100 100 100 100 100 100 100 100 
##$AQSEQ= 0
##$AQ_mod= 1
##$AUNM= <au_zg>
##$AUTOPOS= <>
##$BF1= 200.13
##$BF2= 200.13
##$BF3= 200.13
##$BF4= 200.13
##$BF5= 200.13
##$BF6= 200.13
##$BF7= 200.13
##$BF8= 200.13
##$BYTORDA= 1
##$CFDGTYP= 0
##$CFRGTYP= 5
##$CHEMSTR= <none>
##$CNST= (0..31)
1 1 145 1 1 1 1 1 1 1 1 1 1 1 1 1 1 1 1 1 1 1 1 1 1 1 1 1 1 1 1 1 
##$CPDPRG= <>
##$CPDPRG1= <>
##$CPDPRG2= <>
##$CPDPRG3= <>
##$CPDPRG4= <mlev>
##$CPDPRG5= <mlev>
##$CPDPRG6= <mlev>
##$CPDPRG7= <mlev>
##$CPDPRG8= <mlev>
##$CPDPRGB= <>
##$CPDPRGT= <>
##$D= (0..31)
0 1.2 0 0 0 0 0 0 0 0.06 0 0.03 0 0 0 0 0.0002 0 0 0 0 0 0 0 0 0 0 0 0 
0 0 0 
##$DATE= 1704795339
##$DBL= (0..7)
120 120 120 120 120 120 120 120 
##$DBP= (0..7)
150 150 150 150 150 150 150 150 
##$DBP07= 0
##$DBPNAM0= <>
##$DBPNAM1= <>
##$DBPNAM2= <>
##$DBPNAM3= <>
##$DBPNAM4= <>
$$ [...]
##$SUBNAM3= <"">
##$SUBNAM4= <"">
##$SUBNAM5= <"">
##$SUBNAM6= <"">
##$SUBNAM7= <"">
##$SUBNAM8= <"">
##$SUBNAM9= <"">
##$SW= 18.0517328524113
##$SWIBOX= (0..15)
0 0 2 0 0 0 0 0 0 0 0 0 0 0 0 0 
##$SW_h= 3612.71676300578
##$TD= 16384
##$TD0= 1
##$TE= 0
##$TE2= 300
##$TE3= 300
##$TEG= 300
##$TL= (0..7)
0 120 120 120 120 120 120 120 
##$TP= (0..7)
150 150 150 150 150 150 150 150 
##$TP07= 0
##$TPNAME0= <>
##$TPNAME1= <>
##$TPNAME2= <>
##$TPNAME3= <>
##$TPNAME4= <>
##$TPNAME5= <>
##$TPNAME6= <>
##$TPNAME7= <>
##$TPOAL= (0..7)
0.5 0.5 0.5 0.5 0.5 0.5 0.5 0.5 
##$TPOFFS= (0..7)
0 0 0 0 0 0 0 0 
##$TUNHIN= 0
##$TUNHOUT= 0
##$TUNXOUT= 0
##$USERA1= <user>
##$USERA2= <user>
##$USERA3= <user>
##$USERA4= <user>
##$USERA5= <user>
##$V9= 5
##$VALIST= <valist>
##$VCLIST= <CCCCCCCCCCCCCCC>
##$VD= 0
##$VDLIST= <DDDDDDDDDDDDDDD>
##$VPLIST= <PPPPPPPPPPPPPPP>
##$VTLIST= <TTTTTTTTTTTTTTT>
##$WBST= 1024
##$WBSW= 4
##$XGAIN= (0..3)
0 0 0 0 
##$XL= 0
##$YL= 0
##$YMAX_a= 107483
##$YMIN_a= -144259
##$ZGOPTNS= <>
##$ZL1= 120
##$ZL2= 120
##$ZL3= 120
##$ZL4= 120
##$ABSF1= 15.46703
##$ABSF2= -2.58482
##$ABSG= 5
##$ABSL= 3
##$ALPHA= 0
##$AQORDER= 0
##$ASSFAC= 0
##$ASSFACI= 0
##$ASSFACX= 0
##$ASSWID= 0
##$AUNMP= <proc_1d>
##$AZFE= 0.1
##$AZFW= 0.1
##$BCFW= 0
##$BC_mod= 2
##$BYTORDP= 0
##$COROFFS= 0
##$CY= -3
##$DATMOD= 1
##$DC= 0
##$DFILT= <>
##$DTYPP= 0
##$F1P= 0
##$F2P= 0
##$FCOR= 1
##$FTSIZE= 16384
##$FT_mod= 6
##$GAMMA= 0
##$GB= 0
##$INTBC= 1
##$INTSCL= 3.70164e-10
##$ISEN= 128
##$LB= 0.24
##$LEV0= 0
##$LPBIN= 0
##$MAXI= 10000
##$MC2= 0
##$MEAN= 0
##$ME_mod= 0
##$MI= 1.114404
##$NCOEF= 0
##$NC_proc= -7
##$NLEV= 6
##$NOISF1= 3.799351
##$NOISF2= 2.8
##$NSP= 0
##$NTH_PI= 0
##$NZP= 0
##$OFFSET= 15.46593
##$PC= 1
##$PHC0= -24591.94
##$PHC1= 13.65273
##$PH_mod= 1
##$PKNL= yes
##$PPARMOD= 0
##$PSCAL= 0
##$PSIGN= 0
##$REVERSE= no
##$SF= 200.130011160885
##$SI= 16384
##$SIGF1= 3
##$SIGF2= 2
##$SINO= 5.538805
##$SIOLD= 16384
##$SREGLST= <1H.CDCl3>
##$SSB= 0
##$STSI= 16384
##$STSR= 0
##$SW_p= 3612.71676300578
##$SYMM= 0
##$S_DEV= 0
##$TDeff= 16384
##$TDoff= 0
##$TI= <>
##$TILT= no
##$TM1= 0
##$TM2= 0
##$TOPLEV= 0
##$USERP1= <user>
##$USERP2= <user>
##$USERP3= <user>
##$USERP4= <user>
##$USERP5= <user>
##$WDW= 1
##$XDIM= 16384
##$YMAX_p= 274784312
##$YMIN_p= -539864
$$ End of Bruker specific parameters
$$ ---------------------------------
##NTUPLES= NMR SPECTRUM
##VAR_NAME=  FREQUENCY,     SPECTRUM/REAL,   SPECTRUM/IMAG
##SYMBOL=    X,             R,               I
##VAR_TYPE=  INDEPENDENT,   DEPENDENT,       DEPENDENT
##VAR_FORM=  AFFN,          ASDF,            ASDF
##VAR_DIM=   16384,         16384,           16384
##UNITS=     HZ,            ARBITRARY UNITS, ARBITRARY UNITS
##FACTOR=    0.220516191357247, 1,           1
##FIRST=     3095.1967405208, 0,             0
##LAST=      -517.520022484981, 0,           0
##MIN=       -517.520022484981, -539864,     0
##MAX=       3095.1967405208, 274784312,     0
$$ Real data points
##PAGE= N=1
##DATA TABLE= (X++(R..R)), XYDATA
$$ [...]
9899 1200559 1201642 1099607 1171517 1135635 1230960 1153603 1333306 1164811 877744 1129089 1300324
9888 1300324 1424510 1396676 1423627 1296512 1320730 1399198 1397063 1547470 1571895 1613516 1656405
9877 1656405 1689010 1718410 1566001 1677500 1630423 1770597 1765576 1643771 1582196 1850009 1897951
9866 1897951 1865590 2105605 1909346 1677539 1837899 2066498 2014748 2159721 1923406 2085815
9856 2085815 2010415 1881692 1853141 1804228 1785000 1689259 1816662 2181079 2074143 1867601
9846 1867601 1943741 1917515 2065111 1960334 1936281 1929223 2244156 2019866 1808197 1869419 2096264
9835 2096264 2059207 1871459 1979294 1918837 1985453 2146473 2011330 2076623 2040067 2113435 2409854
9824 2409854 2275633 2017813 1778631 1890792 2067338 2211279 2173978 2147898 2199962 2226355
9814 2226355 2162183 2126703 2301576 2300941 2603794 2634872 2488422 2485542 2404456 2406812 2627359
9803 2627359 2606333 2279419 2435586 2490431 2753951 2610918 2541158 2633640 2658369 2769454
9793 2769454 2789261 2570155 2763196 2962101 3130395 3177803 3348800 3223855 3094045 3240406
9783 3240406 3252267 3490944 3582002 3708590 3912702 3940737 3839612 3804359 3690960 3824964
9773 3824964 3973695 4227638 4196218 4199784 4212631 4194198 4071564 4259708 4400233 4613447
9763 4613447 4720169 4786234 5060802 5059559 5008383 5167875 5275201 5505878 5663222 5615315
9753 5615315 5906328 6041699 6278635 6454475 6538536 6664631 6754278 6907760 7255049 7591107
9743 7591107 7812672 7612401 7924966 8173248 8573660 9047150 9362098 9733556 9723748 9854543
9733 9854543 10079533 10305269 10578795 10958713 11244283 11563428 11857623 12279801 12678611 13025673
9723 13025673 13440792 13865354 14361061 14826645 15299115 15848883 16500900 17386378 18312135
9714 18312135 19177677 20083601 21477765 22452956 23793428 25572384 27545106 29612404 32119694
9705 32119694 35336323 39013225 43218117 48207872 53938064 60001148 65345891 68950099
9697 68950099 71969176 74675431 76040056 74723337 70831551 66118267 61905043 57321228
9689 57321228 51331126 45383788 40478582 36865783 34253913 32315267 31017812 30458997
9681 30458997 30162430 30137852 30274946 30434514 30940141 31382122 32002143 32895340 34322525
9672 34322525 35913999 37669230 39878637 43116373 47147545 51951010 57647387 63748425
9664 63748425 68878432 72466848 75354264 78957775 81031412 79503362 73881850 67810728
9656 67810728 62427885 56910833 50484498 43480023 37438516 32467246 28718285 26137543
9648 26137543 24246945 22391347 21003550 19667115 18602848 17554593 16830071 16074036
9640 16074036 15476232 14849788 14264817 13717541 13106485 12435664 11949913 11454130 10760577
9631 10760577 10393042 10256784 9893547 9573576 9506638 9241582 8834367 8546183 8317230 8047080
9621 8047080 7834106 7621038 7431995 7053844 6715331 6697434 6383509 6263758 6192487 6213247
9611 6213247 6125655 5885675 5743743 5862172 5682726 5613689 5611514 5530670 5280261 5187422 5302811
9600 5302811 5290197 5242979 5065430 4957632 5027566 5015358 5074535 4993106 4766424 4901817 4779447
9589 4779447 4861763 4839992 4695590 4662427 4488283 4500321 4374713 4401564 4432514 4214457 3958530
9578 3958530 3699212 3717874 3669022 3914614 3900307 3815300 3781975 3641097 3728374 3797263 3654198
9567 3654198 3661433 3859171 3595902 3565404 3590483 3783650 3727366 3722634 3987940 4126134 4169835
9556 4169835 4038380 4111089 4150694 4328760 4158464 3951555 3855300 3813127 3823869 3810994 3616996
9545 3616996 3492997 3223015 3283079 2998956 2963978 2879971 2620791 2625450 2410132 2555539
9535 2555539 2427626 2598141 2621071 2489402 2447521 2408595 2464833 2280390 2024294 2129771
9525 2129771 2293595 2188685 2248145 2511002 2571358 2788877 2777856 2810057 2878090 2670628
9515 2670628 2678405 2492062 2407572 2299323 2026089 2038226 2111706 1941032 1747248 1951792
9505 1951792 1970502 1849638 1731486 1529931 1611127 1619846 1677940 1688415 1677007 1756384 1807364
9494 1807364 1564383 1786868 1571176 1319653 1355197 1380663 1371415 1286174 1246466 1286901 1497557
9483 1497557 1638349 1873087 1901122 1915289 1931354 1910727 1782108 1929954 1799868 1595287
9473 1595287 1683976 1655657 1585099 1591225 1520502 1479298 1574669 1480002 1279460 1373566 1514237
9462 1514237 1404822 1301572 1364000 1469201 1323622 1383841 1348384 1450266 1532334 1396813
9452 1396813 1487203 1432756 1308807 1409559 1485880 1584555 1623626 1791550 1850528 1878403 1827492
9441 1827492 1674091 1632760 1705631 1737454 1513951 1520726 1448069 1471379 1401342 1423950 1347507
9430 1347507 1411110 1452432 1366400 1189463 1020535 939825 1140603 1226717 1203589 1132615 1235388
9419 1235388 1171785 1399522 1323375 1339457 1220780 1020273 1146505 1117345 1183372 1450341
9409 1450341 1348089 1284847 1494599 1473899 1478828 1384481 1346498 1200844 1334332 1371451 1304069
9398 1304069 1453133 1661652 1613964 1448778 1379090 1265554 1275336 1425818 1563601 1639862
9388 1639862 1449086 1457789 1254382 1301092 1386022 1535386 1562885 1472962 1391871 1546060 1583381
9377 1583381 1274711 1226896 1340727 1426959 1622017 1721060 1633621 1795374 1936288 1815642
9367 1815642 1587111 1426988 1413497 1258286 1417974 1502683 1347631 1281018 1438437 1669912
9357 1669912 1864753 1896073 1674236 1614270 1642156 1732379 1850447 2165794 2037727 1870643
9347 1870643 1906953 2027282 2226556 2143105 2053956 2157657 2254489 2244672 2318892 2324111 2240683
9336 2240683 2320568 2256731 2206219 2328339 2427974 2396903 2303056 2090832 2115197 2295004 2267054
9325 2267054 2251139 2153831 2261801 2243045 2184160 2247936 2329919 2244720 2182623 2053267 2072523
9314 2072523 2253172 2336255 2446736 2423408 2282000 2437102 2486026 2631188 2620341 2511946
9304 2511946 2643692 2806178 3049415 3140957 3086006 2987784 3216844 3100562 3172652 3194855
9294 3194855 3106037 3210821 3187021 3184947 3096625 2944572 3009163 3213372 3392801 3294026 3297719
9283 3297719 3291697 3213601 3262705 3204234 3173987 3110226 3014739 2984911 3111236 3269781 3349851
9272 3349851 3431196 3410684 3432196 3472457 3553696 3618090 3562511 3510564 3775414 3926251 3850510
9261 3850510 3952458 4036023 3893992 3830069 4046737 4131495 4257621 4265124 4146643 4238240 4263285
9250 4263285 4282341 4297330 4213808 4235263 4245210 4444740 4449875 4430511 4798714 4768218 4732960
9239 4732960 4837742 4964209 5100542 5007683 5056667 5079193 5032301 5079711 5176415 5228120 5401656
9228 5401656 5564296 5659656 5807513 5942862 5947147 6004802 6000876 6240583 6552372 6568343 6686047
9217 6686047 6844934 6761487 6632414 6568340 6655972 6877756 7080503 7118297 7124188 7143911 7389310
9206 7389310 7649195 7945318 7909816 7995173 8179440 8335163 8712109 8933347 9169092 9216045
9196 9216045 9335120 9320947 9556730 10075123 10101632 10072568 10513181 10749845 10912191 11130858
9186 11130858 11387441 11976416 12338472 12468081 12904057 13020706 13196033 13264449 13479125 13729183
9176 13729183 13996716 14340719 14695866 15079228 15668272 16190450 16704007 17232999 17758069
9167 17758069 18584942 19232874 20207871 21450820 22736696 23970718 24855622 25498259 25771790
9158 25771790 25959177 26583475 27075583 26985965 26815151 26859796 27088415 27318338 27575674 28047930
9148 28047930 28662552 29291077 30180917 31086927 31911787 33032961 34098191 35368571 36379173
9139 36379173 37544586 39050799 40729628 42672491 44409931 46587341 48599699 51217633
9131 51217633 54557535 58615901 63566229 69693767 77031682 85528896 94466698 101186273
9123 101186273 104087826 105200644 107202537 110243616 112531373 111390286 108062728 105734105
9115 105734105 106039507 109291760 114348775 119955335 124162135 126697255 128893168 129958003
9107 129958003 129208421 128040284 128758472 132668077 139931046 151172162 165517027 179061057
9099 179061057 186123107 183625068 178173285 173241142 165902606 150829019 129496674 109369866
9091 109369866 92756328 80071248 70998161 64343399 59605269 55798381 52567153 49703375
9083 49703375 47320645 45591243 44430962 43370855 42726602 42521501 42520018 42827276 43067052
9074 43067052 43246511 42545273 41644774 40851178 39595455 37851165 36060608 34454375 32794162
9065 32794162 31490976 30250975 29389351 28633769 28116614 27173446 26277827 25329737 24683261
9056 24683261 24259467 23470000 22698208 22267125 21871501 21726796 21588837 21362935 21421555 21523529
9046 21523529 21356119 21392120 21476961 21248254 20938418 20658895 20517039 20380959 20130816 19707500
9036 19707500 19306180 18961660 18443972 18087209 17933324 17266159 16932269 16648379 16629934 16534622
9026 16534622 16478783 16365232 16150752 15940072 15770983 15539240 15627004 15551826 15533681 15250529
9016 15250529 15384781 15553298 15714687 15968107 16138336 15859414 16074271 16125376 16175568 16346603
9006 16346603 16472781 16389473 16283853 16339771 16385812 16295468 15933778 15874118 15780301 15812581 15755419
8995 15755419 16086278 16533138 16873492 17078907 17227545 17348471 17514579 17835647 18181133
8986 18181133 18565166 18982577 19104877 19234022 19456402 19560610 19766416 19783992 20044358 20264817
8976 20264817 20858278 21400306 21894998 22683035 23635287 24633955 25387593 25948289 25978183 26093005
8966 26093005 26122454 26252558 26630453 26633625 26982019 27460057 27594407 28146084 28873721 29398641
8956 29398641 29965393 30862034 31961289 32789104 33932818 35587147 37815189 40766650 44566717
8947 44566717 49348266 54682532 58549481 58981672 56068199 52456113 49560669 47814318
8939 47814318 47568243 48378979 50279852 52940766 56802544 61625703 66577988 70622501
8931 70622501 73458933 76074120 79983811 86089273 95087427 103285135 105437247 97369459
8923 97369459 87704307 80748509 75069686 70233191 65451239 61007211 57640468 55587394
8915 55587394 55084706 56150440 58407630 62574896 67889323 72795107 75117258 73653502
8907 73653502 68816668 62101702 55462904 50356130 47072606 45034978 43975981 44452807
8899 44452807 45743158 47831426 49752679 50296880 48933901 46437266 44012469 42175457
8891 42175457 41000425 40554438 41191263 42649857 43986771 44458565 42914379 39820936 36668394
8882 36668394 33944762 31881604 30525295 29645603 29380931 29850299 31149631 32816783 34623229
8873 34623229 36412192 36089943 33245119 29809577 26525251 23848886 21656771 19945172
8865 19945172 18897608 18286397 17756052 17381724 16946990 16530718 16010140 15423261 15134010
8856 15134010 14706949 14374840 14095240 13930708 14081696 13947955 14107729 14055636 13755967 13606850
8846 13606850 13306499 12943888 12385201 11869572 11561497 11049548 10803791 10627427 10339519
8837 10339519 10315574 10030258 9984055 9935053 9768276 9579539 9456931 9096119 8835851 8947245
8827 8947245 8661926 8477084 8230526 8209626 8100293 7880619 7716323 7860003 7923313 7942513
8817 7942513 7812845 8080012 8345478 8247974 8228615 8226067 8406280 8637513 8745044 8612758
8807 8612758 8791352 8862180 8969819 9153091 8963059 8796053 8804520 8844142 8795832 8804471 8477225
8796 8477225 8298038 8384435 8370280 8203086 8210794 8283770 7877529 7482255 7445105 6962912 6732382
8785 6732382 6619416 6304583 6206599 6065180 5877142 5739414 5846797 5856972 5978700 5650013
8775 5650013 5449710 5547538 5699681 5568216 5594933 5330823 5453616 5505991 5463580 5641276
8765 5641276 5707715 5867829 5764928 5878286 5672807 5482612 5422652 5459944 5356378 5332344
8755 5332344 5271387 5080247 5132159 5218761 5264358 5202280 5179327 5094101 4813286 4563469 4487823
8744 4487823 4389999 4392515 4200966 3975827 4279466 4198824 4106669 3962861 3696239 3521754
8734 3521754 3588473 3622098 3677960 3756402 3556639 3469281 3520328 3519691 3649324 3851366 3989964
8723 3989964 4304928 4196227 4049224 4182221 4269293 4179497 4019980 3821273 3829202 3667203
8713 3667203 3777599 3800358 3791230 3643771 3654917 3401130 3388379 3451639 3415199 3356421 3247028
8702 3247028 3241980 3106345 3114781 3182210 3268513 3301244 3390302 3413405 3424134 3528424 3456706
8691 3456706 3446532 3565560 3826445 3639240 3425351 3608878 3567001 3822250 3999423 3890079
8681 3890079 3914244 4028632 3920940 3797887 3565963 3524832 3570615 3743557 3636532 3502469
8671 3502469 3588832 3462691 3270138 3325955 3330563 3509356 3546769 3401498 3378256 3299640 3251767
8660 3251767 3318120 3112443 3051237 2848859 2744970 2730127 2836813 3001822 2982572 2889642
8650 2889642 2924778 2964167 2821332 2867206 2940183 3012874 3077335 3192966 3310362 3288818 3333215
8639 3333215 3437681 3307396 3439406 3370761 3230835 3114250 3177547 3057705 3187989 3285502
8629 3285502 3251653 3426486 3442349 3343644 3148292 3139638 3191713 3211810 3391878 3215850 2955044
8618 2955044 3004788 3159858 3011989 3144704 3073706 2712952 2889250 2889329 2938397 3067817 3110698
8607 3110698 3147047 3090020 3006479 3114420 3163830 3240062 3314263 3482885 3537976 3645678 3660498
8596 3660498 3629995 3643868 3678667 3510761 3515304 3602660 3696151 3721293 3661347 3603407 3590914
8585 3590914 3475362 3441043 3327813 3091849 3167959 3357543 3153464 3041552 2907199 2833665
8575 2833665 2965359 2837262 3101396 3113688 3224085 3166864 3074665 3097833 3085915 3038757 2986049
8564 2986049 3104530 3180810 3271953 3120421 3128203 3244474 2996158 3051384 2945594 2780329
8554 2780329 2722370 2789068 2513034 2416301 2540716 2768757 2831841 2646543 2558207 2579966 2594761
8543 2594761 2319732 2354798 2307454 2200336 2085548 2067360 2094962 2142987 2168431 2180075 2105736
8532 2105736 2113686 2157283 2229868 2198507 2235069 2278701 2086606 2026397 2117313 2091267 2114150
8521 2114150 1927696 2111543 2302833 2261163 2049113 1943713 1968912 2156680 2254673 2130283
8511 2130283 2219291 2317756 2285766 2389826 2480532 2274167 2222851 2139596 1941315 1906589 1848699
8500 1848699 1751416 1768461 1986133 2147950 1993910 1891202 2001622 1922846 2006904 2152755
8490 2152755 2176648 2018525 2005644 1789289 1816234 2022235 1906147 1923093 1948319 1780519
8480 1780519 2014616 2039010 1750599 1849228 1710306 1705950 1641911 1947502 1794493 1665389
8470 1665389 1793186 1612627 1348312 1495067 1581027 1492758 1433936 1348068 1504653 1427131
8460 1427131 1332534 1422595 1454821 1593205 1498291 1543533 1375118 1261721 1271818 1444443 1746253
8449 1746253 1949438 1787023 1824064 1741167 1743068 1331314 1133854 1324103 1232615 1052851
8439 1052851 1125655 1425498 1345587 1094349 1121245 975047 1103663 1150253 1074348 1093356 732614
8428 732614 784908 1000811 990485 889593 829338 842403 794791 767576 945349 1011926 864374
8417 864374 866941 884097 511086 489867 669138 611279 692362 760301 777914 977119 910558
8406 910558 599796 440590 650681 604675 722038 669800 636895 820801 670121 488831
8396 488831 803299 617233 579907 505244 424890 266007 293089 449985 548626 486795 541203
8385 541203 533268 545155 360644 234975 284873 281905 504459 431248 586885 604339 521247
8374 521247 346930 384681 283001 113863 370387 276266 362493 412733 490447 497395 424181
8363 424181 514905 710263 719661 839215 762956 585765 629578 594774 517864 337620 458918
8352 458918 322678 294493 382359 468311 460560 418778 353972 268725 193297 64795 198791
8341 198791 362042 371944 383156 400523 538124 508163 333528 289831 234518 194573 180222
8330 180222 165044 122359 287778 366360 350039 412360 479134 505484 407173 415499 374169 316093
8318 316093 408306 510679 407854 454839 357572 218149 328428 375092 202993 247936 330248
8307 330248 234340 1052 -41651 178149 194618 270227 213473 132114 376348 407275 271322
8296 271322 245774 245887 221943 144614 82390 73706 88941 165815 110665 40286 207098 290113
8284 290113 429356 375502 328311 404133 189858 290460 276061 300170 274804 403419 326529
8273 326529 438159 213259 59619 39211 -30002 261217 387922 169359 324931 387502
8263 387502 301563 248209 194908 322981 106904 91804 88579 186168 249384 110880 56306
8252 56306 218523 180458 199439 106790 23805 45954 97989 -117340 -154249 92604 153809
8241 153809 105899 180892 236536 332845 272043 251524 263223 333077 211856 175554 227375
8230 227375 339362 368426 325523 352632 280766 274473 349701 365214 411351 235296 89203
8219 89203 157940 143088 159467 89950 111478 26947 190097 81978 139762 368940 508059
8208 508059 471856 480056 378277 524949 460954 476515 630199 794824 776042 640777 510299
8197 510299 447790 623757 394675 285298 149559 1420190 1493132 726529 871994 643895
8187 643895 679117 792047 516459 511181 739810 482384 599451 650064 737991 670385 758762
8176 758762 908469 952609 1117887 963228 857632 636492 779988 626340 536160 593770
8166 593770 661417 713698 819809 880388 892926 887177 780271 626147 428228 514928 686014
8155 686014 628943 625428 829163 807534 991377 1042407 1060565 1155328 889546 760358 720562
8144 720562 578378 458979 568922 425416 330110 415205 647845 548134 385407 550343
8134 550343 362996 225488 218113 238755 206290 215620 124919 337672 473353 310330 186217
8123 186217 -36062 15950 138972 118782 226188 136983 54303 184026 81396 -63950
8113 -63950 -19703 190936 77371 -69952 -110078 76286 -26338 -22721 99465 164079 322363
8102 322363 -14296 -50539 -34647 -74049 98020 152909 277308 309328 159317 178229 271353
8091 271353 79027 55451 79664 18506 306276 24949 51179 34584 -24712 -173291 -144236
8080 -144236 -65652 -27994 -29809 -264361 -61595 156977 81848 69620 110465 139906 118696
8069 118696 229717 524284 496567 375997 233215 11411 4438 -29392 -36105 17555 127866
8058 127866 144428 103629 175302 93445 89891 134113 199662 220359 291712 165315 -21525
8047 -21525 42561 36948 -21590 26563 80154 245806 261053 242506 374164 497567 586534
8036 586534 812454 1048163 1251393 1343196 1413773 1331187 1256413 865907 734856 782824 718008
8025 718008 495481 311951 266985 105747 24326 166839 196068 265159 176759 76717 196273
8014 196273 63448 38198 94138 161080 238507 325754 77960 -12934 -106068 121096 2700
8003 2700 -55238 -118934 -111119 -134460 -100234 -72352 -205296 -108258 -11691 -129213 -65984 -13306
7991 -13306 -87171 44133 62602 76018 -231724 -142094 -131064 -54766 -58849 153423 -78004
7980 -78004 -176158 16816 -126576 -266492 -28382 -65816 -134357 -119862 -241764 -13346 -324385
7969 -324385 -174104 -95636 -165718 -55602 -220451 -210134 -158633 -212138 -199962 -43164 -99552
7958 -99552 -222866 -229790 -314557 -114062 -68041 -52137 184159 165680 -26479 -13933 -69108
7947 -69108 -174257 -85826 6385 40333 79412 17382 210217 138640 16199 -67714 -274924
7936 -274924 81612 299269 152995 144933 85862 -6213 -86567 38474 94571 -143572 -146704
7925 -146704 -85466 -129858 -50961 -61511 14677 87929 -36833 -239306 -382851 -163443 -71209
7914 -71209 -230659 -257926 -214711 -114051 -129169 -334574 -322099 -220414 -117769 -78199 14158
7903 14158 8514 -21492 -116400 -231324 -89077 -254205 -330327 -312849 -177982 -43317 -146304
7892 -146304 -187419 -20967 -14606 72023 210829 -126836 -144293 -119545 -35304 -21363 -240886
7881 -240886 -225459 -126298 -59406 -268212 -288493 -177150 -253685 81937 -369623 -285826 -42817
7870 -42817 -24473 -100173 27671 71092 164818 197233 69923 -63923 -97585 73535 -91620
7859 -91620 -133685 -128857 13497 -135354 62827 -158660 -353950 -445346 -322253 -255973 -213899
7848 -213899 -161403 -206359 -218025 -189693 -280130 -38038 85627 -41460 -86491 -237197 -291469
7837 -291469 -243124 -93327 -178614 -184876 -7741 -13195 -195252 -250734 -124495 39119 93857
7826 93857 -95390 -277154 -269884 -372495 -430409 -383167 -270566 101625 137307 -105608 -14053
7815 -14053 -187978 -161472 150184 220456 30024 8093 -100250 -74651 -65976 -57502 -260578
7804 -260578 -393626 -138278 -332523 -182170 86166 100193 -50239 -141185 -113448 11236
7794 11236 -118437 -364200 -258142 -63811 -66212 -185345 -16995 -234324 -148476 -4507
7784 -4507 -31290 16522 164922 245619 192419 -94106 -61353 3548 127158 186558 50820
7773 50820 -2492 -56815 163696 61901 44410 -118918 -136180 -173867 -315185 -452501 -227861
7762 -227861 -351011 -283016 -133418 -208984 -40688 -31488 -114101 -74499 -63215 -63456 -133701 -26370
7750 -26370 -168626 -68683 -38065 -91876 -48516 -160680 -141221 4999 -101568 -151607 -71361
7739 -71361 1654 174362 65977 -7651 -151238 -7975 189796 162024 253127 219627 120399
7728 120399 183228 87914 77115 25318 12359 59850 218594 53027 101200 -126084 -362890
7717 -362890 -228478 -153341 -28889 119798 29026 36121 43788 113874 18128 -172094 -25506
7706 -25506 -178115 -114697 -43469 -108168 -264843 -203414 -138734 -78666 82801 75726 137035
7695 137035 -14556 189651 63598 30534 103448 -52461 -18281 97124 199614 186010
7685 186010 187895 84947 -46050 -84254 -93617 -47936 49108 -93935 -70099 -54241 12294
7674 12294 111676 225479 197889 97486 181269 252334 178089 78116 126215 118866 144091 326946
7662 326946 20428 104652 55737 187851 311867 159523 32879 -19660 114733 83259
7652 83259 150856 88355 -26854 -78903 -180019 -179230 -35672 -69283 -143222 -307821 -226604
7641 -226604 -159610 7693 -205517 -329588 -266942 -170421 -254820 -340967 -462196 -298869 -199824
7630 -199824 -248210 -251498 -165995 -163737 -175280 -118569 -10605 -168721 -78495 125023 -77527
7619 -77527 -147781 -66757 -114372 -107411 5610 -100943 27020 -175250 -79399 -13659 -113388
7608 -113388 -131143 -178475 -220414 -255566 -125561 -64820 12929 20596 -49193 138719 -40062
7597 -40062 35255 131940 -35366 -241830 -120280 16532 73509 21079 -48623 46813 36691
7586 36691 32987 77791 -77606 -359524 -224286 -115014 58945 30085 -93414 26579 -116889
7575 -116889 -380140 -200551 -187754 -257533 -220496 -145598 144705 172693 -172964 -350152 -99078
7564 -99078 -48287 10601 -145285 -193167 -139432 -30843 -146387 -83755 100435 65317 109571
7553 109571 153297 10916 -46316 -27417 -236869 -166504 -49280 -82616 103277 -50690 -30676
7542 -30676 39230 -138823 -118728 -62408 10577 44392 -113682 -219793 105134 159461 134697
7531 134697 18836 248218 191359 168894 54669 91376 148160 162700 -3681 -187039 -72146
7520 -72146 -59178 -152956 -335125 -399822 -270044 -174788 -281851 -19777 -148395 -305005 -372734
7509 -372734 -181094 -149519 -80474 -159331 -66367 -171948 -316717 -188831 -225312 -123949 -179333
7498 -179333 -5861 38418 -189796 -360879 -257855 -126637 139008 12460 41425 111367
7488 111367 11788 17569 -8328 168171 327385 160396 104061 83487 25535 -254840 15716
7477 15716 36157 -53585 49821 -65990 -123471 -10381 41842 -158240 -247570 -173114 136039
7466 136039 42643 70531 124859 141043 73187 -147276 -121190 -50131 -99598 -81044 -81023 -117454
7454 -117454 -194096 -76837 -58382 11010 80437 17772 16792 -41315 -130917 -108649 -36263 90267
7442 90267 152402 18655 -58781 -75044 -42552 54401 4517 63630 108342 132754 71894 -113533
7430 -113533 -26651 -129490 -192726 -4454 -14663 62403 119780 144260 67090 111882 54287
7419 54287 -7195 -6649 -32709 -28860 -66334 13487 -68192 23107 102723 44073 -40188 -134024
7407 -134024 -207096 -115673 -32280 114138 78657 151051 64171 -63328 -10104 -233530 -270248
7396 -270248 -244583 -103689 -148445 -109642 46873 -58161 -4453 -82400 -10487 33162 -102388
7385 -102388 47050 34403 18705 25085 28038 -61035 -50208 249654 147815 16327 50862
7374 50862 262924 186012 50772 294432 354516 379986 537290 352498 148101 194096 345052
7363 345052 591518 488850 205238 -24133 105649 205093 206303 206968 344872 305624 218295
7352 218295 152940 98258 85066 8710 60851 49068 -34293 146902 236041 228535 321409 303908
7340 303908 333440 287538 271597 347342 411104 267954 319995 299155 287239 135642 83901
7329 83901 -149 -144652 -104744 -104904 -87963 14271 -25056 -227885 -241134 -24123 112048
7318 112048 195408 271993 349855 366172 226299 341289 106059 238939 570446 458569
7308 458569 256767 377022 203903 189068 251714 87439 218899 141554 -29042 20128
7298 20128 53600 -55601 -112846 41117 27216 -121373 -74129 158023 309197 163307 -67901
7287 -67901 -171788 18496 145667 137380 154885 256118 110072 120783 137030 15027 73750
7276 73750 157775 373002 335834 105643 140770 201886 180070 155893 237973 173210 146774
7265 146774 238531 325940 120622 244096 554029 567908 196030 193824 96082 -93731 -41326
7254 -41326 36201 196100 118249 158901 231509 223637 110508 123825 -6563 80597 135587
7243 135587 291729 323304 216950 369885 370022 396181 594127 492135 343636 327119 190995
7232 190995 190709 173511 216446 87389 123782 170090 183665 185892 -18189 239973 206729 204407
7220 204407 327817 341805 313405 259551 199136 106289 119952 255853 283267 96614 -112082
7209 -112082 -123169 70656 113454 67047 97978 181523 84364 109316 244472 275837 357319
7198 357319 226393 60674 24328 139594 170600 172937 123002 150076 258662 220521 186127
7187 186127 46512 -119053 -49738 82684 185130 23330 138498 203121 154746 37052
7177 37052 -35222 112919 52137 91720 79487 251610 139849 23020 -35814 -32698 -24645
7166 -24645 52287 -3146 -34624 158890 247349 81857 -52017 -271571 -185883 -69882 33967
7155 33967 257405 189676 27224 -120136 129221 161836 222434 298546 134912 216947 250875
7144 250875 73610 48052 137896 177951 35700 42081 56015 34840 231613 328753 469034
7133 469034 305013 161682 172932 -3595 17424 51148 41324 -34816 -167290 -351560 -399988
7122 -399988 -165926 40370 233703 144019 -118664 -69871 -85264 -1168 72246 -67544 -61634
7111 -61634 12959 -120673 -38698 398410 306693 237408 213851 120602 -195518 -209553 -235332
7100 -235332 -149692 39167 -4601 148152 248430 260507 180164 167857 -17995 -41469 9770
7089 9770 -104177 57281 150184 124352 31977 110615 154796 136160 264188 169724 -110475
7078 -110475 -60609 208439 66947 136102 38345 109947 83407 130231 265634 163484 14925
7067 14925 104527 177087 11040 3759 8375 133378 265473 -24444 27354 116608 92198
7056 92198 115434 90441 59334 201117 253613 170212 -7324 57061 105446 52629 190427
7045 190427 215110 43370 140708 3844 -100242 -24662 -68883 -88046 29818 125076 131422
7034 131422 115163 -63454 -151305 -181815 263701 182209 272043 242918 272694 181032 109408
7023 109408 92835 122395 48544 19552 17257 41153 272988 220927 110069 79121 62179
7012 62179 29736 4651 148199 91667 -33354 -19163 155878 56477 10358 126636 134368
7001 134368 58157 -160413 -12562 163832 241845 99300 88565 -6138 45491 -71955 -189890
6990 -189890 -82637 -207997 -164997 -81942 -118057 -57105 3385 46905 174332 134877 62953
6979 62953 410810 389679 -92532 -85288 96710 152349 292507 297066 175224 166984 188957
6968 188957 128886 134774 65697 365653 422442 257282 93307 -18137 13352 67915 -50441
6957 -50441 92683 210035 196605 195330 193594 281049 306919 240765 131858 99679 198035 95011
6945 95011 42967 153251 190201 165089 220619 241113 69142 107560 -7096 221593 188221
6934 188221 -11411 9816 -30385 -36156 9523 -54895 -44029 97677 61677 -55681 -39642
6923 -39642 103217 226169 300870 206395 208735 358854 369810 170095 245790 250637 238894
6912 238894 67739 42141 88189 40375 239339 192396 257211 232122 322692 255824 505851
6901 505851 630037 363133 196352 207813 101983 326748 374648 408662 280321 186767
6891 186767 186237 397769 313227 92918 314669 315183 273461 197835 26272 42029 96448 67547
6879 67547 335823 343585 556090 630716 447731 573266 514926 489611 518414 524654 417494
6868 417494 398957 504706 383639 176031 204913 508252 628904 716116 692517 537804
6858 537804 532925 511045 589409 611805 524058 476276 395251 458505 490270 364400 411170 652696
6846 652696 575032 713139 847228 949133 703748 576146 584873 732095 583288 544398
6836 544398 628852 607178 785156 676159 635428 762563 784236 811672 795384 724351 814433
6825 814433 769382 763906 545279 511470 877861 1003332 938117 908578 1035779 1070655 989180
6814 989180 1004545 1132752 1256806 1288580 1144636 1169427 1110143 1264787 1408840 1440845 1436384
6803 1436384 1536515 1680454 1752937 1590262 1376156 1322094 1274313 1340224 1272358 1342310 1700744
6792 1700744 1565745 1384221 1349180 1236661 1198406 1237512 1413013 1404041 1510998 1480785 1546952
6781 1546952 1569967 1540530 1481515 1395526 1472180 1436696 1303972 1245221 1382425 1323224 1394056
6770 1394056 1514723 1743677 1752410 1459396 1366336 1419619 1396013 1248887 1127990 1135296 1024642
6759 1024642 1061176 1288397 1011392 888164 876442 794511 741762 838876 901608 776244 557262
6748 557262 543684 446851 588164 621082 850659 914095 900903 879297 1075213 988195 828074
6737 828074 842640 668747 853793 908437 907180 618917 703010 670517 652195 627969 714467
6726 714467 838790 894385 915981 838997 558770 698518 815762 779073 891518 973707 1092139
6715 1092139 1190612 1070388 906389 903990 981658 1028533 956121 1057799 914543 822847 813112
6704 813112 719834 707529 963888 861769 752166 624090 510648 483075 701674 643689
6694 643689 877858 948731 930263 688155 732729 931510 816638 780996 751762 889047 917741
6683 917741 1018443 877085 668688 833634 914005 1050472 975123 847096 872108 947441
6673 947441 970315 779961 767651 809513 889854 960775 819630 909484 1006507 899572 908248
6662 908248 900815 1092078 1253008 1179624 996058 1074745 1073365 1206427 1089785 1092420 1189081
6651 1189081 1144995 1040986 951152 1106533 1168186 1212507 1333446 1388325 1193161 1040163
6641 1040163 1050172 1291571 1242761 1211167 1270447 1074022 1124210 1286708 1360381 1462043 1557238
6630 1557238 1501285 1489693 1571099 1688454 1660753 1658786 1634733 1791072 1747498 1611385 1638331
6619 1638331 1899612 1920615 1848848 1921364 1790387 1901217 1813201 1849583 1789247 1654221 1676207
6608 1676207 1642866 1768150 1787909 1791348 1799359 1797428 1806331 1875128 1980048 1968680 1847282 1827802
6596 1827802 1768512 1879264 1914437 1987214 1938724 1977716 2108859 2216012 2121782 2139375 2185108
6585 2185108 2231261 2135420 2195599 2213235 2143675 2070029 2287801 2350182 2406943 2277180 2113209
6574 2113209 2266760 2322045 2407934 2317827 2195437 2438497 2431097 2347332 2263446 2241842 2225689
6563 2225689 2099840 2242381 2205540 2181415 2299398 2697310 2539390 2239008 2398048 2410132
6553 2410132 2573267 2637935 2561940 2579304 2838135 2891962 2746158 2863929 2897443 3042282
6543 3042282 2883866 2841594 3014795 3038887 3109371 3267810 3323026 3453635 3214868 3028402
6533 3028402 3204425 3366459 3216555 3306403 3322781 3323566 3524359 3797638 4042592 3895251
6523 3895251 3683726 3636724 3842208 4049792 4284752 4392362 4341173 4409429 4712857 4840150
6513 4840150 4846478 4846468 4969687 5152460 5091320 5327418 5557290 5653490 5613098 5773382 5890386
6502 5890386 6085748 6404408 6340336 6380843 6693237 6748326 6964837 7248852 7488172 7530543
6492 7530543 7767223 7900181 8098573 8168507 8603791 8774894 9066784 9136710 9419741 9698495
6482 9698495 10150154 10511081 10618400 11218576 11652131 11951442 12330827 12776594 13060489 13208100
6472 13208100 13612539 14234476 14838681 15364850 16033910 17083418 18013219 19231481 20323011
6463 20323011 21673571 23322475 25127865 27574130 30428960 33428395 36746407 40442456
6455 40442456 43778994 45999728 46493220 44935651 41818693 38500346 35532214 32856017
6447 32856017 31136564 30203471 29775625 29481718 29775735 30423270 31396626 32739440 34564168
6438 34564168 36779985 39557291 42993112 47159123 52304686 58303819 65125950 72594326
6430 72594326 79404990 84425236 85241458 80776811 72841294 63690888 55119581 48201563
6422 48201563 42832931 39268779 36345979 33991753 32487690 31263026 30821741 30714680
6414 30714680 30965819 31624383 32699253 34130022 36005069 38503134 41518913 45374735
6406 45374735 49353937 52878945 55385809 55355983 52406123 47434972 41568404 36283510
6398 36283510 31629531 28121715 25323523 23220086 21523692 20152414 18886755 17875555
6390 17875555 17190638 16384931 15775802 15362819 14967513 14911207 14503518 14272224 14044093 13873328
6380 13873328 13702904 13645161 13557050 13218517 12728602 12176780 11472451 11028153 10553854 10166120
6370 10166120 9840363 9444622 9294530 9023658 9122403 8932848 8813741 8530493 8370811 8176349
6360 8176349 7951749 7747123 7706719 7579802 7563708 7623535 7562096 7271910 7441932 7600910
6350 7600910 7484303 7392302 7302842 7433217 7354623 7116750 7452804 7558780 7551172 7895316
6340 7895316 8393281 8651694 9161751 9524586 10000077 10143308 9742432 9062713 8515800 8269090
6330 8269090 7957583 7943353 7937744 8202155 8536755 8849870 9129686 9405664 9083302 9084163 9309422
6319 9309422 9258176 9690610 9939459 10387514 10624782 10497296 9988504 9509943 9273219 8839129
6309 8839129 9012959 9127412 9394462 9124076 8439221 7994512 7768619 7740200 7743414 7762792
6299 7762792 7918441 8448678 8927140 9256987 9268540 8731750 8069024 7541381 6937249 6539464
6289 6539464 6098125 5983168 5947822 5657645 5513746 5404914 5244749 5210232 5095973 5166096
6279 5166096 5285341 5430426 5325734 5132536 5109932 5251153 5173565 5066064 4916413 4823801
6269 4823801 4863640 5051663 4852766 4568640 4540899 4519860 4407694 4404870 4395398 4195495 4176484
6258 4176484 4204839 4327803 4475120 4375557 4332357 4380496 4241713 4273566 4455864 4547729 4736693
6247 4736693 4657601 4705110 5139739 5362333 5458951 5442062 5427138 5319908 5065910 5229884
6237 5229884 5107798 4874823 4728194 4674500 4719722 4569428 4504756 4740181 4787419 4729130
6227 4729130 4588590 4593151 4686915 4655796 4820878 4910365 5106356 4988354 4939629 4868170 5058630
6216 5058630 5376449 5507566 5586047 5521325 5746217 5762664 5448377 5576558 5478973 5469951 5492899
6205 5492899 5523273 5540432 5598067 5513585 5717519 5692875 5827673 5874489 5936742 5979976 6209941
6194 6209941 6144779 6335399 6260056 6202074 6363630 6698972 6895927 6778369 6855425 6956667
6184 6956667 7167303 7414210 7395178 7367267 7558825 7837222 8109368 8315448 8728263 8701747
6174 8701747 8896640 9059240 9007340 9209900 9537105 9948280 10142037 10192512 10513387 10809376
6164 10809376 11173006 11497197 11807576 12210265 12674749 12928455 13368096 13840955 14451463
6155 14451463 14708680 15275601 16314516 17105264 18048550 19047337 20338096 21738938 23741715
6146 23741715 25918027 28504577 32103566 36292671 40758539 45290477 49339003 50739843
6138 50739843 48811744 44816118 40855173 38202418 36699994 36198526 36617502 38487886
6130 38487886 41111119 44203811 47203466 48422219 48077896 47599924 48018968 49656402 52362806
6121 52362806 55324176 56952131 56035060 53025628 49072489 45566484 43339085 42814336
6113 42814336 43274853 44357436 45479511 44841581 42125630 39379685 37434477 36573287 37147007
6104 37147007 38968094 41815696 45541152 49001312 51401902 50378856 45398839 38942830
6096 38942830 32533611 27542620 23615494 20589108 18484227 16790691 15447791 14400047
6088 14400047 13386701 12645397 11885994 11363359 10881053 10383731 10263039 10078805 9825590
6079 9825590 9299955 9112552 8885228 8723451 8416678 7978698 7859735 7888512 7552618 7461773
6069 7461773 7374188 7474342 7201485 7104534 7094889 7095221 7036377 7081846 7156926 7172181 7357824
6058 7357824 7370432 7379564 7391622 7759061 8034253 8234869 8439650 8627380 8832054 9100447
6048 9100447 8943287 8532349 8239750 8210933 8002003 7644247 7623678 7436029 7242128 7234126
6038 7234126 7171341 7178028 7055087 7040480 7400379 7680851 7678226 7913135 8364978 8933469 9121529
6027 9121529 9812423 10178235 10308292 10454561 10089435 9579012 9057623 8609758 8052328 7538094
6017 7538094 7403076 7266304 6944519 6705040 6295474 6089575 6116806 6106388 6188087 6388959
6007 6388959 6369182 6614075 6683007 6875748 7113146 7049737 7042939 7206418 7260709 7003605 6965420
5996 6965420 6672718 6517492 6374130 5992781 5782719 5722822 5638149 5612975 5813271 5932461
5986 5932461 5584214 5387533 5539767 5722460 5748872 5775020 5683243 5707794 5755278 5767716 5722963
5975 5722963 5760031 5818143 5790964 5745233 5685168 5769369 6213214 6283944 6214494 6301590 6606362
5964 6606362 6471915 6620199 6754917 6839593 6727639 6740632 7032657 7139027 7489739 7727415
5954 7727415 7924527 7950717 7748899 7947614 8157905 8194163 8507112 8788159 8904940 9007036
5944 9007036 9012832 9100788 9296798 9539113 9944515 10003130 10216051 10443904 10512579 10810862
5934 10810862 11004572 11056362 11438374 11949169 12458038 12787291 13158847 13461511 13871692 14561360
5924 14561360 15255658 15784784 16456240 16768696 17388105 18309470 19345561 20345976 21582977
5915 21582977 23005014 24838189 26890517 29211621 32062371 35664540 39776846 44091957
5907 44091957 48206819 50862740 51002212 48158465 43864500 39506508 35946046 32912478
5899 32912478 30983208 29546829 28647471 28386102 28483931 28983987 29602971 30736335 32305054
5890 32305054 34076198 36666576 39988830 44029765 49150610 55305064 62866606 71042685
5882 71042685 78151361 82444872 81409197 75147872 65786256 56307838 48316423 42104057
5874 42104057 37503395 33940578 31312563 29041189 27666338 26785171 26009189 25705359 25914664
5865 25914664 26384740 26916814 27813517 29575008 31748476 34300311 37465341 40803452 43445694
5856 43445694 44946681 44468491 41473482 36660497 32318213 28127152 24822581 22400269
5848 22400269 20182590 18336696 16950357 15807876 14869275 14113848 13611420 13232091 12618533
5839 12618533 12319820 12196189 11840221 11699809 11660970 11499031 11384926 11163282 11030125 11001539
5829 11001539 10465001 10139471 9700806 9631845 9481837 9123823 9064832 8985024 8692709 8442523
5819 8442523 8490744 8394134 8429107 8293583 8118647 8036720 7989133 7918552 8141029 8083154 7914313
5808 7914313 7978654 8043633 8083509 8195382 8175315 8405124 8361101 8404576 8464731 8595095 8738919
5797 8738919 8899587 9173288 9560430 9748290 9901818 10014993 10295677 10555129 11107264 11655312
5787 11655312 11964032 12465619 13110897 13640737 13970483 13659814 12869171 12412353 11859075
5778 11859075 11489274 11445431 11359263 11445574 11800220 12405956 13091973 13585111 13794631 13846808
5768 13846808 14088236 14741566 15665493 16069749 16533775 16831230 16737538 16552769 15771224 14996680
5758 14996680 14583413 14461784 14301207 13986074 13310694 12503934 12159488 11882968 11452350
5749 11452350 11415573 11718730 11824725 12137445 12722492 13176301 13741519 13662079 13526354 13702917
5739 13702917 13668068 13495682 12979278 12140376 11450367 11107000 10775821 10325275 9531372 9085366
5729 9085366 8931969 8540000 8084743 8125147 8075798 7749204 7657474 7478515 7405680 7119393
5719 7119393 7205513 7164458 6976407 6938867 7159078 7184207 7315904 7220701 6987278 6787311
5709 6787311 6772325 6841010 6571449 6553046 6787862 6790433 6628650 6749645 6922921 7269040
5699 7269040 7352384 7239282 7340764 7422810 7328325 7493907 7712204 7809412 7770334 7690367 7445447
5688 7445447 7484891 7639137 7644137 7623069 7822892 7671508 7581090 7697424 7929391 7988340 8135384
5677 8135384 8458732 8651556 8845783 8893142 9118104 9485255 9804373 9842850 10057911 10570503
5667 10570503 11178902 11715677 12233268 12349053 12130994 12430737 12880617 13102684 12776391
5658 12776391 12233565 11755880 11175557 10703368 10851729 11175496 11200673 11234310 11340932 11567584
5648 11567584 11932451 12297631 12782633 13145615 13549471 13871955 14363659 14642629 14964371
5639 14964371 15340400 15840654 16123678 16257256 16164830 16019958 15931272 15668976 15434479 15165174
5629 15165174 14933584 14803359 14823346 14966863 15257124 15468155 15913690 16501311 16874093 17406997
5619 17406997 17962326 18643784 19332474 19957386 20786496 21683058 22572131 23563500 25031690
5610 25031690 26715176 28335658 30337091 32741556 35744920 39419034 43888269 49069403
5602 49069403 54004099 58127519 58922086 55769100 51152938 46877693 43791729 42336100
5594 42336100 42217007 43307865 45393858 47719328 50100297 51227577 50395044 49048786
5586 49048786 48505103 49120238 51137340 54205740 57249122 60006001 60491941 58375226 54836474
5577 54836474 51147850 48891283 48064854 48017635 48558685 47623498 44779104 41705550 39536122
5568 39536122 38282338 37913981 38512960 40146188 42728049 45447171 48193446 49658072
5560 49658072 48053014 43460936 37743500 32650571 28357553 25205512 22964976 21357263
5552 21357263 19871612 18731235 17775344 16794621 15867891 15359886 14734064 14015879 13508888
5543 13508888 13007153 12484879 12224951 12129718 11727967 11450111 11273181 11093258 10691115 10692371
5533 10692371 10446751 10170023 9843918 9544900 9187826 8922375 8869773 8829727 8837672 8497489
5523 8497489 8305018 8330566 8041977 7844560 7688048 7346160 7414661 7360543 7190067 7371556
5513 7371556 7474567 7549846 7558044 7704361 7768902 8102258 8278477 8272072 8518604 8709993 9174432
5502 9174432 9306110 9659957 9896723 10137900 9726662 9039270 8504001 7909212 7634597 7550348
5492 7550348 7209489 7064132 7102779 7100237 6880439 6577276 6702888 6661813 6457750 6617362
5482 6617362 6791411 6698439 6912657 7130031 6973868 6946122 6912464 7079477 7191162 7283937
5472 7283937 7295696 7153885 7058689 7148229 7425692 7547177 7623295 7685824 7727740 7756174 7947102
5461 7947102 7775938 7629772 7523214 7412312 7150391 7093519 6972848 6769602 6695273 6592979
5451 6592979 6429662 6528560 6676716 6732290 6619281 6546836 6557573 6507524 6394482 6369118 6195533
5440 6195533 5966573 5864081 5621248 5528293 5404615 5503901 5475536 5304949 5399058 5247045
5430 5247045 5139933 5124972 5046086 4849634 4694966 4653879 4487516 4249479 4113477 4155329
5420 4155329 4284806 3939773 3990589 4033151 4032679 3726001 3761310 3714066 3481979 3605396 3576323
5409 3576323 3561819 3564909 3602295 3709899 3536946 3794336 3845615 3671100 3738233 3725142 3708605
5398 3708605 3605984 3532168 3338664 3254523 3297179 3386628 3303616 3479806 3442874 3461410 3655209
5387 3655209 3551872 3302714 3269498 3403332 3353412 3391465 3401109 3329513 3414017 3281970 3189055
5376 3189055 3383460 3528174 3499696 3514291 3241704 3097250 2779020 2768083 2769851 2715475 2558747
5365 2558747 2602771 2520622 2603953 2665860 2340284 2207381 2070016 2144100 2295118 2127248
5355 2127248 2059665 1991356 2150392 2176207 2124269 2112739 2163623 2186292 2273396 2109515 2124687
5344 2124687 2161388 2158268 2231096 2195649 2210001 2070860 1992004 1870447 1801405 1835981 1865004
5333 1865004 1653176 1925081 1957789 1967157 2041712 2125854 2072993 2022435 1750355 1884370 2021680
5322 2021680 1945167 1742922 1729043 1771278 1707479 1466011 1371483 1543051 1672886 1831086
5312 1831086 1879428 1777925 1602806 1522845 1429977 1646769 1482002 1655604 1875596 1758665
5302 1758665 1622625 1592030 1593999 1606399 1796130 1773417 1658393 1587705 1588544 1658647 1733756
5291 1733756 1549389 1605602 1715666 1552149 1590374 1445082 1636466 1577613 1730220 1797958
5281 1797958 1822557 1862516 1924883 1853160 1710305 1822995 1800614 1787000 1740414 1777014 1864843
5270 1864843 1790931 1798087 1952673 1917437 1936291 2014849 2099437 1900688 1915647 1975725 2002842
5259 2002842 1900394 1969061 2009607 1993846 2008574 2101398 2049759 2165786 1952929 1806803 2025363
5248 2025363 2150982 2141010 1905419 1800172 1824681 1984198 2129128 2156665 2081404 2161368 2124979
5237 2124979 2221308 2239348 2065896 2086569 2227468 2109868 2064537 1928503 1970016 2006909 2164286
5226 2164286 2250228 2235903 2147925 1969961 2121614 2142592 2051200 2051030 2227054 2147232 2016959
5215 2016959 2157509 2189240 2097757 2109499 2139162 1954986 2109609 2112449 2246763 2368183 2184600
5204 2184600 2352412 2390859 2427853 2327907 2267705 2235915 2381894 2302140 2219556 2335370 2303573
5193 2303573 2308453 2167560 2168182 2281274 2439162 2457814 2328335 2248976 2372075 2483298 2610185
5182 2610185 2742969 2595385 2685321 2774065 2779459 2759314 2658847 2800386 2927166 2784314
5172 2784314 2762696 2898096 2945125 3044025 3294131 3372227 3292115 3214891 3294537 3450533 3672277
5161 3672277 3751277 3696020 3403505 3431380 3556627 3551960 3752799 3977539 3699194 3842439
5151 3842439 4238467 4403032 4512563 4473566 4535358 4729383 4715133 4847545 5015471 5230086
5141 5230086 5495164 5862722 6518576 7128415 7665479 8363494 9237818 10509430 12272849
5132 12272849 14877728 17978367 21558657 25002229 27680736 26182915 21388368 17176079
5124 17176079 13656458 11272169 9664322 8592072 7806459 7398707 7016628 6785797 6665549
5115 6665549 6344810 6251112 6658600 6867071 6955869 7212077 7123088 6501957 5764498 5321074
5105 5321074 4922267 4480807 4307723 4030885 3968811 3839629 3720868 3453971 3602361 3622299
5095 3622299 3543472 3377027 3245493 3300711 3532192 3328060 3294546 3371181 3345058 3080675
5085 3080675 3337387 3315741 3352349 3260922 3277250 3426619 3467687 3516717 3610137 3631864 3486135
5074 3486135 3510430 3537747 3661035 3737936 3849508 3817303 3949336 3951829 4042288 3881930 4052331
5063 4052331 3969970 4186467 4393225 4435803 4376559 4237710 4347892 4638240 4799544 4851899
5053 4851899 4939771 5139186 5441658 5778813 5987599 6267961 6610692 6853173 7337298 7700685
5043 7700685 7584917 7520583 7311864 7083215 7012126 6551334 6325882 6309553 6492140 6336107
5033 6336107 6539525 6560413 6463696 6911109 6970918 7291426 7768157 8240734 8655713 8772994
5023 8772994 8702640 8876468 9354877 9928643 10548099 10951793 11332351 11388608 11275590 10941672
5013 10941672 10308576 9774904 9606722 8979505 8498808 8199566 8037690 7810979 7735768 7686623
5003 7686623 7617162 7578271 7478713 7735981 7818273 7942003 7929236 8149356 8352960 8770335
4993 8770335 9186189 9538201 9726674 10141357 10269699 10129582 9867044 9446286 9272995 8880908
4983 8880908 8396983 8014499 7894929 7666957 7461201 7503233 7280420 7207884 7230111 7343692
4973 7343692 7289705 7269344 7180079 7478955 7330692 7358168 7572164 7736627 7809974 7881378 7922449
4962 7922449 7849299 7785922 7893905 7915064 7863116 7946510 8016603 8143109 8109104 8270592 8440141
4951 8440141 8599743 8844211 9095100 9515913 9915115 10279652 10961084 11424105 11384482 10825041
4941 10825041 10124472 9656498 9306952 8982560 8692695 8558341 8700461 8550885 8336484
4932 8336484 8451272 8671868 8701481 8709103 8691331 8785500 8714521 8809285 8760380 8532929 8720969
4921 8720969 8916995 9136731 9133887 8965965 8744622 9037405 8986987 8945938 8901805 8726201
4911 8726201 8563043 8254139 8403465 8406381 8442300 8602326 8339144 8363992 8371389 8091298 7951573
4900 7951573 8016563 7772258 7477962 7530511 7595986 7592108 7387069 7370711 7500972 7608852 7562011
4889 7562011 7490665 7505781 7583821 7338812 7404706 7513195 7690177 7776320 7741437 7581733 7664336
4878 7664336 7587440 7542282 7527067 7555113 7465996 7189961 7066878 7098141 7066542 7010023 6934600
4867 6934600 7022741 7163298 7088413 7139539 7297727 7414988 7235522 7219610 7493527 7317504
4857 7317504 7023794 6893184 7070311 7069262 7067061 7005000 6780945 6764640 6730524 6619537 6655182
4846 6655182 6617457 6550661 6430204 6515022 6630411 6770690 6805700 6944896 7047019 7085195
4836 7085195 6865345 7059686 7320303 7253873 7127730 7105476 7133994 7065995 7088481 7062441 6957959
4825 6957959 7020448 7258839 7436578 7440419 7378098 7326417 7467507 7520927 7601791 7667691 8008188
4814 8008188 8349583 8325686 8333214 8362868 8468026 8393841 8372178 8650280 8646919 8645556 8751939
4803 8751939 8705640 8807406 8915695 9274479 9397122 9288971 9455721 9473652 9438001 9569995
4793 9569995 9773763 9883292 9916998 10057425 9991941 10197571 10362808 10491763 10426257 10774287
4783 10774287 11043084 11166862 11201522 11563016 11689535 11778278 12173978 12471373 12718492 13184899
4773 13184899 13511131 13967330 14413171 15142203 15479009 15845646 15936465 16349565 16472220 16559954
4763 16559954 16581310 16888495 17052252 17415452 17667483 18181440 18859754 19261680 19431060 19857226
4753 19857226 20214877 20901934 21726875 22630365 23297911 24073389 24949482 25443984 26208978
4744 26208978 27149410 27931525 28759621 29661390 30562803 31193896 31935884 32423069 32951692
4735 32951692 33767444 34435774 35293406 36273206 37334356 38463570 39749501 41276114 43044431
4726 43044431 45283289 47879907 50748434 54062546 58510018 64093029 70873856 78889043
4718 78889043 89234299 103226938 122527007 148542612 182307627 221717411 257991303
4711 257991303 274784312 246567910 199448494 156631021 121783135 97573324 80561724
4704 80561724 68394007 59633834 53010938 47431600 43408394 39588966 36755416 34336383
4696 34336383 32143407 29996176 28145607 26745121 25161652 23966754 22780592 21208581
4688 21208581 20098835 19112702 18635550 17742869 16844513 16260767 15700135 14829931 14150451
4679 14150451 13538717 13080528 12574943 12251094 11831738 11516107 11338075 11232848 10821195
4670 10821195 10681073 10209973 9838907 9709196 9622309 9405494 9106833 8836618 8913769 8767119
4660 8767119 8602178 8420526 8546896 8324030 8127706 7887784 7659652 7436319 7441212 7356555
4650 7356555 7248923 7082817 6720133 6733899 6621962 6721092 6678023 6735486 6558337 6743060
4640 6743060 6623782 6383822 6405236 6216974 6139874 6011301 6115390 6101315 6212338 6205277
4630 6205277 5998160 5924042 5961540 5835176 5443343 5403612 5531208 5461764 5257614 5058712
4620 5058712 5111416 5088978 5139149 5366751 5347465 5397357 5011014 4988181 5107912 5009901 4865473
4609 4865473 4767062 4765683 4804756 4767489 4860190 4905520 4877740 4820781 4738782 4996921 4931302
4598 4931302 5077367 5254649 5054242 4877329 4648445 4629168 4538698 4416115 4584168 4553517
4588 4553517 4448422 4365044 4439163 4432647 4356566 4538841 4648290 4348673 4425417 4557031 4555403
4577 4555403 4443385 4284313 4518400 4365836 4292550 4404786 4308999 4320122 4325306 4401673 4458308
4566 4458308 4414231 4398859 4301531 4298613 4272272 4257787 4124678 4090918 4211145 4205742 4292450
4555 4292450 4088079 4293397 4341636 4128490 3981256 4023504 4026656 3955317 3947625 4058775 4102206
4544 4102206 4104863 4148972 4315375 4200270 3996931 3971154 4054157 3957497 3979261 3961337 3937563
4533 3937563 3912820 3836576 3739990 3720565 3717258 3826703 3813033 3909166 3900016 3912085 3998667 3942380
4521 3942380 4191069 4210169 4183078 4244599 4473856 4371923 4357093 4277737 4109988 4317632
4511 4317632 4399572 4428790 4487331 4479118 4490866 4437439 4617280 4455898 4473685 4460326 4221590
4500 4221590 4033381 4280901 4669270 4624502 4318322 4380588 4450515 4560299 4486517 4461120
4490 4461120 4577985 4795119 4989234 4906604 5004944 5097161 5223032 5395254 5450272 5485735
4480 5485735 5564743 5676655 5559878 5359491 5378559 5112361 4953975 5074977 5022314 4997120
4470 4997120 4955298 5000763 4995766 4757218 4818674 5022235 5036106 5101762 5011209 5111667 5083257
4459 5083257 5049462 5146875 5044327 5136585 5399486 5438981 5468658 5490818 5488484 5651071 5742731
4448 5742731 5897930 6093473 6109055 6126794 6128023 6376732 6483248 6344707 6415754 6601479
4438 6601479 6567344 6675117 6664492 6780805 6848384 6606139 6629825 6629660 6771411 6926148 6988837
4427 6988837 7028364 6846334 6852524 6908006 7141295 7323952 7474980 7592404 7743889 8068441
4417 8068441 8368865 8706670 9063915 9273281 9577952 9911123 10073123 10182732 10194070 10297251
4407 10297251 10177760 10439953 10745310 10726305 10770452 10674019 10745518 10930467 11105002 11259154
4397 11259154 11543768 11892326 12081021 11990854 11829535 11552627 11204751 11165071 11142378 11439724
4387 11439724 11486006 11562352 11725062 11991912 12231464 12293285 12114402 12103487 12021218 11815091
4377 11815091 11464665 11111603 10752627 10538819 10627429 10554939 10592176 10632139 10846512 10923129
4367 10923129 10916747 11086171 11189541 11173360 11417263 11508756 11660641 11904505 12047361 12262037
4357 12262037 12433216 12727767 13039119 13184776 13262304 13530853 13685872 13454628 13349278 13527373
4347 13527373 13645366 13759569 13609678 13878359 13790640 13970400 14341369 14500616 14530158 14819951
4337 14819951 15051583 15363113 15732548 16364683 16639035 16876320 17178876 17441334 17873877
4328 17873877 18432513 19111656 19923993 20402964 21658816 22860749 24099848 25629636 27697305
4319 27697305 29772749 32791530 36560823 41695408 48051195 57242828 68722676 84137438
4311 84137438 101733893 115700007 113901422 94078753 74576321 58040735 46294479
4304 46294479 38126082 32624833 28647329 25679837 23249181 21775233 20501936 19400213
4296 19400213 18289964 17158397 16199544 15515937 14870106 14404012 13897963 13591527 13251843
4287 13251843 12785441 12335919 11981232 11759449 11546993 11201361 11082068 10964072 10746338
4278 10746338 10535113 10350876 10250533 10101170 10096090 10152573 10070882 9751095 9607130 9579321
4268 9579321 9522623 9549515 9443960 9269768 9209221 9164239 9406600 9399777 9332907 9232000 9506651
4257 9506651 9782428 9783433 9810509 9667363 9675996 9704505 9640946 9486472 9284843 9500227 9345599
4246 9345599 9315979 9326989 9321119 9237201 9209321 9120664 9030893 9106641 9130269 9115936 9129807 8980302
4234 8980302 8947174 8999189 8853709 8845322 9097464 8922725 8806143 8775367 8624873 8512219
4224 8512219 8441560 8343102 8267110 8180620 8314639 8412447 8420345 8380337 8280358 8061399 8063004
4213 8063004 8143312 8166402 7899660 7894320 8094203 8175685 8359553 8370535 8397431 8318587 8296101
4202 8296101 8486488 8559515 8622533 8372455 8089184 8057521 8258768 8091296 7888070 8060192
4192 8060192 8019069 7903256 7705111 7695836 7646122 7653226 7665821 7658930 7528460 7439995 7577971
4181 7577971 7437541 7449226 7592907 7703779 7665409 7536660 7681976 7520073 7649659 7585752
4171 7585752 7448543 7639570 7453196 7327946 7484236 7629351 7627970 7570251 7588993 7484147
4161 7484147 7389381 7425215 7373824 7294967 7192691 7118108 7151287 7049496 7171105 7155091 6986493
4150 6986493 7119187 7128771 7054870 7123020 7060574 7222670 7092025 6991377 7055044 7236216 7146785
4139 7146785 7138031 7190879 7010313 7102647 7220900 7405051 7376032 7269434 6994900 7048314 7009031
4128 7009031 6887281 6934401 7089866 7169968 6912269 6933822 7038566 7202241 7044483 6908225
4118 6908225 7215853 7168704 6967298 6806427 6951442 7045540 7114917 7092660 6943889 6943097 6808650
4107 6808650 6810655 6747876 7144606 7219444 7145406 7236449 7169478 7120755 7040287 7177946 7089889
4096 7089889 7285418 7330139 7127524 7102113 6995120 6844389 7115500 7243561 7233783 7046867
4086 7046867 7238535 7359124 7629656 7661207 7475206 7526518 7805570 7741886 7587456 7695821
4076 7695821 7842201 7841968 7869416 7865974 7795118 7687825 7777411 7740553 7858976 8002540 8006354
4065 8006354 8030379 7863551 8094671 7989147 7845760 7843979 8020976 7868858 7891831 7771657
4055 7771657 8000816 8184564 8188547 7954231 7949833 8040627 8040069 7988447 8112023 8278196 8312688
4044 8312688 8138856 8085107 8202461 8158252 8021868 7908976 7988016 8074365 8117226 8027463 7883096
4033 7883096 7846271 7713261 7792810 7856472 7928748 7969310 7835309 7953300 8067352 8187906
4023 8187906 8441708 8368539 8218062 8221859 8161733 8205369 8028116 7856330 7815090 7748617 7670391
4012 7670391 7718654 7633679 7668040 7808019 7890858 7724674 7636360 7667969 7631555 7722403 7623918
4001 7623918 7579335 7434822 7210314 7320361 7409440 7193816 7143379 7151252 7373202 7496964
3991 7496964 7154768 7134171 7341078 7047029 6931936 7042886 7064583 7047756 7027296 6949464
3981 6949464 6886816 6827681 6846634 7040307 6994228 6938204 7066429 6945508 6574845 6676251
3971 6676251 6684686 6597496 6632095 6443811 6556409 6495115 6273258 6298414 6268629 6421370 6358857
3960 6358857 6355178 6211308 6167886 6156441 6337571 6317119 6269265 6120936 6211349 6133418 5900167
3949 5900167 5868354 5911844 6008869 6233959 6233476 6139114 6100042 5975577 6022065 5995144 5990715 6268891
3937 6268891 6305946 6208684 6304160 6402022 6311430 6202064 6287550 6184322 6276652 6076486 6029171
3926 6029171 6109493 6020270 6016919 5943568 5959414 6123271 6273781 6269280 6317807 6542931 6510600
3915 6510600 6388998 6394253 6386350 6456896 6461118 6218160 6257855 6391174 6268782 6099933 6001000
3904 6001000 6067098 6159062 5999194 5939248 6002945 6102315 6303545 6238131 6007523 6196419 6118881
3893 6118881 6027912 6145189 6218717 6270880 6226569 6053462 5834545 5767121 5800408 5606598 5583208
3882 5583208 5450479 5650368 5879693 5839434 5982049 5981454 5963013 5800667 5780576 5827995 5776044
3871 5776044 5833326 5944669 5887326 5753185 5768810 5720104 5505294 5542736 5549805 5421779 5399421
3860 5399421 5348414 5299570 5478021 5577729 5570545 5554597 5517259 5398346 5411812 5327421 5296457
3849 5296457 5270696 5303974 5368995 5366199 5508595 5431423 5640967 5579104 5531599 5600048 5253319
3838 5253319 5419806 5612792 5522447 5485436 5327661 5318607 5493062 5566527 5563992 5466521 5512504
3827 5512504 5391423 5379722 5300037 5305694 5257493 5357871 5260950 5252235 5565659 5464879 5417055
3816 5417055 5298373 5381862 5367415 5304469 5334857 5321177 5170411 5168148 5174857 5056540 5116480
3805 5116480 5012441 4863062 4643628 4819729 5019322 4868214 4740438 4912166 4902889 4747095
3795 4747095 4565143 4228782 4316560 4533844 4620588 4543639 4343694 4308050 4430226 4392950
3785 4392950 4297270 4438849 4435159 4503180 4447754 4443351 4574529 4474114 4313676 4036327 4190189
3774 4190189 4091538 4093369 4177075 4244652 4378790 4408892 4272689 4062996 3988528 3947140 3961616
3763 3961616 4019676 3648017 3883866 3904761 3956343 4060236 4037438 4018774 3925833 4227840 4148137
3752 4148137 3895619 3890150 3861484 3937682 3864834 3773545 3943595 4123798 3999793 3777081 3575284
3741 3575284 3517193 3808533 3795013 3794012 3964685 4172507 3937418 3651131 3876499 4197024
3731 4197024 4150605 4137139 4239695 4222714 4438457 4280079 4242502 4422579 4362673 4110346
3721 4110346 4097355 4131045 4035507 4149009 4216534 4286228 4071517 4009767 4095269 4264734 4223575
3710 4223575 4104825 3881810 3918427 3881319 4023011 4251047 4167598 4056812 3764284 3814166
3700 3814166 4000692 3858470 3935037 3954143 3805303 3857488 3903101 3709013 3701438 3725273 3806670
3689 3806670 3891535 3854101 3927887 3964279 3943337 3982137 3940060 4135984 4032014 3947072 4010528
3678 4010528 4090657 4161569 4108125 4258797 4293280 4286214 4434394 4338016 4341284 4631253 4631128 4576989
3666 4576989 4412545 4301658 4188424 4151651 4162529 4205400 4403557 4281227 4220560 4319988
3656 4319988 4527719 4692375 4633824 4561452 4671072 4693053 4809977 4805792 4674085 4581070 4601337
3645 4601337 4747664 4792218 4585724 4408333 4507384 4553800 4519045 4510265 4507531 4589870 4468712
3634 4468712 4274631 4303431 4366670 4375495 4363524 4280899 4270685 4352796 4230725 4282945 4366538
3623 4366538 4488390 4522429 4583947 4485622 4369083 4476388 4500286 4707825 4519616 4490560
3613 4490560 4692753 4715612 4839210 4687183 4755710 4966587 5082846 4902477 5041371 4999541
3603 4999541 4802934 4851131 4981358 4954310 5081776 5028596 5236043 5475396 5511179 5253346
3593 5253346 5134896 5369084 5642523 5795736 5888412 5796428 5690789 5590945 5499410 5312613
3583 5312613 5411446 5498463 5491360 5637474 5662549 5824379 5808273 5890226 5962164 6028590 5997407
3572 5997407 6170546 6379623 6332588 6208247 6325320 6515366 6500551 6547485 6621776 6588848
3562 6588848 6548870 6502300 6733280 6874307 6962172 6785707 6728828 6982082 7187061 7489117
3552 7489117 7529293 7414571 7745143 7897101 7816123 8000939 8074096 8237975 8409209 8291074
3542 8291074 8144708 8220706 8566775 8905801 9051791 9256520 9556835 9690952 9771391 10017253
3532 10017253 10208245 10297959 10332951 10706256 10822743 10817019 10929914 11169987 11350430 11436629
3522 11436629 11543134 11875519 11965822 12195511 12453722 12779069 13065868 12959974 13297503 13547899
3512 13547899 13786127 13918619 14115049 14271842 14557182 14903164 15197927 15475474 15927689
3503 15927689 16309619 16702587 17202461 17801676 18634958 19277624 19940346 20794857 21736601
3494 21736601 22491660 23421595 24594829 25701515 27167427 28315403 30093909 31790360
3486 31790360 33150387 34756032 36235979 37430606 38263497 38909766 38824295 37634857 35353304
3477 35353304 31843056 28379639 25241903 22960441 20930698 19228199 17829639 16942380
3469 16942380 16052839 15170880 14694595 14226353 14240848 13649524 13061497 12635211 11924904 11238153
3459 11238153 10899533 10234403 9684911 9336755 9105536 8810632 8519702 8397678 8107843
3450 8107843 8018986 7772977 7664328 7524164 7272608 7164783 7114093 7015112 6914550 7075804
3440 7075804 7145912 6977868 6892771 6938893 6614116 6494612 6671244 6228949 6044225 5974691
3430 5974691 5430661 5281106 5073663 5229903 5052573 4987028 4866782 4566563 4615413 4561193
3420 4561193 4575915 4563635 4462053 4346432 4178049 4118171 4041221 3934944 4016751 4100427 4130976
3409 4130976 3914419 4065160 3940128 3723766 3755748 3660714 3615860 3475771 3440366 3562510
3399 3562510 3588457 3475848 3473596 3430467 3503842 3579145 3355778 3478316 3334160 3260834 3216531
3388 3216531 3224083 3298541 3106950 3047162 3145672 3034691 2939719 3022259 2839208 2961706 2910628
3377 2910628 3102354 3132334 3205856 3035967 2732794 2699082 2720003 2681774 2500023 2378406
3367 2378406 2513111 2435576 2164030 2049310 2345543 2312118 2315266 2463141 2564116 2588916
3357 2588916 2513571 2315378 2397089 2495856 2357620 2284582 2449559 2327313 2281655 2169861
3347 2169861 1979425 2188266 2097146 1986418 2021628 2012051 2006146 1955585 1936573 1870757 1825017
3336 1825017 1979993 1898292 1976062 1875817 1911818 1825401 2009759 2125549 2138209 2015523
3326 2015523 2198619 2298639 1946114 2059808 2103535 2220330 2273572 2345217 2287066 2047717
3316 2047717 1895763 1986368 2183901 2021311 1841829 1736788 1867376 1862705 1795338 1794676 1903107
3305 1903107 1875025 1716919 1703855 1854864 1977714 2074084 2097613 2105353 2216180 2295018 1991827
3294 1991827 2032557 2010791 1967699 1854720 1647654 1749932 1770171 1787145 1648919 1558070 1508114
3283 1508114 1443007 1511360 1611243 1732623 1694392 1728649 1666075 1805016 1692580 1807337 1836239
3272 1836239 1694520 1602903 1394034 1364882 1614202 1892240 1891198 1846176 1781937 1781746 1883025
3261 1883025 1852895 1678188 1815951 1839583 1768415 1780401 1739919 1742462 1715288 1651188 1836183
3250 1836183 1709119 1701633 1855250 1680576 1750868 1818209 1713069 1541050 1552707 1730157
3240 1730157 1881411 1860233 1911127 2053997 2038463 2116576 2020878 2050046 1927345 2025589 2004221
3229 2004221 1767483 1768965 1723548 1910246 1917903 1862665 1698136 1794765 2016447 2081181 2073320
3218 2073320 2010221 2162951 2023249 2187565 2074632 2038290 1917958 1995734 2092855 2026693
3208 2026693 2045898 2160794 2079049 2014543 2187235 2453746 2580873 2417770 2342259 2381938
3198 2381938 2522195 2758939 2693179 2633351 2693269 2769997 3253413 3439811 3583438 3814453
3188 3814453 4061273 4139783 4019846 4051592 4102997 4035159 3703459 3672965 3667985 3559972 3666224
3177 3666224 3620803 3494006 3615862 3644913 3841100 3841742 3935327 3969748 3933221 3972615 3940211
3166 3940211 3861685 3887406 4198976 4330466 4425516 4661403 4781831 4862990 5189793 5164540
3156 5164540 4932587 5007957 4969501 4873527 5075608 5096722 5147053 5196754 5340950 5306935 5589071
3145 5589071 5804938 6161010 6001996 5816400 5646123 5078318 4999801 4575966 4352114 4351090
3135 4351090 4300707 4007977 3802293 4011030 3702794 3721567 3846645 3847229 3923857 4005763 4000854
3124 4000854 4068462 4044929 3949920 3901821 4005399 4146725 3949623 3912543 4049344 3960056 3853791
3113 3853791 3635881 3471812 3482398 3532754 3345357 3224328 3128170 3106365 2981903 2869174
3103 2869174 2891239 2714036 2878247 2883402 2639587 2468717 2571069 2666801 2453244 2004354
3093 2004354 1997184 1995224 2080857 2095607 1942798 1755162 1731993 1540266 1481552 1545669 1489796
3082 1489796 1646022 1464966 1448948 1511726 1588074 1531150 1450943 1426688 1275880 1376318 1313574
3071 1313574 1274426 1159890 1060997 1279974 1245384 1134807 1212703 1179082 947009 752610
3061 752610 926295 922538 905505 1040798 821284 594853 605068 670160 665689 767839 809174
3050 809174 627137 581669 504108 650743 795425 615404 652722 674378 745879 644312 558267
3039 558267 413315 439807 452596 307325 427256 486368 510207 501417 557841 689496 523610
3028 523610 370363 532224 356859 439856 639644 676525 630824 606228 406425 423143 401866
3017 401866 416110 437351 436544 620985 735838 715943 520626 560080 491882 551844 336137
3006 336137 299999 308235 305821 342332 183298 350533 341124 492046 595500 372491 150708
2995 150708 34718 217000 202439 163266 275486 294426 470921 403624 263262 357264 454646
2984 454646 425717 310809 467398 324569 417297 294895 256737 316894 209986 208598 145312
2973 145312 172017 214270 326369 459876 169283 338898 508741 638266 446860 121252
2963 121252 393818 382504 355895 457251 447304 184776 134133 132175 70572 108769 324229
2952 324229 363499 254303 196772 290633 182022 158508 126255 281274 320650 145469 37715
2941 37715 266283 345810 247382 145171 158540 227316 91817 -65429 27169 97342 159087
2930 159087 270373 396092 462507 344630 334066 248951 419441 401192 112792 47478 149737
2919 149737 143519 -88642 -174451 -7702 17083 3934 -6361 116964 331 37227 92759
2908 92759 143666 263476 406373 413194 156823 -33584 215737 232402 247695 138084 253695
2897 253695 454622 282390 185288 120479 51523 -19307 45195 85637 282925 293089 308862
2886 308862 231377 132467 128372 147137 124877 237914 184808 195097 413618 475804 161891
2875 161891 32710 214438 298108 212087 33453 -69972 -80982 -110769 163256 95270 105971
2864 105971 167401 108196 102314 127071 232527 309191 197162 193722 285585 207475 293884 345697
2852 345697 56757 -10236 96880 112972 240422 220668 170176 20538 -3990 266864 171591
2841 171591 -142569 -85015 -194079 92340 330240 211237 127674 369146 461541 337720
2831 337720 211167 327710 237331 115633 42484 -41971 -70508 -128731 7322 357489 255474
2820 255474 41901 163907 192872 111373 92651 67806 78284 389598 86607 -39218 -164144
2809 -164144 -188152 -72371 -10027 -56246 -63923 63666 243103 170881 254836 235337 90308
2798 90308 25578 -7033 95922 161101 280334 -51067 -151246 -26623 -61498 -55931 194556
2787 194556 135015 191986 232525 256579 76235 -2062 -58914 -81319 186166 130990 272026
2776 272026 343248 326087 345940 159691 199863 151605 261558 484802 67474 -141535 116993
2765 116993 223431 -74584 -81368 -90104 -28692 -37588 13458 27471 -120508 -181950 -112197 61487
2753 61487 -78667 -26903 -61624 -81498 17569 90037 189038 197747 280392 170041 102567 32094
2741 32094 -39345 35569 35737 126829 63730 29030 -14661 -13053 -138133 -219419 -94972 176733
2729 176733 151620 75050 68390 292013 312615 250766 154597 151822 87737 104162 68978 44740
2717 44740 -76386 60937 150156 144460 -20897 -195104 46652 107382 224716 39797 174893
2706 174893 153343 53341 73686 -90872 -140269 -63218 -36778 147592 301057 195404 163924
2695 163924 106260 82819 77881 26488 -9087 2066 85388 -20433 165028 229289 135464
2684 135464 41051 -74771 43932 271290 49719 -17925 3588 -39573 161719 344476
2674 344476 151375 72761 -65841 -57247 117958 2150 -81008 -102591 -4015 -5832 -20044
2663 -20044 80541 38080 112397 228245 216482 328647 372227 184932 318879 269595 152649
2652 152649 147769 229169 183290 205789 360139 254162 365189 299040 140862 106124 134877
2641 134877 349159 342407 272549 79941 19965 239932 335569 337331 82467 183935 272212
2630 272212 88947 203394 311320 242259 248733 256703 32702 288744 515551 445684 360303
2619 360303 561790 473457 643862 872086 886907 831601 695567 596396 476488 426123 336638
2608 336638 253392 152359 199270 334823 217554 125121 319306 289124 251519 293247 352399
2597 352399 258799 257663 60039 26121 183977 283076 187797 179490 125818 262890 179760
2586 179760 120440 250366 353182 100672 66550 58073 -199720 94462 237926 207297 86731
2575 86731 277269 310930 215767 323433 227601 344559 415957 374205 349529 446527 364151
2564 364151 360079 237429 158063 69617 196790 167875 132517 235119 328565 280678 280677 246636
2552 246636 356979 281888 103486 138775 215928 246647 292455 274011 254557 413264 499744
2541 499744 569642 431970 465776 462370 506272 611409 565261 491328 336916 490012 213655
2530 213655 127961 173798 164020 467211 523523 574421 544136 488763 528114 520383 567779 688302
2518 688302 618890 351970 287112 374464 348255 487079 570195 825363 868239 711443 423826
2507 423826 513986 539071 472856 635506 884649 894627 760041 709997 704983 728775 584090
2496 584090 636326 534982 654230 849412 786918 799098 882451 797830 704430 801982 649394
2485 649394 877960 835198 783793 856161 908629 1000125 1018151 928801 933971 840731 721002
2474 721002 804396 982929 1044585 809530 687586 825825 1028427 1289266 1195273 1110393
2464 1110393 1125058 1182827 1207774 1116929 1091672 1245369 1053898 1050676 1117283 1078668 1223588
2453 1223588 1376392 1357271 1215159 1285404 1251359 1275123 1227054 1501955 2019713 1903750
2443 1903750 1759258 1757056 1857350 1712670 1899194 2077722 2008230 2007023 2056919 2043009 2077455
2432 2077455 2312150 2351905 2609902 2772549 2514800 2422399 2426800 2531610 2596272 2789093
2422 2789093 2988562 2982375 3005823 2992616 3089971 3138099 3198435 3398098 3526636 3592793 3606614
2411 3606614 3586078 3827989 3905367 4062347 3963171 4183663 4126176 4124426 4156141 4236785 4579157
2400 4579157 5001838 5004862 5227699 5366267 5452440 5769747 6224246 6721834 6744360 6743058 7126739
2389 7126739 7567319 7710385 8142197 8447474 8798665 9057984 9433384 9656106 10155056 10488042
2379 10488042 10563823 10805968 10920430 11282609 11514868 11929120 12480878 13023792 13498195 13995608
2369 13995608 14638966 15408293 16181252 17283517 18645981 19912406 21634097 23152487 23954820
2360 23954820 25226818 26660508 28672348 31302604 34367430 38606015 44494098 52157427
2352 52157427 62904370 77175559 95823763 121290558 149969489 159793174 140488524
2345 140488524 112015839 87310688 67463557 53427752 43668180 36937190 31939342
2338 31939342 28119950 25259902 23354924 21755012 20594913 19995564 18961148 17427159
2330 17427159 15804325 14498169 13227799 12365397 11319316 10505270 10046144 9648022 8949592
2321 8949592 8468947 8273708 7598194 7262022 6906133 6383140 6041712 5758423 5457248 5128658
2311 5128658 5056260 5015662 4780283 4845511 4765243 4406278 4061464 4066465 4045422 3705679 3456699
2300 3456699 3187517 3238326 3122446 3194527 3181522 3150560 2916575 2928357 2805275 2585829
2290 2585829 2566883 2449560 2433670 2295763 2155422 2125358 2074950 1925130 2096088 2071263
2280 2071263 1831857 1779062 1765707 1681787 1669250 1699330 1485903 1514474 1560252 1452395 1239860
2269 1239860 1358293 1343101 1227139 1215677 1430509 1166284 1154681 1373140 1332382 1329452 1194210
2258 1194210 1092607 895157 877315 785458 614324 725071 713244 825498 778971 706171
2248 706171 533460 466691 457809 588193 716994 692248 602725 485576 657834 711821 824511
2237 824511 895990 652674 603978 544506 570528 652601 360663 501634 410468 536020 433879
2226 433879 342257 529392 513785 608157 562231 485912 310919 222659 296428 233370 264221
2215 264221 451132 453429 442918 141393 104470 177124 381803 608982 344362 256544 244048
2204 244048 352773 378816 293241 301935 294431 -64221 223576 326108 252846 149650 229320
2193 229320 301526 243397 4269 5883 37855 209820 393442 334977 200304 116043 -32952
2182 -32952 283204 488310 418741 401242 318375 465561 434835 389193 261832 102913 278703
2171 278703 132441 -160473 -34880 93082 601 -82442 120104 -34982 186724 133114
2161 133114 171903 115206 178099 227705 70046 107776 102634 192807 158320 -51633 47948
2150 47948 211850 334213 394599 222312 317693 313720 156446 159378 143830 130882 77989
2139 77989 228631 -6172 -67769 -6452 83823 222106 215672 155441 230881 350493 276805
2128 276805 205450 177306 88048 -50341 9778 210505 235807 43655 101137 145682 233653
2117 233653 306961 210019 152278 39537 12645 141373 144752 412909 109722 130908 208558
2106 208558 214184 299655 312019 62046 180515 267457 31921 -150421 -213626 -59404 235766
2095 235766 238468 225805 378904 93170 101228 376457 223999 48049 43332 160758 291636
2084 291636 277349 432240 307794 628195 758828 784283 801542 722594 618361 521075 469426
2073 469426 458519 376433 297813 167583 181623 326650 79323 164379 7950 -89764 75003
2062 75003 -6812 33707 -24650 -172634 46293 -61475 2275 220256 82051 13197 109252
2051 109252 179391 200757 224132 179764 144566 261546 180194 -105271 59505 174089 103090
2040 103090 -39602 -36536 13189 115774 7317 -43649 53834 29268 33767 172292 185371
2029 185371 207354 55693 60396 -1888 -80625 -17146 -1863 83246 120204 -55048 85934
2018 85934 252028 54707 34823 249980 306303 212840 181562 118371 -47646 -43507 -82616
2007 -82616 -85386 -53950 -11022 -93738 170763 61446 -93803 -200847 -151225 85109 98060
1996 98060 -27062 88823 172914 -9665 -47696 -15212 98100 103833 -65343 7808 240221
1985 240221 27760 -171311 -121835 -91837 -20979 2235 -41183 157128 182628 68407 -157060
1974 -157060 73527 -69067 -23291 -118917 -155845 -114771 -179462 -156039 -36076 74303 84049
1963 84049 -122158 -155474 -198947 18271 6582 -12076 -101892 -230278 -313671 -303809 -26190
1952 -26190 44479 72247 22277 31597 10140 -66884 -127219 -128630 -277864 -162568 -154550 -72520
1940 -72520 -39796 90260 -131093 -235035 -191954 -257207 -67344 -136785 -74412 -146358 -94819
1929 -94819 -9423 -219741 39670 127227 160705 184792 85583 201618 -5545 -114945 130106
1918 130106 85855 -4632 38085 -208782 -181400 -250003 -287202 -50187 -28321 -13095 70426
1907 70426 -125452 -123824 -182862 -93843 103476 162546 51610 112806 -15822 -127210 -2361
1896 -2361 -135053 -128786 -172105 -89264 -91335 22473 -141255 -165527 38400 43810 -96447 -149714
1884 -149714 -59441 -26554 -59924 58577 -120559 -13815 117780 83973 15863 -56741 -19917
1873 -19917 4574 -28103 -119683 77035 62297 2108 206668 45437 -124008 74877 129138
1862 129138 182541 -166053 -244041 -178502 67009 -12815 -126899 -107390 -59282 -115774 -94539
1851 -94539 -46181 -240796 -221503 -266533 -284486 -88154 -34392 -58291 -157170 -154470 -94919 -170410
1839 -170410 -154303 130702 125334 -173375 -115289 -32782 -68179 116190 211731 -48686 42356
1828 42356 139266 68657 -46552 -67283 11318 57205 43953 45390 -63734 -102229 -36018 35808
1816 35808 13246 -88503 -98947 -38002 10216 -103691 -103455 -11659 -103178 101221 -57136
1805 -57136 -56916 48833 183095 -7854 66146 187028 318045 141123 1981 -4783 -22182
1794 -22182 100373 128621 -42741 88160 -38035 -35834 -144005 -41952 -115972 -208502 -146855
1783 -146855 -206118 -102837 -248583 -166788 -133292 -142749 -282389 -83594 -104415 -168288 -222941
1772 -222941 -109581 -22189 88416 -34109 -93393 -165556 -321437 -288668 182188 235876 -87197
1761 -87197 -128132 37976 34784 -71420 66194 116934 106428 259161 306959 35204 416
1750 416 -112673 -22041 -103918 28664 -170586 -234317 42662 -6190 167098 29475 -102104
1739 -102104 -94403 -62653 -163630 -177388 -108301 138700 82678 201631 27323 24257 -19119
1728 -19119 -175138 -260375 -135349 -52547 -43781 -162383 44593 96104 28894 -164559 -67267
1717 -67267 -41003 -42689 -68119 -290443 -283772 -136706 -132332 -471245 -452779 -270317 -241726 -171656
1705 -171656 -276366 -422749 -171982 -52440 -31439 -79212 -322617 -224268 -82487 -55235
1695 -55235 -70608 -21276 -18795 -50985 160736 107567 -85226 -192450 -233745 -160091 86544
1684 86544 -131291 -241343 -209540 -32358 32224 67447 113 -117841 -147921 -79783 73237
1673 73237 133394 80080 67453 31999 129879 178262 -20412 20849 28127 -97009 -6897 -85057
1661 -85057 -90992 -46950 145896 153729 -23173 -158906 90257 20282 -186478 -119639 -99918
1650 -99918 -12244 159009 81722 49282 80779 31592 141786 88429 20649 -325327 -320388
1639 -320388 -118169 -58561 -112248 -68122 -137404 -200594 -129708 -28185 -48376 26298 319622
1628 319622 220294 -89093 29077 -16575 135837 167267 73601 119059 47279 163967 -2164
1617 -2164 140067 228889 139646 156268 109818 -61784 -129942 -170122 -132867 -98870 13554
1606 13554 -27727 -39127 -142685 -193712 -40494 57705 8057 43067 67662 162679 64425
1595 64425 -23182 2476 -94731 -209035 -105963 -18316 67422 166339 -54013 -202327 31102
1584 31102 9251 -109418 44199 7713 131363 -38860 97620 270205 146669 -24013
1574 -24013 30012 52889 2110 18126 -50060 23389 -68406 103701 6523 -174198 -193386
1563 -193386 -148372 -44527 91963 125229 -71553 -264147 -109714 19585 -110425 -135077
1553 -135077 -28868 -138025 -278876 -183320 -173831 -83084 -75456 -80834 -40307 -29729 -68421 30478
1541 30478 -90524 -91530 -31300 107267 -116257 -201653 -28522 16790 219664 8428 -93171
1530 -93171 -64345 -150693 -85434 52712 128717 56582 86436 -67840 -75373 -96055 -72129 -84815
1518 -84815 18553 -56553 -121140 -144977 -79514 58101 -249568 -329344 -176428 -145269 -64194
1507 -64194 -80804 -80574 -1410 84509 -56016 -119189 127865 246758 190866 201719 37983
1496 37983 70458 256336 -68269 78142 203613 337860 168781 -135836 -129212 45478
1486 45478 120682 17310 -239647 -243842 -136570 -228302 -243288 -104195 178614 -11559 -23526
1475 -23526 87649 153195 119114 97151 26699 25088 83579 217413 264886 172579 67550
1464 67550 -62044 7070 -71251 -49690 -42017 -209148 -165586 -230678 -319846 -104564 113975
1453 113975 84806 36835 1404 17298 50240 14021 106766 247690 93585 -206117 -283054
1442 -283054 -148990 -155690 97423 85191 -29332 149 -5572 -73090 -142947 28787 82112
1431 82112 -19456 -31577 -90156 -16891 216235 93105 -77987 -171047 -270575 -320660 -230033
1420 -230033 62772 63021 20234 -34077 -50994 80060 -199671 -141600 -214986 -249210 -74229
1409 -74229 -95242 -83522 -30388 -191508 -174900 -188237 -76016 -119235 -73768 -9588 -5968 -223357
1397 -223357 22158 39470 -183289 10580 104691 -73504 -77810 -72686 -74351 -193523 -242255
1386 -242255 -70535 -59402 -63865 269922 283438 157434 214110 166796 27709 -58317 -210133
1375 -210133 -46198 108886 -219356 -184526 -21208 -148039 -91443 64228 -80642 -124133
1365 -124133 222040 172313 112569 -21520 -96440 107278 7147 -63896 30153 59768 49706
1354 49706 -18998 -97372 -189209 -140057 23146 -11045 121070 50211 72203 66043 10572 -109990
1342 -109990 36269 26558 -47909 -157159 -72279 -4358 -49131 -168628 -198891 -343442 -112353
1331 -112353 -86485 -25138 -101187 -146057 -87044 -74078 -92384 43041 94656 55509 -88619
1320 -88619 -194433 83461 297909 304184 126757 -23373 -122137 -77786 144318 129996 157378
1309 157378 -115536 -79387 -100103 -120428 -151923 -49489 -19796 -27926 148058 -37375 -173050
1298 -173050 -2796 102753 12763 83533 174499 53279 66209 274929 45912 66327 34930
1287 34930 -150449 52120 190034 168462 184941 -98195 -42944 -142514 -69952 -85878 -176713
1276 -176713 -118365 -203366 -205718 76306 145535 168523 46819 190698 167700 32526 7247
1265 7247 -7145 98674 95635 -12975 -116157 -58795 -158880 -91443 -51640 -152372 -121706
1254 -121706 -98693 -98362 -70260 -165126 -129924 -62590 30493 3694 -75898 -85636 -170630 -194846
1242 -194846 -273056 -150223 -185395 -236965 -168714 -87541 -947 231601 42236 -154540 -67421
1231 -67421 102913 210920 166035 52310 -55297 14289 -52593 -127339 -28509 -25334 -58568
1220 -58568 -136119 -59881 -130484 -181355 258923 359486 183853 83708 -97215 -268125 -33591
1209 -33591 174966 260912 226367 82517 131230 7241 -238806 -235889 -105752 14733 -93638
1198 -93638 153465 94536 -39227 76888 -67445 404 20433 -271136 20080 387726
1188 387726 199000 246549 147448 117132 -10870 96907 153558 66350 -85456 82790 194096
1177 194096 226087 215898 62905 -71845 -46175 6019 49940 -126877 -44841 51358 -108282
1166 -108282 -199954 -55396 42399 -5501 142732 14937 163951 79164 250055 222753 113516
1155 113516 120821 99044 212501 -20518 -224312 -199638 -91175 -230343 -158698 -193279 -297117
1144 -297117 -182668 -97328 12656 -51827 -73557 -202233 -227029 -79016 39840 51692 -181738
1133 -181738 -30249 179438 -17879 33827 -217654 -176309 -61208 10476 -34184 108317
1123 108317 9730 -53969 -47874 -61804 -130528 -84921 -255021 -188436 -125623 -118995 -74478 23222
1111 23222 -79515 -55169 121409 6267 -11353 -64927 -93723 -45477 -17762 -15700 46004
1100 46004 9142 61903 72394 -28110 -48046 2110 -127578 -181446 -111100 76825 -4036
1089 -4036 -278859 -123070 -86247 -89633 -50965 10507 -58035 -79825 51230 -66805 -99477
1078 -99477 -40234 87922 91484 272851 7192 -26770 -1202 2275 -58041 -40617 -94244 44112
1066 44112 130591 139628 178726 109469 154738 101607 -47426 5111 42245 -172825 -173856 -47631
1054 -47631 63035 14905 122078 182800 154854 -36171 -56889 -194342 -81056 -92419 -153112
1043 -153112 -119618 -288742 -74859 -155799 -145597 -252555 -122895 -35632 -96880 -225402 -91291
1032 -91291 -264827 -84953 26906 -89842 -352880 -348954 -151798 -135311 -49536 97051 -81863
1021 -81863 -131177 -40615 -199821 -192070 -113349 59230 -115445 -194562 -260126 -142829 -68241
1010 -68241 -237396 -158832 -125628 -179893 -230812 100478 36717 -60513 77066 -39611 -95577
999 -95577 -114297 164432 22261 69975 7333 111578 90729 44161 20946 -13747 102261
988 102261 -37082 -128461 -87753 160544 -105934 -395694 -234452 -149880 -94345 126722 319081
977 319081 242738 -42335 -90605 -264601 -309760 -311552 -176542 53035 -46489 -190678 -151687
966 -151687 43156 -51571 -13022 -143506 -15604 -59050 95709 -142050 -40647 42170 66451
955 66451 -56865 12549 -59259 39591 69899 37357 101580 -22836 69913 56294 28465 -103571
943 -103571 -206715 -299324 -204156 -155904 81556 43132 80028 -100925 -227238 26972 74336
932 74336 86999 91968 5321 112029 88043 -40623 -76042 -12961 112626 252122 -11356
921 -11356 -38111 85496 -13461 -18871 11136 -10521 -8330 -11657 -26556 -31616 -101658 101504
909 101504 38583 -180331 -80773 -16561 15010 48311 -9420 245278 209379 231483 -71044
898 -71044 -185753 -141896 -146523 -79886 -282978 -199910 -140515 103334 14094 -104224 -57452
887 -57452 174506 32595 25712 -60720 -96249 -219373 -60975 67193 111817 14812 -247396
876 -247396 -212387 23826 -6702 38527 64535 -67711 -21059 981 -5964 -22478 -43641 -231080
864 -231080 -130874 135092 62183 -34445 -131744 1921 -65007 -117335 43105 104522 6402
853 6402 -219772 -284337 -338078 -284593 -230917 -12406 -60005 47058 121382 155590 212439 167050
841 167050 119010 76375 -48853 -36889 -109213 -78836 -179305 -3791 171839 35637 -4667
830 -4667 167231 134316 39359 130333 66650 52124 33353 -128828 -75168 -36838 -40789 -136607
818 -136607 -13487 -57626 -111481 103779 -131338 -150546 -75831 -339887 -212506 -214815 -308750
807 -308750 -110832 24734 -38732 -135511 -88928 -155733 -62295 7917 -107024 -210980 11788
796 11788 113553 133305 253076 330830 207201 101101 41831 85774 248018 333489 196680
785 196680 179560 32055 55078 -100021 13621 181239 101589 139592 31951 -188150 -149224
774 -149224 -37786 37703 11206 23559 -73078 -139180 -37772 43495 21049 -141860 53534
763 53534 191047 83512 -130047 -123086 -86369 -135448 11466 531 -90615 9521 -295002
752 -295002 -281387 -199611 -132050 317439 143904 196298 296343 -25441 -5680 -4987 -1217 -42589
740 -42589 -66112 -28237 -129998 -122777 -69516 -7139 28205 -208206 -139328 -228833 -203804 -149649
728 -149649 -212633 -182492 -46272 97591 -63929 -59644 148485 226399 90357 -63804 65111
717 65111 24828 -176753 -238440 -114644 182065 -4693 -34179 -134219 -93141 56894 63357
706 63357 126302 214697 213110 18586 -171219 -172883 -104733 -119817 19543 -48319 -7029 -74535
694 -74535 -6668 60281 122091 -284819 -257820 -25543 41662 -137594 -342778 -193490 -147128
683 -147128 -114470 -158320 180687 200817 5414 -20389 -58500 -11012 -70015 -5716 -164641
672 -164641 -66826 -124400 -66058 36972 -51937 -28267 56541 -65839 6843 100191 13214
661 13214 211961 57088 2744 -56922 27478 33265 -19549 40469 2379 179528 73661
650 73661 4228 150627 -639 103515 157892 50764 -256883 -124645 -92520 -170425 44802
639 44802 186058 184636 137542 -55409 -27057 40033 -64762 26388 -135682 -66026 -7077
628 -7077 -78810 152177 39469 152889 64737 94483 109243 141654 132824 86513 1835 -132809
616 -132809 -81545 -107928 21284 231957 216151 122839 -74843 150385 105172 -100396 -198494
605 -198494 -37555 12003 -132985 19588 210389 178906 -103295 -125482 -6489 -22210 49828
594 49828 -49870 -15804 179421 45336 131803 119029 14113 55927 94295 73739 148300
583 148300 17989 -49591 129745 288783 220913 43031 -229297 -25821 322423 240202
573 240202 102113 106904 25862 8710 136241 292063 226843 191410 133796 -97491 63870
562 63870 237996 52023 115713 110013 105668 76131 9347 -4159 -4949 -31463 -193379 -336081
550 -336081 -104449 -184769 -196582 9631 152117 40623 -171814 -62505 -65009 -145575 -54943
539 -54943 28834 59921 109638 155637 209684 107994 -148975 -121245 -18189 -49576 66447
528 66447 -27359 -160868 -195449 -101640 -20255 43512 76372 203458 182306 123988 -63494
517 -63494 73452 117468 58818 -64705 -292546 -207304 17923 -112872 -125279 -35304 -77590
506 -77590 26041 -53307 138813 -19765 -76862 -50818 254473 55610 156402 175700 -77755
495 -77755 -143348 52407 -61481 30876 85818 -82200 20980 -76656 26176 223632 700
484 700 -150298 41428 80696 36158 -129636 -69603 -139842 -224751 -118760 52209 7819
473 7819 122952 212100 83647 225865 108026 -129028 -14406 276591 217047 -9250 -98099
462 -98099 -38324 97379 41926 133698 -73353 -92612 60732 327927 99441 13286 -94066
451 -94066 -134563 -190625 -13367 1910 -120200 -138769 168498 163787 57706 -36779 -205644
440 -205644 -17006 38077 236650 141323 83243 136276 207846 153885 227684 194215 214703
429 214703 124370 160519 8091 -265607 28702 245544 -2425 26592 115081 -79513 2271
418 2271 -103510 58008 59972 -5389 168880 45066 12648 48742 -119604 -39621 -54009
407 -54009 -106677 -133684 -4261 -8109 -80955 125759 92964 -32440 -76219 106363 -29126
396 -29126 -26436 185165 -16847 6086 192478 115858 151591 167400 17306 -37770 30740
385 30740 345403 101507 88810 146689 69053 -23226 -1289 -72536 208052 282255 293839
374 293839 331199 215391 173912 29118 46923 139379 173286 13074 289704 155554 -37321
363 -37321 -66593 91327 -60252 -7351 -84791 17115 -7947 9859 2826 74471 -139582
352 -139582 -109988 103601 -113341 14290 77181 81228 208557 23974 -27587 6906 64531
341 64531 189028 53917 -135517 84230 151354 -66121 135055 279650 288096 109577 111539
330 111539 97699 55564 137537 179106 99342 109621 167458 132084 206182 -26228 -163521
319 -163521 -63098 52017 92497 -116 248462 114550 -61486 -79669 6141 13962 -83739
308 -83739 -10798 15828 183631 371878 341349 220222 92684 -109335 107210 -6998 36436
297 36436 63507 114966 65324 14606 133922 249548 140289 22799 168796 336313 339877
286 339877 126650 116480 66542 67574 -129135 -192044 -101352 -61731 -34421 146185 -44084
275 -44084 8526 241344 314114 158603 -98213 -98008 118201 -4595 -143498 -104998 -31367
264 -31367 25377 20265 10295 -70380 -195886 -188144 -11245 21144 71204 143604 102996 189332
252 189332 200648 72813 17107 85519 58422 112851 273681 208608 68749 -22416 98239
241 98239 -8051 -168538 -44827 106408 146551 134118 77482 -18503 -36398 -145250 3658
230 3658 7437 3238 -38753 -19331 -129331 -115816 -69593 69664 -13889 -20734 38825 52677
218 52677 405677 275073 71260 119804 38129 -16435 -40616 43416 230895 243364 178380
207 178380 55478 213623 279809 299234 301096 209912 31590 123368 160037 248713 360783
196 360783 378799 127772 70932 63332 236536 120856 87079 174172 95747 39934 -63507
185 -63507 100111 201298 405598 302318 246651 213987 4076 -226009 -125753 103771
175 103771 222151 157121 -144838 211013 258313 98234 155118 72921 198346 360736 286120
164 286120 75403 220238 226320 92776 -69558 -11348 116349 11926 42789 469 -130084
153 -130084 -130177 127285 201704 68056 158895 87409 29827 61113 80176 18473 97204 150808
141 150808 198860 95311 -83338 50331 15159 -20153 -77017 -152938 -118068 -211134 -335147
130 -335147 -170499 58864 187970 121914 33399 22271 80811 273874 287836 146190 201246
119 201246 221309 202751 286472 299213 307326 272556 267231 45848 176721 221513 198352 152855
107 152855 182046 464762 445389 274469 112794 258192 222366 188747 -4029 127724 292582
96 292582 259684 169748 58860 71671 -5668 -4015 -37395 -108044 86218 93408 64414 149519
84 149519 136252 142757 86240 -62492 56107 -75466 -202948 -95796 67316 244737 218925
73 218925 89679 -36279 170383 179680 171225 66450 200158 150472 -12093 58125 64097
62 64097 88418 110234 136159 77861 13911 8358 -4577 76191 62034 157481 97056 86539
50 86539 146995 124446 164507 72942 69867 149299 119500 85597 122044 148970 52303 101177
38 101177 -26059 -164505 142063 119102 145555 141877 231945 190991 130030 16187 -125212
27 -125212 -137993 23816 121957 176857 263250 201891 127959 175257 185346 47504 28958 -9930
15 -9930 146571 34179 126918 264993 357098 267457 326671 228250 130335 149705 141603 182394
3 182394 83545 146460 34912
0 34912
$$ Imaginary data points
##PAGE= N=2
##DATA TABLE= (X++(I..I)), XYDATA
16383 -850757 -924852 -615720 -630793 -677841 -583323 -528706 -556924 -607398 -472725 -510657 -509379
16372 -509379 -715385 -712552 -517707 -605723 -517118 -404161 -456874 -485547 -357191 -263985 -233191
16361 -233191 -269132 -301332 -408071 -378476 -313128 -421866 -271828 -262322 -296205 -294089 -227764
16350 -227764 -48556 -82491 -128319 -113714 -64604 52138 119126 -14067 62785 -36075 68949
16339 68949 138851 239371 232458 107688 171706 109631 61343 88511 194545 165727 248059
16328 248059 317744 276683 345086 348118 410372 294842 299978 328778 346368 351927 253928 170384
16316 170384 322045 485360 538480 596054 553025 632650 678786 755354 812962 724156 615774
16305 615774 579017 584819 493058 429305 556127 820897 911434 746219 881286 905622 958532
16294 958532 980848 882312 861634 962711 859929 861538 835170 914929 1041964 1221838 1057863
16283 1057863 1044837 1027206 1021554 1057840 1140852 1228182 1104426 1261458 1126296 1115307 1162363
16272 1162363 971823 1092734 1116288 1407923 1589653 1436730 1539887 1480630 1338149 1415334
16262 1415334 1333746 1132434 1299691 1452408 1375159 1261736 1494110 1527237 1382572 1420635
16252 1420635 1555258 1520778 1392093 1416819 1651266 1659009 1583009 1613468 1525746 1482652 1448041
16241 1448041 1485132 1597100 1689635 1673242 1594005 1531169 1660195 1749045 1689823 1632229 1717174
16230 1717174 1540157 1430803 1767178 1811695 1611217 1667992 1700843 1687224 1778414 1882820
16220 1882820 1831183 1585850 1681407 1699496 1902685 1770840 1705678 1803849 1796174 1780776 1728852
16209 1728852 1877253 1988119 1862962 1965438 1940498 1913609 1845528 2005407 2062772 2058600
16199 2058600 2045567 1859486 1694554 1750563 1814030 1836276 1816086 1642935 1769278 1748336
16189 1748336 1839711 2090960 2070188 2114359 2035710 1944104 1838569 1840567 1822676 1828651 1752241
16178 1752241 1702796 1865414 1803780 1973224 2097477 2151335 2167817 2090924 2091862 2120482 2118017
16167 2118017 2104785 2055336 2045217 2084174 2010797 2115120 2237106 2135237 2214190 2109632
16157 2109632 2064186 2121216 2140445 2080394 2211126 2304139 2405151 2275033 2395270 2329624
16147 2329624 2340159 2382469 2359089 2310415 2284667 2053414 2007738 2171081 2313999 2282920 2269562
16136 2269562 2230874 2026690 2024399 2122714 2240768 2120283 2121941 2034577 2187334 2353065 2464071
16125 2464071 2269329 2065898 1916544 1904709 2112076 2022320 1981072 2109201 2073781 2171068
16115 2171068 2275171 2072943 2145121 2403823 2449373 2343095 2306603 2196684 2242012 2397133
16105 2397133 2269614 2453461 2234441 2186035 2372243 2306362 2351443 2326460 2288085 2277970
16095 2277970 2340990 2204654 2348539 2427015 2531336 2383101 2083157 2181822 2211567 2261814
16085 2261814 2374988 2505166 2487093 2407351 2418260 2349522 2382805 2266570 2344151 2418799 2358975
16074 2358975 2292417 2411620 2503885 2521095 2571343 2423691 2254644 2327414 2573648 2510279
16064 2510279 2488440 2196042 2286061 2440449 2465784 2403870 2460847 2547182 2383190 2197995
16054 2197995 2274735 2341900 2157374 2254471 2105708 1913596 2171599 2372969 2348417 2464355
16044 2464355 2310880 2221711 2225485 2254927 2395295 2371930 2270119 2106680 2126496 2208386 2326221
16033 2326221 2534498 2496295 2247271 2321584 2434301 2407533 2390879 2252983 2267100 2354207
16023 2354207 2364998 2259115 2283833 2470255 2559501 2676402 2673863 2704963 2611072 2477725 2417684
16012 2417684 2544762 2555788 2371757 2087708 2209052 2215119 2337237 2491856 2434460 2387801
16002 2387801 2418710 2460146 2330385 2380711 2372235 2350923 2460154 2425299 2335041 2383621 2348124
15991 2348124 2342407 2298274 2218445 2213807 2341224 2518278 2447683 2561701 2587594 2389829 2437903
15980 2437903 2510004 2309543 2312356 2450801 2486318 2373140 2387934 2467296 2380461 2458604 2306071
15969 2306071 2256488 2231523 2350134 2401981 2123212 2227975 2484337 2496284 2422160 2410593
15959 2410593 2416735 2352349 2343121 2316165 2370122 2123844 2172629 2208061 2439219 2559628 2583736
15948 2583736 2477176 2355279 2331711 2255370 2241239 2352240 2366763 2337892 2347243 2110892 2253217
15937 2253217 2412635 2441750 2173595 2253640 2505908 2426276 2622271 2537792 2473064 2357138
15927 2357138 2105033 2155278 2216561 2149909 2352729 2441389 2562564 2439205 2444060 2304866
15917 2304866 2300050 2546937 2580474 2468031 2284648 2370041 2519802 2415814 2349129 2373262
15907 2373262 2498155 2706991 2573647 2452761 2359486 2323485 2130167 2231123 2227285 2406415
15897 2406415 2400785 2415064 2445326 2409058 2319844 2558191 2658417 2405819 2251589 2414410
15887 2414410 2648023 2695951 2508678 2294943 2188652 2181535 2257722 2325640 2537175 2402518
15877 2402518 2449934 2377282 2346306 2439857 2459513 2457941 2344433 2440129 2356861 2495233 2490820
15866 2490820 2467234 2325348 2211001 2474469 2529967 2306282 2503107 2354094 2213888 2407995
15856 2407995 2421691 2389259 2642331 2629493 2417490 2434521 2206269 2566572 2439693 2436013
15846 2436013 2349561 2267594 2268713 2352668 2328952 2341601 2387362 2468783 2463947 2241527 2337890
15835 2337890 2486459 2400199 2310070 2486558 2390531 2396330 2449317 2385049 2229275 2355382 2474316
15824 2474316 2510898 2548235 2402519 2373604 2587828 2720374 2829343 2562428 2565681 2664886
15814 2664886 2409614 2319013 2418689 2319411 2438549 2255708 2201055 2108793 2157861 2451044
15804 2451044 2338018 2307317 2270215 2480731 2289448 2306938 2242313 2463365 2434820 2199288
15794 2199288 2171795 2099212 2247821 2427684 2505582 2353145 2271640 2530848 2517493 2537206
15784 2537206 2781148 2672877 2553076 2427383 2446004 2640280 2492023 2439476 2675446 2608588
15774 2608588 2590383 2643187 2545028 2633914 2491750 2358945 2492473 2437795 2421204 2393125 2212926
15763 2212926 2427726 2473392 2509358 2515609 2312948 2211309 2466110 2474978 2391936 2375693 2353401
15752 2353401 2359003 2382513 2420783 2292603 2463656 2561473 2536471 2374597 2437925 2479419 2560187
15741 2560187 2299358 2370728 2474912 2541456 2547122 2473425 2708447 2551845 2318377 2363797
15731 2363797 2257377 2334031 2335737 2231087 2274683 2244216 2180627 2388527 2458551 2294331 2346740
15720 2346740 2310191 2336882 2395323 2339939 2431811 2467071 2389595 2621814 2503616 2449058 2372477
15709 2372477 2559753 2710679 2515462 2631489 2624423 2588508 2540604 2532258 2362372 2476415
$$ [...]
##END NTUPLES=NMR SPECTRUM
##END=
