##TITLE=1H_CG-1182
 CDCl3
 8 sc, 
 26.12.2023
##JCAMPDX= 6.0         $$ Bruker NMR JCAMP-DX V2.0
##DATA TYPE= NMR SPECTRUM
##DATA CLASS= NTUPLES
##ORIGIN= UXNMR, Bruker Analytische Messtechnik GmbH
##OWNER= root
$$ XWIN-NMR		Version 3.5
$$ Tue Dec 26 14:25:47 2023 Russian Standard Time (UT+4h)  she@DPX200
##.OBSERVE FREQUENCY= 200.1313
##.OBSERVE NUCLEUS= ^1H
##.ACQUISITION MODE= SIMULTANEOUS
##.ACQUISITION SCHEME= undefined
##.AVERAGES= 8
##.DIGITISER RES= 18
##SPECTROMETER/DATA SYSTEM= spect
##.PULSE SEQUENCE= zg30
##.SOLVENT NAME= CDCl3
##.SHIFT REFERENCE= (INTERNAL, CDCl3, 0, 15.4483)
##AUDIT TRAIL= $$ (NUMBER, WHEN, WHO, WHERE, WHAT)
$$ ##TITLE= Audit trail, XWIN-NMR		Version 3.5
$$ ##JCAMPDX= 5.01
$$ ##ORIGIN= Bruker BioSpin GmbH
$$ ##OWNER= she
$$ F:/spectra/data/she/nmr/H-F/1/pdata/1/auditp.txt
$$ ##AUDIT TRAIL=  $$ (NUMBER, WHEN, WHO, WHERE, WHAT)
(   1,<2023-12-26 14:24:32.82 +0400>,<she>,<DPX200>,
      <created by zg, POWCHK disabled, PULCHK disabled
       configuration hash MD5:
       00 E9 B6 7A A2 85 ED C7 34 08 36 98 17 FE 4E 26
       data hash MD5: 16K
       A3 1D 80 7A 6F 5D 0A FC 62 8E F5 80 E7 EE DC 1F>)
(   2,<2023-12-26 14:24:34.95 +0400>,<she>,<DPX200>,
      <Start of raw data processing
       efp BC_mod = 2 LB = 0.24 FT_mod = 6 PKNL = 1 PHC0 = -24597.59 PHC1 = 12.05273 SI = 16K 
       data hash MD5: 16K
       45 34 B6 10 94 FB B4 42 B6 C3 78 A0 3E 6E B9 46>)
(   3,<2023-12-26 14:25:01.04 +0400>,<she>,<DPX200>,
      <pk PHC0 = 5.819074 PHC1 = -3.4 
       data hash MD5: 16K
       22 D7 EA 75 B0 7B A6 0F 8F CA 7D 7A 83 2D 3F F6>)
(   4,<2023-12-26 14:25:04.48 +0400>,<she>,<DPX200>,
      <abs ABSG = 5 
       data hash MD5: 16K
       D5 9F 28 13 61 A0 5F 7C 82 54 8F 8C 98 42 C7 77>)
$$ ##END=
$$ 
$$ hash MD5
$$ E4 3D C9 A3 6D 3D 89 20 E8 80 B4 9B 70 05 20 9F
##$RELAX= 
##$RELAX= 
##$RELAX= 
##$RELAX= 
##$RELAX= 
##$RELAX= 
$$ Bruker specific parameters
$$ --------------------------
##$DU= <F:/spectra>
##$EXPNO= 1
##$NAME= <H-F>
##$PROCNO= 1
##$TYPE= <nmr>
##$USER= <she>
##$AMP= (0..31)
100 100 100 100 100 100 100 100 100 100 100 100 100 100 100 100 100 100 
100 100 100 100 100 100 100 100 100 100 100 100 100 100 
##$AQSEQ= 0
##$AQ_mod= 1
##$AUNM= <au_zg>
##$AUTOPOS= <>
##$BF1= 200.13
##$BF2= 200.13
##$BF3= 200.13
##$BF4= 200.13
##$BF5= 200.13
##$BF6= 200.13
##$BF7= 200.13
##$BF8= 200.13
##$BYTORDA= 1
##$CFDGTYP= 0
##$CFRGTYP= 5
##$CHEMSTR= <none>
##$CNST= (0..31)
1 1 145 1 1 1 1 1 1 1 1 1 1 1 1 1 1 1 1 1 1 1 1 1 1 1 1 1 1 1 1 1 
##$CPDPRG= <>
##$CPDPRG1= <>
##$CPDPRG2= <>
##$CPDPRG3= <>
##$CPDPRG4= <mlev>
##$CPDPRG5= <mlev>
##$CPDPRG6= <mlev>
##$CPDPRG7= <mlev>
##$CPDPRG8= <mlev>
##$CPDPRGB= <>
##$CPDPRGT= <>
##$D= (0..31)
0 1.2 0 0 0 0 0 0 0 0.06 0 0.03 0 0 0 0 0.0002 0 0 0 0 0 0 0 0 0 0 0 0 
0 0 0 
##$DATE= 1703586272
##$DBL= (0..7)
120 120 120 120 120 120 120 120 
##$DBP= (0..7)
150 150 150 150 150 150 150 150 
##$DBP07= 0
##$DBPNAM0= <>
##$DBPNAM1= <>
##$DBPNAM2= <>
##$DBPNAM3= <>
##$DBPNAM4= <>
$$ [...]
##$SUBNAM3= <"">
##$SUBNAM4= <"">
##$SUBNAM5= <"">
##$SUBNAM6= <"">
##$SUBNAM7= <"">
##$SUBNAM8= <"">
##$SUBNAM9= <"">
##$SW= 18.0517328524113
##$SWIBOX= (0..15)
0 0 2 0 0 0 0 0 0 0 0 0 0 0 0 0 
##$SW_h= 3612.71676300578
##$TD= 16384
##$TD0= 1
##$TE= 0
##$TE2= 300
##$TE3= 300
##$TEG= 300
##$TL= (0..7)
0 120 120 120 120 120 120 120 
##$TP= (0..7)
150 150 150 150 150 150 150 150 
##$TP07= 0
##$TPNAME0= <>
##$TPNAME1= <>
##$TPNAME2= <>
##$TPNAME3= <>
##$TPNAME4= <>
##$TPNAME5= <>
##$TPNAME6= <>
##$TPNAME7= <>
##$TPOAL= (0..7)
0.5 0.5 0.5 0.5 0.5 0.5 0.5 0.5 
##$TPOFFS= (0..7)
0 0 0 0 0 0 0 0 
##$TUNHIN= 0
##$TUNHOUT= 0
##$TUNXOUT= 0
##$USERA1= <user>
##$USERA2= <user>
##$USERA3= <user>
##$USERA4= <user>
##$USERA5= <user>
##$V9= 5
##$VALIST= <valist>
##$VCLIST= <CCCCCCCCCCCCCCC>
##$VD= 0
##$VDLIST= <DDDDDDDDDDDDDDD>
##$VPLIST= <PPPPPPPPPPPPPPP>
##$VTLIST= <TTTTTTTTTTTTTTT>
##$WBST= 1024
##$WBSW= 4
##$XGAIN= (0..3)
0 0 0 0 
##$XL= 0
##$YL= 0
##$YMAX_a= 483794
##$YMIN_a= -569522
##$ZGOPTNS= <>
##$ZL1= 120
##$ZL2= 120
##$ZL3= 120
##$ZL4= 120
##$ABSF1= 15.49899
##$ABSF2= -2.552859
##$ABSG= 5
##$ABSL= 3
##$ALPHA= 0
##$AQORDER= 0
##$ASSFAC= 0
##$ASSFACI= 0
##$ASSFACX= 0
##$ASSWID= 0
##$AUNMP= <proc_1d>
##$AZFE= 0.1
##$AZFW= 0.1
##$BCFW= 0
##$BC_mod= 2
##$BYTORDP= 0
##$COROFFS= 0
##$CY= -3
##$DATMOD= 1
##$DC= 0
##$DFILT= <>
##$DTYPP= 0
##$F1P= 0
##$F2P= 0
##$FCOR= 1
##$FTSIZE= 16384
##$FT_mod= 6
##$GAMMA= 0
##$GB= 0
##$INTBC= 1
##$INTSCL= 3.70164e-10
##$ISEN= 128
##$LB= 0.24
##$LEV0= 0
##$LPBIN= 0
##$MAXI= 10000
##$MC2= 0
##$MEAN= 0
##$ME_mod= 0
##$MI= 1.114404
##$NCOEF= 0
##$NC_proc= -6
##$NLEV= 6
##$NOISF1= 3.799351
##$NOISF2= 2.8
##$NSP= 0
##$NTH_PI= 0
##$NZP= 0
##$OFFSET= 15.4483
##$PC= 1
##$PHC0= -24591.77
##$PHC1= 8.652729
##$PH_mod= 1
##$PKNL= yes
##$PPARMOD= 0
##$PSCAL= 0
##$PSIGN= 0
##$REVERSE= no
##$SF= 200.130014690301
##$SI= 16384
##$SIGF1= 3
##$SIGF2= 2
##$SINO= 5.538805
##$SIOLD= 16384
##$SREGLST= <1H.CDCl3>
##$SSB= 0
##$STSI= 16384
##$STSR= 0
##$SW_p= 3612.71676300578
##$SYMM= 0
##$S_DEV= 0
##$TDeff= 16384
##$TDoff= 0
##$TI= <>
##$TILT= no
##$TM1= 0
##$TM2= 0
##$TOPLEV= 0
##$USERP1= <user>
##$USERP2= <user>
##$USERP3= <user>
##$USERP4= <user>
##$USERP5= <user>
##$WDW= 1
##$XDIM= 16384
##$YMAX_p= 277009256
##$YMIN_p= -648045
$$ End of Bruker specific parameters
$$ ---------------------------------
##NTUPLES= NMR SPECTRUM
##VAR_NAME=  FREQUENCY,     SPECTRUM/REAL,   SPECTRUM/IMAG
##SYMBOL=    X,             R,               I
##VAR_TYPE=  INDEPENDENT,   DEPENDENT,       DEPENDENT
##VAR_FORM=  AFFN,          ASDF,            ASDF
##VAR_DIM=   16384,         16384,           16384
##UNITS=     HZ,            ARBITRARY UNITS, ARBITRARY UNITS
##FACTOR=    0.220516191357247, 1,           1
##FIRST=     3091.66857831386, 0,            0
##LAST=      -521.048184691925, 0,           0
##MIN=       -521.048184691925, -648045,     0
##MAX=       3091.66857831386, 277009256,    0
$$ Real data points
##PAGE= N=1
##DATA TABLE= (X++(R..R)), XYDATA
$$ [...]
6390D3071454k310523j735131j254977p89495l24567K31823P17404J209795J942370
6381D0758153K533896L041464L673954L747232L194856J682592p71053l000967
6373E4860127m572370n253580m917666m415092l684502l015637k451492k161770
6365B4388018j700040j347566j100832r78218r28606o71622m86035n70846n47249
6356A6057004l07489k85212m645P2644J80083J99311L02323K76170K38162K39174
6346A6967525j49061m52497n87087p37036o55014o40814n50809n64648o22675
6337A2007884m42305l77594m12964k55219k37202k62008k20929m8681M4392R3077
6327I888451l6640K10150J44096K03067K63012K42710K76326K47990M1781N4640
$$ plain form
6390 43071454 40760931 39025800 37770823 36981328 36656761 36888584 37605988 38815783 40758153
6381 40758153 43292049 46333513 50007467 53754699 56949555 58632147 57861094 54860127
6373 54860127 50287757 45034177 40116511 35701419 32016917 29001280 26549788 24388018
6365 24388018 22687978 21340412 20239580 19261362 18332756 17661134 17175099 16604253 16057004
6356 16057004 15749515 15464303 15459658 15532302 15712385 15911696 16214019 16490189 16728351 16967525
6346 16967525 16818464 16365967 15778880 15041844 14386830 13746016 13195207 12630559 12007884
6337 12007884 11565579 11187985 10775021 10519802 10282600 10020592 9799663 9750982 9795374 9888451
6327 9888451 9851811 10061961 10206057 10409124 10672136 10914846 11191172 11439162 11480943 11535583
6317A1535583N5593J8526J18314l7159j84498k46386n07535l82364m07709o53854
6307I308511m19802l90619l29998k22151l24667o8288k31708k6154j5282j62693
6297G117149J00250M6695O6809n358J57964K22471K31994J45209J51989o238J96746
6286H425680K35432N5425l3448j58110j90618J59990Q5638J77658J91423L41032
6276I290102L48379L89588L65568L47978O00418P33467Q05930Q08021P52392L88684
6266A4830527K6190m15561p70624p70383p91348n72215l78280k84027j54850k41492
6256A0477937j27457l4609l2530J47853M01806M00873M54845P11143Q78137J064624
6246A4342622J323342J609853J951601K161422J851767R80475m5236j156647k124376
$$ plain form
6317 11535583 11591176 11609702 11728016 11690857 11506359 11259973 10752438 10370074 9962365 9308511
6307 9308511 8888709 8498090 8168092 7945941 7621274 7552986 7321278 7295124 7279842 7117149
6297 7117149 7217399 7264094 7330903 7325545 7483509 7705980 7937974 8083183 8235172 8228934 8425680
6286 8425680 8661112 8716537 8683089 8524979 8334361 8494351 8579989 8757647 8949070 9290102
6276 9290102 9638481 10028069 10393637 10741615 11342033 12075500 12881430 13689451 14441843 14830527
6266 14830527 14856717 14441156 13670532 12900149 12108801 11536586 11158306 10874279 10719429 10477937
6256 10477937 10350480 10315871 10283341 10431194 10833000 11233873 11688718 12399861 13277998 14342622
6246 14342622 15665964 17275817 19227418 21388840 23240607 24221082 24175846 23019199 20894823
6237B0894823k261985k122516j898434j405046r06598o82065o87323o02837n70623
6228I757396m57182k74891j51000m6751J79623J11800K66250M15007M94581O40335
6218A0935168Q62663R10500P73585M17768n7473o36760j194479j309529j192129
6209I509314j172872q35222o05354n04658n68305m76704l57041m67885k63085
6200D258188j59577j16893k03663k41869q9748r8618j14618o0427p6662j03883
6190B992230q4448o8312o3674l0205j82302P3295J910j66304j04300k1452j05466
6179B240972o0445j88655J8155O6916Q7714l3010j62382j37938l2060N685j21104
6168A683848J3006k7389l8234N0285J36509j44576m1912O6704j17868l4588j5523
$$ plain form
6237 20894823 18632838 16510322 14611888 13206842 12300244 11618179 10930856 10328019 9757396
6228 9757396 9300214 9025323 8874323 8827572 9007195 9118995 9385245 9800252 10294833 10935168
6218 10935168 11797831 12708331 13481916 13899684 13842211 13205451 12010972 10701443 9509314
6209 9509314 8336442 7501220 6895866 6391208 5822903 5346199 4989158 4521273 4258188
6200 4258188 4098611 3981718 3778055 3536186 3446438 3347820 3233202 3172775 3096113 2992230
6190 2992230 2907782 2839470 2775796 2745591 2563289 2636584 2638494 2472190 2367890 2346438 2240972
6179 2240972 2180527 1991872 2010027 2076943 2164657 2131647 1969265 1831327 1799267 1804952 1683848
6168 1683848 1696854 1669465 1631231 1681516 1818025 1673449 1631537 1698241 1580373 1545785 1530262
6157A530262k0889M600K8148L5411K61k8764r4641O0815k3314n0483m895K6352
6145A462863o273m9527Q5153m070j67598K988J23552M1304L938j3942K7954M2258
6133A548600L085l800M8994Q0812r2614M1203j66406J7805N3943J4659n5124q8003
6121A403154K0944P1896m1370j18654J13756K6399L0871p4763m7696k7574L3868
6110A390831R1170R0116l5112j0635k9992L7410P0892k7127q8930m8886O2707
6099A502444Q1040L7767k6925o3839J3881Q1793R1271P4055Q9426L320n1764j3131
6087A819338n3504l4580m3314n1223j6182P3363j2163R3636n4889n1114j47986
6076A521382q3364J60066p0045j7805J33734P0653L0652j3080l9862Q9202j4888
$$ plain form
6157 1530262 1509373 1513973 1542121 1577532 1577793 1549029 1454388 1515203 1491889 1441406 1436511 1462863
6145 1462863 1456590 1407063 1492216 1488146 1320548 1323536 1447088 1488392 1492330 1478388 1506342 1548600
6133 1548600 1551685 1547885 1596879 1677691 1585077 1626280 1459874 1477679 1531622 1546281 1491157 1403154
6121 1403154 1424098 1495994 1454624 1335970 1449726 1476125 1506996 1432233 1384537 1356963 1390831
6110 1390831 1482001 1572117 1537005 1526370 1496378 1533788 1604680 1577553 1488623 1439737 1502444
6099 1502444 1583484 1621251 1594326 1530487 1544368 1626161 1717432 1791487 1880913 1884233 1832469 1819338
6087 1819338 1765834 1731254 1687940 1636717 1620535 1693898 1681735 1775371 1720482 1669368 1521382
6076 1521382 1438018 1598084 1528039 1510234 1643968 1714621 1745273 1732193 1692331 1781533 1766645
6065A766645J8724L3823l9034Q1342k2007r173K5030l2454K1835O5868N8643m5284
6053A923958n8675n2290m1001P5868R8337L1060k8560K6094J11771J2121o4386
6042B034297J07165l5826R1361M9294J6763J1823J46914J11305L7992K16011K67100
6031C054199l1202j03060j23957k04908M6290q2692L025K161J44987J04694n1618
6020B757919L1087J73843J0245K28968K27655J09207J79423N1321J79434L28857
6010D277959L37323L14045M10266P38747O66437O90373L60843m42674p56659o09287
6000E987373n27866j97923k31915j37017p3537j19639Q671J00580J25977R0933
5990E025637L6558J05714K67416K13469K49047M31953M53727N02060P35763R78237
$$ plain form
6065 1766645 1785369 1819192 1780158 1861500 1839493 1830320 1855350 1822896 1844731 1910599 1969242 1923958
6053 1923958 1865283 1812993 1771992 1847860 1946197 1977257 1948697 1974791 2086562 2098683 2034297
6042 2034297 2141462 2105636 2196997 2246291 2263054 2274877 2421791 2533096 2571088 2787099 3054199
6031 3054199 3022997 2919937 2795980 2591072 2637362 2554670 2557695 2559856 2704843 2809537 2757919
6020 2757919 2789006 2962849 2973094 3202062 3429717 3538924 3718347 3769668 3949102 4277959
6010 4277959 4615282 4929327 5339593 6078340 6744777 7435150 7795993 7353319 6596660 5987373
6000 5987373 5459507 5261584 5029669 4892652 4819115 4699476 4708147 4808727 4934704 5025637
5990 5025637 5062195 5167909 5435325 5648794 5897841 6329794 6783521 7285581 8021344 8999581
5980H999581J268369J591831J785553J443459L11853j284869j864263j684544
5972A0566970j277778r43409o98608n08143j89309k6087j63378j75642m8729J19806
5962F655693J34871J24490K48439L09425L33198M34953N83338Q06110J029495
5953A0660012J383113J680766K088941K370727J865191j81624k044136k656136
5945A5166854k295059j728228j225040q35902o79360l88419k67270j51880j00296
5936G495400o6662j06072m2013J10777K9123K35899L27729M96408N62085O09912
5926I652586R05510J011616J347413J695707J861277J085738n73897j820199k001498
5917A3164253j670568j323578r01867n19418n07630j91872k44881j76669j01638
$$ plain form
5980 8999581 10267950 11859781 13645334 15088793 15400646 14115777 12251514 10566970
5972 10566970 9289192 8345783 7647175 7139032 6949723 6923636 6760258 6584616 6535887 6655693
5962 6655693 6790564 6915054 7163493 7472918 7806116 8241069 8824407 9630517 10660012
5953 10660012 12043125 13723891 15812832 18183559 20048750 19867126 17822990 15166854
5945 15166854 12871795 11143567 9918527 9082625 8403265 8014846 7747576 7595696 7495400
5936 7495400 7428738 7322666 7280653 7391430 7420553 7656452 7984181 8480589 9042674 9652586
5926 9652586 10558096 11569712 12917125 14612832 16474109 17559847 16985950 15165751 13164253
5917 13164253 11493685 10170107 9268240 8748822 8241192 8049320 7804439 7627770 7526132
5908G526132p3617o2807M5855M256O6885N4857J59483K03991K19803L18921L36950
5897H800709O04445P71948P88277P14882K44929k25898n75768o85922n44413k17487
5887I675702j91045j53008L1638M4872L2085J86842K1099L40489L76634L03427
5877A0668735L75326L98746M51251K69394Q8170J24173L7161J09113J98054K25382
5867A2945505K80742K04088K06913K32217J93941O7234M06454K41561L43984M51675
5857A5574314N00163P28273O21172P98108P79739R08646J203755J026890J426559
5848B3567619J479369J718950J514830J502583J669711J763878K393966L092306
5840C8703212L602252M334945M529208M620619L595408J455712j003648l142574
$$ plain form
5908 7526132 7452515 7389708 7435563 7439819 7506704 7561561 7721044 7925035 8144838 8463759 8800709
5897 8800709 9405154 10177102 10965379 11680261 11925190 11699292 11123524 10437602 9893189 9675702
5887 9675702 9484657 9331649 9363287 9408159 9440244 9627086 9648185 9988674 10365308 10668735
5877 10668735 11044061 11442807 11894058 12163452 12251622 12375795 12412956 12522069 12720123 12945505
5867 12945505 13226247 13430335 13637248 13869465 14063406 14130640 14537094 14778655 15122639 15574314
5857 15574314 16074477 16802750 17423922 18222030 19001769 19910415 21114170 22141060 23567619
5848 23567619 25046988 26765938 28280768 29783351 31453062 33216940 35610906 38703212
5840 38703212 42305464 46640409 51169617 55790236 59385644 60841356 59837708 56695134
5832E6695134l959398l948993l387334k613304j829423j317832p53280k38146
5824C8647424K47132O11952J156398J688459K266094K968862L506967M455904
5816E5549192N509350O839509Q125648Q851018P998417M756031k60117n480842
5808I1888206q683125r473094q893676p423308n908947m655422l685836k712914
5800D0451884k194617j657373j182526o47891l45390K62503O07860J086777J733938
5791C8115165K204670K717122K988745L302311K809362J401195o71613k763185
5783E0103772m118599m555093m381358l734011l304772k844936k307046j876941
5775B2981016j664181j230619j076972j005902p00328m92660m93556m22667k63148
$$ plain form
5832 56695134 52735736 48786743 45399409 42786105 40956682 39638850 38885570 38647424
5824 38647424 38894556 39506508 40662906 42351365 44617459 47586321 51093288 55549192
5816 55549192 61058542 67898051 76023699 84874717 92873134 97629165 97369048 91888206
5808 91888206 83205081 73731987 64838311 57415003 51506056 46850634 43164798 40451884
5800 40451884 38257267 36599894 35417368 34769477 34424087 34686590 35294450 36381227 38115165
5791 38115165 40319835 43036957 46025702 49328013 52137375 53538570 52866957 50103772
5783 50103772 45985173 41430080 37048722 33314711 30009939 27165003 24857957 22981016
5775 22981016 21316835 20086216 19009244 18003342 17303014 16810354 16316798 15894131 15630983
5766A5630983q2666q4039L9246J1554J07080l865J70848K49988M60770N38496
5756A7038395J34311j57938m18644o26620p94286q04700n25409l65367m42188
5747A3037554k00306j60353l29033l24215l86346k54434k43291j18729n0574Q5307
5737A1055580J49347R3765K14759J36753K39750K03562K28347K38135Q3253k7498
5727A2615753K4959j37017k52400j86033m24638k36759j27147j79632j57418j74361
5717A0765307Q6297R4486L0765j57195J36129K81210L09021L07136L44473N66073
5707A2763702K76608L34683L59260K86251K33387K32672K74186M56721O04489
5698A5821959Q27936Q12251J113080J028964O99840J78138o12265r62943r43924
$$ plain form
5766 15630983 15548317 15464278 15503524 15515078 15622158 15618293 15789141 16039129 16499899 17038395
5756 17038395 17172706 17014768 16596124 15969504 15175218 14370518 13845109 13479742 13037554
5747 13037554 12837248 12676895 12347862 12023647 11637301 11382867 11139576 11020847 10970273 11055580
5737 11055580 11204927 11298692 11513451 11650204 11889954 12093516 12321863 12559998 12643251 12615753
5727 12615753 12640712 12503695 12251295 12065262 11640624 11403865 11276718 11097086 10939668 10765307
5717 10765307 10851604 10946090 10976855 10819660 10955789 11236999 11546020 11853156 12197629 12763702
5707 12763702 13040310 13374993 13734253 14020504 14253891 14486563 14760749 15217470 15821959
5698 15821959 16649895 17462146 18575226 19604190 20304030 20482168 19869903 18906960 17963036
5689A7963036p53414n88439l01123j72163M4925J68155L54069M28206L79565K38566
5679A7761383J20175J58431J47109L67993N62800Q79692J395816J835916K420601
5670B5649916K877433K951444J829792k24643k135966k913390k916916k580638
5662B2537032j905909j423225j130467q69675p07568m88841m37105k11742j50282
5653A5212218k04393m4168j20985K5026J62179J86270L58097P12912R49490J100665
5643A8337311J377172J165010R72193O12791N67303N99297O51272J51272j885017
5634B2548604k715546k444172k051568j397517r45212p45601p10495l93623k91762
5625A0853108m25511l53141j70095j24031n0260J6190n9034o8726J30814J39172
$$ plain form
5689 17963036 17209622 16621183 16320060 16147897 16192822 16360977 16715046 17143252 17522817 17761383
5679 17761383 17881558 18039989 18187098 18555091 19117891 19997583 21393399 23229315 25649916
5670 25649916 28527349 31478793 33308585 33083942 30947976 28034586 25117670 22537032
5662 22537032 20631123 19207898 18077431 17207756 16500188 16011347 15574242 15362500 15212218
5653 15212218 15007825 14963657 14842672 14867698 15029877 15216147 15574244 16287156 17236646 18337311
5643 18337311 19714483 20879493 21851686 22464477 23031780 23631077 24282349 24433621 22548604
5634 22548604 19833058 17388886 15337318 13939801 12994589 12248988 11538493 11144870 10853108
5625 10853108 10427597 10074456 9904361 9780330 9730070 9746260 9687226 9618500 9749314 9888486
5615I888486J16908K21707M28578M21428M94111N49315R68288J155207J660952
5606A5904980K019732J733798O82968j407190k183475j989943j484603r11012
5598A2365255o86637m84298m31801l01811j83943j32594j42955m8013P3191L160
5588A0029554J53447M1371Q5607K82568L00393J98682L06505K83290M26043L40105
5578A2447565K64609L23826L96077P31137P82844Q33600M01938m01637o23591
5569A5156368l96048k06581o3547Q8099P4877K44550K61530L03592M48915L31119
5559A6242874M31261N07232N39566P26017R29531Q53199R18005Q82075Q32226
5550B2861986R02132J061901J372577J452987J861695K172617K510899K845081
$$ plain form
5615 9888486 10005394 10227101 10655679 11077107 11571218 12120533 13088821 14244028 15904980
5606 15904980 17924712 19658510 20341478 18934288 16750813 14760870 13276267 12365255
5598 12365255 11678618 11194320 10762519 10460708 10276765 10144171 10001216 9953203 10026394 10029554
5588 10029554 10183001 10224372 10309979 10592547 10892940 11091622 11398127 11681417 12107460 12447565
5578 12447565 12712174 13036000 13432077 14163214 14946058 15779658 16181596 15779959 15156368
5569 15156368 14760320 14553739 14490192 14578291 14653168 14897718 15159248 15462840 15911755 16242874
5559 16242874 16674135 17181367 17720933 18446950 19376481 20229680 21147685 22029760 22861986
5550 22861986 23764118 24826019 26198596 27651583 29513278 31685895 34196794 37041875
5542C7041875L225665L855663M145612L907596L051012J588964j70241j612311
5534E5033835k069023k098757j524632q69937k79751J98826L09902N86631P75019
5525E0062113Q60553R74823J238548K151291K980143L995555M805709N496326
5517G2565061N360826L882201K168347M51868j040161k085061k785168l613047
5509G4904866m441243m734430m379686l763542k746189j958722j181224n47314
5501E1152516p8069J15517K73899J35465K22526M95025R43032J426122K102185
5492E6788218K236970J291636k98929k163757l822007m483626m729525m418969
5484D0400011l782121l371525l005046k344336j908811j786425j254958r16153
$$ plain form
5542 37041875 40267540 44123203 48268815 52176411 55227423 56816387 56646146 55033835
5534 55033835 52964812 50866055 49341423 48471486 48191735 48390561 48700463 49287094 50062113
5525 50062113 50922666 51897489 53136037 55287328 58267471 62263026 67068735 72565061
5517 72565061 77925887 81808088 83976435 84428303 83388142 81303081 78517913 74904866
5509 74904866 70463623 65729193 61349507 57585965 54839776 52881054 51699830 51152516
5501 51152516 51074447 51189964 51463863 51599328 51821854 52316879 53259911 54686033 56788218
5492 56788218 59025188 60316824 60017895 57854138 54032131 49548505 44818980 40400011
5484 40400011 36617890 33246365 30241319 27896983 25988172 24201747 22946789 22030636
5476B2030636p29689p08113o16385n87182l70849n12415m84344l65779n99470
5467A7056410p24973p37412p96912p20276o69078p12765o65674m89498m99501
5458A1040321m56641l05181k72158k73992l91760l50338k25031j45083j80468
5449H439669j43571l24112j77525j98273l15713j92142j47712o7471j32410p8219
5439F662521j85522k51335L2403j57838k79421o2547q1108r706j99757k07770
5429E259920p6405L4978k7775q8517n2590M2278r3563j04254O4757m358j7307
5418D937164l2303k5327l2654j7314o0107Q440O1044Q5131J7838j70393Q2635
5407D854154L4139P2296N5926k3549M04O08J5035J26486J0575K8250J3149K2223
$$ plain form
5476 22030636 21300947 20592834 19976449 19389267 19018418 18506003 18021659 17655880 17056410
5467 17056410 16331437 15594025 14797113 14076837 13407759 12694994 12029320 11539822 11040321
5458 11040321 10583680 10278499 10006341 9732349 9340589 8990251 8765220 8620137 8439669
5449 8439669 8296098 7971986 7794461 7596188 7280475 7088333 6940621 6873150 6740740 6662521
5439 6662521 6476999 6225664 6258067 6100229 5820808 5758261 5677153 5667447 5467690 5259920
5429 5259920 5183515 5218493 5190718 5102201 5049611 5091889 4998326 4894072 4958829 4954471 4937164
5418 4937164 4904861 4879534 4846880 4829566 4769459 4777899 4838943 4924074 4941912 4771519 4854154
5407 4854154 4888293 4960589 5016515 4992966 4993370 4993978 5009013 5135499 5146074 5174324 5187473 5209696
5395E209696o5124P1553J38190J02563R7713Q7260J62360J57744K22776N2046
5385F236777M7886K73817J28696K47169L61179M14306M29776M26620L72819N92830
5375I531875R01336J199720J688630K156619K378217K600960J504548j883082
5367B0078823l053801k774120k067924j440169o70748m44916l93348k72182n89374
5358H372241n97000n84080o06751m44402k71169k68425l07975k18312p6439p8337
5348D919351j70308J4554l4203k08310j30438j31591j73431l1117j31489l8385
5338C884633M1389o5239o6822M3244L7729n8273R978J28808M5108j39100j77961
5327C683494q2238R9201j5725n6659j44085L4160P3093p4135k8669L6347n8274
$$ plain form
5395 5209696 5144572 5216125 5354315 5456878 5554591 5641851 5804211 5961955 6184731 6236777
5385 6236777 6284663 6558480 6687176 6934345 7295524 7709830 8139606 8566226 8939045 9531875
5375 9531875 10433211 11632931 13321561 15478180 17856397 20457357 21961905 20078823
5367 20078823 17025022 14250902 12182978 10742809 10072061 9627145 9233797 8961615 8372241
5358 8372241 7775241 7191161 6584410 6140008 5868839 5600414 5292439 5074127 4997688 4919351
5348 4919351 4749043 4763597 4729394 4521084 4390646 4259055 4085624 4054507 3923018 3884633
5338 3884633 3926022 3860783 3793961 3837205 3874934 3816661 3826639 3955447 4000555 3861455 3683494
5327 3683494 3601256 3700457 3684732 3628073 3483988 3518148 3591241 3517106 3488437 3524784 3466510
5316C466510l4923n1887n9765n3010j10973O929k9482M6921j74269P3532Q8408
5305C167991q4290l6094J04086q4165n5150Q8639j25915O4528m9347J3314k6971
5294B976626P2689M8104l6507J13198Q3433O2978J22710L4771J4189L8741k9300
5283C501632K0665m3988o1871J6121P4937q8565j11526K5663J25448l5424j08453
5272C314639K4023j9132J15054p2811R2934l3240L9225j22275M7033J04798r1411
5261C398837J7147r554J44420p1606l3637J35648P020m4932O0683J10683R8561
5250C813270k9103j40526O7758p9772M0751n1105k9483J01802J12483O3426k0211
5239C849290N1839M5368j6900n0340n6603M9511Q472O6223J03581L6382M7118
$$ plain form
5316 3466510 3431587 3379700 3319935 3266925 3155952 3162881 3133399 3180320 3006051 3079583 3167991
5305 3167991 3083701 3047607 3151693 3067528 3012378 3101017 2975102 3039630 2990283 3003597 2976626
5294 2976626 3049315 3097419 3060912 3174110 3257543 3320521 3443231 3478002 3492191 3530932 3501632
5283 3501632 3522297 3478309 3416438 3432559 3507496 3418931 3307405 3333068 3458516 3423092 3314639
5272 3314639 3338662 3319530 3434584 3361773 3454707 3421467 3460692 3338417 3385450 3490248 3398837
5261 3398837 3415984 3406430 3550850 3479244 3445607 3581255 3588275 3543343 3604026 3714709 3813270
5250 3813270 3784167 3643641 3711399 3631627 3672378 3621273 3591790 3693592 3806075 3869501 3849290
5239 3849290 3901129 3946497 3929597 3879257 3822654 3872165 3880637 3946860 4050441 4086823 4133941
5228D133941n9910J11366P3039K3213n6217L2551K28209Q0414L0755Q2061J28548
5217D807970J42950J81073J18161p6266R4636k6649M5160J24557j5408K0874P0218
5206E487276j3159K21711N8749p2448K7731N0239K7069O8687P8328N7849M2555
5195F034587K2505J17869J89779K19325J68418J28602J94373J44098J79519N1107
5185G450182J12027J58369J75666j2082j34557p784m0625o2656L9358m2087m3301
5174G592510N5076J11983J28779L1193N5690R1429J36381o5400R9823J22109J13554
5163H473127J13105J51855J74134J22309J59767L25442L25458L83128L92956K14561
5153A0835842K50330J36772k0208J6777k26710k19817j62191k10436k17308o8635
$$ plain form
5228 4133941 4074031 4185397 4258436 4281649 4225432 4257983 4486192 4566606 4597361 4679422 4807970
5217 4807970 4950920 5131993 5250154 5173888 5268524 5241875 5287035 5411592 5396184 5417058 5487276
5206 5487276 5474117 5695828 5754577 5682129 5709860 5760099 5787168 5855855 5934183 5992032 6034587
5195 6034587 6057092 6174961 6364740 6584065 6752483 6881085 7075458 7219556 7399075 7450182
5185 7450182 7562209 7720578 7896244 7884162 7749605 7741821 7701196 7638540 7677898 7635811 7592510
5174 7592510 7647586 7759569 7888348 7919541 7975231 8066660 8203041 8137641 8237464 8359573 8473127
5163 8473127 8586232 8738087 8912221 9034530 9194297 9519739 9845197 10228325 10621281 10835842
5153 10835842 11086172 11222944 11202736 11219513 10992803 10772986 10610795 10400359 10183051 10114416
5143A0114416j70929O22o8478l6608M8394j02371N0753J692k9903J26255J71890
5132A0105733R855O9888J29986J94605K92842O2425k4511J62797K32026L07831
5122A1543477M2549J80076J20334L6787J12521J891q9997J048j71469j24903k4078
5111A1628236j4790L6833O8949K2701j5085J40702J18600R3657N0884J26766O9065
5100A2326518K5263R0739J72261J95865O5060N7112J14785J65174K6499N9436
5090A3298712J99242K35459O3162k046J87226K04854J28190O1856Q9296J44899
5080A4610850K70421J37895J53202K95683J76636J72357K8044K8251K79660K08723
5070A6361722j8553J17466J87111K61628J32989P6690K61928L90134J84629K53788
$$ plain form
5143 10114416 9943487 9944109 9875631 9839023 9887417 9785046 9835799 9837491 9807588 9933843 10105733
5132 10105733 10115588 10185476 10315462 10510067 10802909 10865334 10840823 11003620 11235646 11543477
5122 11543477 11586026 11766102 11886436 11923223 12035744 12037635 11947638 11948686 11777217 11652314 11628236
5111 11628236 11613446 11650279 11719228 11741929 11726844 11867546 11986146 12079803 12130687 12257453 12326518
5100 12326518 12351781 12442520 12614781 12810646 12875706 12932818 13047603 13212777 13239276 13298712
5090 13298712 13497954 13733413 13796575 13794529 13981755 14186609 14314799 14376655 14465951 14610850
5080 14610850 14881271 15019166 15172368 15468051 15644687 15817044 15845088 15873339 16152999 16361722
5070 16361722 16343169 16460635 16647746 16909374 17042363 17119053 17380981 17771115 17955744 18209532
5060A8209532K05548K85127K47465L59159K80423J63013J88142K57053L93023
5051B0588485K67599J03737J32448K73216J98200J93277J76181K60591L82746
5042B2576480K90207K79527M52878L72966L85503K54881L15917N12008N46516
5033B5986883O54345O40659O72900Q11789J130055J514927J683440K200947K771612
5024C8067557L353738M409787O075789Q138669J0152298J0294397N460238n606692
5016H0345781j0979692j0869740r003113o428803m544038l431373k633038j898738
5008C0557246j627545j209297j214895r36474p46975p01299o28118m83536l40570
4999B2668537l50149m30833l88979l35593j48032l90575k03221k57446k72689
$$ plain form
5060 18209532 18415080 18700207 18947672 19306831 19587254 19750267 19938409 20195462 20588485
5051 20588485 20856084 20959821 21092269 21365485 21563685 21756962 21933143 22193734 22576480
5042 22576480 22866687 23146214 23599092 23972058 24357561 24612442 24928359 25440367 25986883
5033 25986883 26641228 27281887 27954787 28766576 29896631 31411558 33094998 35295945 38067557
5024 38067557 41421295 45831082 51906871 60045540 70197838 80492235 85952473 80345781
5016 80345781 69366089 58496349 49493236 43064433 38520395 35089022 32455984 30557246
5008 30557246 28929701 27720404 26505509 25569035 24822060 24120761 23492643 23009107 22668537
4999 22668537 22318388 21887555 21498576 21162983 21014951 20624376 20421155 20163709 19891020
4990A9891020j58684l06474l65415l30594k60810j80373l99304l10474k62143
4981A7316749r6306j23661q5275j99480l18439j83553j28947j62247j3298j55402
4971A5850141k33160j33318j43351k84551j05556m3237k01797k03156j30802j20029
4961A4251184j27673k44303j53330k2797j27757n4306m4896j44308k31911o3288
4951A3036615k06212j19747j55275m3394J179j82435j77791N4375M465j71142
4941A2040638j08729k55110j1701n4809j17010j22005r5220q7198O6884j37587
4931A1118153q6294j13256j3693j1227l703q8529N6252M0392J1635J10482J11907
4920A1132119j0741J3793K07892P0337O4439J24223K56673Q1651J72908K18707
$$ plain form
4990 19891020 19732336 19425862 19060447 18729853 18469043 18288670 17889366 17578892 17316749
4981 17316749 17220443 17096782 17011507 16812027 16493588 16310035 16181088 16018841 16005543 15850141
4971 15850141 15616981 15483663 15340312 15055761 14950205 14906968 14705171 14502015 14371213 14251184
4961 14251184 14123511 13879208 13725878 13703081 13575324 13521018 13476122 13331814 13099903 13036615
4951 13036615 12830403 12710656 12555381 12511987 12513166 12330731 12152940 12207315 12211780 12040638
4941 12040638 11931909 11676799 11665098 11610289 11493279 11371274 11276054 11188856 11255740 11118153
4931 11118153 11031859 10918603 10904910 10893683 10889980 10801451 10857703 10898095 10909730 11020212 11132119
4920 11132119 11121378 11135171 11343063 11413400 11477839 11602062 11858735 11940386 12113294 12332001
4910A2332001K67394m0867j03276p8474l31340l55008j89454j33099k90026j37695
4900A0940156k01039j28100M7371o5745j82927J01467J91660J10870K04871J62983
4890A1181567L18872M20147M64978K05168K9851l800j5648R4544J06358O8105
4880A2870142J60197K5144O9797m150j40710m9878m5074l42534k39228j92299
4870A2111407k65586k05850J27741N3472m7141j88592k61453k80394j71301l34507
4860A0537796k15203j56530j80722m4285Q3418n9923L3104J19082L3466J62959
4850A0313162N1546K86889P6749J80713L39865M02214K64648K99182N16171J98921
4840A2930060O2896L8025q1147k17650k63490k10622k20945r6656K5074L8450
$$ plain form
4910 12332001 12599395 12558528 12455252 12376778 12045438 11690430 11500976 11367877 11077851 10940156
4900 10940156 10739117 10611017 10658388 10592643 10409716 10511183 10702843 10813713 11018584 11181567
4890 11181567 11500439 11920586 12385564 12590732 12620583 12616783 12601135 12695679 12802037 12870142
4880 12870142 13030339 13055483 13125280 13121130 12980420 12930542 12885468 12542934 12303706 12111407
4870 12111407 11845821 11639971 11767712 11821184 11774043 11585451 11323998 11043604 10872303 10537796
4860 10537796 10322593 10166063 9985341 9941056 10024474 9964551 9997655 10116737 10150203 10313162
4850 10313162 10364708 10651597 10728346 10909059 11248924 11651138 11915786 12214968 12731139 12930060
4840 12930060 12992956 13030981 12949834 12732184 12468694 12258072 12037127 11940471 11965545 12003995
4830A2003995J48432K95952J78850L36164M43435N09656O80461P92866R73765
4821A6363576J482614J653087K144220K823067L830813M874428O000150O051781
4813D5223736K500218l055070o042215o248354n352084m150757k909496k074007
4805A7891971j724321j333481r16243q56046p06896n93644m50336l66045l95618
4796A0549341l20800m09886j94066k18771j52044q3788J0331J7856j68334J20
4786I029959p0610j19200N680p8398q7121j37450n862J967O5990j9264P5881k4129
4774H637443R5187K8652q8638j6252J51000l9530K27319J76967J7789J59380P8290
4763I427607R4253K16157R8988J85939K87244K20354L53970J84423M01105L37766
$$ plain form
4830 12003995 12152427 12448379 12627229 12963393 13406828 13916484 14596945 15389811 16363576
4821 16363576 17846190 19499277 21643497 24466564 28297377 33171805 39171955 45223736
4813 45223736 47723954 44668884 38626669 32378315 27026231 22875474 19965978 17891971
4805 17891971 16167650 14834169 13917926 13061880 12354984 11761340 11311004 10944959 10549341
4796 10549341 10228541 9818655 9624589 9405818 9253774 9169986 9180317 9198173 9029839 9029959
4786 9029959 8959349 8840149 8845829 8767431 8680310 8542860 8536998 8538965 8604955 8585691 8661572 8637443
4774 8637443 8732630 8761282 8672644 8656392 8807392 8767862 8995181 9172148 9189937 9349317 9427607
4763 9427607 9521860 9738017 9837005 10022944 10310188 10530542 10884512 11068935 11470040 11807806
4753A1807806L49593L87452K55619P6060J70540Q8087N7805J99532J82565L26137
4743A3901196J77445K66568K67684L20304M28924M08434L80479N20106M27069
4734A7098209M60622N34380O16323P98168P38805P29518O74676P25004Q75926
4725B3251631R61015J159256J369268J584056J890920K151136K541077K930136
4717C7838495L455097L827874M350099M087336L429810J911904k52908j820880
4709E6826827k590524k906592k497350k003000j445776p19071l37495J41628L63454
4700D4832101M16898O81119J313003K006787K790461L820367M408698M700343
4692F4969777M356465L783652K781560J717291K96750j200831l007442m526821
$$ plain form
4753 11807806 12157399 12544851 12800470 12876530 13047070 13135157 13192962 13392494 13575059 13901196
4743 13901196 14078641 14345209 14612893 14933197 15362121 15770555 16151034 16671140 17098209
4734 17098209 17558831 18093211 18709534 19507702 20246507 20976025 21650701 22375705 23251631
4725 23251631 24212646 25371902 26741170 28325226 30216146 32367282 34908359 37838495
4717 37838495 41293592 45121466 49471565 53558901 56988711 58900615 58647707 56826827
4709 56826827 54236303 51329711 48832361 46829361 45383585 44664514 44327019 44468647 44832101
4700 44832101 45248999 45930118 47243121 49249908 52040369 55860736 60269434 64969777
4692 64969777 69326242 73109894 75891454 77608745 77905495 76704664 73697222 69170401
4684F9170401n444968n491843m796198m155881l135572k356264j576779j107247
4676D1105649q46018o02884n34924k23609L32753O64497J281377J815820K219577
4667D5212238K224378J461505J50963j496464l094874l944852m194133l870358
4659C2448403l425629k790802k465939k078399j691521j355399j338104j081320
4651A6221290r41458q48264o75598p32612o81552m49491k77818l80789l82858
4642A0850850l21708l56790l05323l01213l71502k49806l01617o3226j85061k02387
4632H192217j70344r0993O7287q2125l3399L3976J14413Q7484j74811k00568k01848
4621G541289r3625k46704k62057k32031j89568j35374j88229q3817j85887j30329
$$ plain form
4684 69170401 63725433 58233590 53437392 49281511 46145939 43789675 42212896 41105649
4676 41105649 40259631 39656747 39121823 38898214 39230967 39895464 41176841 42992661 45212238
4667 45212238 47436616 48898121 49049084 47552620 44457746 40512894 36318761 32448403
4659 32448403 29022774 26231972 23766033 21687634 19996113 18640714 17302610 16221290
4651 16221290 15279832 14431568 13755970 13023358 12341806 11892315 11614497 11233708 10850850
4642 10850850 10529142 10172352 9867029 9565816 9194314 8944508 8642891 8579665 8394604 8192217
4632 8192217 8021873 7930880 7998167 7916042 7882643 7916619 8031032 8118516 7943705 7743137 7541289
4621 7541289 7447664 7200960 6938903 6706872 6517304 6381930 6193701 6109884 5923997 5793668
4611E793668k5121j4073p0084o957j54845q8175N7809j10595p5787K8545M5237
4600E379622J44977J59087J70673K45711K42468J83798J93569R0923M8728q2017
4590F777539l35014k28585l11541k47154l35822k17290j96475k36521j21619j85734
4580D361784n2262j28607r298J960j43757n0894r3036j0891m0724j21552J3430
4569C726153n9876N4380L5240J7778O4153O1231P1804L8677l5973j20250k1435
4558C831882j36799j13297p7691j21599j16374o4433j90409j40305j01578o3089
4548B706308m6968p4852j1186j69184M280N5365L9296r2958l1515j4434l7855
4537B326297k3043k1763N7604m3331p9078M8053K2063j14652j01837N3867r912
$$ plain form
4611 5793668 5768547 5754474 5684390 5677433 5522588 5434413 5492222 5381627 5305840 5334385 5379622
4600 5379622 5524599 5683686 5854359 6100070 6342538 6526336 6719905 6810828 6859556 6777539
4590 6777539 6442525 6213940 5902399 5655245 5319423 5102133 4905658 4669137 4547518 4361784
4580 4361784 4309522 4180915 4171617 4173577 4029820 3978926 3885890 3874999 3834275 3712723 3726153
4569 3726153 3666277 3720657 3755897 3773675 3837828 3899059 3970863 4009540 3973567 3853317 3831882
4558 3831882 3695083 3581786 3504095 3382496 3266122 3201689 3011280 2870975 2769397 2706308
4548 2706308 2659340 2584488 2573302 2404118 2408398 2463763 2503059 2410101 2378586 2364152 2326297
4537 2326297 2303254 2281491 2339095 2295764 2216686 2264739 2286802 2172150 2070313 2124180 2114268
4526B114268o0920l7034N6965K8825K5370l6684l7063P8660p8884n1457o1031
4515A941015o6564N8572K2828j04764P667J15073m3083P7738K8341m6989O4949
4504B054783p1506l3395j5224k8114q2038J4031K2208l8953P7374n7486l4412
4493A807268N2453n273M5517J2978k0146O5186j879K676m338p3538o3263j6393
4481A801248j5198Q1479O7211j3501J60931p1791q7030m0331j0372K8990J23917
4470B025553j22326J12355K1653p8981K8733L9248k094P470J24147j40030L6468
4459B052196j057K923P3938J3814l116J991N606N4721j6113j09103j7760l256
4447B054784k3194N3897O3426L8138j03975j39029l1141o315k6029J19569M5449
$$ plain form
4526 2114268 2053348 2016314 2073279 2102104 2127474 2090790 2053727 2132387 2053503 2002046 1941015
4515 1941015 1874451 1933023 1955851 1851087 1858754 1973827 1930744 2008482 2036823 1989834 2054783
4504 2054783 1983277 1949882 1934658 1906544 1824506 1838537 1860745 1821792 1899166 1841680 1807268
4493 1807268 1859721 1854448 1899965 1912943 1892797 1957983 1956104 1958780 1954442 1880904 1817641 1801248
4481 1801248 1786050 1867529 1934740 1921239 2082170 2010379 1923349 1883018 1872646 1901636 2025553
4470 2025553 1903227 2015582 2037235 1958254 1986987 2026235 2024141 2031611 2155758 2015728 2052196
4459 2052196 2051139 2054062 2128000 2141814 2138698 2140689 2146295 2201016 2184903 2075800 2058040 2054784
4447 2054784 2031590 2085487 2148913 2187051 2083076 1944047 1912906 1906591 1880562 2000131 2045580
4436B045580n8551l0188O7764K6717K6374J8812k1759q4596n4120J33652n123
4425B064562R030p1754o8127O1453M6012J2801m7437p9622N6558N707l65J2825
4413B001643P9948Q4851m3002M8323J5983j40925J11089O6420l091q541r4049
4402B118649l5202J33248P2343q7939O6089m1466n4731K0696N3103k858M2000
4391B283932M9150J11425J7735l5648K6816Q3752j5768Q095Q9327L4904n8127
4380B595593m3138k423R5236P7173j01794j83950r9403K7616L1357j39955L2494
4369B288806N4779J02714L397J1319J82469R0360o7324N7448j6056m6192R3267
4358B754987p5720P0574J14867M6112q4824R5824j1727j11486n8157L0391R2958
$$ plain form
4436 2045580 1987029 1956841 2024605 2051322 2077696 2096508 2074749 1990153 1936033 2069685 2064562
4425 2064562 2073592 2001838 1933711 1995164 2041176 2053977 2006540 1926918 1983476 1989183 1988818 2001643
4413 2001643 2081591 2166442 2123440 2171763 2187746 2046821 2157910 2224330 2221239 2212698 2118649
4402 2118649 2083447 2216695 2289038 2201099 2267188 2225722 2170991 2191687 2244790 2241932 2283932
4391 2283932 2333082 2444507 2462242 2426594 2453410 2537162 2521394 2529489 2618816 2653720 2595593
4380 2595593 2552455 2550032 2645268 2722441 2620647 2436697 2337294 2364910 2396267 2256312 2288806
4369 2288806 2343585 2446299 2449696 2461015 2643484 2733844 2666520 2723968 2707912 2661720 2754987
4358 2754987 2679267 2749841 2864708 2910820 2825996 2921820 2910093 2798607 2740450 2770841 2863799
4347B863799L9294M1324j644n2644r572N7199J24917k3290k6942p094j8430L3708
4335C020625O176m746L8632P2849Q845R6166J16522K7316Q9814O8095L7831M7668
4323C625793n873L6576m8844N8580J8058Q1542J81710K43270L6580j49818K10113
4312D287687P0220O0960N6020r4163J02905K92769M5800R0586K16346O5385l2960
4301E161555j32J64856K07775M4915P3384J31024J03366N8147J66795J66765P2194
4290F350644J47480J79266J8198P6692K42118Q555R5967J63665J05204K3660K90400
4279G701849K61478J0236Q9521J37419K69714J39314J13220J84137K58426K02151
4269I367465J64522J05169K57350K10197J45431J39257K96029K62861R0714J76023
$$ plain form
4347 2863799 2903093 2944417 2942773 2890129 2880557 2937756 3062673 3039383 3012441 3005347 2986917 3020625
4335 3020625 3026801 3022055 3060687 3133536 3142381 3238547 3355069 3382385 3472199 3540294 3578125 3625793
4323 3625793 3619920 3656496 3607652 3666232 3684290 3765832 3947542 4190812 4227392 4077574 4287687
4312 4287687 4357907 4418867 4474887 4380724 4483629 4776398 4822198 4912784 5129130 5194515 5161555
4301 5161555 5161423 5326279 5534054 5578969 5652353 5783377 5886743 5944890 6111685 6278450 6350644
4290 6350644 6498124 6677390 6695588 6772280 7014398 7022953 7118920 7282585 7387789 7411449 7701849
4279 7701849 7963327 7973563 8063084 8200503 8470217 8609531 8722751 8906888 9165314 9367465
4269 9367465 9531987 9637156 9894506 10104703 10250134 10389391 10685420 10948281 11038995 11215018
4259A1215018K40238K78852K05402L14558J40608K76285K57944K26628L06206
4250A3461739L47375J74286K71457K89123K76808K20571K05073K42125K53487
4241A5742044K95838L41295L14802Q5445K09418L55713K28086K11479K49475J42139
4231A8175734J10186L19106K82055K69305L27743Q5846J38626K38017Q7458J41756
4221B0175832L11486J44031L2216K82939K12903J93422K62239J78808L33028J70012
4211B2296916L13274L74790K27560K64913M92263N01433L18835L27689N49563
4202B5667236M79898N48908M10875O33482O36643O49193Q81093Q83742R87961
4193C1779031J009112J070202J159762J338251J452215J537578J464668J702213
$$ plain form
4259 11215018 11455256 11734108 11939510 12254068 12394676 12670961 12928905 13155533 13461739
4250 13461739 13809114 13983400 14254857 14543980 14820788 15041359 15246432 15488557 15742044
4241 15742044 16037882 16379177 16693979 16779424 16988842 17344555 17572641 17784120 18033595 18175734
4231 18175734 18285920 18605026 18887081 19156386 19484129 19569975 19708601 19946618 20034076 20175832
4221 20175832 20487318 20631349 20663565 20946504 21159407 21352829 21615068 21793876 22126904 22296916
4211 22296916 22610190 22984980 23212540 23477453 23969716 24471149 24789984 25117673 25667236
4202 25667236 26147134 26696042 27106917 27740399 28377042 29026235 29907328 30791070 31779031
4193 31779031 32788143 33858345 35018107 36356358 37808573 39346151 40810819 42513032
4185D2513032J841165J890427J869339J996639K014610K120276K084592K287858
4177E8617938K226031K442349K312324K331597K302671K355474K321315K289853
4169G7199552K170415K009253J983094J947514J879602J573190J423186J268677
4161I1454483J496011J281982J379337J158844J116285J046239Q29303L83389
4153A00145873Q8118m883m28565n03869o86008r31768j044290j023047j177691
4144I4433870j459551j345245j520198j663522k016315k019675k325492k387872
4136G9696000k532647k571849k725969k882655k758554k567604k573215k577464
4128E8506043k411511k166601k437989k316154k184713k274365j992055j998505
$$ plain form
4185 42513032 44354197 46244624 48113963 50110602 52125212 54245488 56330080 58617938
4177 58617938 60843969 63286318 65598642 67930239 70232910 72588384 74909699 77199552
4169 77199552 79369967 81379220 83362314 85309828 87189430 88762620 90185806 91454483
4161 91454483 92950494 94232476 95611813 96770657 97886942 98933181 99762484 100145873
4153 100145873 100233991 100229108 99800543 99296674 98610666 97678898 96634608 95611561 94433870
4144 94433870 92974319 91629074 90108876 88445354 86429039 84409364 82083872 79696000
4136 79696000 77163353 74591504 71865535 68982880 66224326 63656722 61083507 58506043
4128 58506043 56094532 53927931 51489942 49173788 46989075 44714710 42722655 40724150
4120D0724150j827220j894690j740992j760257j433320j403271j385697j237434
4112B8041269j202860j142561r39484p93044q79940p98166q14977q72553r07468
4103A9690216q93706p34426p62792o79208o80610n67472n95495m98862l42672
4094A3934973m50298m84390k18446k42390m02494j95539k18070k49734j02708
4085A1370904k37309k54740j25262O2184p8641j80334M6165j08000j88106k18248
4075A0088613j71855k15775j65374j90736j59930p2590k63721k55897L1525j19722
4065H504538k42640j83710j95881k3653j54776k01200j44722p8782j80448p3767
4055G024959n8677o5778j67324j22197j15741p8394l2597j00318j37277l0321
$$ plain form
4120 40724150 38896930 37002240 35261248 33500991 32067671 30664400 29278703 28041269
4112 28041269 26838409 25695848 24756364 23963320 23083380 22285214 21470237 20597684 19690216
4103 19690216 18796510 18062084 17299292 16620084 15939474 15372002 14776507 14277645 13934973
4094 13934973 13484675 13000285 12781839 12539449 12136955 11941416 11723346 11473612 11370904
4085 11370904 11133595 10878855 10753593 10815777 10737136 10556802 10602967 10494967 10306861 10088613
4075 10088613 9916758 9700983 9535609 9344873 9184943 9112353 8848632 8592735 8624260 8504538
4065 8504538 8261898 8078188 7882307 7858654 7703878 7502678 7357956 7279174 7098726 7024959
4055 7024959 6966282 6900504 6733180 6610983 6495242 6416848 6384251 6283933 6146656 6116335
4045F116335O1394m1539p3144j11033J1553L2307l9396k923l9408N1093q4820
4034E880419r5951N1163K3419L1724n168l0298k8724p3874M1171K2022j17512
4023E698391K2364N4943J28035J53M1062l9036J8397N2642q4524P8860L6902O9220
4011F077409K1133O9940l8559k3999R086M1500Q742m0599J61456Q3616R6010J03268
3999F569003Q4289K00405M4162J05186J10396Q7429l2121l1798Q3855J5970k0044
3988G216732j0259J63594R3504R7325J5290O5192J00435K2399o5486k4471j3514
3977G660741J8641R0406J65508M6892o1056L1472R5316J84846J02062K7486L0961
3966H393275k4533J34686J71809J51613K36663K46528J27799L17612J58181O1530
$$ plain form
4045 6116335 6177729 6136190 6063046 5952013 5963566 5995873 5956477 5953554 5914146 5965239 5880419
4034 5880419 5784468 5835631 5859050 5890774 5885606 5855308 5826584 5752710 5793881 5815903 5698391
4023 5698391 5720755 5775698 5903733 5903886 5944948 5905912 5924309 5976951 5892427 5971287 6008189 6077409
4011 6077409 6098542 6168482 6129923 6105924 6115010 6156510 6165252 6124653 6286109 6369725 6465735 6569003
3999 6569003 6653292 6853697 6897859 7003045 7113441 7200870 7168749 7136951 7220806 7236776 7216732
3988 7216732 7206473 7370067 7463571 7560896 7576186 7641378 7741813 7764212 7698726 7674255 7660741
3977 7660741 7679382 7769788 7935296 7982188 7921132 7952604 8047920 8232766 8334828 8362314 8393275
3966 8393275 8368742 8503428 8675237 8826850 9063513 9310041 9437840 9755452 9913633 9975163
3956I975163J72185K31382J93975K83688R9610K08822K47585K95403J55651L07805
3946A2171269M29650K22841K74821M40594L14699L01104L04852L91539M90999
3937A5342368N84651P21673P14703P86624P19536J179884J258365J234395J326463
3928B3868662J492338J643459J503793J292008J123524Q04957N53331K95071R7812
3919C2674955N1467N9724l775L9289K74544L00231K44212J91272L26745J92347
3909C4351011j34843l86570o75360p81772q85850p51463q62705o29377m98310
3900B8744761m19876j95004l300j15372p2337o9067j99003j329J59998K03063
3890B8032534K36677M06544M02955M91507N50931N97240N87853N70194P34580
$$ plain form
3956 9975163 10147348 10378730 10572705 10856393 10956003 11164825 11412410 11707813 11863464 12171269
3946 12171269 12600919 12823760 13098581 13539175 13853874 14154978 14459830 14851369 15342368
3937 15342368 15927019 16648692 17363395 18150019 18869555 20049439 21307804 22542199 23868662
3928 23868662 25361000 27004459 28508252 29800260 30923784 31728741 32282072 32577143 32674955
3919 32674955 32726422 32786146 32782371 32821660 33096204 33396435 33640647 33831919 34158664 34351011
3909 34351011 34216168 33829598 33154238 32372466 31486616 30735153 29872448 29243071 28744761
3900 28744761 28324885 28129881 28126581 28011209 27938872 27869805 27670802 27669473 27829471 28032534
3890 28032534 28269211 28675755 29078710 29570217 30121148 30718388 31306241 31876435 32611015
3881C2611015N99772M34096K15760L41272K10152L34677M00412N12007O21752
3872C6280915Q52797J013473J053401J161583J186910J239003J222385J133682
3864D5144149J042123J135021P75134Q14968Q23530P60891O74379Q14273J029687
3855E3014155R47848R40302J047806J148018J062430R83090Q15909P03296M70985
3846F1133839K18932K56842J43391K6254Q6649P139R4195K67489J46323J62794
3836F2543847L61411K92555K73540K15993J65757J27649J72890K02149N4386K74757
3826F4684934L10109M39367O17569P00560J057770J172674J372876J699617J731942
3817G3787418J975553K151495K346921K563018K668810K768697K818736L039744
$$ plain form
3881 32611015 33210787 33644883 33860643 34201915 34412067 34746744 35147156 35659163 36280915
3872 36280915 37133712 38147185 39200586 40362169 41549079 42788082 44010467 45144149
3864 45144149 46186272 47321293 48096427 48911395 49734925 50495816 51170195 51984468 53014155
3855 53014155 53962003 54902305 55950111 57098129 58160559 59143649 59959558 60662854 61133839
3846 61133839 61352771 61609613 61753004 61779258 61865907 61873046 61967241 62234730 62381053 62543847
3836 62543847 62905258 63197813 63471353 63687346 63853103 63980752 64153642 64355791 64410177 64684934
3826 64684934 64995043 65434410 66051979 66752539 67810309 68982983 70355859 72055476 73787418
3817 73787418 75762971 77914466 80261387 82824405 85493215 88261912 91080648 94120392
3809I4120392K963308K794809K777576K797708K633980K326778K277547K316874
3801A15008972K315722K273745K263357K175797K017525J627036J251941P10047
3793A29644142K05163l16242p78691j160278j510916j692248j679741j457363
3785A21253826j280391j110677j050231r00206o36739n58009l74807m00833l76243
3776A14565690k28307k28816r9524j3072k8745J21009J48547K09584M18525L90951
3766A15255842N54446P62675Q37818R49454Q79837J151071Q72736N38255M66303
3757A22268437o1946n97510j005709j396237j821661k167510k533102k822048
3749A09862714l121393l186594l257245l213826l271769l103627l074497k922726
$$ plain form
3809 94120392 97083700 99878509 102656085 105453793 108087773 110414551 112692098 115008972
3801 115008972 117324694 119598439 121861796 124037593 126055118 127682154 128934095 129644142
3793 129644142 129849305 129533063 128754372 127594094 126083178 124390930 122711189 121253826
3785 121253826 119973435 118862758 117812527 116912321 116275582 115717573 115342766 114941933 114565690
3776 114565690 114337383 114108567 114009043 113995971 113967226 114088235 114236782 114446366 114864891 115255842
3766 115255842 115810288 116572963 117410781 118360235 119240072 120391143 121263879 121802134 122268437
3757 122268437 122206491 121608981 120603272 119207035 117385374 115217864 112684762 109862714
3749 109862714 106741321 103554727 100297482 97083656 93811887 90708260 87633763 84711037
3741H4711037k993616l096544l202683l247012l314018l365560l168981l045303
3733E9277320l020905k719133k398418k210530j812002j463879j280027j028688
3725D3343738p40507n46160l09099j80771R4647K01060L40986L55940L04385M13935
3715D3278154L23751L61007K31693J37579L65526L70657M09436N92181N38397
3706D6608381O16687O16889M97747M21217P022j71118k30223m30760m48800m45040
3696D7042002n45591n90749p40882o84997n60423p75774p25009o21688n60106
3687D1236783m23026o19453n79071o84851n68248n84005n19139m97449k69584
3678C6491957l25152l31332l69392l64719l46552k64560J4424J06406J31890K77452
$$ plain form
3741 84711037 81717421 78620877 75418194 72171182 68857164 65491604 62322623 59277320
3733 59277320 56256415 53537282 51138864 48928334 47116332 45652453 44372426 43343738
3725 43343738 42603231 42057071 41747972 41567201 41661848 41862908 42203894 42559834 42864219 43278154
3715 43278154 43601905 43962912 44194605 44332184 44697710 45068367 45477803 46069984 46608381
3706 46608381 47225068 47841957 48339704 48760921 48767943 48596825 48366602 47935842 47487042 47042002
3696 47042002 46496411 45905662 45164780 44479783 43919360 43143586 42418577 41796889 41236783
3687 41236783 40813757 40194304 39615233 38930382 38362134 37778129 37258990 36761541 36491957
3678 36491957 36166805 35835473 35466081 35101362 34754810 34490250 34504674 34611080 34742970 35020422
3668C5020422K50672L81682M76104O67672O61633N13868M40693O91103O80751
3659C9784600P61454R59442R33358J032416J014264J128618R68772J106583J183515
3650D8873022J267932J273851J434999J476110J499617J617394J896641J928568
3642F1268134K138959K349360K472393K661069L043146L283619L688478M252696
3634H5157854M780642N369504N982631O601986P326367Q097709R326225J0742400
3626A43385318J2374382J3833227J5067366J6048718J6152111J5496080J4237835
3619B46595037J2043052Q897969N946994L004178N22026r91138j897086k029739
3611B72091293j742350j285391n94924l68923p94896j818887l450603n842037
$$ plain form
3668 35020422 35271094 35652776 36128880 36796552 37458185 37972053 38412746 39103849 39784600
3659 39784600 40546054 41505496 42438854 43471270 44485534 45614152 46582924 47689507 48873022
3650 48873022 50140954 51414805 52849804 54325914 55825531 57442925 59339566 61268134
3642 61268134 63407093 65756453 68228846 70889915 73933061 77216680 80905158 85157854
3634 85157854 89938496 95308000 101290631 107892617 115218984 123316693 132642918 143385318
3626 143385318 155759700 169592927 184660293 200709011 216861122 232357202 246595037
3619 246595037 258638089 267536058 273483052 276487230 277009256 276018118 274121032 272091293
3611 272091293 270348943 269063552 268468628 268099705 267304809 265485922 262035319 256193282
3603B56193282q598634j1441049j3859939j5600673j6572096j6682888j6115047
3596A57322956j4763538j3212252j1794658j0269397q922521p924486o790859
3589H3645245o028671n279170m698647m087169l686174l203028k898103k567005
3581E1197278k281576k123212j983154j708221j566071j389508j386868j470819
3573C7287849j243069j160938j028396r54634j055780q98099p75456p46371p68643
3564B8656463q51796n33655n79268o56455m82015n02937l80929m27731m39929
3555B3801748m41825l93075l66459l06122l06648l79626l79730k11645j38256
3546B0878362j98974k74952j91540o3096j20392k16870j88607l3887k7658l5780
$$ plain form
3603 256193282 247594648 236153599 222293660 206692987 190120891 173438003 157322956
3596 157322956 142559418 129347166 117552508 107283111 98360590 90436104 83645245
3589 83645245 77616574 72337404 67638757 63551588 59865414 56662386 53764283 51197278
3581 51197278 48915702 46792490 44809336 43101115 41535044 40145536 38758668 37287849
3573 37287849 36044780 34883842 33855446 32900812 31845032 30946933 30171477 29425106 28656463
3564 28656463 27804667 27271012 26691744 26035289 25553274 25050337 24669408 24241677 23801748
3555 23801748 23359923 22966848 22600389 22294267 21987619 21607993 21228263 21016618 20878362
3546 20878362 20679388 20404436 20212896 20149800 20029408 19812538 19623931 19590044 19562386 19526606
3536A9526606l5956L4669p1400n8327k9509p7715l9587N9965N0135J58372J13818
3525A9631071K08012J46804J99350J89355J65639J28581L19101M44494K52046
3516B1684453L66611M30452M19585N97946O55172P00851O82669Q57535R27894
3507B7323168J003416Q84289R10831R95946R22512O49956M53538M55550M8569
3498C3647775k71881o72978j047621j069891j167644j142482p26258p01915p44202
3489B6102903p25228n69537k82029l85489k64055k91698q8682l0003j23603j26574
3479B3216005q059k03287K1749K0812N810n3412J48321R5266J52242P0514J64761
3468B3630722K40484J67839K40921L70757K51856K79469J60567K59606K11148
$$ plain form
3536 19526606 19490650 19525319 19453919 19395592 19366083 19288368 19248781 19308746 19358881 19517253 19631071
3525 19631071 19839083 19985887 20185237 20374592 20540231 20668812 20987913 21432407 21684453
3516 21684453 22051064 22481516 22901101 23499047 24154219 24855070 25537739 26395274 27323168
3507 27323168 28326584 29210873 30121704 31117650 32040162 32690118 33143656 33599206 33647775
3498 33647775 33375894 32702916 31655295 30585404 29417760 28275278 27549020 26847105 26102903
3489 26102903 25377675 24808138 24526109 24140620 23876565 23584867 23496185 23466182 23342579 23216005
3479 23216005 23207946 23004659 23026408 23047220 23053030 22999618 23147939 23243205 23395447 23465961 23630722
3468 23630722 23871206 24039045 24279966 24650723 24902579 25182048 25342615 25602221 25813369
3459B5813369K03647K21529L69196M48155L88190K42025M06838M58642M44941
3450B8996532N50844N50378Q19472J037087J345046J702080K069081K682298K948040
3441D2700858K903448J123197n20578o87042l79099N07637J102185J857500K643187
3432E1251293L421070L840998M574551N522834P365692R848439J3946974J8818799
3424A18590650K6009294L0397936K1690573j0417323k9164498k7750787k3139223
3417A06216622j5160059j0020759n852670l650994j353778K49243K032353K591182
3409G5051140K223159k104208m336455l774067j999071j37513J470779K749032
3401F9142796M085826N967269R290008J3382327J8511527K5453175K8273135J4450525
$$ plain form
3459 25813369 26017016 26238545 26607741 27055896 27444086 27686111 28092949 28551591 28996532
3450 28996532 29547376 30097754 30917226 31954313 33299359 35001439 37070520 39752818 42700858
3441 42700858 45604306 46727503 46206925 45519883 45140784 45648421 46750606 48608106 51251293
3432 51251293 54672363 58513361 63087912 68610746 75976438 85824877 99771851 118590650
3424 118590650 144599944 174997880 196688453 186271130 157106632 129355845 106216622
3417 106216622 91056563 81035804 75183134 71532140 70178362 70427605 72459958 75051140
3409 75051140 77274299 75170091 70833636 67059569 65060498 64922985 66393764 69142796
3401 69142796 73228622 79195891 88485899 101868226 120379753 145832928 174106063 188556588
3393A88556588j7897612l0513777k8097295k2426347j5012392j0378117p030597
3386E7200451n251256l835361l190687k333940k137846j361930o89784K57236
3378C8656883O10120L87770j702186k513182k182433j380553n90699J36568P20599
3369C2142887M33102j526566k681993k766803k536417j871216j343061j291266
3361A8558667r60163p44304n49452n55186m24581n45472l46348l14971k38170
3352A3880020j44430l6154Q267N6365J79067J98753N26761Q45670J143607J477407
3342A8135333J687489R94620j129426k018539k029485j661787j167080q04240
3334A2006885n30473n68223m23499k64475k72508l33880l20145j64114k65345
$$ plain form
3393 188556588 170658976 140145199 112047904 89621557 74609165 64231048 57200451
3386 57200451 51949195 48113834 44923147 42589207 40451361 39089431 38399647 38656883
3378 38656883 39267003 39654773 37952587 35439405 33256972 31876419 31285720 31422288 32142887
3369 32142887 32575989 31049423 28367430 25600627 23064210 21192994 19849933 18558667
3361 18558667 17598504 16854200 16304748 15749562 15324981 14779509 14433161 14118190 13880020
3352 13880020 13735590 13699436 13707703 13764068 13943135 14141888 14668649 15514319 16657926 18135333
3342 18135333 19822822 20817442 19688016 17669477 15639992 13978205 12811125 12006885
3334 12006885 11476412 10908189 10484690 10220215 9947707 9613827 9293682 9129568 8864223
3325H864223k67796k03840j82755j20628l8351j76287J274j01605j45746j67520
3315G460969j80283m4086k97487k79442j5340j15027k09476j13140k06829j70052
3305E829807j220r4582n7721N9819j63098m2486p6957p8777j65588j30481L4308
3294E113024r7603k03327R657j9459o2964r5775j15944o8693j91716j71740n6891
3283D038569m6592j14467J0264j25133N9018J23062J5463L313m9358P737l9306
3272C882570q0052p9419J68595j24692K4774K56456K04195j2377j42918j9183
3262D077949j19935q5125P8984O697j28156p9476o2976l0140j60012n7434q4476
3251C355900j34844l1024l5059j0032O5650O5487O3133l8753j9667M8842J9179
$$ plain form
3325 8864223 8596427 8392587 8209832 8089204 8050853 7874566 7875840 7774235 7628489 7460969
3315 7460969 7280686 7236600 6939113 6659671 6644331 6529304 6319828 6206688 5999859 5829807
3305 5829807 5828587 5734005 5676284 5736103 5573005 5530519 5453562 5374785 5209197 5078716 5113024
3294 5113024 5015421 4812094 4821751 4802292 4739328 4643553 4527609 4458916 4267200 4095460 4038569
3283 4038569 3991977 3877510 3887774 3762641 3821659 3944721 3960184 3963497 3914139 3921876 3882570
3272 3882570 3802518 3723099 3891694 3767002 3791776 4048232 4252427 4240050 4097132 4077949
3262 4077949 3958014 3872889 3951873 3958570 3830414 3750938 3687962 3657822 3497810 3440376 3355900
3251 3355900 3221056 3190032 3154973 3144941 3210591 3276078 3339211 3300458 3280791 3329633 3348812
3240C348812J44520M5658P0355K0779n1672L3893J01365J67984J50151L942J5398
3229D051185P5602O8778M1744J36566J13355J15488m2637Q407j25181p8800r4851
3218D269656j98127q3833l7345r2275n210M0764J36765N0386J3630L7466J70315
3207D302192J04027O9178Q205K8980J37315J15510M7334l5241K4290J96531K55483
3196E253804K74018J60188J75255L17437K64931L45881J25258m6503K989j46941
3186F726317k43280j64513q6893j06185n5776r4915J1647L7961J11605J15078
3176F251046J04225J39243o7017J30281J46583J59620K75562J59112J42615K03518
3166G644788K08443K72552K91555L12532L25891L62375K46164r0636k62546l69261
$$ plain form
3240 3348812 3493332 3538990 3609345 3630124 3578452 3612345 3713710 3881694 4031845 4035787 4051185
3229 4051185 4126787 4195565 4237309 4373875 4487230 4602718 4560081 4568488 4443307 4364507 4269656
3218 4269656 4071529 3987696 3950351 3858076 3852866 3893630 4030395 4080781 4094411 4131877 4302192
3207 4302192 4406219 4475397 4483602 4512582 4649897 4765407 4812741 4777500 4801790 4998321 5253804
3196 5253804 5527822 5688010 5863265 6180702 6445633 6791514 6916772 6870269 6873258 6726317
3186 6726317 6483037 6318524 6231631 6125446 6069670 5974755 5986402 6024363 6135968 6251046
3176 6251046 6355271 6494514 6427497 6557778 6704361 6863981 7139543 7298655 7441270 7644788
3166 7644788 7853231 8125783 8417338 8729870 9055761 9418136 9664300 9573664 9311118 8941857
3156H941857l84030l00669k51182k70660k58956q9681j66627L1638L4839J44032
3146G430561M5836R8083J06183R8813J42903J23911K48804K27540L31947L08288
3136I162869J52012m0735j05389j32570k58155k59684j91115k48160j94597j78468
3126G706008k59313l07974k31385k81121j71341r3848o4051o5385l0186j0131
3116F191273K7353J23828l9733J5610L6350J11411n9312p8348j87411k05628q3413
3105E851980l29488l18332l21412k08849k37185k01491j21793j30034j26265j79848
3095C677283n4112j36627k52453j18777n6082j07624R7270j16009p3060j29217
3085B730592o3391j10386p1370N6003q3764j95625m274L573l8258j53429q5848
$$ plain form
3156 8941857 8557827 8257158 8005976 7735316 7476360 7386679 7220052 7251690 7286529 7430561
3146 7430561 7476397 7574480 7680663 7779476 7922379 8046290 8295094 8522634 8854581 9162869
3136 9162869 9314881 9274146 9168757 9036187 8778032 8518348 8327233 8079073 7884476 7706008
3126 7706008 7446695 7138721 6907336 6626215 6454874 6361026 6296975 6231590 6201404 6191273
3116 6191273 6218626 6342454 6302721 6318331 6354681 6466092 6406780 6328432 6141021 5935393 5851980
3105 5851980 5522492 5204160 4882748 4673899 4436714 4235223 4113430 3983396 3857131 3677283
3095 3677283 3623171 3486544 3234091 3115314 3059232 2951608 3048878 2932869 2859809 2730592
3085 2730592 2667201 2556815 2485445 2541448 2457684 2262059 2257785 2261358 2223100 2069671 1983823
3074A983823N2385j35174r4369j58454O3104Q7048n5139M810M8767n8018q6434
3063A652349j10148p646l2483k6396k0224Q1555j45179n2067O4899m4467j4531
3052A345662l6132j08997Q748k0475j25561P2191m5163N7693J8781j65791n8733
3041I42223J20891k2290j7718o7251N5630n981k5782N997j0691m9833p4355l0284
3029H20556q2196M4P5396r2928j4382j7530r0094m2407l3938J42278J33705j71851
3017F26653J1694q795l7466L0810j32257N909M1040k4848j38712Q9452N6354L8737
3005E58571r0299J0866n2132j8579K9239r5225R2663j6160L9435k2992q0503M3672
2993C98556J7685L1858N8953n5062j28997N3403n9224O7963O2080L0706l6545
$$ plain form
3074 1983823 2036208 1901034 1806665 1648211 1711315 1798363 1743224 1748034 1796801 1738783 1652349
3063 1652349 1542201 1534555 1502072 1475676 1455452 1537007 1391828 1339761 1404660 1360193 1345662
3052 1345662 1309530 1200533 1209281 1188806 1063245 1135436 1090273 1147966 1166747 1000956 942223
3041 942223 1063114 1040824 1023106 955855 1011485 1005504 979722 985719 975028 925195 850840 820556
3029 820556 738360 738404 813800 720872 706490 688960 598866 556459 522521 664799 798504 626653
3017 626653 638347 629552 592086 622896 490639 496548 537588 512740 374028 463480 519834 558571
3005 558571 468272 479138 427006 408427 437666 342441 435104 418944 458379 435387 354884 398556
2993 398556 416241 448099 507052 451990 322993 376396 317172 385135 447215 477921 441376
2982D41376j8332j1276k3713n8015m675J14510r3514p5129J2476O344M9002j6107
2970C22947J1501p2181l1000P4575L3746k2914L4944k7405R8390m7471n7887L418
2958C20663l8865m6474j3165J3121J5184J89210m0728o3808j24394o2930k0788
2947A27026L750J30203q3544M9252k5629j1984M8203k0974k4709O2781k8281o3440
2935A62654l1452K8200j6466m1148p5801O2446R8042N2793J347m1864J4629j5169
2923A98211j3624j9553P8798j00277j8229M7429M364O506k5566q6502Q2250j2798
2911A41009L1943J05052q1528o6951j01680l0218j0679M764J6701L0390N3766
2900I2569J4013M1932o3973k199L302P2240q4576r5881M6868L2435L3513k8956
$$ plain form
2982 441376 423044 411768 388055 330040 325365 439875 346361 271232 283708 290052 339054 322947
2970 322947 334448 262267 231267 305842 339588 316674 351618 324213 422603 375132 317245 320663
2958 320663 281798 235324 222159 235280 250464 439674 398946 335138 210744 147814 127026
2947 127026 130776 260979 177435 226687 201058 189074 237277 216303 191594 254375 226094 162654
2935 162654 131202 159402 142936 101788 25987 88433 186475 239268 240615 198751 213380 198211
2923 198211 184587 165034 243832 143555 125326 172755 177119 183625 158059 71557 153807 141009
2911 141009 172952 278004 196476 129525 27845 -2373 -13052 -8288 8413 38803 92569
2900 92569 106582 148514 84541 82342 85644 157884 73308 -22573 24295 56730 90243 61287
2888F1287Q127K7880q4728k2520O2934J35854m8719j14160P6513P7423j8966N725
2876A66650n9764L0363m71p3519j2276P4123m371j04192O687O6324n2602r3788
2864e6836J38323q550K8545N475l0625l6244j07402O9862J25762J5974j4009L1009
2852A61284j01241O7563k4849o0332p1241P3039k096j0760q5567J11990P0666
2841A28456j2515M8724P9518n0664j60339l5794j04051J10082P0732m4836l4752
2830e439L875M3664q1905M2595R5056O6525m7933m8944j7871R357O9294r2562
2818C5712N10l147J9195o6881m4465J31884m7963j13984j813n8806P5425l2838
2806a07171M5792L413M4193j0437j9157P0075l7504j0758k6643O0983L1533n2414
$$ plain form
2888 61287 69414 97294 12566 -9954 52980 188834 140115 25955 102468 179891 160925 166650
2876 166650 106886 137249 136778 63259 50983 125106 120735 16543 23230 89554 36952 -56836
2864 -56836 81487 72937 101482 106957 76332 40088 -67314 2548 128310 144284 130275 161284
2852 161284 60043 127606 102757 42425 -28816 44223 42127 31367 -54200 57790 128456
2841 128456 115941 164665 244183 193519 33180 -2614 -106665 3417 74149 29313 -5439
2830 -5439 -1564 42100 -39805 2790 97846 164371 116438 67494 49623 58980 128274 35712
2818 35712 36222 33075 52270 -14611 -59076 72808 24845 -89139 -90952 -149758 -74333 -107171
2806 -107171 -61379 -57966 -13773 -24210 -43367 26708 -10796 -21554 -48197 12786 44319 -8095
2794h095q4786J1941K7715O8723m1276n265N2492P5077q5043n3861K30885q7367
2782A01140j66928L2707J6384O0316l9907j26781l5425N7582k3697j7444J04978
2771c7075O8686M3259k7798o8584J5736k8851l0262R0327l2124J6751p983O4760
2759F6842j28228O2120m0832l7891K6168k5738L8873J00232j04128r3346J6450
2748a19478r2849J54448J4605m4432l3080Q7254M8017K0844m5277l09m6050J2476
2736d3831L2131J6662J33967N974m4808j04092J9120j26178L5224R9521R4932
2725A18622n3926m2562q8660j1168P8562Q0415p3980n4245k3687L6680q2214P878
2713a08285n4215N6092J26204K56n7181O1987M0313q324p8798J0232m8512p5903
$$ plain form
2794 -8095 -92881 -80940 -53225 15498 -25778 -31043 21449 96526 11483 -42378 188507 101140
2782 101140 -65788 -33081 -16697 43619 3712 -123069 -158494 -100912 -124609 -142053 -37075
2771 -37075 31611 74870 47072 -21512 -5776 -34627 -64889 25438 -6686 10065 2082 66842
2759 66842 -61386 734 -40098 -77989 -51821 -77559 -38686 61546 -42582 -135928 -119478
2748 -119478 -212327 -57879 -43274 -87706 -120786 -33532 14485 35329 -9948 -10257 -56307 -43831
2736 -43831 -11700 4962 138929 144903 100095 -3997 15123 -111055 -75831 23690 118622
2725 118622 64696 22134 -66526 -77694 868 81283 7303 -46942 -70629 -33949 -116163 -108285
2713 -108285 -162500 -106408 19796 20052 -37129 24858 65171 56847 -21951 -11719 -60231 -136134
2701a36134M6670M7874q5595K4944K6185k1977o4236j3376K57203o1407n4796
2690c4645l7043j16882p6581K12529k953j04156M6766P1727n7007R2068j0819
2679a6996R199j65960n8689J51246R1006n2884p318Q313j8462j01765J2333L9698
2667a10279n4674N8016J06643l8580M2571L009L4764k9331J2790o1406J03535
2656F7058m9830k4392o1335j0849P3661r9829l6039R8158K1459k7626j8465J2168
2644e5861j3554p5085N1715J07906K9773l0627k4265J28042n2822M5951M2311
2633A53484l5597J15091J53491L4332R253K7198q0921o6739j82937p7681n0991
2622b017q480N256M8936P1601L639j12370L8797O0083J1935q8047m0899P096J27106
$$ plain form
2701 -136134 -89464 -41590 -127185 -102241 -76056 -98033 -162269 -175645 81558 20151 -34645
2690 -34645 -71688 -188570 -265151 -52622 -55575 -159731 -112965 -41238 -98245 -6177 -16996
2679 -16996 -7797 -173757 -232446 -81200 9806 -43078 -50396 -42083 -60545 -162310 -149977 -110279
2667 -110279 -164953 -106937 -294 -38874 3697 6706 41470 12139 24929 -36477 67058
2656 67058 17228 -7164 -68499 -79348 -5687 -105516 -141555 -43397 -21938 -49564 -68029 -55861
2644 -55861 -69415 -144500 -92785 15121 44894 14267 -9998 118044 65222 111173 153484
2633 153484 117887 232978 386469 420801 430054 457252 376331 309592 126655 48974 -2017
2622 -2017 -10497 -5241 43695 115296 118935 6565 45362 105445 117380 29333 -11566 -4470 122636
2609A22636j37489q0158O3175O1816j5109O7307J4825o0129Q3864r2383n4441
2598b6086N1309j4429p9542R7703K6228p266R486p0149O1087n2318o7850N1462
2586b0365m1565Q8686L0564j8454K7032o9319l5729p9155J50060j4344M5617k644
2574F0384p8332n061R5002K8050n4418J21317n5014r0229q066M5556j9347l9381
2562D61n896o5161R2216R3341l659o5390m1099J5595N6736L2485m6367K3848j0205
2549G6905o3588J8220N8313J14303k9963K0753N1376j01511Q9552j21674N6679
2538A69365N8241L9710o7487o2770N2114L9391O5003O2152j69905J118J7145l4434
2526A69643P1104j02294O526O8085p108j10707J00512j7240J23j65149P6460R5824
$$ plain form
2609 122636 -14853 -95011 -31836 29980 14871 82178 97003 36874 120738 28355 -26086
2598 -26086 25223 10794 -68748 28955 55183 47917 57403 -12746 48341 -3977 -71827 -20365
2586 -20365 -61930 26756 57320 38866 65898 -3421 -39150 -118305 31755 17411 63028 60384
2574 60384 -17948 -23009 71993 100043 45625 166942 111928 21699 13633 59189 39842 461
2562 461 -5435 -70596 21620 114961 111302 45912 4813 20408 77144 109629 63262 87110 76905
2549 76905 13317 31537 89850 204153 174190 194943 246319 144808 234360 112686 169365
2538 169365 227606 267316 199829 137059 189173 228564 293567 355719 185814 186932 204077 169643
2526 169643 240747 138453 144979 213064 205956 95249 195761 178521 178644 13495 89955 185779
2514A85779P00L8329P744O9204n9749O8068J50564j00295j10355J45264Q6842
2503D82095J9287l6712j28627K1580q4165l2304m0285K8359q223O4098K8051m2339
2491B70815P9322O0995l0582l0509K5549k2766m677K8670k8129P9702p978k1050
2479C99362J19691M0304l0235N8418r239q386k2484p4088J09350M7003j9779j09006
2467E00911q0983J17714J77939O4781J8133l7642q0676J159M8315J19257P5400
2456I24308M3724m1251j8666k6021N6136J22069J6870j2830q0667k428J52806
2445A134050J17035O2338p5925J12703o2898m0533J66756k2114l508Q5347M5878
2434A519129p2393J37599n0306Q4175J26077Q7961L8914O511k0684J57226l012
$$ plain form
2514 185779 186479 224808 232552 301756 242007 310075 460639 360344 249989 395253 482095
2503 482095 501382 464670 336043 357623 273458 241154 200869 229228 221005 285103 313154 270815
2491 270815 350137 411132 380550 350041 375590 352824 348147 376817 348688 428390 420412 399362
2479 399362 519053 559357 529122 587540 578301 569915 547431 473343 582693 629696 609917 500911
2467 500911 419928 537642 715581 780362 798495 760853 680177 681336 729651 848908 924308
2456 924308 968032 926781 908115 882094 938230 1060299 1077169 1064339 983672 981244 1134050
2445 1134050 1251085 1313423 1237498 1350201 1287303 1246770 1413526 1391412 1387904 1473251 1519129
2434 1519129 1446736 1584335 1534029 1618204 1744281 1832242 1871156 1877667 1856983 2014209 2011197
2423B011197j9699L1686Q0231K7700O596M3152J25570R3684M928L9438J28095
2412B572578R4579l5849J01883K69425J23498J37954O4131J38698J07425K40812
2402C815134K64059K11677J34170J38150K47175K18135K31539K75923J92559J16257
2392E844778O6853j5202P2359K47007J83099K10676L83899L18778L48671M93533
2382H154451M77919N60828P96860R82548R36562O87201K49709M76137P53127J128812
2372A5204154J594069K141079K395285L341534M262362N915669Q011300J0842884
2364E3708336J5562434J5742373j19304j4409061j4773323j3453814r287583o157239
2356B6812819m336288l386641k455413j863441j322828j236211r58041n35129
$$ plain form
2423 2011197 1991498 2023184 2103415 2131115 2137711 2180863 2306433 2400117 2405045 2444483 2572578
2412 2572578 2667157 2631308 2733191 3002616 3126114 3264068 3328199 3466897 3574322 3815134
2402 3815134 4079193 4290870 4425040 4563190 4810365 5028500 5260039 5535962 5728521 5844778
2392 5844778 5911631 5896429 5968788 6215795 6398894 6609570 6993469 7312247 7660918 8154451
2382 8154451 8632370 9193198 9990058 10972606 11909168 12596369 12846078 13322215 14075342 15204154
2372 15204154 16798223 18939302 21334587 24676121 28938483 34854152 42865452 53708336
2364 53708336 69270770 85013143 84893839 70484778 55711455 42257641 32970058 26812819
2356 26812819 22476531 19089890 16634477 14771036 13448208 12211997 11253956 10718827
2348A0718827m47238o99417r77526o59967p24080p13775l42672k96008l47219
2339E510925k64624j92049k54659l97145l07276j51275k15515l20837k32576j77117
2329B997852J7994j58968j69966n6242j30033o1867j98874O7814j65506r6715
2319B045489p4907p1691k9129q1697k3560j71140l8605R0012j32644j46686Q26
2308A366268o882O6333j48349j51327j5195J06750l8377o2704m8133j73242k8037
2297H67105J5210p4069r527q8245j13310O3562N6675r2214k2650p6283L8911j0515
2285E54650k6831l3635m7003R7364p0973l5862j03313L208L2838l0373m2630J20470
2273D17910R3986m3187o2849K2139J9751n5209j10999O5451k6122L2390n2496
$$ plain form
2348 10718827 10271589 9572172 8594646 7934679 7210599 6496824 6154152 5858144 5510925
2339 5510925 5246301 5054252 4799593 4402448 4095172 3943897 3728382 3407545 3174969 2997852
2329 2997852 3015846 2856878 2686912 2630670 2500637 2438770 2239896 2307710 2142204 2045489
2319 2045489 1970582 1898891 1869762 1788065 1764505 1593365 1554760 1644772 1512128 1365442 1366268
2308 1366268 1359386 1425719 1277370 1126043 1110848 1217598 1179221 1116517 1068384 895142 867105
2297 867105 882315 808246 798719 710474 597164 660726 717401 625187 602537 526254 565165 554650
2285 554650 527819 494184 447181 544545 473572 437710 334397 337605 370443 340070 297440 417910
2273 417910 511896 468709 405860 427999 447750 392541 281542 346993 320871 353261 300765
2262C00765M6364J53311o6518l4241j0944P764j39636m2505M9743N9864q6156
2251B37811l1418k643K1000k2271K6900k811k278j20235q9014Q8814J15449M4578
2239B63882J8523p1321n8001o9804L750o0436K0992q2712N0731J45620N6318j27409
2227I0133j05834N3469m6722O6233N646M5737J0737r2696K2516J23262k1764j17452
2215C3265O8059J6197m9327J6377P6008m2146J10694K166j02756l7033R144o9814
2203C0834L0053l2313m425N412l7319r0925N9319O4263O4779L2068n9598j37522
2191g5374J4843N6228O0663j2121k06821J06909L5076J08504p9687o9689L9087
2180b2382M3666o8271j7774O1823K7147k9355n3779Q3340j3280R0417n7149j627
$$ plain form
2262 300765 347129 500440 433922 399681 388737 396501 256865 214360 264103 323967 237811
2251 237811 206393 203750 224750 202479 229379 226568 224290 104055 15041 103855 219304 263882
2239 263882 282405 211084 153083 83279 87029 26593 47585 -35127 15604 161224 217542 90133
2227 90133 -15701 37768 -8954 57279 62925 108662 119399 26703 49219 172481 150717 33265
2215 33265 101324 117521 68194 84571 160579 118433 229127 231293 128537 91504 100648 30834
2203 30834 60887 28574 24149 29561 -7758 -98683 -39364 24899 89678 121746 62148 -75374
2191 -75374 -60531 -4303 56360 44239 -162582 -55673 -20597 87907 8220 -61469 -22382
2180 -22382 21284 -46987 -64761 -2938 24209 -5146 -58925 24415 11135 101552 44403 42776
2168D2776L9879l6377r953j39426k3465J21287N3780M9522K793j36824J01568
2157F5560k1370M4366j16825L2121J7133O5985R748k0560p0315L4740J4456J9711
2145G4750p7r1026O9313k0525n6514p0671O5446j0164O670r4023n1361P8956J44301
2132D5075k7191p1205j884K1873P3887q4089P297J4580O7466L0500p259m4017
2120B5033p1797R5530O349r2920l2345N1975R7377r1160r10j7096n9157L9283
2108d9838o946Q4526o3510j4607J01419m2485p0120P6589k8729K2392L430J70787
2096A82908J52215j3827m7253M4322K2984j2086r6030r9246q8183j668N0863q1919
2084A3080j47123j48280j8270J79425J31864j02317J03539m9526Q9818L4964j12724
$$ plain form
2168 42776 82655 46278 36325 -103101 -126566 -5279 48501 98023 100816 -36008 65560
2157 65560 44190 88556 -28269 3852 20985 86970 96718 76158 5843 40583 55039 74750
2145 74750 74673 -16353 52960 32435 -24079 -94750 -29304 -39468 -32798 -126821 -178182 -99226 45075
2132 45075 17884 -53321 -55205 -33332 40555 -43534 -36237 -21657 45809 76309 69050 25033
2120 25033 -46764 48766 55115 -37805 -70150 -18175 79202 -11958 -12868 -29964 -89121 -49838
2108 -49838 -56784 27742 -35768 -50375 51044 8559 -61561 15028 -13701 8691 12121 182908
2096 182908 335123 321296 274043 318365 341349 329263 233233 133987 45804 44136 94999 13080
2084 13080 -134043 -282323 -300593 -121168 10696 -91621 11918 -37608 52210 87174 -25550
2073b5550K5299j853k5130Q4251j21667o3165J94806j25036L5104N0729m1814
2062a4026K0938n3532J8554J09487k1250l9143J31697p9487j49199o5216P5565
2051f5612j00119J9283P0841N5269P631k0671k282n6083K1432L1512j5012K8128
2039b5683N9828J7661n6346M3636k7054J23753N5391j29049m5656j6612l7934
2028c8065p5581P8327L6448q7065n0756J23917l604M0075r7819j8170n9692L4588
2016a17397n4364L5787R1164j8130L4128q9700J2069J06703L2623o9157j6281
2005e2555l9647L9848k8466O6P2762J6577j59958k6462L9645J33329p8695L5168
1993d8388K0047L8661o5378o6085K6838q977J82139k3388o4579L2445j1596q1835
$$ plain form
2073 -25550 -251 -2104 -27234 57017 -64650 -127815 66991 -58045 -22941 27788 -14026
2062 -14026 6912 -46620 -28066 81421 60171 21028 152725 73238 -75961 -141177 -65612
2051 -65612 -165731 -146448 -75607 -20338 -12707 -33378 -35660 -91743 -70311 -38799 -53811 -25683
2039 -25683 34145 51806 -4540 39096 12042 135795 191186 62137 16481 -131 -38065
2028 -38065 -113646 -35319 1129 -85936 -136692 -12775 -16379 23696 -74123 -92293 -151985 -117397
2016 -117397 -171761 -135974 -44810 -62940 -28812 -118512 -106443 260 32883 -36274 -52555
2005 -52555 -92202 -52354 -80820 -80754 -7992 8585 -151373 -177835 -138190 -4861 -83556 -48388
1993 -48388 -28341 10320 -55058 -121143 -94305 -103282 78857 55469 -9110 23335 11739 -70096
1981g0096q894j32958L4838J26302l0138q2860N2188J5086l9123O692P8458n2653
1969a03158m0832O8654Q2519l6172P8275r2994j11341N3483K8134o7765P4404
1958f6793j3445k3800Q6789N5454j8511k9692l3070L1717k30763P3133J95955
1947B6974q9358o3444l48l1092p6228J10806L5943n6688M9328K3809q3772L1244
1935a22826R0757j10479k6580L936j07536J38033M4529k2023l6946q3505K7888
1924b04752n9894M507N5456O2762J4411J764n107j0005m0328J11619Q5492k5013
1912i088m6207K0919o0907j0856N7032l7969R8979r7333J2397P1678n272q9600
1900i6227j16560Q5237M5877L3267L5595o9532j5660l1477M0393m0472k0909Q1686
$$ plain form
1981 -70096 -78990 -211948 -177110 -50808 -80946 -163806 -111618 -96532 -135655 -128963 -50505 -103158
1969 -103158 -143990 -75336 7183 -28989 49286 -43708 -155049 -101566 -73432 -141197 -66793
1958 -66793 -80238 -104038 -17249 38205 19694 -9998 -43068 -11351 -242114 -168981 26974
1947 26974 -62384 -125828 -126176 -157268 -233496 -122690 -86747 -143435 -94107 -70298 -154070 -122826
1935 -122826 -32069 -142548 -169128 -165192 -272728 -134695 -90166 -112189 -149135 -232640 -204752
1924 -204752 -264646 -260139 -204683 -141921 -127510 -125746 -130853 -140858 -181186 -69567 15925 -9088
1912 -9088 -55295 -34376 -95283 -106139 -49107 -87076 11903 -85430 -73033 -1355 -6627 -96227
1900 -96227 -212787 -127550 -81673 -48406 -12811 -82343 -98003 -129480 -89087 -129559 -150468 -68782
1888f8782l6054j25723p6962J24576J80871L2966q2867r924J76403j72790o1822
1877a20108K4095R4742o8447q1469P4767K5493o8171m5329J1909N0075J8587Q3280
1865e76j02400o212j9167P37N4884n139m9058P1173q304J15200o980r5255j75574
1852b26671N4081P8356m8845m6139J27366P4068r8921k2946k2032M8426j2515
1841i5772K2717P3955N6316k06334j2824o5454R5339K6579j04819K9431L2445
1830a48421l8662m5284p813J10546R5847O5655q1477M4795m814K9984q9096m7161
1818a15901l2758L6815K8661j4781k9530P9651k0714M7680J1968p9966N0774p7272
1806a15373K3589N844k5065N511o820O1271n2795j9647J28068l9622k911m582
$$ plain form
1888 -68782 -104836 -230559 -307521 -182945 -2074 30892 -51975 -61899 114504 -58286 -120108
1877 -120108 -96013 -1271 -69718 -151187 -76420 -50927 -119098 -164427 -152518 -102443 -83856 -576
1865 -576 -102976 -109188 -128355 -127618 -72734 -77873 -126931 -55758 -64062 51138 44158 -51097 -226671
1852 -226671 -172590 -94234 -143079 -189218 -61852 12216 -86705 -109651 -131683 -83257 -95772
1841 -95772 -73055 900 57216 -149118 -161942 -227396 -132057 -105478 -210297 -180866 -148421
1830 -148421 -187083 -232367 -240180 -129634 -33787 31868 -49609 -4814 -9628 20356 -68740 -115901
1818 -115901 -148659 -111844 -83183 -97964 -127494 -47843 -68557 -20877 -8909 -88875 -38101 -115373
1806 -115373 -91784 -85940 -111005 -105494 -112314 -51043 -103838 -123485 4583 -35039 -37950 -42532
1794d2532K9183n0387M64p5950l9481P805k1753J11074k4505j6006M1018n9691
1782a40761k6812P9557J2164J9077N2482n2925P3250R0390n7907p8607j8345j31644
1770a80081k4319Q6022J1956j6764m6721k1016J7610l1415m0747J11232l2457
1759a66700O0883J56083o4567r0594K0000l641P9329k669r6075P6351p0168j59316
1747b61084J04789j0938m2783l742Q5638k4171l3386O8556N083m8831Q4687J27411
1735E1229j7245k00619L1449o2041K1020J9829o7993J19374k4128Q8597l3649
1724g4177j2838j0197J869L8199j08276M3411J43715k113J5027R742j16153m9805
1712a21596L6593O7585o1697j01889J00087r3851J0144J45732j8829j03405K8165
$$ plain form
1794 -42532 -13349 -63736 -63272 -139222 -178703 -170898 -192651 -81577 -106082 -122088 -81070 -140761
1782 -140761 -167573 -88016 -75852 -56775 -4293 -57218 16032 106422 48515 -30092 -48437 -180081
1770 -180081 -204400 -118378 -106422 -123186 -169907 -190923 -173313 -204728 -245475 -134243 -166700
1759 -166700 -105817 50266 -14301 -104895 -84895 -88536 -9207 -11876 -107951 -31600 -101768 -261084
1747 -261084 -156295 -167233 -210016 -213758 -128120 -152291 -185677 -117121 -112038 -160869 -76182 51229
1735 51229 33984 -166635 -135186 -197227 -176207 -156378 -224371 -104997 -129125 -40528 -74177
1724 -74177 -87015 -97212 -95343 -57144 -165420 -122009 21706 19593 34620 44362 -71791 -121596
1712 -121596 -85003 -17418 -79115 -181004 -80917 -174768 -164624 -18892 -37721 -141126 -112961
1701a12961Q7088n7058m0844k7942O8138Q5058j11823j10373p696Q3566J32846
1690a2001Q8143j26444N6057J8363j36004P9210K7340j8138J5855K6733K4600
1679D3714l9218L3005j44099l9328K2814j5978M8022p568M6414m1591q1627J30597
1667d4843p1416j23165J11315k6030J6840P4343J0219K5182l0581l1092J3987
1656g5241m8742J01718m705j23877l3364M9501J26003o3841n6017K6514m321l6476
1644a42848L7849M7612P0009k0009j15326j0401O7930Q2218N6251j0673j4149
1633D8463j290L6516o0868n4308J29161J7205k06642k0900j5632l0139J07394
1622e1040l2522n9681k7552O9809M3579M7197k7778q4628L3784m3319q5387J27580
$$ plain form
1701 -112961 -25873 -82931 -123775 -151717 -83579 1479 -110344 -220717 -228413 -144847 -12001
1690 -12001 76142 -50302 5755 24118 -111886 -32676 -5336 -23474 -7619 19114 43714
1679 43714 4496 37501 -106598 -145926 -123112 -139090 -91068 -98636 -52222 -93813 -175440 -44843
1667 -44843 -116259 -239424 -128109 -154139 -137299 -62956 -52737 -27555 -58136 -89228 -75241
1656 -75241 -123983 -22265 -26970 -150847 -184211 -134710 -8707 -72548 -128565 -102051 -106372 -142848
1644 -142848 -104999 -57387 12622 -7387 -122713 -133114 -65184 17034 73285 62612 48463
1633 48463 47173 83689 22821 -31487 97674 114879 -91763 -112663 -128295 -158434 -51040
1622 -51040 -83562 -143243 -170795 -100986 -57407 -10210 -37988 -122616 -88832 -132151 -217538 -89958
1610h9958L4510K4720q6626N0750K6965n3592P3130k7846L3651j7832p3039m8897
1598a54064Q7126J6975O8762l5352l9800k9405N7235L679k9266l4115l4478L6922
1586h5781P4085k3193j60911J11922O0000O7358j25387K8781O1679P0042k9308
1575D9287k6752K368K9837K3119L500q4914k4306J23836l9872L2707j08995j9261
1563c9446j700J04986L4777p3677r7375n4142M9723m8892L6731l2265M2725J10304
1551C1749q7895l8000P230J13840J2822k1702p5754j04689j0151J03196J23634
1540E4280J30439p0038p7486o7277l5285p0493N4952l9198K0952J35347k1084
1529A5109l8145n9225K9208O8784R5417j03724n9000o6927k4132L3425m3346P4310
$$ plain form
1610 -89958 -55448 -30728 -117354 -66604 -39639 -93231 -20101 -47947 -14296 -32128 -105167 -154064
1598 -154064 -66938 -49963 18799 -16553 -56353 -85758 -28523 -24844 -54110 -88225 -122703 -85781
1586 -85781 -11696 -34889 -195800 -83878 -23878 43480 -81907 -53126 8553 78595 49287
1575 49287 22535 24903 54740 77859 81359 -3555 -27861 95975 56103 88810 -20185 -39446
1563 -39446 -41146 63840 98617 24940 -72435 -126577 -76854 -125746 -89015 -121280 -78555 31749
1551 31749 -56146 -94146 -86916 26924 39746 18044 -57710 -162399 -172550 -69354 54280
1540 54280 184719 114681 37195 -30082 -65367 -135860 -80908 -120106 -99154 36193 15109
1529 15109 -23036 -82261 -53053 15731 111148 7424 -51576 -118503 -142635 -109210 -152556 -78246
1517g8246J66668j23904P892P2071j16885J0251J12365r1644m6702k3806Q480
1506a03460k9504R6485O8809j6548j57279l3958P9510q672J08531j63793J17013
1495d2866j1905k2139N651K98L6045k0894O9737p2087K2021k1667l9006M978J02839
1482A1005n0862l9845r349L8106k5486L2173j37910Q2159J20047N829n0798N1717
1470B6786O1225J3407L0559l836n9085p0844K0961J1362n3583l9827n8115l7830
1458a58820O0335m9565O6941Q463P968M3467p5292Q2346o6803l7773J18968k3615
1446b3380N5352n8850m7218j7769m706l5598p1658J18978J7978j6355J33673j36685
1434h6238J20019j3621j4354n6895n2723R333K4495o6482J59927p9969j4148k6174
$$ plain form
1517 -78246 88422 -35482 -27590 44481 -72404 -62153 50212 -41432 -88134 -111940 -103460
1506 -103460 -132964 -36479 32330 15782 -141497 -175455 -95945 -104617 3914 -159879 -42866
1495 -42866 -54771 -76910 -71259 -70961 -34916 -55810 13927 -58160 -36139 -57806 -96812 -91834 11005
1482 11005 -39857 -79702 -89051 -50945 -76431 -44258 -182168 -100009 20038 25867 -24931 26786
1470 26786 88011 101418 131977 128141 69056 -1788 19173 30535 -23048 -62875 -120990 -158820
1458 -158820 -98485 -148050 -81109 -72646 -64678 -21211 -96503 -14157 -80960 -118733 235 -23380
1446 -23380 31972 -26878 -74096 -91865 -96571 -132169 -203827 -84849 -66871 -83226 50447 -86238
1434 -86238 33781 20160 5806 -51089 -103812 -94479 -69984 -136466 23461 -56508 -70656 -96830
1422i6830j897M0751J1529J09609j00812J9620k6158O488M5099k5411l3299R8673
1410D7362r5103q1296J4757J00304J06063m6805j16395m6344J3966q957L2594
1399g9854N1336j1578j680k3882j11676J63709j060j50485O6988J21724M6845
1388G0387j42890J6322J6074m690n7112N0481O5034l9050j3768P4953p8606J2282
1376c0583L7705K0632j9739J5862n725j4344k4175l9402J49277o1322p0747q0135
1364a22696L8180Q1024J59405k8288r2817q3868j9857N0384r52k8932L7040Q5928
1352G4551r3047O5657j35195L9280N1892r9169j18206P1689J71091M2525m6203
1341B4865K080N9440L8037j48126k4303O219n3063J9595p9173J07767j36479J12134
$$ plain form
1422 -96830 -98727 -57976 -46447 63162 -37650 -18030 -44188 -37700 7399 -18012 -51311 47362
1410 47362 -47741 -129037 -114280 -13976 92087 45282 -71113 -117457 -103491 -112448 -79854
1399 -79854 -28518 -40096 -41776 -65658 -177334 -13625 -14685 -165170 -98182 23542 70387
1388 70387 -72503 -56181 -40107 -44797 -101909 -51428 13606 -25444 -39212 35741 -42865 -30583
1376 -30583 7122 27754 8015 23877 18152 3808 -20367 -59769 89508 28186 -42561 -122696
1364 -122696 -84516 -3492 155913 127625 34808 -49060 -68917 -18533 -19485 -48417 -11377 74551
1352 74551 -18496 47161 -88034 -48754 3138 -96031 -214237 -142548 28543 71068 24865
1341 24865 26945 86385 124422 -23704 -48007 -41788 -94851 -75256 -154429 -46662 -183141 -71007
1329g1007O0814O0766j7203o1198L2884K529J40174n5329j34499m9166j1866m5920
1317a49021M0369L4600O3960P1944j00338N4203k4302K1960k8037L6403q4392
1306f2651p655p2824l3219Q2802N9454j1255q4693J6412n4973R3637l3932p152
1294a16049Q2826n3734m8156R3422J01967L6050p0132j4299p6659M230m6483O0194
1282d6823Q6129L3694K4055j996r0596r7531o1883R7972m0194j5681L1147N4901
1270b6806l1426n3647L330J33214J01062j62833l2550m8839m8685L4305M6543
1259h6332O5410M09R3823J8834m1262j9793j53750J8935O2852n7528J06230m4800
1247c6972N2591L3430j15710k2641K2897m1178j237K671K2940L0798r019N137
$$ plain form
1329 -71007 -10193 50573 33370 -27828 5056 7585 147759 92430 -42069 -91235 -103101 -149021
1317 -149021 -108652 -74052 -10092 61852 -38486 15717 -8585 13375 -14662 21741 -62651
1306 -62651 -70306 -143130 -176349 -93547 -34093 -45348 -130041 -113629 -168602 -74965 -108897 -116049
1294 -116049 -33223 -86957 -135113 -41691 60276 96326 26194 11895 -64764 -60534 -107017 -46823
1282 -46823 39306 73000 97055 95059 4463 -93068 -154951 -56979 -97173 -112854 -81707 -26806
1270 -26806 -58232 -111879 -108549 24665 125727 -37106 -69656 -118495 -167180 -132875 -86332
1259 -86332 -20922 -20513 73310 92144 50882 31089 -122661 -103726 -40874 -98402 7828 -36972
1247 -36972 15619 49049 -66661 -89302 -66405 -107583 -108820 -106149 -83209 -52411 -61430 -56293
1235e6293M8477m4672j8705l6148Q484q635Q7650J04151K7847o103r4506l9242
1223b7695o7465m9343M5349m0495p5048J14678L7627J70334k3271o6304L7597
1212E5964J5049j08148l8184j6813J07316l5390j4627N6189J11857J20451q7137
1201A66527j64518K6358p5252K9383l980o1313P9637j6990K5677o156k7831j1416
1189c9874L3949J0691p1201L1813N0781q2108l5914J17382P8776q7836l2773j02079
1177a28393j8182J78685m4876J2843q7650R9599K5398j28463O8832k5425o1597
1166a09229n9650L6831R3187k0796M2307N7369j7525L2978j11697o8622J02967
1155b1880O872P2710o8638k6141O524j00543K7081j9689L4808O9353J02026L700
$$ plain form
1235 -56293 -7816 -52488 -71193 -107341 -98857 -107492 -19842 84309 112156 106053 11547 -27695
1223 -27695 -95160 -144503 -99154 -139649 -214697 -100019 -62392 107942 84671 18367 55964
1212 55964 71013 -37135 -75319 -92132 15184 -20206 -34833 21356 133213 253664 166527
1201 166527 2009 28367 -46885 -17502 -21482 -82795 -3158 -20148 5529 -627 -28458 -39874
1189 -39874 -5925 4766 -66435 -34622 16159 -65949 -101863 15519 94295 6459 -26314 -128393
1177 -128393 -146575 32110 -12766 77 -87573 12026 37424 -91039 -22207 -47632 -109229
1166 -109229 -168879 -132048 -38861 -59657 -17350 40019 22494 55472 -56225 -124847 -21880
1155 -21880 -15008 57702 -10936 -37077 -30553 -131096 -104015 -123704 -88896 -19543 82483 86183
1143H6183l5559j00084L6803K5293j5824K8515L9946q2283j17324o486J19838
1132b0982j5424k2922P4542k036J0068M7018o3546m4630L8492J41188l8178j03274
1120C16l8241o9207N6430o0353P542J0918R9270P3791l7044j52231J04114O9556
1108F4861j6114K0785k8513n6525L8104j7985j0772k5679q1944O804k1940k0738
1096a49656j4331R0099k9726O8614K1560m5415K9195J7989r700K8857j37228L2778
1084i6964J29678n0113r1715P9726l3606m8487O8066Q8802r382j73039o0752L0558
1072a67228O7498J11450j7107l0881L3717n884l5542j10040Q9812J37625q9359
1061a5939o0609l640R4762O0217K1692l9649j1639j1924l3396k7548k037J14626
$$ plain form
1143 86183 50624 -49460 -12657 12636 -3188 25327 65273 -17010 -134334 -140820 -20982
1132 -20982 -36406 -59328 15214 13178 23246 70264 6718 -37912 580 141768 103590 316
1120 316 -37925 -107132 -50702 -111055 -103513 -92595 6675 80466 43422 -108809 -4695 64861
1108 64861 48747 69532 41019 -15506 22598 4613 -6159 -31838 -113782 -106978 -128918 -149656
1096 -149656 -163987 -73888 -103614 -35000 -13440 -58855 -29660 -11671 -21371 7486 -129742 -96964
1084 -96964 32714 -17399 -109114 -29388 -62994 -111481 -43415 45387 36005 -137034 -197786 -167228
1072 -167228 -99730 11720 -5387 -36268 -2551 -8435 -43977 -154017 -64205 73420 -15939
1061 -15939 -76548 -80188 14574 74791 96483 56834 45195 33271 -125 -27673 -29710 84916
1049H4916K1102n7015j39430j03564J67981o7621j7305P1309l7393Q2819n1470
1038d5671M2846J12554q608n196m8998j4838j0097L3866l4722J8784j3281n7319
1026c0680n5536j6080R1025K8174R3716m3109J2329n4282K6073m4830M4281j7236
1014C3845p4705P4607p6755J2174N500r019R0493J11914m0282j17149K4766j936
1002C3453K1430J8132p3593L2889M1322L6943m2980L2391L1931p9310K333p8935
990b3994Q2838j8516O750k7638J6615q0472n3012k3743j5994J36477n2158K4957
978b7890R7394N129J2418n7299j52798J5130M6155O9782n9709Q814O9967N5941
966H3034j85127m0977N5396K8524r0393j4133J27169Q4000l143r4536J5385O3341
$$ plain form
1049 84916 106018 49003 -90427 -193991 -26010 -93631 -110936 -39627 -77020 5799 -45671
1038 -45671 -2825 109729 101121 95925 46927 32089 21992 55858 21136 39920 26639 -30680
1026 -30680 -86216 -102296 -11271 16903 110619 67510 79839 25557 51630 6800 51081 33845
1014 33845 -40860 33747 -43008 -30834 -25334 -34353 56140 168054 127772 10623 35389 33453
1002 33453 54883 73015 -578 32311 73633 110576 67596 99987 131918 52608 54941 -23994
990 -23994 58844 40328 47078 19440 36055 -44417 -97429 -121172 -137166 -689 -52847 -27890
978 -27890 69504 74633 87051 29752 -123046 -107916 -61761 8021 -51688 -42874 27093 83034
966 83034 -102093 -143070 -87674 -59150 -149543 -163676 -36507 47493 44350 -50186 -34801 28540
954B8540l7104j6015P4086k5795M7916n0957J8899l1224M4811l8986l5366K189
942a9006K9146L9007O047J7506P7291k39880k2639n930L874J45819J9974p5844
930b4635m7661j0491q5971J45777Q6905M2487q003M7598m8440r281l0403o3765
918e883m0790J6672P9770j00084J10334J35156l7144l2834j7045l214n2833p7082
906b4977J2567o5725J17129j3950k6495N3822j18456M2764r3703J1072L3378K1166
894e1408m5833N2500M6520p0002J06595L6669K2511j15704n2044K199j3052J17507
882C6458P870o7968J7834Q9390l3819j2976L3141j24180k1323R8861n3566P9249
870D8971m8359j3919M2260L4137l8505o6901r5793J02876J5675O0004O692m9655
$$ plain form
954 28540 -8564 -24579 49507 23712 71628 20671 39570 8346 53157 14171 -21195 -19006
942 -19006 10140 49147 55194 72700 149991 -89889 -112528 -118458 -114584 31235 51209 -24635
930 -24635 -72296 -82787 -168758 -22981 63924 106411 98408 146006 97566 88285 57882 -5883
918 -5883 -46673 -30001 49769 -50315 60019 195175 158031 125197 108152 104938 52105 -24977
906 -24977 -12410 -78135 38994 25044 -1451 52371 -66085 -23321 -117024 -105952 -72574 -51408
894 -51408 -97241 -44741 1779 -68223 38372 75041 97552 -18152 -70196 -67997 -81049 36458
882 36458 44328 -23640 -5806 83584 49765 36789 69930 -54250 -75573 23288 -30278 48971
870 48971 612 -13307 28953 63090 24585 -42316 -138109 -35233 -19558 40446 47138 -2517
858b517J74694n7606n1913L8445K0448p6281p783J644J7758k5525L4542k4720
846D1186k6120J18663j20006m6458k0567L7312r956Q4380j9514r737p9811Q5773
834C5145j3655m9923M0133R735l121M0401n8839n5607R2493Q0339j2558k02635
822i8092J10992R1945n7511K5968J1572j58291Q1215P8104L9930q3997k384l5191
810D260L7956n7135Q5627K3618j66274M411R5975j4754Q44J2217O2024N497N3324
797A47590j13800j0735K9265j86152R8085J57564q5396q8350L4341k4539n6983
786i9110J42266k3951L3462L3600o1717o2633q7914p0954J14110J15407l4681
775b115j1990J50808L3892n8939L50r9669J9607l9926j71130J49769Q0438n0793
$$ plain form
858 -2517 172177 114571 62658 101103 121551 45270 37487 39131 56889 31364 65906 41186
846 41186 15066 133729 13723 -32735 -53302 -15990 -25946 58434 38920 29183 -50628 35145
834 35145 21490 -28433 11700 21435 18314 58715 -124 -55731 36762 117101 104543 -98092
822 -98092 12900 104845 47334 73302 84874 -73417 7798 85902 125832 41835 39451 4260
810 4260 42216 -14919 70708 94326 -71948 -67537 28438 13684 14528 26745 88769 94266 147590
797 147590 33790 23055 52320 -133832 -35747 121817 36421 -51929 -17588 -42127 -99110
786 -99110 43156 19205 52667 86267 24550 -38083 -125997 -196951 -82841 32566 -2115
775 -2115 -14105 136703 170595 111656 112006 12337 31944 -7982 -179112 -29343 51095 302
763C02R5167k5655k735k2053j4175j7730P5966r5525Q0703L4487J31511J6625
751B56888j22893j07290M7438J0957j993n9408O4386l0437O925j0455q42L5854
739H9130Q52j5170j2965j59006l2469M2472L5194J32688J1126R429j22605J2159
727i165P3320o863k1669q3916j3154j7611Q8349k7054o8629J8994Q4984j7083
715E03n9454N6153L7319q1621p0966J31061Q8306j00773P2016P7888o9439N0300
703A31293j22045L6607Q4747k8715j35441N553L548M420P1488r0488o2146J70042
691F8863J0794j9789K748o4348P8960O4547l8104J13806k2755q6969L8967J23534
679B70254l1584k5576j17767q5815j5814L7824j8707k4470j538J06586j4115j15982
$$ plain form
763 302 95469 69814 67079 45026 30851 13121 89087 -6438 74265 108752 240263 256888
751 256888 133995 26705 74143 85100 83107 23699 88085 57648 64573 54118 53276 89130
739 89130 89982 74812 61847 -97159 -129628 -87156 -51962 80726 91852 101281 -21324 -9165
727 -9165 64155 57292 35623 -48293 -61447 -79058 9291 -17763 -86392 -67398 17586 503
715 503 -58951 -2798 34521 -47100 -118066 12995 101301 528 72544 150432 80993 131293
703 131293 9248 45855 130602 101887 -33554 -28001 -24453 -20033 51455 -39033 -101179 68863
691 68863 79657 59868 62616 -1732 77228 141775 103671 217477 194722 107753 146720 270254
679 270254 238670 213094 95327 9512 -6302 31522 12815 -11655 -13193 93393 79278 -36704
667c6704m8137j7943n0373J13441N0019P8010O2593k8592o2780m3578j1657q228
655c929N516P3245M6628k5574L0516k4053L4057K6608k9256n5656M7866J692n2894
642G4766j11306O7092o5500k0252r09R0915N7577k4938j1424q5619k6672L2825
630b3445J11077m4772k8390Q9611K4115N505n2814n8655l985J7219k2924K778
618A5320r2139J08925Q3340l1499m6309l3936J76460R245p4338K189j5071l909
606I8278J0595m2281M7736o9747K931Q377n6758K8991K0116L4367Q522j7698p8505
593e076n6528M1913Q6430O4739o272N334j24363J36326p7843q9101J93435j5398
581A53596K0005q7182L2584l6811n3149Q768n3959L8386J26697J8087o8408r5995
$$ plain form
667 -36704 -84841 -102784 -153157 -39716 10303 88313 150906 122314 59534 15956 4299 -3929
655 -3929 1587 74832 121460 95886 126402 102349 136406 163014 133758 78102 125968 127660 74766
642 74766 -36540 30552 -34948 -55200 -56109 34806 92383 67445 56021 -29598 -56270 -23445
630 -23445 87632 42860 14470 104081 128196 133701 80887 22232 18247 35466 12542 15320
618 15320 -76819 32106 115446 83947 37638 3702 180162 189407 115069 117258 102187 98278
606 98278 108873 66592 114328 44581 47512 55889 -869 28122 48238 82605 91127 73429 -5076
593 -5076 -61604 -19691 66739 131478 125206 130540 6177 142503 64660 -24441 168994 153596
581 153596 173601 86419 119003 82192 29043 37811 -16148 22238 148935 167022 98614 2619
569B619k195L1622M8813n2636N0414r8818J3812j5179J44945n8428R4770n6716
557A03023m5322K9688j69513J22183K9537k9815R2908K5376k3277k3738p8043
546C3007M9147J4104O2622P471p4585M0389n8555l9119j1491p7894J3340Q853
534c2711o196O3607j0000r7730J17102q805J6688K9608P7556q4729r795n7027
522b432q634J42144L3034n9535M5836N855l104p8401j21769J10309P4818n3426
510H4695j01877k6599M9751j3076M7299J7009l4736L5092O6084j8668k0360k4242
498F0372M4193O5149n4413j5990r5674j1620Q402m8221O6085k3857j36744r331
486a51649J13905J10541J6391n5446L3299M9905q6244l4464o003m6877K9673q100
$$ plain form
569 2619 424 32046 80859 28223 78637 -20181 -6369 -21548 123397 64969 159739 103023
557 103023 57701 87389 -82124 40059 69596 39781 132689 158065 134788 111050 33007
546 33007 82154 96258 158880 166351 91766 132155 73600 34481 22990 -54904 -41564 -32711
534 -32711 -38907 24700 14700 -83030 34072 25267 41955 71563 149119 64390 54595 -2432
522 -2432 -11066 131078 164112 104577 150413 156268 153164 74763 -47006 63303 138121 84695
510 84695 -17182 -43781 5970 -7106 40193 57202 22466 57558 123642 104974 84614 60372
498 60372 104565 169714 115301 99311 3637 -7983 419 -47802 18283 -5574 -142318 -151649
486 -151649 -37744 72797 89188 33742 67041 116946 30702 -3762 -9765 -56642 -26969 -35069
474c5069J6470R983K1789N0683R9382j33518p9413N9417J23919p8845j7812J4099
462E1085M9375l463p1572O2855m6776p1839k4350J05098J24091j70817n1038N0853
450C502P1095k8637J8848J7838q1468O9087o9552P1189l9373n7550N1389M1833
438F8201p9361N7753K3963j0230R2090q8461j92676J7896O8715K7132M7894P0422
426A03338k5890o8574j19687J29714j1359Q199P6530N3065J5514j11958K9055
415G7947k5042O0794J4581n5031J05301l8089j51786N0949l8727M4355M3292r176
403G9368j39029O1774j4860L4370k7016m4689P9774L7959O5479k252K749j27708
$$ plain form
474 -35069 -18599 -8616 13173 63856 163238 29720 -49693 9724 133643 54798 36986 51085
462 51085 100460 96997 25425 88280 41504 -30335 -54685 50413 174504 3687 -47351 3502
450 3502 74597 45960 64808 82646 1178 70265 713 71902 32529 -25021 26368 68201
438 68201 -11160 46593 70556 60326 152416 63955 -128721 -110825 -42110 -14978 32916 103338
426 103338 77448 8874 -110813 18901 7542 15741 92271 145336 160850 48892 77947
415 77947 52905 113699 128280 73249 178550 140461 -11325 39624 897 45252 88544 79368
403 79368 -59661 2113 -12747 21623 -5393 -50082 29692 67651 133130 130878 133627 5919
$$ [...]
##END NTUPLES=NMR SPECTRUM
##END=
