##TITLE=1H_CG-1182-x+y
 DMSO
 8 sc, 
 11.1.2024
##JCAMPDX= 6.0         $$ Bruker NMR JCAMP-DX V2.0
##DATA TYPE= NMR SPECTRUM
##DATA CLASS= NTUPLES
##ORIGIN= UXNMR, Bruker Analytische Messtechnik GmbH
##OWNER= root
$$ XWIN-NMR		Version 3.5
$$ Thu Jan 11 14:19:13 2024 Russian Standard Time (UT+4h)  she@DPX200
##.OBSERVE FREQUENCY= 200.1313
##.OBSERVE NUCLEUS= ^1H
##.ACQUISITION MODE= SIMULTANEOUS
##.ACQUISITION SCHEME= undefined
##.AVERAGES= 8
##.DIGITISER RES= 18
##SPECTROMETER/DATA SYSTEM= spect
##.PULSE SEQUENCE= zg30
##.SOLVENT NAME= DMSO
##.SHIFT REFERENCE= (INTERNAL, DMSO, 0, 15.5398)
##AUDIT TRAIL= $$ (NUMBER, WHEN, WHO, WHERE, WHAT)
$$ ##TITLE= Audit trail, XWIN-NMR		Version 3.5
$$ ##JCAMPDX= 5.01
$$ ##ORIGIN= Bruker BioSpin GmbH
$$ ##OWNER= she
$$ F:/spectra/data/she/nmr/H-F/1/pdata/1/auditp.txt
$$ ##AUDIT TRAIL=  $$ (NUMBER, WHEN, WHO, WHERE, WHAT)
(   1,<2024-01-11 14:17:20.81 +0400>,<she>,<DPX200>,
      <created by zg, POWCHK disabled, PULCHK disabled
       configuration hash MD5:
       00 E9 B6 7A A2 85 ED C7 34 08 36 98 17 FE 4E 26
       data hash MD5: 16K
       21 F4 79 B3 5B 8C 3D 74 A9 09 0E 89 78 C2 26 66>)
(   2,<2024-01-11 14:17:26.42 +0400>,<she>,<DPX200>,
      <Start of raw data processing
       efp BC_mod = 2 LB = 0.24 FT_mod = 6 PKNL = 1 PHC0 = -24617.4 PHC1 = 43.05272 SI = 16K 
       data hash MD5: 16K
       A5 7F 8C CA C7 B6 1D E1 C7 EC A0 01 83 CF F8 4C>)
(   3,<2024-01-11 14:18:00.12 +0400>,<she>,<DPX200>,
      <pk PHC0 = 26.39212 PHC1 = -36.40002 
       data hash MD5: 16K
       D5 E3 01 AC 4F 1A FF 61 8E 80 63 D7 86 81 7B F8>)
(   4,<2024-01-11 14:18:03.71 +0400>,<she>,<DPX200>,
      <abs ABSG = 5 
       data hash MD5: 16K
       1D F7 E2 BE 9D B9 96 80 58 28 7E 96 FF 71 EB 0C>)
$$ ##END=
$$ 
$$ hash MD5
$$ 61 D9 BD 77 83 5B 55 80 D0 03 2E BE 63 A8 7F 8E
##$RELAX= 
##$RELAX= 
##$RELAX= 
##$RELAX= 
##$RELAX= 
##$RELAX= 
$$ Bruker specific parameters
$$ --------------------------
##$DU= <F:/spectra>
##$EXPNO= 1
##$NAME= <H-F>
##$PROCNO= 1
##$TYPE= <nmr>
##$USER= <she>
##$AMP= (0..31)
100 100 100 100 100 100 100 100 100 100 100 100 100 100 100 100 100 100 
100 100 100 100 100 100 100 100 100 100 100 100 100 100 
##$AQSEQ= 0
##$AQ_mod= 1
##$AUNM= <au_zg>
##$AUTOPOS= <>
##$BF1= 200.13
##$BF2= 200.13
##$BF3= 200.13
##$BF4= 200.13
##$BF5= 200.13
##$BF6= 200.13
##$BF7= 200.13
##$BF8= 200.13
##$BYTORDA= 1
##$CFDGTYP= 0
##$CFRGTYP= 5
##$CHEMSTR= <none>
##$CNST= (0..31)
1 1 145 1 1 1 1 1 1 1 1 1 1 1 1 1 1 1 1 1 1 1 1 1 1 1 1 1 1 1 1 1 
##$CPDPRG= <>
##$CPDPRG1= <>
##$CPDPRG2= <>
##$CPDPRG3= <>
##$CPDPRG4= <mlev>
##$CPDPRG5= <mlev>
##$CPDPRG6= <mlev>
##$CPDPRG7= <mlev>
##$CPDPRG8= <mlev>
##$CPDPRGB= <>
##$CPDPRGT= <>
##$D= (0..31)
0 1.2 0 0 0 0 0 0 0 0.06 0 0.03 0 0 0 0 0.0002 0 0 0 0 0 0 0 0 0 0 0 0 
0 0 0 
##$DATE= 1704968240
##$DBL= (0..7)
120 120 120 120 120 120 120 120 
##$DBP= (0..7)
150 150 150 150 150 150 150 150 
##$DBP07= 0
##$DBPNAM0= <>
##$DBPNAM1= <>
##$DBPNAM2= <>
##$DBPNAM3= <>
##$DBPNAM4= <>
$$ [...]
##$SUBNAM3= <"">
##$SUBNAM4= <"">
##$SUBNAM5= <"">
##$SUBNAM6= <"">
##$SUBNAM7= <"">
##$SUBNAM8= <"">
##$SUBNAM9= <"">
##$SW= 18.0517328524113
##$SWIBOX= (0..15)
0 0 2 0 0 0 0 0 0 0 0 0 0 0 0 0 
##$SW_h= 3612.71676300578
##$TD= 16384
##$TD0= 1
##$TE= 0
##$TE2= 300
##$TE3= 300
##$TEG= 300
##$TL= (0..7)
0 120 120 120 120 120 120 120 
##$TP= (0..7)
150 150 150 150 150 150 150 150 
##$TP07= 0
##$TPNAME0= <>
##$TPNAME1= <>
##$TPNAME2= <>
##$TPNAME3= <>
##$TPNAME4= <>
##$TPNAME5= <>
##$TPNAME6= <>
##$TPNAME7= <>
##$TPOAL= (0..7)
0.5 0.5 0.5 0.5 0.5 0.5 0.5 0.5 
##$TPOFFS= (0..7)
0 0 0 0 0 0 0 0 
##$TUNHIN= 0
##$TUNHOUT= 0
##$TUNXOUT= 0
##$USERA1= <user>
##$USERA2= <user>
##$USERA3= <user>
##$USERA4= <user>
##$USERA5= <user>
##$V9= 5
##$VALIST= <valist>
##$VCLIST= <CCCCCCCCCCCCCCC>
##$VD= 0
##$VDLIST= <DDDDDDDDDDDDDDD>
##$VPLIST= <PPPPPPPPPPPPPPP>
##$VTLIST= <TTTTTTTTTTTTTTT>
##$WBST= 1024
##$WBSW= 4
##$XGAIN= (0..3)
0 0 0 0 
##$XL= 0
##$YL= 0
##$YMAX_a= 344071
##$YMIN_a= -325443
##$ZGOPTNS= <>
##$ZL1= 120
##$ZL2= 120
##$ZL3= 120
##$ZL4= 120
##$ABSF1= 15.47695
##$ABSF2= -2.5749
##$ABSG= 5
##$ABSL= 3
##$ALPHA= 0
##$AQORDER= 0
##$ASSFAC= 0
##$ASSFACI= 0
##$ASSFACX= 0
##$ASSWID= 0
##$AUNMP= <proc_1d>
##$AZFE= 0.1
##$AZFW= 0.1
##$BCFW= 0
##$BC_mod= 2
##$BYTORDP= 0
##$COROFFS= 0
##$CY= -3
##$DATMOD= 1
##$DC= 0
##$DFILT= <>
##$DTYPP= 0
##$F1P= 0
##$F2P= 0
##$FCOR= 1
##$FTSIZE= 16384
##$FT_mod= 6
##$GAMMA= 0
##$GB= 0
##$INTBC= 1
##$INTSCL= 3.70164e-10
##$ISEN= 128
##$LB= 0.24
##$LEV0= 0
##$LPBIN= 0
##$MAXI= 10000
##$MC2= 0
##$MEAN= 0
##$ME_mod= 0
##$MI= 1.114404
##$NCOEF= 0
##$NC_proc= -6
##$NLEV= 6
##$NOISF1= 3.799351
##$NOISF2= 2.8
##$NSP= 0
##$NTH_PI= 0
##$NZP= 0
##$OFFSET= 15.53975
##$PC= 1
##$PHC0= -24591.01
##$PHC1= 6.652699
##$PH_mod= 1
##$PKNL= yes
##$PPARMOD= 0
##$PSCAL= 0
##$PSIGN= 0
##$REVERSE= no
##$SF= 200.129996388015
##$SI= 16384
##$SIGF1= 3
##$SIGF2= 2
##$SINO= 5.538805
##$SIOLD= 16384
##$SREGLST= <1H.CDCl3>
##$SSB= 0
##$STSI= 16384
##$STSR= 0
##$SW_p= 3612.71676300578
##$SYMM= 0
##$S_DEV= 0
##$TDeff= 16384
##$TDoff= 0
##$TI= <>
##$TILT= no
##$TM1= 0
##$TM2= 0
##$TOPLEV= 0
##$USERP1= <user>
##$USERP2= <user>
##$USERP3= <user>
##$USERP4= <user>
##$USERP5= <user>
##$WDW= 1
##$XDIM= 16384
##$YMAX_p= 446381965
##$YMIN_p= -343962
$$ End of Bruker specific parameters
$$ ---------------------------------
##NTUPLES= NMR SPECTRUM
##VAR_NAME=  FREQUENCY,     SPECTRUM/REAL,   SPECTRUM/IMAG
##SYMBOL=    X,             R,               I
##VAR_TYPE=  INDEPENDENT,   DEPENDENT,       DEPENDENT
##VAR_FORM=  AFFN,          ASDF,            ASDF
##VAR_DIM=   16384,         16384,           16384
##UNITS=     HZ,            ARBITRARY UNITS, ARBITRARY UNITS
##FACTOR=    0.220516191357247, 1,           1
##FIRST=     3109.97013121998, 0,            0
##LAST=      -502.746631785805, 0,           0
##MIN=       -502.746631785805, -343962,     0
##MAX=       3109.97013121998, 446381965,    0
$$ Real data points
##PAGE= N=1
##DATA TABLE= (X++(R..R)), XYDATA
$$ [...]
13170h7600l6891j8221K8215J915J8228m5287Q3208J9996n4858P0356J0734r9884
$$ -87600 -124491 -142712 -114497 -112582 -94354 -139641 -56433 -36437 -91295 -20939 -10205 -110089
13158a10089k8119Q3818L5283p8205N7025N9618n305j7877Q1920j9581N6385l4902
$$ -110089 -138208 -54390 -19107 -97312 -40287 19331 14026 -3851 78069 58488 114873 79971
13146G9971j24789l3593m2782J18967R8269j8696n2177m9655p8848J24689j2545
$$ 79971 -44818 -78411 -121193 -2226 96043 77347 25170 -24485 -103333 21356 8811
13135H811r4040P5578J18332l7967k1502m5268j15206k8163J25132K9266j33775
$$ 8811 -85229 -9651 108681 70714 49212 3944 -111262 -139425 -14293 14973 -118802
13124a18802N0568R3025K2010j11132k00679K05256j162m4624J04520J0091L910
$$ -118802 -68234 24791 46801 -64331 -265010 -59754 -60916 -105540 -1020 9071 12981
13113A2981L0783j1241k9503K3661l0964q2687m449K7511l6699n396j413l6972
$$ 12981 43764 32523 3020 26681 -4283 -86970 -91419 -63908 -100607 -106003 -107416 -144388
13101a44388l5950J14672m418J30243L8909n5458r9743l253K9025o5971O9759
$$ -144388 -180338 -65666 -70084 60159 99068 43610 -56133 -59386 -30361 -96332 -26573
13090b6573P0731N2894j24304J4676n0623K478k4085l707M6678J3332j3472K1514
$$ -26573 44158 97052 -27252 -12576 -63199 -60721 -84806 -88513 -41835 -28503 -41975 -20461
13078b0461m0704N1449R8798n8226r1576k9420Q1875O2747m5157m0274o5599J06209
$$ -20461 -61165 -9716 89082 30856 -60720 -90140 -8265 54482 9325 -30949 -96548 9661
13066I661K8375l8778m197R8608q3698K2788r03L927O2543j4940l4909j00174
$$ 9661 38036 -742 -4939 93669 9971 32759 31856 35783 98326 83386 48477 -51697
13054e1697l7398m7095J78594q1512L5367K4949o7365j33052J28777J38452j34100
$$ -51697 -89095 -136190 42404 -39108 -3741 21208 -46157 -179209 -50432 88020 -46080
13043d6080m1728l643q679K6497k0668j2895O8108K7591J096O5879q4639m0897
$$ -46080 -87808 -91451 -100130 -73633 -94301 -107196 -39088 -11497 -10401 55478 -29161 -70058
13031g0058J10319l3508l4357n759k7423L3331n0146M6629N8074M898P7185n3703
$$ -70058 40261 6753 -27604 -33363 -60786 -27455 -77601 -30972 27102 32000 109185 55482
13019E5482k5475j7087k6455m4050Q506L3472j6766Q5645l3030q8753J03966N1940
$$ 55482 30007 12920 -13535 -57585 -49079 -15607 -32373 53272 20242 -68511 35455 87395
13007H7395q8967p5043n4438N9155l2179Q5704J26355o2157m3786L4107K2305
$$ 87395 -1572 -76615 -131053 -71898 -104077 -18373 107982 45825 2039 36146 58451
12996E8451K2379q7337j9502K455J1501N1452L4949l6183r30M3750n4087O5640
$$ 58451 80830 -6507 -26009 -23554 -12053 39399 74348 38165 37235 80985 26898 92538
12984I2538M3440r0102M0784o7309L1927q91j09937J8517J7197M4562j05655N2570
$$ 92538 135978 45876 86660 19351 51278 50387 -59550 -41033 -23836 20726 -84929 -32359
12972c2359j4176n5533L5849K0515r061J1416n0394k4217k4122Q9742m3014Q4401
$$ -32359 -46535 -102068 -66219 -45704 -54765 -43349 -93743 -117960 -142082 -52340 -95354 -10953
12960a0953P1724n9284N8671j04141l4990r4059N4538J13674L4680K1583n9915
$$ -10953 60771 1487 60158 -43983 -78973 -173032 -118494 -4820 29860 51443 -8472
12949h472M3809j7185j5468k3624L8130k0359L4832p7912m3869P891r915j518
$$ -8472 35337 18152 2684 -20940 17190 -3169 31663 -46249 -90118 -82227 -92142 -93660
12937i3660J7909m5447K4649n1589O9361N2885r7526J15636o3067L1278J78299
$$ -93660 -75751 -121198 -96549 -148138 -78777 -25892 -123418 -7782 -70849 -39571 138728
12926A38728m7349r2219k719J9634N1469j45839K1931O6876j7990n6L2670j03810
$$ 138728 91379 -840 -3559 16075 67544 -78295 -56364 10512 -7478 -7534 25136 -78674
12914g8674k4102M2344l017j59541R6951L4545L8220K5732M3350Q7021m1301p9309
$$ -78674 -102776 -60432 -63449 -222990 -126039 -91494 -53274 -27542 15808 102829 61528 -17781
12902a7781j625K9504K9383m3185o5647K3945K891P69L3605j6726k8554P688L5410
$$ -17781 -19406 10098 39481 -3704 -69351 -45406 -42515 -41746 -8141 -24867 -53421 -45733 -10323
12889a0323m1384L3107Q6592K2923j19667K3332n472j09969P1087j228r9611o7575
$$ -10323 -51707 -18600 67992 90915 -28752 -5420 -10892 -120861 -49774 -51002 -150613 -218188
12877b18188J32054P3866K967q7951K5598M3241m1562N11M9211j2926M2361r447
$$ -218188 -86134 -12268 -9301 -97252 -71654 -28413 -69975 -69464 -20253 -33179 9182 -265
12865b65m3356n9225J17399L2395O3659p5898j64891J51208l5458j15559N9014
$$ -265 -43621 -102846 14553 46948 110607 34709 -130182 21026 -14432 -129991 -70977
12854g0977k2639O5622L8305N858N4146p2084P7574k0493q7635j0492o3552r6824
$$ -70977 -93616 -27994 10311 16169 70315 -1769 75805 55312 -32323 -42815 -106367 -203191
12842b03191M8725J56841j5478q856J382m8146p6820J59596L3946l8452o6124
$$ -203191 -154466 2375 -13103 -21959 -20577 -68723 -145543 14053 47999 9547 -56577
12831e6577K169K4697m0879K8332R8414r1032J8959Q3467J1391q416K559j20571
$$ -56577 -54408 -29711 -70590 -42258 56156 -34876 -15917 67550 78941 70525 73084 -47487
12819d7487r3469J05115L5923K7755O064n3968j29j4541j9844N674p5907r5924
$$ -47487 -140956 -35841 82 27837 33901 -20067 -20196 -34737 -54581 -48907 -124814 -220738
12807b20738R1748N5083L215O1145l0244m865j2116J0920P1366K0339l181m2356
$$ -220738 -128990 -73907 -70692 -9547 -39791 -44656 -56772 -45852 25514 45853 42672 316
12795C16J8658K2133p1139k2945q5182P1834N4241M7336L4741p7029j01620M5643
$$ 316 18974 41107 -30032 -52977 -138159 -66325 -12084 35252 69993 -7036 -108656 -63013
12783f3013l8583R1085M5932k5297L0049J00462j00300p4966N5079M890o2446
$$ -63013 -101596 -10511 35421 10124 40173 140635 40335 -34631 20448 25338 -37108
12772c7108j23037N027J9137M9390J41792j5875j34497l0086J5602l2512J9736
$$ -37108 -160145 -155118 -135981 -86591 55201 39326 -95171 -125257 -109655 -142167 -122431
12761a22431L3144J08514Q9463o3622j3305o9252m3395l9283L3882Q8102p9468
$$ -122431 -89287 19227 108690 45068 31763 -37489 -80884 -120167 -86285 1817 -77651
12750g7651n3879K3296K9483l6389l172Q1019J9173j8760O3397M8901L8159p8833
$$ -77651 -131530 -108234 -78751 -115140 -118312 -37293 -18120 -36880 26517 75418 113577 34744
12738C4744m8511M7670j46667N9919Q6640p1889L7583P1185q4897p8378P3257
$$ 34744 -13767 33903 -112764 -52845 33795 -38094 -511 70674 -14223 -92601 -19344
12727a9344j6568n7578j0081R2291l0545M4520l1482k8174M1567j1379L0001r1467
$$ -19344 -35912 -93490 -103571 -11280 -41825 2695 -28787 -56961 -15394 -26773 3228 -88239
12715h8239K1295J11834n6116J4298P1876M2332j45651j5361J11209q9200k8912
$$ -88239 -66944 44890 -11226 3072 74948 117280 -28371 -43732 67477 -21723 -50635
12704e0635O4571n698p711j3863j9877l8188K5280Q6276o1382J789J6989l6497
$$ -50635 13936 8238 527 -13336 -33213 -71401 -46121 40155 -21227 -19438 -2449 -38946
12692c8946m8978l3989K8753N8588k8723n3304M6285L527N2420J13211n8037o379
$$ -38946 -87924 -121913 -93160 -34572 -63295 -116599 -70314 -66787 -14367 98844 40807 34428
12680C4428j29144q0244Q4523K5241J24650j15241m2618R0721m011P7450j4744
$$ 34428 -94716 -174960 -90437 -65196 59454 -55787 -98405 -7684 -11695 65755 51011
12669E1011j57993M0806J72217j02872L9675j17786m2517J5384J40232N8861K939
$$ 51011 -106982 -66176 106041 3169 42844 -74942 -117459 -102075 38157 97018 99957
12658I9957k2288l7251l4215q952J20m0686J4700n769k2992J4597j8288P5488
$$ 99957 77669 40418 6203 -2749 -2629 -43315 -28615 -34384 -57376 -42779 -61067 14421
12646A4421L7582n0755r153q4945M8801O1840j7345j1067J9597M5461j14160J0776
$$ 14421 52003 1248 -7905 -92850 -44049 17791 446 -10621 8976 54437 -59723 -48947
12634d8947L6060R0371J7183p2942n9500j01143J47819n9788K8434J06052n6778
$$ -48947 -12887 77484 94667 21725 -37775 -138918 8901 -50887 -22453 83599 26821
12623B6821j32068J5509L0086K0516Q5435n1153o9030J922k8784K0402l3986Q2524
$$ 26821 -105247 -89738 -59652 -39136 46299 -4854 -73884 -71962 -100746 -80344 -114330 -31806
12611c1806J4458M3027r569k7854P0210m9650J09853l0135o0761j05381R607Q3626
$$ -31806 -17348 25679 16110 -11744 58466 8816 118669 88534 27773 -77608 -68001 15625
12599A5625P5468l3886j03544m1786J3359Q719N8915P0439o5130N7289k8847N3219
$$ 15625 91093 57207 -46337 -88123 -74764 -66045 -7130 63309 -1821 55468 26621 79840
12587G9840k7717o3522l070K4846M1130j53259P1637j4113j12799n13Q5792J035
$$ 79840 52123 -11399 -14469 10377 51507 -101752 -30115 -44228 -157027 -157540 -71748 -70713
12575g0713R8334n9211j47774O8185N2610J23608o4174N1423j52714O782J02444
$$ -70713 27621 -31590 -179364 -111179 -58569 65039 865 52288 -100426 -93644 8800
12564H800k5018l8089N8370Q648o2851r0244M4368j8931M560J26808Q764l8346
$$ 8800 -16218 -54307 4063 12711 -50140 -140384 -96016 -114947 -110387 16421 25185 -13161
12552a3161j5538O9751n3563L7690M7448o1243Q5148o5781q6094J1782j1403n3520
$$ -13161 -28699 41052 -12511 25179 72627 11384 96532 30751 -55343 -43561 -54964 -108484
12540a08484N7914k963r3917J67993N7557o8058m7999M9021M0414q3936O7881
$$ -108484 -50570 -53533 -147450 20543 78100 10042 -37957 11064 51478 -32458 35423
12529C5423J7896j00157M0142r6941K3659K7213K0088p730L4748K8494k6832k8498
$$ 35423 53319 -46838 -6696 -103637 -79978 -52765 -32677 -40407 -5659 22835 -3997 -32495
12517c2495R5124O0915r7337k4325j1210m514j8133l7740l3951M6284O586O7093
$$ -32495 62629 123544 26207 1882 -9328 -13842 -31975 -69715 -103666 -57382 -50796 16297
12505A6297l9197l1916R2667K4613l4186j5410l0425j8314M8631l1744j6727K8797
$$ 16297 -22900 -54816 37851 62464 28278 12868 -17557 -35871 12760 -18984 -35711 -6914
12493f914K2914k7594J7273R02j918j6493r3339N4103p853L5478Q4144o511n9346
$$ -6914 16000 -11594 5679 6581 4663 -11830 -105169 -51066 -58919 -23441 60703 54192 -5154
12480e154p0813m480n2270R7274O0781j2018J3737Q0303r2990j4390j02102K8366
$$ -5154 -75967 -80447 -132717 -35443 25338 13320 27057 107360 14370 -20 -102122 -73756
12468g3756K6108O9883R3092K8288O8238j09102m4355L5112P5402r8268l6470
$$ -73756 -47648 22235 115327 143615 211853 102751 58396 93508 168910 70642 34172
12457C4172k4261k5369M8676M6006r0350M4961k0430q7220J9543J9964K0934n5489
$$ 34172 9911 -15458 33218 79224 -11126 33835 13405 -73815 -54272 -34308 -13374 -68863
12445f8863O8032m6817M9012J0051r945O690O6089p9489o6683R4640l2318k1124
$$ -68863 -831 -47648 1364 11415 1470 8160 74249 -5240 -71923 22717 -9601 -30725
12433c0725j8366P7963O0826K7818o2229m0809L096p4581j8665J19702p9083N8054
$$ -30725 -49091 28872 89698 117516 55287 14478 17574 -57007 -75672 44030 -35053 23001
12421B3001q075r61M5472M8817r8991k1285P1139N2181l0949j02191p2686m273
$$ 23001 14926 13965 59437 108254 9263 -12022 59117 111298 80349 -21842 -94528 -98801
12409i8801N6577O5049j9334q6744N9499K9058q1077m3450J01477k5749L0758
$$ -98801 -42224 22825 3491 -83253 -23754 5304 -75773 -119223 -17746 -43495 -12737
12398a2737P2674m3854j3973J3495N1224r9251J823J03275l4378p5910P797l7637
$$ -12737 59937 16083 2110 15605 66829 -32422 -30599 72676 38298 -37612 -29815 -67452
12386f7452L2766L5192K1186j07825M6862P0939J14j2898J1749J3390m4248K4946
$$ -67452 -34686 506 21692 -86133 -39271 31668 31782 18884 30633 44023 -225 24721
12374B4721n2548n0000M1790j7596J1926j9669o1703J62793K5334m8946r3779
$$ 24721 -27827 -77827 -36037 -53633 -41707 -61376 -123079 39714 65048 16102 -77677
12363g7677l3406M8278j0017J5852P7790q2659Q3135j03039M9864n1999o3725
$$ -77677 -111083 -62805 -72822 -56970 20820 -61839 21296 -81743 -31879 -83878 -147603
12352a47603J2060Q8423O9652o992o2179M1534k686q956J8000L881J9865k4939
$$ -147603 -135543 -47120 22532 15540 -46639 -5105 -7791 -16747 1253 5134 24999 60
12340F0j03879l454O5425o3054J9014k2832M1706J08859j08099l0356k8141n4859
$$ 60 -103819 -107273 -41848 -104902 -85888 -108720 -67014 41845 -66254 -96610 -124751 -179610
12328a79610J08877J08788P4878m5062J1274q9417o1006O430K6620J27J9024J6847
$$ -179610 -70733 38055 112933 67871 79145 -10272 -71278 -64848 -38228 -38101 -19077 -2230
12316b230J1542k2776r896L9265k7822J1554n1569K5284K1586k313P6441l9863
$$ -2230 9312 -13464 -23360 15905 -11917 -363 -51932 -26648 -5062 -7375 69066 29203
12304B9203p3574P6771K798l0255K6574j19802m281N8112J5593J11562n8282k3010
$$ 29203 -44371 32400 35198 4943 31517 -88285 -92566 -34454 -18861 92701 34419 11409
12292A1409N633N039P6051P0424n7754K975l5943m6451N7029l1256o209p605q0683
$$ 11409 17042 22081 98132 168556 110802 113777 77834 31383 88412 57156 50947 43342 -37341
12279c7341O009J39447r9611Q121n1468m4014o605j9401L2436L6673l4398P4425
$$ -37341 -31332 108115 8504 16625 -34843 -78857 -85462 -104863 -72427 -35754 -70152 4273
12267D273N145K9303j03655k087J3485p66R4818K07L2515L8115m2447j9534r9608
$$ 4273 9418 38721 -64934 -67021 -53536 -54302 40516 40723 73238 111353 68906 49372 -50236
12254e0236p0690j8525J09568r3448J07947J44637q4774n0701m066J3154k8249
$$ -50236 -120926 -139451 -29883 -123331 -15384 129253 44479 -6222 -10288 2866 -25383
12243b5383l0943P561p7548P1424P4852l6212q1342l043k6294N787O4200L1814
$$ -25383 -56326 -48765 -126313 -54889 19963 -16249 -97591 -100634 -126928 -121141 -56941 -25127
12231b5127O6332m1138o0559m6795L7036J6245l686p02J1581o7343K9839J02998
$$ -25127 41205 67 -60492 -107287 -70251 -54006 -57692 -58394 -46813 -114156 -84317 18681
12219A8681J536k2793P7516l0447m0153L8065l1498n3815k0707M9476Q4963J5934
$$ 18681 20217 -2576 74940 44493 4340 42405 10907 -42908 -63615 -14139 70824 86758
12207H6758M8457j25354n999o3624m937L911o9013N8882J5776M9702l1645k3640
$$ 86758 135215 9861 3862 -59762 -64699 -60788 -129801 -70919 -55143 -5441 -37086 -60726
12195f0726K6329n0657N6849j06773K0212K4178J16039K9379o8555R332q443J1059
$$ -60726 -34397 -85054 -28205 -134978 -114766 -90588 25451 54830 -13725 -4393 -12836 -1777
12183a777L0782O5329K4734p2859J878p3125l1287P6380K1455j10732J0808O2205
$$ -1777 29005 94334 119068 46209 48087 -25038 -56325 20055 41510 -69222 -58414 3791
12171C791J2968q176r4483O1735Q0859k9503k0917J5189L3116r993l6093M6172
$$ 3791 16759 8583 -85900 -24165 56694 27191 6274 21463 54579 44586 8493 54665
12159E4665o4777p2181k9978j0271L9435k116R4265q201j5731j2914q975K3220
$$ 54665 -10112 -82293 -112271 -122542 -83107 -85223 9042 841 -14890 -27804 -36779 -13559
12147a3559N7670K5808J4003N375r6323J5647m85m3634k6154K8354q514q0419
$$ -13559 44111 69919 83922 89297 -7026 8621 8136 -35498 -61652 -33298 -41812 -122231
12135a22231J60793j1425n4060m4040n0723K2626O377Q9467R0861r126p8800n4441
$$ -122231 38562 27137 -26923 -70963 -121686 -99060 -92683 -3216 87645 78519 -281 -54722
12123e4722K0759N8803q3195n8184K7364K378q1689J0534J39960j1243q3386O6108
$$ -54722 -33963 24840 -58355 -116539 -89175 -86797 -168486 -157952 -17992 -29235 -112621 -46513
12111d6513r0574K6607J07342J18240P049j2144m7842p4713K123R5130p9848n7359
$$ -46513 -137087 -110480 -3138 115102 122151 110007 62165 -12548 -10425 84705 4857 -52502
12099e2502M9435O5128Q061j00433o939L517K9160K7941n3912N6835K3837j26447
$$ -52502 -3067 62061 70122 -30311 -37250 -33733 -4573 23368 -30544 26291 50128 -76319
12087g6319j4521J25058o7752n1889N7094N175m3998n8610J56178l4282m5776
$$ -76319 -90840 34218 -33534 -85423 -28329 -23154 -67152 -125762 30416 -3866 -49642
12076d9642L5226o076O8103j2658K5825K3423k2483j01221o9252l9470l2917O0007
$$ -49642 -14416 -20492 47611 34953 60778 84201 61718 -39503 -108755 -148225 -181142 -121135
12064a21135J60624k4260J7940J21904n9790j87820J133p187R3102j5434r6744
$$ -121135 39489 15229 33169 155073 95283 -92537 -91404 -98591 -5489 -20923 -117667
12053a17667Q7721j2992L506J1252j2166q3446R3841P8982J1904L0545m7053j919
$$ -117667 -29946 -42938 -39432 -28180 -40346 -123792 -29951 49031 60935 91480 44427 42508
12041D2508n5258k9347N2366j1311r4832m5022J47619J7413p9855Q6180k2705
$$ 42508 -12750 -42097 10269 -1042 -95874 -140896 6723 24136 -55719 30461 7756
12030G756l5595P0031m6846j72979R7471Q6309J00690k8542n9582J874l915J3003
$$ 7756 -27839 42192 -4654 -177633 -80162 6147 106837 78295 18713 20587 16672 29675
12018B9675o7214M740k7667J3870L9326R7357q859n3138l8032r927J1424m7496
$$ 29675 -37539 -32799 -60466 -46596 -7270 90087 81228 28090 -9942 -19869 -8445 -55941
12006e5941N0585j3708n4439p040P2930k6947N8665N7576n0455l7899p187O1311
$$ -55941 -5356 -19064 -73503 -80543 -7613 -34560 24105 81681 31226 -6673 -13860 47451
11994D7451k5861M8421j25573K0986j04861k3798Q3151L032J4039n5746K3039
$$ 47451 21590 70011 -55562 -34576 -139437 -163235 -80084 -77052 -63013 -118759 -95720
11983i5720Q7273O4209l1827j16816L2662K500N5415Q8124q2214q0270j9980o7744
$$ -95720 -8447 55762 23935 -92881 -60219 -57719 -2304 85820 3606 -76664 -96644 -164388
11971a64388R9381l4k9728P0578N799p7799o1J06352n9642m5009R4470J19651
$$ -164388 -65007 -65041 -94769 -24191 -18392 -96191 -96252 10100 -49542 -94551 -81 119570
11959A19570o3352j00676K9295O2256p4414l5779J85076r331m8900j35141N5794
$$ 119570 56218 -44458 -15163 47093 -27321 -63100 121976 112645 63745 -71396 -15602
11948a5602J38244j4254k4537N0307n8928r8057n7880O2306M7081L1040m9416
$$ -15602 122642 108388 83851 134158 75230 -22827 -80707 -18401 28680 59720 10304
11937A0304k0467N1990K9284L4657J4038L3595k5789p3290n7926r783q3516M2420
$$ 10304 -10163 41827 71111 105768 119806 153401 127612 54322 -3604 -13387 -96903 -54483
11925e4483K2412K3281l9411O4763m0332o5468o457K3535L6030K5035J8737k4632
$$ -54483 -32071 -8790 -48201 16562 -23770 -89238 -95695 -72160 -36130 -11095 7642 -16990
11913a6990j9300P3226j06808p3356J6560J41211p833L197j9145k2466L6651o5864
$$ -16990 -36290 36936 -69872 -143228 -126668 14543 6710 9907 -9238 -31704 4947 -60917
11901f0917O3524L6806j25882k8687o531J09628J03346r082j59733j13484J48587
$$ -60917 2607 39413 -86469 -115156 -121687 -12059 91287 82205 -77528 -191012 -42425
11890d2425K7572l9906R4874K1452q3019J3591n2798R0465N4865p5836j2460O3456
$$ -42425 -14853 -54759 40115 61567 -21452 -7861 -60659 29806 84671 8835 -3625 59831
11878E9831j7454o2696R8165o5608r5886k2735J11356N3691m5650K4934L0081
$$ 59831 42377 -20319 77846 12238 -83648 -106383 4973 58664 13014 37948 68029
11867F8029r97p1427n7492M8442O5506q3348K3038K0919m2957r0637M8725N6932
$$ 68029 67032 -4395 -61887 -13445 52061 -31287 -8249 12670 -30287 -120924 -72199 -15267
11855a5267L662n7400K3617j6853l0493P118R033k722K6218L3922k3717q5240
$$ -15267 -11605 -69005 -45388 -62241 -92734 -85616 -76583 -79305 -53087 -19165 -42882 -128122
11843a28122O4247M4650k8091p9903J66810k4353j23007L637R819M9569k2758
$$ -128122 -63875 -19225 -47316 -127219 39591 15238 -107769 -104132 -94313 -44744 -67502
11832f7502N0763l2478O3159M8813J070j17033o2988r121J7038K8508R169J3906
$$ -67502 -16739 -49217 13942 62755 63825 -53208 -116196 -125317 -108279 -79771 -70602 -56696
11820e6696M1086N8893j7335m3099k840M3823K1595K4656j2313j7933k634r280
$$ -56696 -15610 43283 25948 -17151 -19991 23832 45427 70083 57770 39837 37203 27923
11808B7923M8240o9639J7629k6504l8173K9596l4751j3212J24444J2603n240p906
$$ 27923 76163 6524 24153 -2351 -40524 -10928 -45679 -58891 65553 78156 72916 65010
11796F5010J2488R4027q8971o4610k2638p5125N6035l0444m1658P7077K9519q1634
$$ 65010 77498 171525 82554 17944 -4694 -79819 -23784 -54228 -95886 -18809 10710 -70924
11784g0924O3064j9172M5712r9643K0657M6953K6979o8385m9810K4473j8784L3693
$$ -70924 -7860 -27032 18680 -80963 -60306 -13353 13626 -54759 -104569 -80096 -98880 -65187
11772f5187J1036P0032O768M876k5149L356j6408m8873O4346M953k2629K5267
$$ -65187 -54151 15881 22649 27525 2376 5732 -10676 -59549 4797 9750 -12879 12388
11760A2388M0850k3082M035K6720n8054K7243O5427Q4618q6562m5729l227K657
$$ 12388 53238 30156 34191 60911 2857 30100 95527 180145 93583 47854 44627 47284
11748D7284P9309J1306k0410p8401k800K9127j10940J30488K1356n8256m220R2630
$$ 47284 126593 137899 117489 39088 36288 65415 -45525 84963 106319 48063 43843 136473
11736A36473j16839j05336p0032J18167L8565n9837m3591M6926N3885j33246L9353
$$ 136473 19634 -85702 -155734 -37567 998 -58839 -102430 -55504 -1619 -134865 -95512
11725i5512J40503J0515l9357q5319m1540p040J00004J5070M1029J090k6329R0461
$$ -95512 44991 55506 16149 -69170 -110710 -117750 -17746 -2676 38353 39443 13114 103575
11713A03575l3253l6118K6101q6544p2958p505P5601K0333l209k4676n3458K1732
$$ 103575 70322 34204 60305 -26239 -99197 -106702 -31101 -10768 -13977 -38653 -92111 -70379
11701g0379j26195O2800J01937R1049l503o3332r4914Q9974k0627n4187J38643
$$ -70379 -196574 -133774 -31837 59212 55709 -7623 -102537 -12563 -33190 -87377 51266
11690E1266M266q7703K3551O3120K0457j23467N9055j6022n3958n6770O8098O9074
$$ 51266 55532 -32171 -8620 54500 74957 -48510 10545 -5477 -59435 -116205 -48107 20967
11678B0967m9157N7039o2661m4888j102J01006l6535M2168j07671L7949K7424
$$ 20967 -28190 28849 -33812 -78700 -79802 21204 -15331 26837 -80834 -42885 -15461
11667a5461P9627m3404m4816J2174M3776R022q390q2280N4160p8208l3319M0055
$$ -15461 64166 20762 -24054 -11880 31896 40918 32528 -49752 4408 -73800 -107119 -67064
11655f7064K0508p806k8226l2446N1083m8578n1263Q6387Q5278P1302l3660L6759
$$ -67064 -46556 -54362 -82588 -115034 -63951 -112529 -163792 -77405 7873 79175 45515 82274
11643H2274j07399J4387k4245J67o7052Q3039j4073J19446p1587M5384K4740l189
$$ 82274 -25125 -10738 -34983 -34816 -101868 -18829 -32902 86544 14957 60341 85081 81892
11631H1892Q899p3359R2129o5775j01999o9280K783K09362L1210j4432p3619m294
$$ 81892 90791 17432 109561 43786 -58213 -127493 -124710 84652 115862 101430 27811 23517
11619B3517J2910q2757j5087n8821M2552K1896J1097R0965M6331o5743j25550
$$ 23517 36427 -46330 -61417 -120238 -77686 -55790 -44693 46272 92603 26860 -98690
11608i8690K5842M3167l7925M8786O2299p3232l7847j3476O7960R091O3939o913
$$ -98690 -72848 -29681 -67606 -18820 43479 -29753 -67600 -81076 -13116 -4025 59914 53001
11596E3001l0442n8484K5629l564O645J10352O1480j43737q7802n4258n470J56789
$$ 53001 22559 -35925 -10296 -13860 -7215 103137 164617 20880 -66922 -121180 -126650 30139
11584C0139r8463n7536Q0775J631N4177P105j8320M32O0307p2429R0592j9365
$$ 30139 -68324 -125860 -45085 -43454 10723 17828 -492 -60 60247 -12182 78410 59045
11572E9045j24784K5517O5447k6405L9792O8919o2683n2823l493j1786k2085Q4845
$$ 59045 -65739 -40222 25225 -1180 38612 107531 44848 -7975 -11468 -23254 -45339 39506
11560C9506k1869L8437J2401q3262Q2077l8690j45835J02062m881P6624j1606
$$ 39506 17637 56074 68475 -14787 67290 28600 -117235 -15173 -20054 56570 44964
11549D4964j0344l7546n7435k1913N1498M73r707k3601J1240j4870m1872J64864
$$ 44964 34620 -2926 -60361 -82274 -30776 -30303 -40010 -63611 -52371 -67241 -109113 55751
11537E5751l4531k7788M0913p5555J52888P077j41742n6203J4163l7124O9901
$$ 55751 21220 -6568 34345 -41210 111678 118755 -22987 -79190 -65027 -102151 -32250
11526c2250m0167j7534J2946J20200l903j8723J5230l2800M3012K4688n9498L837
$$ -32250 -72417 -89951 -77005 43195 39292 20569 35799 2999 46011 70699 11201 15038
11514A5038O3907P3111j34015r858l5492k6088m6816N3067O6038j6584p281M421
$$ 15038 78945 152056 18041 8183 -27309 -53397 -100213 -47146 18892 2308 -4973 -552
11502e52L3774J03643L1142j18924q6285k2468Q4532l6767l5768J43335J5419
$$ -552 33222 136865 168007 49083 -37202 -59670 24862 -11905 -47673 95662 111081
11491A11081j8438j3837m3899j4931N7839J344j16961P9825M151n0885k949L0966
$$ 111081 92643 78806 34907 19976 77815 79159 -37802 42023 46174 -4711 -7660 23306
11479B3306j03002L2308k6216M5958m3691n473N6003K3139J0265N046O4996o6957
$$ 23306 -79696 -47388 -73604 -27646 -71337 -76810 -20807 2332 12597 17643 82639 15682
11467A5682J02947M670n1263n163p3441K1284j8745l0747J93376j8098l9396J9150
$$ 15682 118629 123299 72036 66873 -6568 14716 -4029 -34776 158600 140502 101106 120256
11455A20256j02956q2817l0934J17200j5047k6695P334N9723J1015J7056o7860
$$ 120256 17300 -65517 -96451 20749 5702 -20993 -13659 46064 57079 74135 6275
11444F275J7533R1774j24746J0563j14629N0034N8114m9094J14082k5643j1704
$$ 6275 23808 115582 -9164 1399 -113230 -63196 -5082 -54176 59906 34263 22559
11433B2559J9273k083K5216J2734J9982j17002j37165n9214J37873Q3624M376
$$ 22559 41832 39749 64965 77699 97681 -19321 -156486 -215700 -77827 5797 10173
11422A0173J00894o9185L4210o4417R357n2101M0743N6894N3754j85977J3933
$$ 10173 111067 41882 76092 11675 21032 -31069 9674 66568 120322 -65655 -51722
11411e1722Q235N7838Q251O9827J00586j26699l8730m8695K9283N1735m4018O2239
$$ -51722 -43487 14351 22602 92429 193015 66316 27586 -21109 8174 59909 15891 78130
11399G8130o7590q185L3298o9095N5210K8681j5660j80493O1754R4438k385O7309
$$ 78130 10540 2355 35653 -33442 21768 50449 34789 -145704 -83950 10488 8103 75412
11387G5412q0803O5095L3539k127J6092p0290l6456L1238P273N2910o9260p5554
$$ 75412 -5391 59704 93243 91116 107208 36918 462 31700 38973 91883 22623 -52931
11375e2931p360K5398R8479m3295j4964q2028P769L7825J5938N9070r785m811
$$ -52931 -60291 -34893 63586 20291 5327 -76701 -68932 -31107 -15169 43901 34116 29305
11363B9305l5581O9471l108p1776N2010o1524L8182Q518R431J8754k4589m5622
$$ 29305 -6276 63195 60087 -11689 40321 -21203 16979 25497 34928 53682 29093 -16529
11351a6529L1205L6273q1632r271L3593O2751N2034j21230Q220J10724O445q5170
$$ -16529 14676 50949 -30683 -39954 -6361 56390 108424 -12806 -4586 106138 112583 27413
11339B7413j34352J60653j1641j21684j2574P6089O6605l4770N9953k5819N6077
$$ 27413 -106939 53714 42073 -79611 -92185 -16096 50509 15739 75692 49873 105950
11328A05950m9692M5779q3043R729k3764N101p281O7544J09172J3458q2815o1417
$$ 105950 56258 102037 18994 28723 4959 10060 2779 70323 179495 192953 110138 48721
11316D8721r325k084N7977J2443N4125l4242j07152M2656J21180m0995r4478m6558
$$ 48721 39396 37312 95289 107732 161857 127615 20463 63119 184299 143304 48826 2268
11304B268k3647J1267R4231N8791j07279j3570K715J44220o0843J7425K7188m1527
$$ 2268 -21379 -10112 84119 142910 35631 22061 24776 168996 108153 125578 152766 111239
11292A11239j17578J8104P2614K8894r426o1683p1789K2358L3965K2631L9432
$$ 111239 -6339 11765 84379 113273 103847 42164 -29625 -7267 26698 49329 88761
11281H8761j44772l4642L3403J13633n760P9755o6483n739L1563o4498R415M4209
$$ 88761 -56011 -90653 -57250 56383 50623 130378 63895 58156 89719 25221 34636 78845
11269G8845Q2234m671o6883n272j0652j0481q8108k3554P6182J7705k7573P2998
$$ 78845 161079 156408 89525 84253 73601 63120 -24988 -48542 27640 45345 17772 90770
11257I0770M0714q9933O246p0891R10R5638N1755m2220q4953p4566q029J24358
$$ 90770 131484 41551 47797 -23094 -22184 73454 125209 82989 -1964 -76530 -84559 39799
11245C9799j03272M8036L9521O7115J5180K1249j81501j23640Q1995Q8146O5186
$$ 39799 -63473 -15437 24084 91199 106379 127628 -53873 -177513 -95518 -7372 57814
11234E7814L0072j2489n4787p6772O1754L9282o5891p9253j2676Q1427j13272
$$ 57814 87886 75397 20610 -56162 5592 44874 -21017 -100270 -112946 -31519 -144791
11223a44791O9794N1144K429N7904l9063j3214k5580N8777M4621M7229p466M5045
$$ -144791 -74997 -23853 -21424 36480 -2583 -15797 -41377 17400 62021 109250 101784 146829
11211A46829n2855l4703l952o9549P3111R5039j2784O3292n2425p1464P6145N5135
$$ 146829 93974 59271 55319 -14230 58881 153920 141136 204428 152003 80539 156684 211819
11199B11819N0459j47429L6479k3153k3802m8429k9570L7763O3278j3335m1504
$$ 211819 262278 114849 151328 128175 104373 55944 26374 64137 127415 114080 72576
11188G2576J6033p800J11228M1204p4179j22011Q1859J7668j16585l0791p0684
$$ 72576 88609 80809 192037 233241 159062 37051 118910 136578 19993 -10798 -81482
11177h1482O1776m1903m8173R4854P0306K9437j37110P0885N5078q904r0111j279
$$ -81482 -19706 -61609 -109782 -14928 55378 84815 -52295 18590 73668 64764 -25347 -26626
11165b6626j2088J6975j2044n0444K4834L173M4546l0387J2735o8864P6588R2421
$$ -26626 -38714 -21739 -33783 -84227 -59393 -56220 -11674 -42061 -29326 -98190 -21602 70819
11153G0819L5087o6301l1845R306m5009j1663J04554k9136r2943K9732Q9776N4108
$$ 70819 105906 39605 7760 17066 -27943 -39606 64948 35812 -57131 -27399 62377 116485
11141A16485o4862M9392q3854K8876j3010l008M0956J1968K7456M4271m4924o977
$$ 116485 51623 101015 17161 46037 33027 30019 70975 82943 110399 154670 109746 102769
11129A02769r4247m0091L9900r3478O0199J0864K9157l1450Q9942P1411P2405
$$ 102769 8522 -31569 8331 -85147 -24948 -14084 15073 -16377 73565 144976 217381
11118B17381r9604Q5924j21696n8734k019L2921j1835O708N2093j63466N5028
$$ 217381 117777 203701 82005 23271 21252 54173 42338 49046 101139 -62327 -7299
11107g299J30632N914l1594M2140j15659L9179J1480k8668R7946p2073N6664N491
$$ -7299 123333 129247 97653 139793 24134 63313 74793 46125 144071 71998 128662 134153
11095A34153j5172j02332O3940R831o2614j10460J8178J77308k2710J04230o7287
$$ 134153 118981 16649 80589 90420 27806 -82654 -64476 112832 90122 194352 127065
11084A27065J2614q488p0149m6865J67809n1786l0378n2418l4039R7152L4579
$$ 127065 139679 131191 61042 14177 181986 130200 99822 47404 13365 110517 145096
11073A45096j03154j9938M9135o6505J4764O4405P5982J313j63087O612M5410
$$ 145096 41942 22004 71139 4634 19398 83803 159785 161098 -1989 4623 50033
11062E0033J7286k8866J6521N5287q0238M2594P7997J42620o6026j44082n0958
$$ 50033 67319 38453 54974 110261 30023 72617 150614 293234 227208 83126 32168
11051C2168K4716l7211k372o1895J3209P3548P964O7966p4263N3625J1031q4312
$$ 32168 56884 19673 17301 -44594 -31385 42163 50127 118093 43830 97455 108486 24174
11039B4174r4459l1995J41283M5885n5334p6991o5347Q6145J04609N5896K0040
$$ 24174 -70285 -102280 39003 84888 29554 -47437 -112784 -26639 77970 133866 153906
11028A53906o6974R970n9749n2226L8992J06455m9864K2893J44731q1034m1028
$$ 153906 86932 96902 37153 -15073 23919 130374 80510 103403 248134 167100 126072
11017A26072p3671O5859j04650M5973J37094r4582J8317l1844K0641N6343q4343
$$ 126072 52401 118260 13610 59583 196677 102095 120412 88568 109209 165552 81209
11006H1209j39416J37513J25952j2380N046n9385p8883k6713o6415J665J17614
$$ 81209 -58207 79306 205258 192878 197924 138539 59656 32943 -33472 -31807 85807
10995H5807K0164L1732k1857l3679J47476j6431j63978J8992J00824n5527O2195
$$ 85807 105971 137703 115846 82167 229643 213212 49234 68226 169050 113523 175718
10984A75718j41336M8083J6166o4260l1231P9506K3498L1242P0523j29983j5885
$$ 175718 34382 82465 98631 34371 3140 82646 106144 137386 207909 77926 62041
10973F2041j8068j29119N1361Q4573J6399J322j5347L1253m9013k7258p2688J19346
$$ 62041 43973 -85146 -33785 50788 67187 68509 53162 84415 35402 8144 -64544 54802
10961E4802Q726j16223J09691M1121l989K1621k7360M0670L9515J0374j75210
$$ 54802 63528 -52695 56996 98117 94128 115749 88389 129059 168574 178948 3738
10950C738k6890Q7479l440o405J5547l2504n3406O6002K1600p827J29608K4769
$$ 3738 -23152 64327 60887 54482 70029 37525 -15881 50121 71721 63894 193502 218271
10938B18271m5334j20482J68004l5858l9654l1488k3367n7958L7094o4486p810
$$ 218271 172937 52455 220459 184601 144947 113459 90092 32134 69228 4742 -3068
10927c068K2407j4616j8377J0750J2475m7420N1481M4924P3580m3477j12101k5216
$$ -3068 19339 4723 -13654 -2904 9571 -37849 13632 58556 132136 88659 -23442 -48658
10915d8658R0299n0525J39463m3213n6780R3328m8097Q7153O0487O1958m0190
$$ -48658 41641 -8884 130579 87366 30586 123914 75817 162970 223457 285415 245225
10904B45225p4319m1457n1298L301J7252J3081n6041k2749M7691M7602M1922r8777
$$ 245225 170906 129449 78151 81452 98704 111785 55744 32995 80686 128288 170210 71433
10892G1433o4365N8257j10533J02316N7509n0080r621L7246J8510j00088M2864
$$ 71433 7068 65325 -45208 57108 114617 64537 54916 92162 110672 10584 53448
10881E3448N4074m3410O0622O03Q8065r9847J7141N511q2799N7029j5940L5673
$$ 53448 107522 64112 124734 125337 213402 113555 130696 136207 53408 110437 94497 130170
10869A30170P52L2157K6289j34184Q6225m8244m0143O289K7418p9296J2084O1766
$$ 130170 130922 163079 189368 55184 141409 93165 53022 59311 86729 7433 19517 81283
10857H1283P426o9388k0064J24426m0916q5784L3975k4576j03427M5738N295k8496
$$ 81283 88709 19321 -743 123683 82767 -3017 30958 6382 -97045 -51307 -46012 -74508
10845g4508N9373J32670j20269P89J20976L6784o1044k0657O3407j12521q5528
$$ -74508 -15135 117535 -2734 -1945 119031 155815 94771 74114 137521 25000 -60528
10834f0528Q2345N7138l3659k1568R7102j8657P756k4842M3369J1018p0991J1251
$$ -60528 21817 78955 45296 23728 120830 102173 109929 85087 128456 139474 68483 79734
10822G9734k5514j1580O7772J439J7744R0003K5552j92614j15092P4170J01501
$$ 79734 54220 42640 110412 111851 129595 219598 245150 52536 -62556 11614 113115
10811A13115O2872L7229M2310j7397r0644N007J3534l8050K1979p5949J03601
$$ 113115 175987 213216 255526 238129 147485 152492 166026 127976 149955 74006 177607
10800A77607k8023M2993L1934r3486m0339k5363O0229p8231Q7542J5868O218l1045
$$ 177607 149584 192577 224511 131025 90686 65323 125552 47321 134863 150731 156949 125904
10788A25904p6962O0232P993J4335l2758Q5139n3711q1358K1976p7484k0010P4349
$$ 125904 48942 109174 117167 131502 98744 183883 130172 48814 70790 -6694 -26704 47645
10776D7645J22032P7997j51513l2695M3864q0853N839J12864j2731M8499p9837
$$ 47645 169677 247674 96161 63466 107330 26477 32316 145180 132449 180948 101111
10765A01111L1409k8410O775l7742O4234j2937m0631j6426n4752k6283M936L8985
$$ 101111 132520 104110 110885 73143 137377 124440 83809 67383 12631 -13652 -8716 30269
10753C0269J3234J00057l4490L7972l3150o4584M1201j47m7L7652j92123J40820
$$ 30269 43503 143560 109070 147042 113892 49308 90509 90362 90315 127967 -64156 76664
10741G6664l7101J5216K7466J31924j9481j17519K2116O6739O3740q749q0985
$$ 76664 39563 54779 82245 214169 194688 77169 99285 166024 229764 221015 140030
10730A40030K356J8434n5512J5715n283R280J8731n3692N9061j424J9734K2937
$$ 140030 142386 160820 105308 121023 115740 125020 143751 90059 149120 147696 167430 190367
10718A90367n6865K5535J2795L9758m1368P2220J6133j09116p8710j1632Q1858
$$ 190367 133502 159037 171832 211590 170222 242442 258575 149459 70749 59117 140975
10707A40975q3473Q2874J3380J35813r5442j02786P1230N4532k5986q7040R2028
$$ 140975 57502 140376 153756 289569 194127 91341 162571 217103 191117 104077 196105
10696A96105P8677l2738o3372L3970j05079M6077Q2209K6625k7348L1459n5148
$$ 196105 274782 242044 178672 212642 107563 153640 235849 262474 235126 266585 211437
10685B11437L3717M929K9209n1851J6313j66769q8863J57014J14939r1613j215
$$ 211437 245154 250083 279292 227441 243754 76985 -11878 145136 260075 168462 167247
10674A67247j00226l3487L274J20702M8660j04257P1397N6442L0570j24216J9693
$$ 167247 67021 33534 36808 157510 206170 101913 173310 229752 260322 136106 155799
10663A55799L8024K3916o3882j132J43067J5907o9030j0623n524k4277m4184n6296
$$ 155799 193823 217739 153857 152725 295792 311699 242669 232046 226522 202245 158061 101765
10651A01765o2755M5248l3142Q4176l7742P2102n609p2187n567K1548l418K2876
$$ 101765 39010 84258 51116 135292 97550 169652 164043 91856 86289 107837 104419 127295
10639A27295P2969k0152P8756M7221q5759m4223J57538q3940p3995n5111O3109
$$ 127295 200264 180112 258868 306089 220330 176107 333645 249705 175710 120599 183708
10628A83708q99l4537j0941j1969L0711L3279r6719n514J60744l4458J2600M3321
$$ 183708 182809 148272 137331 125362 156073 189352 92633 87119 247863 213405 226005 269326
10616B69326r6552l5029L4233J36683K098j33281o171K9983n896J8450P051j32873
$$ 269326 172774 137745 171978 308661 310759 177478 171307 201290 195394 213844 220895 88022
10604H8022K521O1429j8556o474K3095J05263k3296k0481j2964n8072M7046L6927
$$ 88022 90543 151972 133416 126942 150037 255300 232004 211523 198559 140487 187533 224460
10592B24460l8596P183J2555k8334j0225O6871M6760M8751o1057p5157o1131O9652
$$ 224460 185864 193047 205602 177268 167043 233914 280674 329425 268368 193211 132080 201732
10580B01732N1529m3425P29k4373M9024j9850P360m3333K6170j2895R7083L1824
$$ 201732 253261 209836 210565 186192 235216 215366 222726 179393 205563 192668 289751 321575
10568C21575l4650p868k2809Q239j07658N6382Q7885J162j36942p337n857Q8637
$$ 321575 286925 279057 256248 264487 156829 213211 301096 302258 165316 157979 152122 240759
10556B40759O8154M7183o1505p3755l6510P1494P6159M0701K8635l2470O974j00497
$$ 240759 308913 356096 294591 220836 184326 255820 331979 372680 401315 368845 375819 275322
10544B75322l6167M6730Q5218k01650R0809K8460L7785N1097j23149k6716P5209
$$ 275322 239155 285885 371103 169453 260262 288722 326507 377604 254455 227739 302948
10533C02948j22127k8825O4460J9593k029R8074k7342p209K6962l9960k4977O7973
$$ 302948 180821 151996 216456 236049 234020 332094 304752 297543 324505 284545 259568 327541
10521C27541O9035k8720p867m5795J24146q0839r6263K4731J7992O8335l106m1889
$$ 327541 396576 367856 359989 314194 438340 357501 261238 285969 303961 372296 369190 327301
10509C27301p6909J0518Q3753l76k7220K9005n3361R1183m9311r0325K2964M3254
$$ 327301 250392 260910 344663 344287 317067 346072 292711 383894 334583 244258 267222 310476
10497C10476R7614j66753n5458L9582R2371R1495k1430j9502m2025j7329J6765
$$ 310476 408090 241337 185879 225461 317832 409327 387897 368395 326370 309041 325806
10486C25806m7568K9868M0741k2681k0023N0096J5700N0100m3343J3294m6783
$$ 325806 278238 308106 348847 326166 306143 356239 371939 422039 378696 391990 345207
10475C45207k6501k3703j0858P8222l9545p90j685N6360M6713O7843j3497l199
$$ 345207 318706 295003 284145 362367 322822 322032 320347 376707 423420 491263 477766 474567
10463D74567p8254j7656j8005M8397Q534l095p100N4007N0367o0739p5693J3661
$$ 474567 396313 378657 360652 409049 417583 414488 407388 461395 511762 451023 375330 388991
10451C88991O4169n1593r682q5966r840J09108r984j22412K8482P6305r7223J15387
$$ 388991 453160 401567 391885 305919 296079 405187 395203 272791 301273 377578 280355 395742
10439C95742M0489o3001K8386p0159J6308K5586J5182L9364j1513m6133J38885
$$ 395742 436231 373230 401616 331457 347765 373351 388533 427897 416384 370251 509136
10428E09136k8079p3051p4085R0011L7480L8684m6823o2472M4252J2761p7309
$$ 509136 481057 408006 333921 423932 461412 500096 453273 390801 435053 447814 370505
10417C70505R9693N9381j1987m649j722M286Q7024j10567L6875P1591l5839n221
$$ 370505 470198 529579 517592 512943 511221 515507 602531 491964 528839 600430 564591 559370
10405E59370m233m4714m3861j8811o4984N1649N5791Q7618n2833O1232O815j20609
$$ 559370 555137 510423 466562 447751 382767 434416 490207 577825 524992 586224 593039 472430
10393D72430R1867K1654l6981L2175m0302l2678J4797n2935r537N2747L062J5431
$$ 472430 564297 585951 548970 581145 540843 508165 522962 470027 460490 513237 516299 531730
10381E31730Q972j0898l1428k2554r0029J05630O8939M2064o2181n1503J3355
$$ 531730 540702 529804 498376 475822 385793 491423 560362 602426 540245 488742 502097
10370E02097J00592Q3769p7315j37707M3156L8788J01840k5911M379p5016M1828
$$ 502097 602689 686458 609143 471436 514592 553380 655220 629309 633688 558672 600500
10359F00500J8974q1261P7398q5433J00851J4362K104n3134l0872J7258o8605
$$ 600500 619474 538213 615611 530178 631029 645391 647495 594361 563489 580747 512142
10348E12142N3635O3609K8070n6557K5502J5966J0407m4233M3197k648j611J08477
$$ 512142 565777 629386 657456 600899 626401 642367 652774 608541 651738 649090 647479 755956
10336G55956Q0009j51711m5613n4167o4304L8810l5946j5087J0865O0698n1445
$$ 755956 835965 684254 638641 584474 520170 558980 523034 507947 518812 579510 528065
10325E28065J43808Q1960n5987k0689p3584J02759o988K9296K2527m4576j2012
$$ 528065 671873 753833 697846 677157 603573 706332 699344 728640 751167 706591 694579
10314F94579o6811m3776L9742k1072m8308J04161L3454L407K5611M1319o5234
$$ 694579 627768 583992 623734 602662 554354 658515 691969 695376 720987 762306 697072
10303F97072k1285N7511O8776j48529m987r4628L4953p663j9645P5914R5194R5011
$$ 697072 675787 733298 802074 653545 648558 553930 588883 581220 561575 637489 732683 827694
10291H27694n6278j6507m1143L5847q309P2557O1040K4583n7002Q136j4066J4882
$$ 827694 771416 754909 713766 749613 741304 813861 874901 899484 842482 850618 836552 851434
10279H51434R9334R280l3336L4983o2400r2952k4308l3849m8829J9442M2735O9935
$$ 851434 950768 960048 926712 961695 899295 806343 782035 748186 699357 718799 761534 831469
10267H31469P3169n0100o0086M339J10798l9822o3106O7802P7566n4690k9513
$$ 831469 904638 854538 794452 798791 909589 869767 806661 874463 952029 897339 867826
10256H67826J08334n156q5539L0590M8004J02190q979p6341n5018K3784j14727
$$ 867826 976160 971004 885465 916055 964059 1066249 1057270 980929 925911 949695 834968
10245H34968J59495O0398m5133l2060L7415K438J9154q5528M1000L3199P631J7534
$$ 834968 994463 1054861 1009728 977668 1015083 1017521 1036675 951147 992147 1025346 1032977 1050511
10233A050511N5564R582L3201L5296j5033R4468q1444N3278q7345J2722O0711
$$ 1050511 1106075 1115657 1148858 1184154 1169121 1263589 1182145 1235423 1148078 1160800 1221511
10222A221511J3661j59942J53311R2097r1389R180l4913j13438N7621L6733J14931
$$ 1221511 1235172 1075230 1228541 1320638 1229249 1238429 1203516 1090078 1147699 1184432 1299363
10211A299363q5976k6062J7375J24929r647j6388n3905L0903P8215m4593k5908
$$ 1299363 1213387 1187325 1204700 1329629 1319982 1303594 1249689 1280592 1358807 1314214 1288306
10200A288306K7208J89727P233L4714k6167k7532j11650L6756N7668M5864l455
$$ 1288306 1315514 1505241 1512474 1547188 1521021 1493489 1381839 1418595 1476263 1522127 1518672
10189A518672l282K6593J2459M9094L6940j25185P2638N5058L2837j561l7720
$$ 1518672 1515390 1541983 1554442 1603536 1640476 1515291 1587929 1642987 1675824 1674263 1636543
10178A636543k8162M3837L7299o4726O2465k1345M652m4466O9837K6229l7357
$$ 1636543 1608381 1652218 1689517 1624791 1687256 1665911 1670563 1626097 1695934 1722163 1684806
10167A684806k2997P9J5422P104O7925R7342J2685k0487k2234L0951J02276N4536
$$ 1684806 1661809 1661888 1677310 1684414 1752339 1849681 1862366 1841879 1819645 1850596 1952872 2007408
10155B007408J535K8522J4135m5026l229J16659P3999r9867r6048K6329J08046
$$ 2007408 2008943 2037465 2051600 2006574 2003345 2120004 2194003 2094136 1998088 2024417 2132463
10144B132463n3020J07166J53693j3146j61j02779K3380K5838j9052N8828J3451
$$ 2132463 2079443 2186609 2340302 2327156 2326995 2224216 2247596 2273434 2254382 2313210 2326661
10133B326661O7337m9643k7729O7090P498J351j4268N7773l5433P9932L2994p8876
$$ 2326661 2393998 2344355 2316626 2383716 2391214 2392565 2378297 2436070 2400637 2480569 2513563 2434687
10121B434687l7105L5660J45927J08174p710p196N6446q0697m504M5243Q9890
$$ 2434687 2397582 2433242 2579169 2687343 2679633 2672437 2728883 2648186 2643682 2688925 2778815
10110B778815J5051p9809M9830R5180L48m1914K5681n0549M9466M5685j6554J06762
$$ 2778815 2793866 2714057 2763887 2859067 2859415 2817501 2843182 2792633 2842099 2887784 2871230 2977992
10098B977992P6128O371j9655j5538n0760K5726O8324r004L3681p476J31963R5404
$$ 2977992 3054120 3060491 3040836 3025298 2974538 3000264 3068588 3059584 3093265 3085789 3217752 3313156
10086C313156q5008n255L9468O6701L9810N4153m0591j1468l0969q2364J47636
$$ 3313156 3228148 3222893 3262361 3329062 3368872 3423025 3382434 3370966 3339997 3257633 3405269
10075C405269R0067K0580J59820k6026O6417J18828N6520L0743p451J9123K6387
$$ 3405269 3495336 3515916 3675736 3649710 3716127 3834955 3891475 3922218 3914767 3933890 3960277
10064C960277M0978Q5459P2620P8102q754Q096O4024K3831M186k0541O7186J23524
$$ 3960277 4001255 4086714 4159334 4237436 4228682 4236778 4300802 4324633 4328819 4308278 4375464 4498988
10052D498988Q4440k1987k9480Q0083J0686O1015O5151J1413K5286Q8314K16187
$$ 4498988 4583428 4561441 4531961 4612044 4622730 4683745 4748896 4760309 4785595 4873909 5090096
10041E090096L4683l1417Q6208K5363L8870J24938L3647k8102Q8200P3316J54749
$$ 5090096 5124779 5093362 5179570 5204933 5243803 5368741 5402388 5374286 5462486 5535802 5690551
10030E690551K3500K9187J9386P0939j0746L609J9290J55167J26312Q0303K093
$$ 5690551 5714051 5743238 5762624 5833563 5822817 5826426 5845716 6000883 6127195 6207498 6209591
10019F209591k8883J32447J58378L235N7209N8157Q2141J45129K9091P0890K6975
$$ 6209591 6180708 6313155 6471533 6474768 6531977 6590134 6672275 6817404 6846495 6917385 6944360
10008F944360J88838J83024K5703R5675R4260N3835K16676Q7331J55011K3981
$$ 6944360 7133198 7316222 7341925 7437600 7531860 7585695 7802371 7889702 8044713 8068694
9998H068694o072J20619J87739O3294J57708M0928P3970O0772J68611J90696J11165
$$ 8068694 8062622 8183241 8370980 8434274 8591982 8632910 8706880 8767652 8936263 9126959 9238124
9987I238124N9660K23717Q2404K64220J44857J41455J88876J85658N6683j2906
$$ 9238124 9297784 9521501 9603905 9868125 10012982 10154437 10343313 10528971 10585654 10572748
9977A0572748J80362K15836J80975J63841J93650L59018K72413J50996K25902
$$ 10572748 10753110 10968946 11149921 11313762 11507412 11866430 12138843 12289839 12515741
9968A2515741K97700K89995J34087K04081K60884K84989K32110K36067K64034
$$ 12515741 12813441 13103436 13237523 13441604 13702488 13987477 14219587 14455654 14719688
9959A4719688K85722M37202J92898L09699M09340K20524L43080L38932M08251
$$ 14719688 15005410 15442612 15635510 15945209 16354549 16575073 16918153 17257085 17665336
9950A7665336M20510M01533L41724L32711M14276M91378M07348O60512M48130
$$ 17665336 18085846 18487379 18829103 19161814 19576090 20067468 20474816 21135328 21583458
9941B1583458M51562L96334O13273O24369N84837N85875O20936O50653O78358
$$ 21583458 22035020 22431354 23044627 23668996 24253833 24839708 25460644 26111297 26789655
9932B6789655O91211O91380P92786Q39527Q22205Q24145Q38597J020707R31617
$$ 26789655 27480866 28172246 28965032 29804559 30626764 31450909 32289506 33310213 34241830
9923C4241830J028946J166234J018855J112359J207157J313956J393450J324226
$$ 34241830 35270776 36437010 37455865 38568224 39775381 41089337 42482787 43807013
9915D3807013J415462J523563J521986J604291J631291J808474K042203J913253
$$ 43807013 45222475 46746038 48268024 49872315 51503606 53312080 55354283 57267536
9907E7267536K002386K195404K229758K255089K474479K551396K571271K797807
$$ 57267536 59269922 61465326 63695084 65950173 68424652 70976048 73547319 76345126
9899G6345126K980855L038593L107200L353257L361902L570260L892488M010112
$$ 76345126 79325981 82364574 85471774 88825031 92186933 95757193 99649681 103659793
9891A03659793M209079M451646M663246M906104N195336N510962N901971O387616
$$ 103659793 107868872 112320518 116983764 121889868 127085204 132596166 138498137 144885753
9883A44885753O746481P141350P524316Q225013Q776420R342419J0203862J0832481
$$ 144885753 151632234 158773584 166297900 174522913 183299333 192641752 202845614 213678095
9875B13678095J1547988J2367342J3172312J3856423J4748749J5474458J5899026
$$ 213678095 225226083 237593425 250765737 264622160 279370909 294845367 310744393
9868C10744393J6240157J6539178J6398689J5763836J5071750J3778936J2250226
$$ 310744393 326984550 343523728 359922417 375686253 390758003 404536939 416787165
9861D16787165J0387492Q414165N971399L563365J258379j125747l147395m968026
$$ 416787165 427174657 435588822 441560221 445123586 446381965 445256218 442108823 437140797
9853D37140797o423338p566770q558741r098498r588516r694026r531861r396069
$$ 437140797 430717459 423150689 414591948 405493450 395904934 386210908 376679047 367282978
9845C67282978r268422q891001q591783q293182p739281p432494o996828o764940
$$ 367282978 358014556 349123555 340531772 332238590 324499309 317066815 310069987 303305047
9837C03305047o126894n705156n558241n315285m896621m698537m601059m474409
$$ 303305047 297178153 291472997 285914756 280599471 275702850 271004313 266403254 261928845
9829B61928845m406465m364716m157732m071483m015562l919265l944562l654862
$$ 261928845 257522380 253157664 248999932 244928449 240912887 236993622 233049060 229394198
9821B29394198l606059l471518l333422l339068l059558k890689k897179k748872
$$ 229394198 225788139 222316621 218983199 215644131 212584573 209693884 206796705 204047833
9813B04047833k572320k677757k536284k474449k329588k313251k359461k145576
$$ 204047833 201475513 198797756 196261472 193787023 191457435 189144184 186784723 184639147
9805A84639147k161242k079462k047614k069840k103389k071260k308840k153272
$$ 184639147 182477905 180398443 178350829 176280989 174177600 172106340 169797500 167644228
9797A67644228k109171k384662k570315k567223k734701k907667k950896l144320
$$ 167644228 165535057 163150395 160580080 158012857 155278156 152370489 149419593 146275273
9789A46275273l262504l205324l408173l396229l634606l540804l476331l604984
$$ 146275273 143012769 139807445 136399272 133003043 129368437 125827633 122351302 118746318
9781A18746318l405432l533306l560442l279383l100546l022702k939347k912349
$$ 118746318 115340886 111807580 108247138 104967755 101867209 98844507 95905160 92992811
9773I2992811k663171k628007k461351k362606k331965k151912k007469j948620
$$ 92992811 90329640 87701633 85240282 82877676 80545711 78393799 76386330 74437710
9765G4437710j967431j712938j620741j723162j591542j569756j367546j381982
$$ 74437710 72470279 70757341 69136600 67413438 65821896 64252140 62884594 61502612
9757F1502612j330881j167611j192230j225183j114553j047542j073632j099538
$$ 61502612 60171731 59004120 57811890 56586707 55472154 54424612 53350980 52251442
9749E2251442q16193r72024r47634o85406q52985q37376p65033q13698p99609
$$ 52251442 51435249 50463225 49515591 48830185 47977200 47139824 46374791 45561093 44761484
9740D4761484p23014o37931o22859o15855o92636o85005o06866n83242n57053
$$ 44761484 44038470 43400539 42777680 42161825 41469189 40784184 40177318 39594076 39037023
9731C9037023n63575n87218n21971l63948n03984m89929n26653k73693l54202
$$ 39037023 38473448 37886230 37364259 37000311 36496327 36006398 35479745 35206052 34851850
9722C4851850l90240l56123l56215k33036k11458q3626o3415j04209J44919J85916
$$ 34851850 34461610 34105487 33749272 33516236 33304778 33221152 33157737 33053528 33198447 33384363
9712C3384363M99038N88628P16533P24531O59010M83827M05274o4187l28426n10565
$$ 33384363 33883401 34472029 35188562 35913093 36572103 37055930 37461204 37397017 37068591 36558026
9702C6558026r56952r75562j105368j415946j588135j357090j218142j070817
$$ 36558026 35601074 34625512 33520144 32104198 30516063 29158973 27940831 26870014
9694B6870014q70264o90733n99240n30515m04522l70401m43108l97578l20700
$$ 26870014 25999750 25309017 24709777 24179262 23774740 23404339 22961231 22563653 22242953
9685B2242953k34238k77483k83893p1422J84500j5447K60532K48927M14645O53851
$$ 22242953 22008715 21731232 21447339 21375917 21560417 21544970 21805502 22054429 22469074 23122925
9675B3122925Q63058Q39518P96013O25526K86302q1969k18420n53434p51927j043844
$$ 23122925 23985983 24825501 25621514 26247040 26533342 26451373 26232953 25679519 24927592 23883748
9665B3883748j089264j301105j643956j434191j191728j046114p55031o41105
$$ 23883748 22794484 21493379 19849423 18415232 17223504 16177390 15422359 14781254
9657A4781254m99375m02546m46585m69194k29198j56107k20182k42076k63712
$$ 14781254 14281879 13879333 13432748 12963554 12734356 12578249 12358067 12115991 11852279
9648A1852279l04151k69942j11993k38669k05730k20120k70919l29880j25443
$$ 11852279 11548128 11278186 11166193 10927524 10721794 10501674 10230755 9900875 9775432
9639I775432k14276j65573j90726j63667j66609k40384j08799j48508j32839j74751
$$ 9775432 9561156 9395583 9204857 9041190 8874581 8634197 8525398 8376890 8244051 8069300
9629H069300j37337l5519o4021j03420j46095p4503j96621r8125K4471j12372
$$ 8069300 7931963 7896444 7832423 7729003 7582908 7508405 7311784 7213659 7238130 7125758
9619G125758j82781j21276o6483j45426l8551r4627m1610q4402j57548p2849L3297
$$ 7125758 6942977 6821701 6755218 6609792 6571241 6476614 6435004 6350602 6193054 6120205 6153502
9608F153502r642j35743r1053o0756r6982j9558r8171j7090o7644q5443j01885
$$ 6153502 6143860 6008117 5917064 5856308 5759326 5739768 5641597 5624507 5556863 5471420 5369535
9597E369535k43129P2199p1960j05806r2600l7712l4606L0238j18012r5328p1078
$$ 5369535 5126406 5198605 5126645 5020839 4928239 4890527 4855921 4886159 4768147 4672819 4601741
9586D601741n8497p2388n8912j4545K9204k15388n9659q6701J25558j16349p2560
$$ 4601741 4543244 4470856 4411944 4397399 4426603 4211215 4151556 4064855 4190413 4074064 4001504
9575D001504K6998p6694l3741m9427q2039m5734p6378R397J0570j55821L7484
$$ 4001504 4028502 3951808 3918067 3868640 3786601 3740867 3664489 3673886 3684456 3528635 3566119
9564C566119q955o2744n6945j2853j07289N8424j7535n7130p0339j9009O5637
$$ 3566119 3557164 3494420 3437475 3424622 3317333 3375757 3358222 3301092 3230753 3211744 3277381
9553C277381j50112m7291J02952o5933m1525N2666J5696j04853n1881o2344P2747
$$ 3277381 3127269 3079978 3182930 3116997 3075472 3128138 3143834 3038981 2987100 2924756 2997503
9542B997503n6217o5752j8745L2436q108j24480n0519k9615L1309j1687r8699
$$ 2997503 2941286 2875534 2856789 2889225 2881117 2756637 2706118 2676503 2707812 2696125 2597426
9531B597426L3117O7002o5363r6674Q96o6789l2403j11444j1306J3197q1810j4569
$$ 2597426 2630543 2697545 2632182 2535508 2536404 2469615 2437212 2325768 2314462 2327659 2245849 2231280
9519B231280J597j2728J22629k132m0882j08986L505O6465n3695n0198l8058L3906
$$ 2231280 2232877 2220149 2342778 2340646 2299764 2190778 2194283 2260748 2207053 2156855 2118797 2152703
9507B152703m4641k0927M8298K5790K2352O2823q6412j79690j08920L7172k9487
$$ 2152703 2108062 2087135 2135433 2161223 2183575 2246398 2159986 1980296 1871376 1908548 1879061
9496A879061J3777K5927j7606m4709O4734L4279o0701r5853P900L1923m4434O1298
$$ 1879061 1892838 1918765 1901159 1856450 1921184 1955463 1894762 1798909 1806809 1838732 1794298 1855596
9484A855596K7483L9035r8844R1119n559n3242j45508p405k22o1153Q7886m3158
$$ 1855596 1883079 1922114 1823270 1914389 1908830 1855588 1710080 1702675 1702453 1641300 1729186 1686028
9472A686028j30035n2480R8169j7726J02012k4151k9805O1450l4238j1251r4147
$$ 1686028 1555993 1503513 1601682 1583956 1685968 1661817 1632012 1693462 1659224 1647973 1553826
9461A553826l439M4193n3841L9412p0889r1628L0774j6305K6762J290k7829J14305
$$ 1553826 1550387 1594580 1540739 1580151 1509262 1417634 1448408 1432103 1458865 1460155 1432326 1546631
9449A546631l7710l5765j7378J3644o716k4244k4295J7964m559J9111j21047k8410
$$ 1546631 1508921 1473156 1455778 1469422 1462706 1438462 1414167 1432131 1427572 1446683 1325636 1297226
9437A297226J2649M7214M156q9932N8751k7704J37852O5684K2438j53791m2432
$$ 1297226 1309875 1357089 1361245 1271313 1330064 1302360 1440212 1505896 1528334 1374543 1332111
9426A332111J20554L0842p0330m819j26441n7362L6454J2157M2798j05696O0828
$$ 1332111 1452665 1483507 1413177 1408358 1281917 1224555 1261009 1273166 1315964 1210268 1271096
9415A271096N2788J43310j21085k6130N0124q5051K9727j82145R2598m2870n6089
$$ 1271096 1323884 1467194 1346109 1319979 1370103 1285052 1314779 1132634 1225232 1182362 1126273
9404A126273L7223K2415p2305M5215n090n9937R4387K6987m2436m7739J184l5561
$$ 1126273 1163496 1185911 1113606 1158821 1153731 1093794 1188181 1215168 1172732 1124993 1126177 1090616
9392A090616K3315j6514j0999m8155J06326j12276L3761J24502l5751q4621j61179
$$ 1090616 1113931 1097417 1086418 1038263 1144589 1032313 1066074 1190576 1154825 1070204 909025
9381I09025Q6344J63223o0419K2281j8615k8578j0812K4451n290j06009N3421
$$ 909025 995369 1158592 1098173 1120454 1101839 1073261 1062449 1086900 1081610 975601 1029022
9370A029022K3280p4048k6627Q0346l0461m4769K2696J12135M465J836J268n04
$$ 1029022 1052302 978254 951627 1031973 1001512 956743 979439 1091574 1096039 1097875 1099143 1098639
9358A098639K6735k6252n6563j03063J76467P8962r1636j9809j01434K8036P0057
$$ 1098639 1125374 1099122 1042559 939496 1115963 1194925 1103289 1083480 982046 1010082 1080139
9347A080139r1428Q5665J40066j15852k2066O5124l2035R9506j26295J40618R7037
$$ 1080139 988711 1074376 1214442 1098590 1076524 1141648 1109613 1209119 1082824 1223442 1320479
9336A320479l1527p1945O5748R577J26M1770j95254K9907K3244j9532J1429L9472
$$ 1320479 1288952 1217007 1282755 1292332 1292458 1334228 1138974 1168881 1192125 1172593 1184022 1223494
9324A223494l9266O243n6812J08833J62399O0634J668l3347M1979J0138L051o6694
$$ 1223494 1184228 1190471 1133659 1242492 1404891 1465525 1467193 1433846 1475825 1485963 1489014 1422320
9312A422320M7326Q2456J0427J21104j1570n9291K136Q1867Q9R5315P2150Q6404
$$ 1422320 1469646 1552102 1562529 1683633 1672063 1612772 1614908 1696775 1696864 1792179 1864329 1950733
9300A950733o9237o1549J74030P9071n0473n4451J017J42595p419j438Q2731j9483
$$ 1950733 1881496 1819947 1993977 2073048 2022575 1968124 1969141 2111736 2104317 2102879 2185610 2166127
9288B166127J37233J93495L9189J54189L9557N3510J01647J12511K70966J72102
$$ 2166127 2303360 2496855 2536044 2690233 2729790 2783300 2884947 2997458 3268424 3440526
9278C440526J99516J27566J85182K98684L03568M81331M00197N85264P67644R21996
$$ 3440526 3640042 3767608 3952790 4251474 4555042 5036373 5436570 6021834 6789478 7711474
9268G711474R20842P48621Q94509P40854O90750K26886q9482m05162o57624q00007
$$ 7711474 8632316 9380937 10275446 11016300 11707050 11933936 11844454 11439292 10781668 9981661
9258I981661r37525q90833p81904q02958o41985l94829j56420j86902k05248o4408
$$ 9981661 9044136 8153303 7371399 6568441 5926456 5531627 5375207 5188305 4983057 4918649
9248D918649q6686n4238N0948k6621p1155J28507J00272Q9145L17715L33375L08376
$$ 4918649 4831963 4777725 4828673 4802052 4730897 4859404 4959676 5048821 5366536 5699911 6008287
9237F008287L68359L86636N81870P73299R62114J192128J299552J428065J149061
$$ 6008287 6376646 6763282 7345152 8118451 9080565 10272693 11572245 13000310 14149371
9228A4149371R91061P22306N15095p5763p51186r66608j148235j306574j423995
$$ 14149371 15140432 15862738 16377833 16302070 15550884 14584276 13436041 12129467 10705472
9219A0705472j360152j361985r88127p09696o37477o65308l36610k68488k92140
$$ 10705472 9345320 7983335 6995208 6285512 5648035 4982727 4646117 4377629 4085489
9210D085489r2996k69381k87090j79423k08913j09680n6834o8297j85914o3302
$$ 4085489 3992493 3723112 3436022 3256599 3047686 2938006 2881172 2812875 2626961 2563659
9200B563659J2261j42757j20937J08342k9474j21951j82426p0487m7432P2518
$$ 2563659 2575920 2433163 2312226 2420568 2391094 2269143 2086717 2016230 1968798 2041316
9190B041316L2930k9167k9368m0836j09771j21382k8832p8750j7532k2788l4468
$$ 2041316 2074246 2045079 2015711 1974875 1865104 1743722 1714890 1636140 1618608 1595820 1561352
9179A561352N4990J6979l6085r0836m7866J0096j9109L7825n5049L3745J9795
$$ 1561352 1616342 1633321 1597236 1506400 1458534 1468630 1449521 1487346 1432297 1466042 1485837
9168A485837K8054n7273k903M6339m9008o118N2866q0548o2493J09241j3269n2506
$$ 1485837 1513891 1456618 1453715 1500054 1451046 1444928 1497794 1417246 1354753 1463994 1450725 1398219
9156A398219k8185j11316L4491Q4343p8012P9156j7690L9057j1463J1476p8877
$$ 1398219 1370034 1258718 1293209 1377552 1299540 1378696 1361006 1400063 1388600 1400076 1321199
9145A321199Q8761N9326r9680M1921N7479L406P6222L8137M0264j146k8387Q3407
$$ 1321199 1409960 1469286 1369606 1411527 1469006 1472412 1548634 1586771 1627035 1625889 1597502 1680909
9133A680909k9755k51O0601J76111j2323k5219J1880J16673j6542L7567O572P998
$$ 1680909 1651154 1650903 1711504 1887615 1875292 1850073 1861953 1978626 1962084 1999651 2006223 2014221
9121B014221k0352P668J13145J31864m9790N5655J27547J53754K8709J8840J70485
$$ 2014221 1993869 2001537 2114682 2246546 2196756 2252411 2379958 2533712 2562421 2581261 2751746
9110B751746R3825K07271J30535M8145K22728K55646L40750K91684K73750M82292
$$ 2751746 2845571 3052842 3183377 3231522 3454250 3709896 4050646 4342330 4616080 5098372
9100E098372N97237O71050P80974O00015M09192M8563n5065O1852K54781J1907
$$ 5098372 5695609 6366659 7147633 7747648 8156840 8205403 8150338 8212190 8466971 8478878
9090H478878m59804o69113o93265m78590n15714m13530k84787k15114j08701p2057
$$ 8478878 8019074 7349961 6656696 6178106 5662392 5248862 4964075 4748961 4640260 4568203
9080D568203O8435j943N534J4799J33247K21565J31555J86556M15625L54943M65291
$$ 4568203 4636638 4634695 4640229 4655028 4788275 5009840 5141395 5327951 5743576 6098519 6563810
9069F563810N26977O92724R38839J143716J074418P15864L83077J37578K74861
$$ 6563810 7090787 7783511 8722350 9866066 10940484 11656348 12039425 12177003 12451864
9060A2451864M07974J98858m03128p97065q87512p38244p13639o22539r54064
$$ 12451864 12859838 13058696 12655568 11858503 10970991 10232747 9519108 8896569 7942505
9051G942505q84600o00820n10884m50134k74238k80546k12329j42094j90696k26023
$$ 7942505 7057905 6457085 5946201 5496067 5221829 4941283 4728954 4586860 4396164 4170141
9041D170141n0056p4283N1295J18065K0792r5031J06390J42329K57584K37474
$$ 4170141 4120085 4045802 4097097 4215162 4235954 4140923 4247313 4389642 4647226 4884700
9031D884700M05408M48929O36357O56204M77565J85678p2002q6520j05138j57519
$$ 4884700 5290108 5739037 6375394 7031598 7509163 7694841 7622839 7536319 7431181 7273662
9021G273662k20125n72290o54822o19934n39732m45033m58296k22206k02833l09318
$$ 7273662 7053537 6481247 5826425 5206491 4666759 4221726 3763430 3541224 3338391 3029073
9011C029073l08772j39557k96162p4366j6033l2362p782q4766j67076j49988m0328
$$ 3029073 2720301 2580744 2284582 2210216 2194183 2161821 2154039 2069273 1902197 1752209 1711881
9000A711881M6396L539m3831k14948P4870q604m5109L6156m6038m5037o3664n7759
$$ 1711881 1758277 1761816 1717985 1503037 1577907 1569303 1524194 1560350 1514312 1469275 1405611 1347852
8988A347852k0614j08780Q847m0645o4031Q478l9504p829j05661Q4266n129n8011
$$ 1347852 1327238 1218458 1227305 1186660 1122629 1131107 1091603 1083774 978113 1062379 1057250 999239
8976I99239M5757m3024k7284o8689r8743L8099Q0535o2251Q992j09153j4678J30604
$$ 999239 1044996 1001972 974688 905999 807256 845355 925890 863639 872631 763478 748800 879404
8964H79404r3738M1146L4006J7283M6652k0182N8796N4011q0056j22464l3857
$$ 879404 785666 826812 860818 878101 924753 904571 963367 1017378 937322 814858 781001
8953G81001M25P4202N83Q0468k0489r2359M2208n5090q4959R3725j5264P0234
$$ 781001 781426 855628 856211 936679 916190 823831 866039 810949 725990 819715 804451 874685
8941H74685M841k1859P7856j01791J7453k6428O9542M3973k5698n098p0181r6512
$$ 874685 879526 857667 935523 833732 851185 824757 894299 938272 912574 907476 837295 740783
8929G40783J6161M9051J67962M9652J4443l7603J1290J33111J3242L8352p7502
$$ 740783 756944 805995 973957 1023609 1038052 1000449 1011739 1144850 1158092 1196444 1118942
8918A118942P0304J0983m4161K833L622Q0515j3315O0811L1415q2305J14842J4641
$$ 1118942 1189246 1200229 1156068 1158901 1162523 1243038 1229723 1290534 1321949 1239644 1354486 1369127
8906A369127l8836J6742J12418P4196k0989M6051L730R0808J15419N8928J33728
$$ 1369127 1330291 1347033 1459451 1533647 1512658 1558709 1562439 1653247 1768666 1827594 1961322
8895A961322J18566n8035l7609J07416J66809N1435P5155Q1402R9322J3866R0862
$$ 1961322 2079888 2021853 1984244 2091660 2258469 2309904 2385059 2466461 2565783 2579649 2670511
8884B670511K34501J91797J00341M03281M48294L64555N34101N44533P67301Q05931
$$ 2670511 2905012 3096809 3197150 3600431 4048725 4413280 4947381 5491914 6259215 7065146
8874G065146J005530P46158M67865K35031N8679m8560l90483o76893r09723q62065
$$ 7065146 8070676 8816834 9284699 9519730 9578409 9529849 9139366 8462473 7552750 6690685
8864F690685q08243n23682k70886k74838k16515j61980r7684n7127l7104Q168
$$ 6690685 5882442 5358760 5087874 4813036 4596521 4434541 4336857 4279730 4242626 4250794
8854D250794P416O7086J97720J77421K61325L01688K10532M43990L72725P19447
$$ 4250794 4258210 4325296 4523016 4700437 4961762 5263450 5473982 5917972 6290697 7010144
8844G010144Q85914R65765J271500J113719J150189Q75609N98019L39274j70817
$$ 7010144 7896058 8861823 10133323 11247042 12397231 13272840 13870859 14210133 14039316
8835A4039316n13447p05988r89560j361907j278119j103914r43846p56815o75869
$$ 14039316 13525869 12819881 11830321 10468414 9190295 8086381 7142535 6385720 5709851
8826E709851o05637l76597k27252j47922j41615j43636j07127m8021l6109m616
$$ 5709851 5104214 4727617 4500365 4352443 4210828 4067192 3960065 3912044 3875935 3871319
8816C871319P619j2934P0785J06284J78389J94722J98797L39006N18284N19734
$$ 3871319 3878938 3866004 3936789 4043073 4221462 4416184 4614981 4953987 5472271 5992005
8806E992005P01616L40769Q7370j23701k06413l16758m72029p22252o62503o35395
$$ 5992005 6693621 7034390 7121760 6998059 6791646 6474888 6002859 5280607 4618104 3982709
8796C982709m87659m50271l84007k05647j54554j04721j12679j59049j82726j3177
$$ 3982709 3495050 3044779 2660772 2455125 2300571 2195850 2083171 1924122 1741396 1728219
8786A728219j45323k3991L7649J1183N3223n0969j53389q2145j76712k880o7937
$$ 1728219 1582896 1558905 1596554 1607737 1660960 1609991 1456602 1374457 1197745 1194865 1126928
8775A126928j8242K6786J5499j37412k09475O7798j9621r1282N4464j1825N4975
$$ 1126928 1108686 1135472 1150971 1013559 804084 871882 852261 760979 815443 803618 858593
8764H58593p0056q1910l3580J6319m1544L709p2392N076J6058k1987P020j8182
$$ 858593 788537 706627 673047 689366 647822 651531 579139 584215 600273 578286 585306 567124
8752E67124n2379m4856n2977l021J7615m5292K5680Q6452j7731o6891L3311M4919
$$ 567124 514745 469889 416912 413891 431506 386214 411894 498346 480615 413724 447035 491954
8740D91954l9179o5525p5845M257J0034R202J10812k9069J3542p1058m8279k6382
$$ 491954 452775 387250 311405 315662 325696 334898 445710 416641 430183 359125 310846 284464
8728B84464K1552K0786P4402l7515q2514P9746k665n900n8202p5140R0666L7205
$$ 284464 306016 326802 401204 363689 281175 360921 358256 352356 294154 219014 309680 346885
8716C46885n202j0662Q6342R2431q9610p4529N5732r3719k394M1832j38126JJ40570
$$ 346885 341683 331021 417363 509794 420184 345655 401387 307668 305274 347106 208980 208981 349551
8703C49551j4613q7863n6472J0823M7180o1421l5584j4839m2827K9912j5580l2666
$$ 349551 334938 247075 190603 201426 248606 187185 151601 136762 93935 123847 108267 75601
8691G5601K2988R0260L0306j09777q512L263q0300P5804M7188K7571j18455K8321
$$ 75601 98589 188849 219155 109378 100866 104129 23829 99633 146821 174392 55937 84258
8679H4258k2720P0064j720r7020o7283J39421M8362j12375j2630j8361Q1735k1159
$$ 84258 61538 131602 129882 32862 -34421 105000 153362 40987 28357 9996 91731 70572
8667G0572j2965K7375M338P3211O6681m1557L3034n2187k1150l4155K448m1452
$$ 70572 57607 84982 89320 162531 229212 187655 220689 168502 147352 113197 115645 74193
8655G4193M096K3544M4526n1147O389j6389r2111n7696O4841P2766P9431J05037
$$ 74193 78289 101833 146359 95212 101601 85212 -6899 -64595 246 73012 152443 257480
8643B57480j27443l4174N0725o3131J03201K2232m6389K5030j24579J8370o6572
$$ 257480 130037 95863 146588 83457 186658 208890 162501 187531 62952 81322 14750
8632A4750J1436J06019n4255r4637l4775J46143J3672j06616j1089N6880J8207
$$ 14750 26186 132205 77950 -16687 -51462 94681 108353 1737 -9352 47528 65735
8621F5735K4842o0478j9659Q9552j06490j19958J16993M0599K844j8794k7815
$$ 65735 90577 30099 10440 99992 -6498 -126456 -9463 31136 33980 15186 -12629
8610a2629n726N155N4061l2038J0915L9982j39L5981l2271m4631j18395j4626
$$ -12629 -18355 -13200 40861 8823 19738 59720 59581 95562 63291 18660 -99735 -114361
8598a14361L0109O9703M0031P530m7338n7871k973N6309P5353k9694p4742j7955
$$ -114361 -84252 -14549 25482 33012 -14326 -72197 -75170 -18861 56492 26798 -47944 -65899
8586f5899j26777L5443L29285K4112n2094n0927j08851J44672m9470j4733j3349
$$ -65899 -192676 -157233 172052 196164 144070 93143 -15708 128964 79494 64761 51412
8575E1412l066O5607r195j1636l3425k9654j49233L0308K0593J85911j00742j64487
$$ 51412 48346 113953 104758 93122 59697 30043 -119190 -88882 -68289 117622 16880 -147607
8563a47607P3724Q2002K0097J21986q0634o501L9743m0686M9832n9647q0238J9333
$$ -147607 -73883 8119 28216 150202 69568 63067 102810 62124 111956 52309 -27929 -8596
8551h596q162J5716M8303m6205r2585J15374J52250m231n6845k0147R1508j00886
$$ -8596 -16758 -1042 47261 1056 -91529 23845 176095 171864 115019 94872 186380 85494
8539H5494o6035j1878J11679J5124o1768Q8665j17445O541m633k9672O9305k2874
$$ 85494 19459 7581 119260 134384 72616 161281 43836 50377 45744 16072 85377 62503
8527F2503J6228l8247l6471n3879J563J13808Q2575K1719q7779m3873m604N2581
$$ 62503 78731 40484 4013 -49866 -48303 65505 148080 169799 82020 38147 33543 86124
8515H6124q8722o6488J048o141O4598O5418L5169j9804M3520j4653p2942J172
$$ 86124 -2598 -69086 -68038 -74179 -9581 55837 91006 71202 114722 100069 27127 28299
8503B8299J8560q601J1518J856j7810K2319l551j278J70310j42772l1359l2333
$$ 28299 46859 38258 49776 51632 33822 56141 52590 51312 221622 78850 47491 15158
8491A5158K8795q097k4982o159R0088l0151j50493Q9285N2599J8194N8863j29466
$$ 15158 43953 35856 10874 4715 94803 64652 -85841 3444 56043 74237 133100 3634
8479C634j3022J3046J2307k903k5634J40548M8135j08614n7586M205J7883K4853
$$ 3634 -9388 3658 15965 13062 -12572 127976 176111 67497 9911 14116 31999 56852
8467E6852l054l4223k5904N3256m7784q8663q5423O022O1624Q6967J4545k1822
$$ 56852 53798 19575 -6329 46927 -857 -89520 -174943 -168921 -107297 -20330 -5785 -27607
8455b7607O8480l4073J03415L6315j03643K4276o2953k1688j6346P5492N6910
$$ -27607 40873 6800 110215 146530 42887 67163 4210 -17478 -33824 41668 98578
8444I8578l621m8606K0854m9997K29N8468m5907j3486j8105J17332J012m5791
$$ 98578 94957 46351 67205 17208 17437 75905 29998 16512 -1593 115739 116751 70960
8432G0960J734j20369p758L5424O3063L2197J2812m1524N9328j28006j069O0896
$$ 70960 72694 -47675 -55433 -20009 43054 75251 88063 46539 105867 -22139 -23208 37688
8420C7688P3209l6506j8311j08958j0335M3413N7805K1940j50770r0882J21779
$$ 37688 110897 74391 56080 -52878 -63213 -19800 38005 59945 -90825 -181707 -59928
8409e9928P6224p296Q7514l4850L1197o6970k7102N1266O4405r1453P641k0629
$$ -59928 16296 9000 96514 61664 92861 25891 -1211 50055 114460 23007 30648 10019
8397A0019J8885l4945k2706P1813N2498L673m7775n0833j8823L6098N2156L3345
$$ 10019 28904 -6041 -28747 43066 95564 99237 51462 629 -18194 17904 70060 103405
8385A03405q8596p5280O731Q2433o167J3372Q4738n1720j2813k1227L2919n082
$$ 103405 14809 -60471 -53740 28693 22526 35898 120636 68916 56103 34876 67795 62713
8373F2713j29456Q4206L9690l1276j23681J08181O471j0009m281n7006P9059n7282
$$ 62713 -66743 17463 57153 25877 -97804 10377 16848 6839 2558 -54448 24611 -32671
8361c2671j23169j7130j9041l8252J23471N9703k150m4422J01774J629l4337j0949
$$ -32671 -155840 -172970 -192011 -230263 -106792 -47089 -49239 -93661 8113 9742 -24595 -35544
8349c5544k7418N141J228m7985L5259M1888l1285L1442R0143j15883J1499J14876
$$ -35544 -62962 -57821 -56593 -104578 -69319 -27431 -58716 -27274 62869 -53014 -41515 73361
8337G3361O866j75886n0454J7685l200R777p4322N7968R5674J6216p5717K1804
$$ 73361 80227 -95659 -146113 -128428 -131628 -121851 -196173 -138205 -42531 -26315 -102032 -80228
8325h0228O6290k9854K4631n5596L3478K4299L4746J20191l9839j18011r3089
$$ -80228 -13938 -43792 -19161 -74757 -41279 -16980 17766 137957 98118 -19893 -112982
8314a12982R9525O1088o761o297p9169m019j8732M6570J16070k8968o7584O3155
$$ -112982 -13457 47631 40870 34573 -44596 -48615 -67347 -20777 95293 66325 -1259 61896
8302F1896N9045k5782k5705K5897n3615O686o7190N252L1167q72M6879r9858O7303
$$ 61896 120941 95159 69454 95351 41736 48422 -18768 -13516 17651 16779 63658 -36200 31103
8289C1103L2408k3622n0039n749J15549k9683J3637j3894m8581P2897j26156o9519
$$ 31103 63511 39889 -10150 -15899 99650 69967 83604 69710 21129 94026 -32130 -101649
8277a01649R0869M3955j40887J9054K9698L6046N9737J32822p5860r2854N2857
$$ -101649 -10780 33175 -107712 -88658 -58960 -22914 36823 169645 93785 931 53788
8266E3788o2313j02882J9426K7978J6668P7088L3534j07187r9767J7752J03582
$$ 53788 -8525 -111407 -91981 -64003 -47335 29753 63287 -43900 -143667 -125915 -22333
8255b2333J16553p0036p5899l2841J2176o410N6871j1844m889n7143q056K4931
$$ -22333 94220 24184 -51715 -84556 -72380 -78790 -21919 -33763 -38652 -95795 -103851 -78920
8243g8920Q5156l5388p0189L7306l3716J03320k6828L3271o3268k3376n886O7222
$$ -78920 6236 -29152 -99341 -62035 -95751 7569 -19259 14012 -49256 -72632 -78518 -11296
8231a1296j8264p401R2493o1874O4457L308n3905j17051J441k8727J25946K5991
$$ -11296 -29560 -36961 55532 -6342 58115 61423 7518 -109533 -108092 -136819 -10873 15118
8219A5118m6345n2335j5640O7490l5858M3078L5696p1219j0069R4040m1186q9390
$$ 15118 -31227 -83562 -99202 -31712 -67570 -24492 11204 -60015 -70084 23956 -17230 -106620
8207a06620K7188O0638K3400K9598p781p3868Q1981j21005j19082R2659K6844
$$ -106620 -79432 -18794 4606 34204 26423 -47445 34536 -86469 -205551 -112892 -86048
8196h6048K17N359k231R6807N18795k18809l49124M7729p7796J1852n5799M9662
$$ -86048 -85831 -80472 -82703 14104 532899 314090 -35034 12695 -65101 -53249 -109048 -59386
8184e9386L8308n5979j8978L0200L2158Q9502K9858p3108q8908O4302J32972J5868
$$ -59386 -21078 -77057 -96035 -65835 -33677 55825 85683 12575 -76333 -12031 120941 136809
8172A36809r3190q3234r784N478l2423J5972P2230j5701j21332n8419P7881j882
$$ 136809 43619 -39615 -49399 -43921 -76344 -60372 11858 -3843 -125175 -183594 -105713 -107595
8160a07595J10101R0816k03012j13299R0690K8969R6217l0813K5129J05183l0807
$$ -107595 2506 93322 -109690 -222989 -132299 -103330 -7113 -37926 -12797 92386 61579
8149F1579o9993M8250n9121J8331j11621k0398J22609j961l6142O4910M843n6187
$$ 61579 -8414 39836 -19285 -954 -112575 -132973 -10364 -12325 -48467 16443 21286 -34901
8137c4901n1743l2680m2103O7933N5482j03894J42336O6278L8018j32179M7855
$$ -34901 -86644 -119324 -161427 -93494 -38012 -141906 430 66708 104726 -27453 20402
8126B0402O407q159L4378j48096p9096K2999o2765L1695k7761L4688K0890O9134
$$ 20402 26809 18650 53028 -95068 -174164 -151165 -213930 -182235 -209996 -175308 -154418 -85284
8114h5284K9733k989j8137m960L5925K8160m1837l8045l0480j5820O7362m1707
$$ -85284 -55551 -58540 -76677 -81637 -45712 -17552 -59389 -97434 -127914 -143734 -76372 -118079
8102a18079j2601Q1850J24285k8384k0461J3529j7735l2761j7268M5279J3045
$$ -118079 -130680 -48830 75455 47071 26610 40139 22404 -10357 -27625 17654 30699
8091C0699q083m3654m9584p5383m5932J3307j8718J11573P3866r5602J4119L6569
$$ 30699 22616 -21038 -70622 -146005 -191937 -178630 -197348 -85775 -11909 -107511 -93392 -56823
8079e6823P5110J9508r0856n3482k4113n322j07928J54132R9915m9392r7912P7210
$$ -56823 18287 37795 -53061 -106543 -130656 -135978 -243906 -89774 10141 -39251 -137163 -59953
8067e9953j9875o5491O9741j3283r282L0273O0675m6044N9491j4884j4708q3893
$$ -59953 -79828 -145319 -75578 -88861 -98143 -67870 -7195 -53239 6252 -8632 -23340 -107233
8055a07233j4218P091J3519Q5636J4601o974j52298Q454M4834Q288M0936P0017
$$ -107233 -121451 -114360 -100841 -15205 -604 -7578 -159876 -151422 -106588 -98300 -57364 12653
8043A2653k360k6862l534P586J06672r58l7828l3973k0343K9112n7060P5697L0206
$$ 12653 10293 -16569 -20103 -12517 94155 93197 55369 21396 1053 30165 -26895 48802 79008
8030G9008M881n9138r2576L351N5254M7391n5481j405j38373L2721N2757O239
$$ 79008 83889 24751 -67825 -64474 -9220 38171 -17310 -18715 -157088 -124367 -71610 -65371
8018f5371j1674P1910K5256n1893R665n9722p4800Q4355P3819Q86Q718o9719O1035
$$ -65371 -77045 -5135 20121 -31772 -22107 -81829 -156629 -72274 1545 2431 11149 -58570 2465
8005B465J154o1655p6350N9943J00753p7904n6740J9716R7557l471k9588P7697
$$ 2465 3619 -58036 -134386 -74443 26310 -51594 -108334 -88618 8939 5468 -24120 53577
7993E3577p9573j27880R520O2093k5388o9667P2043o486m1187K2745J0479M6770
$$ 53577 -25996 -153876 -144356 -82263 -107651 -177318 -105275 -111761 -152948 -130203 -119724 -72954
7981g2954l8819K4139O0814L3007q8188L4494P0732M5562m5688j15896L1385P0444
$$ -72954 -111773 -87634 -26820 6187 -82001 -47507 23225 68787 23099 -92797 -61412 9032
7969I032l4347O4438l2161l7147p8996l8553J20676L1879M6936j16474q4031L9335
$$ 9032 -25315 39123 6962 -30185 -109181 -147734 -27058 4821 51757 -64717 -148748 -109413
7957a09413O3138R7361N405q9788k3429K2076M6787P28l9171k2046K0998p3978
$$ -109413 -46275 51086 56491 -33297 -56726 -34650 12137 12865 -26306 -48352 -27354 -101332
7945a01332J00L2169Q3334K253p7606N8973L9023q5910p524R5119j15879j45361
$$ -101332 -101232 -69063 14271 16524 -61082 -2109 36914 -48996 -56520 38599 -77280 -222641
7933b22641K846J55228P4464p1897n606N1643l1253M8213k0759r1567N7544N4936
$$ -222641 -219795 -64567 9897 -62000 -67606 -15963 -47216 997 -19762 -111329 -53785 1151
7921A151o8445j3814J1282k6085P1856J4041K0290r6661P1639N4251j02802P6696
$$ 1151 -67294 -81108 -69826 -95911 -24055 -10014 10276 -86385 -14746 39505 -63297 13399
7909A3399j938J7101L4533r1535L9825m0996m2043K7073o5123M5862J1948q8109
$$ 13399 11461 28562 63095 -28440 11385 -29611 -71654 -44581 -109704 -63842 -51894 -140003
7897a40003o4862Q2204J32811P155j5764m7122j733M1226J5748n7604j06618P7708
$$ -140003 -204865 -122661 10150 17305 1541 -45581 -47314 -6088 9660 -47944 -154562 -76854
7885g6854j60885j8736O9873Q2318L6274q381p60L2204L9506n3093k8554j8244
$$ -76854 -237739 -256475 -186602 -104284 -68010 -76391 -77151 -44947 -5441 -58534 -87088 -105332
7873a05332N3498k1949L3657n5021p1707l0713P7326P7591N0285l6553j08085
$$ -105332 -51834 -73783 -40126 -95147 -166854 -197567 -120241 -42650 7635 -28918 -137003
7862a37003m9396J13960N7589k032k223m3084m5048R5261P794l5429J9276O5623
$$ -137003 -186399 -72439 -14850 -16882 -19105 -62189 -107237 -11976 -4182 -39611 -20335 45288
7850D5288Q54l9293J8742R107k9904K6032l7769J5767Q9818j08811p4766k9104
$$ 45288 46142 6849 25591 34698 4794 30826 -6943 8824 98642 -10169 -84935 -114039
7838a14039l9172j8714J72558R046o1907l3489j0819P8173L370M0861K3429m7587
$$ -114039 -153211 -171925 633 9679 -52228 -85717 -96536 -18363 -14993 25868 49297 1710
7826A710n0757k4810j2960J0878p128j21198j7154J26202K7855K6825J7581r9640
$$ 1710 -49047 -73857 -86817 -75939 -83067 -204265 -221419 -95217 -67362 -40537 -22956 -122596
7814a22596n6150L3351J31844J40831L2765j07620o7387O711n860M1335N1727
$$ -122596 -178746 -145395 -13551 127280 160045 52425 -14962 -8251 -14111 27224 78951
7803G8951M1933l8143m1555J87119Q2550l71740p9245Q4638J0937M8111J311l9810
$$ 78951 120884 82741 41186 228305 310855 -60885 -140130 -55492 -44555 3556 4867 -34943
7791c4943N7462p7400o4735l0902k2424J7330Q0737R226N6617m8420m5894K7447
$$ -34943 22519 -54881 -119616 -150518 -172942 -155612 -74875 -65649 -9032 -57452 -103346 -75899
7779g5899o6498J22049N3964j7091j06684R9119l4831j7314j6064M92m2872o5877
$$ -75899 -142397 -20348 33616 16525 -90159 8960 -25871 -43185 -59249 -58757 -101629 -167506
7767a67506J45920K0959j7231J949m7910L4466p3682l0978L8926N2830o439l1584
$$ -167506 -21586 -627 -17858 -15909 -63819 -29353 -103035 -134013 -95087 -42257 -48696 -80280
7755h0280l5584M6342J9204M9944l1623n8289l4127N4898J1972k4048j4249J3340
$$ -80280 -115864 -69522 -50318 -374 -31997 -90286 -124413 -69515 -57543 -81591 -95840 -82500
7743h2500J10212J3403p7439M7459n5469n5301j2074J31477O1108j01343j5077
$$ -82500 27712 41115 -36324 11135 -44334 -99635 -111709 19768 80876 -20467 -35544
7732c5544J6811r4787l4J2262O8019N4736n1170P6877l0539m6761N6491M9259
$$ -35544 -18733 -113520 -113554 -101292 -33273 21463 -29707 47170 16631 -30130 26361 75620
7720G5620j16727L8850o0209L4017o0724r2174L0499j3802L2690P9086n1054p6056
$$ 75620 -41107 -2257 -62466 -28449 -89173 -181347 -150848 -164650 -131960 -52874 -103928 -179984
7708a79984L7809K0685p521r6363j18588L6788j5895K14663J04682j00421O7812
$$ -179984 -142175 -121490 -129011 -225374 -343962 -307174 -323069 -108406 -3724 -104145 -36333
7697c6333L7868p4795m0134L5797k5163R037k9699J5013K0765o5456M0765O1832
$$ -36333 1535 -73260 -113394 -77597 -102760 -93723 -123422 -108409 -87644 -153100 -112335 -50503
7685e0503p9971R0183O9833r9504M3719R6204k7131j05709n9560j8233N1877O1641
$$ -50503 -130474 -40291 29542 -69962 -26243 69961 42830 -62879 -122439 -140672 -88795 -27154
7673b7154P1362p1564R3748L278L971J9158k3434l9448O683P0865j53050r3283
$$ -27154 44208 -27356 66392 69670 73641 92799 69365 29917 36600 107465 -45585 -138868
7661a38868L9090K9281N9099R1760k77p0854n1294o6235n303Q2254j7513k9236
$$ -138868 -99778 -70497 -11398 80362 80085 9231 -42063 -108298 -113601 -31347 -48860 -78096
7649g8096K244q702j4486N837J766J8917J2447K3213P6430m2388j6802J2366Q945
$$ -78096 -75852 -84554 -99040 -93203 -91437 -72520 -60073 -36860 39570 -2818 -19620 -7254 1691
7636A691j5563m1769J9697K3552r7735M899J0202P6254k2360j36100M4097R9747
$$ 1691 -13872 -55641 -35944 -12392 -110127 -105228 -95026 -18772 -41132 -177232 -133135 -33388
7624c3388R175m8271k4152m3685J02263Q7691o8102n5645p772Q1524m3264O3364
$$ -33388 -24213 -72484 -96636 -140321 -38058 49633 -18469 -74114 -81886 -362 -43626 19738
7612A9738L9313n7312n154j01569K6268O4666k2961j18214L1560O8589R3784j17682
$$ 19738 59051 1739 -3415 -104984 -78716 -14050 -37011 -155225 -123665 -55076 38708 -78974
7600g8974P4174J2766o0840N2745n9943r1451O5527M6641L3176P440q5438N2588
$$ -78974 -4800 7966 -52874 -129 -60072 -151523 -85996 -39355 -6179 1261 -84177 -31589
7588c1589k633p3281Q9598K78N2710J5776q9635n0380m9707N0151J22556J3310
$$ -31589 -34222 -107503 -17905 -17627 35083 50859 -38776 -89156 -138863 -88712 33844 47154
7576D7154j30897K5567J46250j5492n3637k0975O693R8702o3082j5046P5407n7172
$$ 47154 -83743 -58176 88074 72582 18945 -2030 4663 103365 40283 25237 100644 43472
7564D3472j37641o6672J02888R2782k1944M3185m3493r480Q0639p3755r8041o251
$$ 43472 -94169 -160841 -57953 34829 12885 56070 12577 3097 83736 9981 -88060 -94311
7552i4311n4663q5004P9495J15443L4831j05211K6096l5099Q0J83617p8177q1990
$$ -94311 -148974 -233978 -154483 -39040 -4209 -109420 -83324 -118423 -118343 65274 -12903 -94893
7540i4893N609k1190P838o797O7220k1004O5595n2631n0062m9719K8911R5687
$$ -94893 -89284 -110474 -102636 -109433 -42213 -63217 2378 -50253 -100315 -150034 -121123 -25436
7528b5436k7389O5088j182p6467J4210M331K4173N5678k6646o9299o7340L0972
$$ -25436 -52825 12263 11081 -65386 -51176 -46845 -22672 33006 6360 -62939 -130279 -99307
7516i9307J5530O5806M4993o5364j1978K0926K6889J0912m1407L9349q277l3523
$$ -99307 -83777 -17971 27022 -38342 -50320 -29394 -2505 8407 -33000 6349 -1928 -35451
7504c5451j68532K3561Q7714R1925n9283K5632O4191M9001M0106r0085l21r2424
$$ -35451 -203983 -180422 -92708 -783 -60066 -34434 29757 78758 118864 28779 28458 -63966
7492f3966l8586M3087l4083O7842j4013l3564J00605q9054J6583N03j41472Q6950
$$ -63966 -102552 -59465 -93548 -25706 -39719 -73283 27322 -61732 -45149 -44646 -186118 -99168
7480i9168M4486Q0239j34907Q218l7705N6013k126J8916m1903J4900J14337P8689
$$ -99168 -54682 25557 -109350 -101132 -138837 -82824 -84950 -66034 -107937 -93037 21300 99989
7468I9989q3444n9045j846j03782J20665J9863j2814j04550k3813N1735J7591
$$ 99989 16545 -42500 -44346 -148128 -27463 -7600 -20414 -124964 -148777 -97042 -79451
7457g9451o4930J03312M3063M7421l5501r3329J7745l9294k5098J26479J4933
$$ -79451 -144381 -41069 1994 49415 13914 -79415 -61670 -100964 -126062 417 15350
7446A5350o779l84j6528j1814p4866R156O9291n1693L6034o2652j3797l098L5803
$$ 15350 8571 8187 -8341 -20155 -95021 -85865 -16574 -68267 -32233 -94885 -108682 -111780 -75977
7433g5977K3581n9808n8750Q3196m0774N7631l0317n3590R248k5730J12802o8111
$$ -75977 -52396 -112204 -170954 -87758 -128532 -70901 -101218 -154808 -145560 -171290 -58488 -126599
7421a26599j3284R2504L1230n2652P9992K0736p2322k4837N900k0423O7454l2685
$$ -126599 -139883 -47379 -16149 -68801 11191 31927 -40395 -65232 -59332 -79755 -12301 -44986
7409d4986m8221Q2268m0914K836M6451L2528j53310j55215N5083L7919J10553
$$ -44986 -93207 -10939 -51853 -49017 -2566 29962 -123348 -278563 -223480 -185561 -75008
7398g5008N7066l032J99949q7556j41392M6586Q27n6350L801K3021m5178n3129
$$ -75008 -17942 -20974 178975 91419 -49973 -3387 -2560 -58910 -55109 -32088 -77266 -130395
7386a30395q238J17790J2366L0798o8674p0924j5114R7933l9475n6737Q1685j7011
$$ -130395 -138633 -20843 -8477 22321 -46353 -117277 -132391 -34458 -73933 -130670 -48985 -65996
7374f5996j24231J02332j8584j3936L152L0518O6019O028p4067j8142L8724p2162
$$ -65996 -190227 -87895 -106479 -120415 -117263 -86745 -20726 -14698 -88765 -106907 -68183 -140345
7362a40345R0062q3095P7192L6961J6455o137M1827l7597j00634q842O0246m6422
$$ -140345 -50283 -133378 -56186 -19225 -2770 -8907 32920 -4677 -105311 -114153 -53907 -100329
7350a00329J5964R7407J8876n2399m2860m8377O0013J16606o4817m8245j7260
$$ -100329 -84365 13042 31918 -20481 -63341 -111718 -51705 64901 84 -48161 -65421
7339f5421L5967m1535K4976L0323k1336j9010J16553Q0674j09682m9098l818q6935
$$ -65421 -29454 -70989 -46013 -15690 -37026 -56036 60517 141191 31509 -17589 -21407 -108342
7327a08342k9427n511L3763j5220m6946q692N9267m3698M794J30449N7675N6881
$$ -108342 -137769 -143280 -109517 -124737 -171683 -180375 -121108 -164806 -160012 -29563 28112 84993
7315H4993j35303l9485J1102k7134Q0960K4579O207o6738l0100P9230j4186l0174
$$ 84993 -50310 -89795 -78693 -105827 -24867 -288 5919 -60819 -90919 -11689 -25875 -56049
7303e6049K2764q9472J2838J30459n5670M9641k7139n1416p211M2994j1570o3703
$$ -56049 -33285 -122757 -109919 20540 -35130 14511 -12628 -64044 -71255 -28261 -39831 -103534
7291a03534O1575K0976L6532j2004N4283R278m1910p7029L3647k5358p9836M1727
$$ -103534 -41959 -20983 15549 3545 57828 67106 25196 -51833 -18186 -43544 -123380 -81653
7279h1653P3453P584N8335p7022n565L445J6441j313L5349o9158o7509K489L0125
$$ -81653 -8200 -616 57719 -19303 -24868 -21423 -4982 -6295 29054 -40104 -107613 -105124 -74999
7266g4999n9408N913m4270J3172k4540l466J206K9366J17751j7740O8976K255
$$ -74999 -134407 -128494 -172764 -159592 -184132 -187598 -186392 -157026 -39275 -57015 11961 14216
7254A4216k8161l9594J7367j31950m1167L5939O4671K7492P0346m6169m30R4821
$$ 14216 -13945 -53539 -36172 -168122 -209289 -173350 -108679 -81187 -10841 -57010 -57440 37381
7242C7381o412j03233M5286N8782q68k7025o1437J7656j5346M1989L000n8474
$$ 37381 30969 -72264 -26978 31804 30936 3911 -57526 -39870 -55216 -13227 -10227 -68701
7230f8701M6213n7207k7079l01P4582k2356O0522l3721n8359o910n1406K239K5371
$$ -68701 -22488 -79695 -106774 -107075 -32493 -54849 5673 -28048 -86407 -93317 -144723 -142484 -117113
7217a17113N9516O5216N4730p6059n8145M2656J4376K3556N041N5868r5816K1669
$$ -117113 -57597 7619 62349 -13710 -71855 -29199 -14823 8733 13774 69642 -26174 -4505
7205d505j7176o1156J9724Q7606O0535q6349P7492j08575k5708R9541m9801P7432
$$ -4505 -21681 -82837 -63113 24493 85028 -1321 76171 -32404 -58112 41429 -8372 69060
7193F9060l7611k3811L6228k9527j13136j34110Q7893L429M6540k4137L0317K2445
$$ 69060 31449 7638 43866 14339 -98797 -232907 -145014 -141585 -95045 -119182 -88865 -66420
7181f6420M7889L9674o4745q6460K0476J0130J7193l4088l7342K4027O8348K8034
$$ -66420 -18531 21143 -43602 -130062 -109586 -99456 -82263 -116351 -153693 -129666 -61318 -33284
7169c3284J9722M3624Q2823L398j38226j3681r687j3000M7908q6215l3709J57769
$$ -33284 -13562 30062 112885 116283 -21943 -35624 -45311 -58311 -10403 -96618 -130327 27442
7157B7442k2303k3540q1177m073L5848j4872j5908J2404r065K4665L8026N9052
$$ 27442 5139 -18401 -99578 -103651 -67803 -82675 -98583 -86179 -95244 -70579 -32553 26499
7145B6499j31113Q387J66932j21250J9240O3956m7421m1492J942N0950p3849k6776
$$ 26499 -104614 -96227 70705 -50545 -31305 32651 -14770 -56262 -54320 -3370 -77219 -103995
7133a03995Q1885P887L3392o9276P252m2522Q4522K7982l7608r5007K0863L8413
$$ -103995 -22110 -14223 19169 -50107 -42855 -85377 -855 27127 -10481 -105488 -84625 -46212
7121d6212M0464p016J004M085j4372J5917q7182O1637P320M8891P5362p8325q5247
$$ -46212 -5748 -12764 -11760 -7675 -22047 -6130 -93312 -31675 -24355 24536 99898 21573 -63674
7108f3674K0872o2077Q3406l0947K8655P6256q4619Q6799O5856j07875P6316m193
$$ -63674 -42802 -104879 -21473 -52420 -23765 52491 -32128 54671 120527 12652 88968 84775
7096H4775o7216J1928J6191R820l278N062j35286M3713J3283L5409L197N73p9462
$$ 84775 17559 29487 45678 55498 52220 57282 -78004 -34291 -21008 14401 17598 18171 -61291
7083f1291M9330L8404j07298O8943J03788k6766k5117r3097N8767J6443k8462
$$ -61291 -11961 26443 -80855 -11912 91876 65110 39993 -53104 5663 22106 -6356
7072f356J08627n4223o5138j34546l993M0910j5193N198L4283J3295k3484J9965
$$ -6356 102271 48048 -17090 -151636 -155629 -114719 -129912 -124714 -90431 -77136 -100620 -80655
7060h0655o6874O1202J9122l4390Q0066N0004k6522J1973N5758o4374J606k0016
$$ -80655 -147529 -86327 -67205 -101595 -21529 28475 1953 13926 69684 5310 6916 -13100
7048a3100P2821q1790j12549M6759K7140J01666j5275j20822O2144m4967o7989
$$ -13100 59721 -22069 -134618 -87859 -60719 40947 25672 -95150 -33006 -77973 -145962
7037a45962L0039l3218J5009O2829K779K2252K7349K463o7467o9550J30609P6024
$$ -145962 -115923 -149141 -134132 -71303 -68524 -46272 -18923 -16460 -83927 -153477 -22868 53156
7025E3156p3482K5095q1783k5374j6828m5770O6144J1117L3034K586L7741O7866
$$ 53156 -20326 4769 -77014 -102388 -119216 -164986 -98842 -87725 -54691 -52105 -14364 53502
7013E3502j20170j02163L8728N3472O7763o7589O292N4060O1282k9124M7737M75
$$ 53502 -66668 -168831 -130103 -76631 -8868 -76457 -70165 -16105 45177 16053 63790 64265
7001F4265m3826Q2110k8202j3501l3101m6500K0887N223M0794q0041m3621P1354
$$ 64265 20439 102549 74347 60846 27745 -18755 2132 7355 48149 -31892 -75513 -4159
6989d159K6672K9901o3798q4687K4397L8938J3772o6721M7045J21232j24618m8542
$$ -4159 22513 52414 -11384 -96071 -71674 -32736 -18964 -85685 -38640 82592 -42026 -90568
6977i0568o6986M8926J9011J19761O2883K0177j16069k8179r1847P486L7700K6645
$$ -90568 -157554 -108628 -89617 30144 93027 113204 -2865 -31044 -122891 -115405 -77705 -51060
6965e1060L1793q4795M6155o320K5530Q0464K6100L5264l9822k8442J3337j22725
$$ -51060 -19267 -104062 -57907 -64227 -38697 41767 67867 103131 63309 34867 48204 -74521
6953g4521N6633j6750K9539o855J1480M8299j47879J1060J9028J0647k7218N7257
$$ -74521 -17888 -34638 -5099 -11954 -474 47825 -100054 -88994 -69966 -59319 -86537 -29280
6941b9280J9440n7572L5202M3435q0712j7613P0960L5777P5668k6372m245l8919
$$ -29280 -9840 -67412 -32210 11225 -69487 -87100 -16140 19637 95305 68933 64688 25769
6929B5769j9487L23L40q7171j3373K7790L8694q1252J03701N9313j0958O3985
$$ 25769 6282 6605 6945 -80226 -93599 -65809 -27115 -108367 -4666 54647 43689 107674
6917A07674L4464L434o134q1685p0805m1633K1617L1465j8532l5644Q8135j2668
$$ 107674 142138 145572 139438 57753 -13052 -54685 -33068 -1603 -20135 -55779 32356 19688
6905A9688J9367k2885P645q4775k8973L955m7595N2039m7689n3490J5185J03117
$$ 19688 39055 16170 23815 -60960 -89933 -85978 -133573 -81534 -129223 -182713 -167528 -64411
6893f4411R2320q2396N7054k021k3881l4938q236K7615K0295N2365m3153l1233
$$ -64411 27909 -54487 2567 546 -23335 -58273 -66509 -38894 -18599 33766 -9387 -40620
6881d0620N9460N3773q3224L3813n0745j2205p4566L7462J22710o3374o1851n2202
$$ -40620 18840 72613 -10611 23202 -27543 -39748 -114314 -76852 45858 -17516 -79367 -131569
6869a31569L0272J19756K6924j8505q1367M7034j8866l985m4854j0629q6608L7609
$$ -131569 -101297 18459 45383 26878 -54489 -7455 -26321 -30306 -75160 -85789 -172397 -134788
6857a34788J19632N3476L9305N333p3280J155j5011l9762K7608L2095Q5429m9655
$$ -134788 -15156 38320 77625 82958 9678 10833 -4178 -43940 -16332 15763 101192 51537
6845E1537N7787j72571j38916J36137Q7776o2463K7633M1303k7512k4613k9497
$$ 51537 109324 -63247 -202163 -66026 21750 -40713 -13080 28223 711 -23902 -53399
6834e3399O2879L9144P6487j32178K1923L970o9333J06487j17706J5799Q3644
$$ -53399 9480 48624 125111 -7067 14856 18826 -50507 55980 -61726 -45927 37717
6823C7717J5396j03338r9693J09839R233o7572P9185O0704o0680Q5589M1621q3972
$$ 37717 53113 -50225 -149918 -40079 -30846 -98418 -19233 41471 -19209 66380 108001 24029
6811B4029m2930Q0046k3333n1962J19784j1683o3486j14778O2701M5211j11158
$$ 24029 -18901 61145 37812 -14150 105634 93951 30465 -84313 -21612 23599 -87559
6800h7559q02L3916J18215q7601j1064Q4390J8113L5744o4726j21869J44630J43168
$$ -87559 -88361 -54445 63770 -23831 -34895 49495 67608 103352 38626 -83243 61387 204555
6788B04555Q612m1546o2438o3205o2812N5880L2388o0731J5308j09763J25650
$$ 204555 213167 171621 109183 45978 -16834 39046 71434 10703 26011 -83752 41898
6777D1898J52071n2575k9754L5777n8909n8021M5329o5419K4352M8444r228P9795
$$ 41898 193969 141394 111640 147417 88508 30487 75816 10397 34749 83193 73965 153760
6765A53760m5149j1361l3675L878K2824M898J7835p447O6607p3826j04783J3522
$$ 153760 108611 97250 63575 67453 90277 95175 113010 105563 172170 98344 -6439 7083
6753G083O5183j14823N4812k392R862R5787q6519o8530M5028N647J1628M2083
$$ 7083 72266 -42557 12255 9863 19725 115512 28993 -39537 5491 11138 22766 64849
6741F4849j3167q1862N1030J4674j8393p9506l9696j3671M2475m4527O4727O0566
$$ 64849 51682 -30180 20850 35524 17131 -62375 -102071 -115742 -73267 -117794 -53067 7499
6729G499O069L8624j0716l5336J0839N4389q7865K545M1242K1111Q796L8849k2648
$$ 7499 13568 52192 41476 6140 16979 71368 -16497 -13952 27290 48401 57197 96046 73398
6716G3398n2983q2669j1278J26402O1415Q178O82m209M263k5670K3031q6314n0274
$$ 73398 20415 -62254 -73532 52870 114285 122463 123145 118936 123199 97529 120560 34246 -16028
6703a6028K9472J0857p3038P768P4962j993K1563M1568K9503M5484P4496r1115
$$ -16028 13444 24301 -48737 -40969 33993 32000 53563 95131 124634 170118 244614 153499
6691A53499n9847k8686j7341M5138N9579m0420J8397J8258l438K5965k469l7346
$$ 153499 93652 64966 47625 92763 152342 111922 130319 148577 145139 171104 168635 131289
6679A31289L1130n3599k676J0601R1106l2447k0943j4294k928K4452J01941J3134
$$ 131289 162419 108820 106144 116745 207851 175404 154461 140167 137239 161691 263632 276766
6667B76766j56522j8143M816j0143L9394J7602m6326J7056k0599K5846j8272j7566
$$ 276766 120244 102101 106917 96774 136168 153770 107444 124500 103901 129747 111475 93909
6655I3909L4348N9097q4565m5941J6552R3570j6382L9469q8197J9960K4599J3515
$$ 93909 128257 187354 102789 56848 73400 166970 150588 190057 101860 121820 146419 159934
6643A59934j4797l3110K5217p7207O1181J3350M4209M9871l7465l9106L1676n1871
$$ 159934 145137 112027 137244 60037 121218 134568 178777 228648 191183 152077 183753 131882
6631A31882J83356l9093o1350J21346n582m4553p3802J0499K6662o7485o02J25008
$$ 131882 315238 276145 214795 336141 330559 286006 212204 222703 249365 181880 181278 306286
6619C06286k1091J0920M074j267J7775k5062o019j9185j2651P9911K0109N5551
$$ 306286 285195 296115 300189 298922 316697 291635 285616 266431 253780 333691 353800 409351
6607D09351p1505J9840m3354K97j2666j7748l5438O9480P4772p6453Q2847M6405
$$ 409351 337846 357686 314332 314629 301963 284215 248777 318257 393029 316576 399423 445828
6595D45828K7309q3218q6609m185J18905j4076j5179N39K8088r2728R3345J05684
$$ 445828 473137 389919 303310 299125 418030 403954 388775 389314 417402 324674 418019 523703
6583E23703j03877Q6477R3464L2073Q6013r7700o744N6800K2381k6017j16707
$$ 523703 419826 506303 599767 631840 717853 620153 613409 670209 692590 666573 549866
6572E49866J07739o7140n2206J25672N0566n2506N2734R5899R203M133K8350Q4008
$$ 549866 657605 590465 538259 663931 714497 661991 714725 810624 819827 823960 852310 936318
$$ [...]
##END NTUPLES=NMR SPECTRUM
##END=
