##TITLE=1H_CG-1182-3x
 DMSO
 8 sc, 
 10.1.2024
##JCAMPDX= 6.0         $$ Bruker NMR JCAMP-DX V2.0
##DATA TYPE= NMR SPECTRUM
##DATA CLASS= NTUPLES
##ORIGIN= UXNMR, Bruker Analytische Messtechnik GmbH
##OWNER= root
$$ XWIN-NMR		Version 3.5
$$ Wed Jan 10 13:56:00 2024 Russian Standard Time (UT+4h)  she@DPX200
##.OBSERVE FREQUENCY= 200.1313
##.OBSERVE NUCLEUS= ^1H
##.ACQUISITION MODE= SIMULTANEOUS
##.ACQUISITION SCHEME= undefined
##.AVERAGES= 8
##.DIGITISER RES= 18
##SPECTROMETER/DATA SYSTEM= spect
##.PULSE SEQUENCE= zg30
##.SOLVENT NAME= CDCl3
##.SHIFT REFERENCE= (INTERNAL, CDCl3, 0, 15.5001)
##AUDIT TRAIL= $$ (NUMBER, WHEN, WHO, WHERE, WHAT)
$$ ##TITLE= Audit trail, XWIN-NMR		Version 3.5
$$ ##JCAMPDX= 5.01
$$ ##ORIGIN= Bruker BioSpin GmbH
$$ ##OWNER= she
$$ F:/spectra/data/she/nmr/H-F/1/pdata/1/auditp.txt
$$ ##AUDIT TRAIL=  $$ (NUMBER, WHEN, WHO, WHERE, WHAT)
(   1,<2024-01-10 13:54:05.07 +0400>,<she>,<DPX200>,
      <created by zg, POWCHK disabled, PULCHK disabled
       configuration hash MD5:
       00 E9 B6 7A A2 85 ED C7 34 08 36 98 17 FE 4E 26
       data hash MD5: 16K
       5C BE 36 5E 19 04 18 9B 09 5C 43 69 87 37 3D 88>)
(   2,<2024-01-10 13:54:10.21 +0400>,<she>,<DPX200>,
      <Start of raw data processing
       efp BC_mod = 2 LB = 0.24 FT_mod = 6 PKNL = 1 PHC0 = -24590.54 PHC1 = 10.85273 SI = 16K 
       data hash MD5: 16K
       D2 CA E5 08 40 84 F6 AD 12 67 DD EB 85 46 38 CE>)
(   3,<2024-01-10 13:54:29.76 +0400>,<she>,<DPX200>,
      <pk PHC0 = -3.968699 PHC1 = -0.8 
       data hash MD5: 16K
       DF 81 7D 39 69 B9 93 3E CE F2 CE A9 07 3F 6B 89>)
(   4,<2024-01-10 13:54:33.37 +0400>,<she>,<DPX200>,
      <abs ABSG = 5 
       data hash MD5: 16K
       49 36 20 68 C7 CF D3 C3 AE 97 08 65 72 0A E3 33>)
(   5,<2024-01-10 13:54:52.00 +0400>,<she>,<DPX200>,
      <abs ABSG = 5 
       data hash MD5: 16K
       D4 C7 F7 D3 72 C1 CA 2C A8 0A ED AD 01 D8 DA CC>)
$$ ##END=
$$ 
$$ hash MD5
$$ 32 A0 E5 B6 40 1B 4D DD 71 7F 59 6B F3 F2 E3 1D
##$RELAX= 
##$RELAX= 
##$RELAX= 
##$RELAX= 
##$RELAX= 
##$RELAX= 
$$ Bruker specific parameters
$$ --------------------------
##$DU= <F:/spectra>
##$EXPNO= 1
##$NAME= <H-F>
##$PROCNO= 1
##$TYPE= <nmr>
##$USER= <she>
##$AMP= (0..31)
100 100 100 100 100 100 100 100 100 100 100 100 100 100 100 100 100 100 
100 100 100 100 100 100 100 100 100 100 100 100 100 100 
##$AQSEQ= 0
##$AQ_mod= 1
##$AUNM= <au_zg>
##$AUTOPOS= <>
##$BF1= 200.13
##$BF2= 200.13
##$BF3= 200.13
##$BF4= 200.13
##$BF5= 200.13
##$BF6= 200.13
##$BF7= 200.13
##$BF8= 200.13
##$BYTORDA= 1
##$CFDGTYP= 0
##$CFRGTYP= 5
##$CHEMSTR= <none>
##$CNST= (0..31)
1 1 145 1 1 1 1 1 1 1 1 1 1 1 1 1 1 1 1 1 1 1 1 1 1 1 1 1 1 1 1 1 
##$CPDPRG= <>
##$CPDPRG1= <>
##$CPDPRG2= <>
##$CPDPRG3= <>
##$CPDPRG4= <mlev>
##$CPDPRG5= <mlev>
##$CPDPRG6= <mlev>
##$CPDPRG7= <mlev>
##$CPDPRG8= <mlev>
##$CPDPRGB= <>
##$CPDPRGT= <>
##$D= (0..31)
0 1.2 0 0 0 0 0 0 0 0.06 0 0.03 0 0 0 0 0.0002 0 0 0 0 0 0 0 0 0 0 0 0 
0 0 0 
##$DATE= 1704880444
##$DBL= (0..7)
$$ [...]
##$SUBNAM3= <"">
##$SUBNAM4= <"">
##$SUBNAM5= <"">
##$SUBNAM6= <"">
##$SUBNAM7= <"">
##$SUBNAM8= <"">
##$SUBNAM9= <"">
##$SW= 18.0517328524113
##$SWIBOX= (0..15)
0 0 2 0 0 0 0 0 0 0 0 0 0 0 0 0 
##$SW_h= 3612.71676300578
##$TD= 16384
##$TD0= 1
##$TE= 0
##$TE2= 300
##$TE3= 300
##$TEG= 300
##$TL= (0..7)
0 120 120 120 120 120 120 120 
##$TP= (0..7)
150 150 150 150 150 150 150 150 
##$TP07= 0
##$TPNAME0= <>
##$TPNAME1= <>
##$TPNAME2= <>
##$TPNAME3= <>
##$TPNAME4= <>
##$TPNAME5= <>
##$TPNAME6= <>
##$TPNAME7= <>
##$TPOAL= (0..7)
0.5 0.5 0.5 0.5 0.5 0.5 0.5 0.5 
##$TPOFFS= (0..7)
0 0 0 0 0 0 0 0 
##$TUNHIN= 0
##$TUNHOUT= 0
##$TUNXOUT= 0
##$USERA1= <user>
##$USERA2= <user>
##$USERA3= <user>
##$USERA4= <user>
##$USERA5= <user>
##$V9= 5
##$VALIST= <valist>
##$VCLIST= <CCCCCCCCCCCCCCC>
##$VD= 0
##$VDLIST= <DDDDDDDDDDDDDDD>
##$VPLIST= <PPPPPPPPPPPPPPP>
##$VTLIST= <TTTTTTTTTTTTTTT>
##$WBST= 1024
##$WBSW= 4
##$XGAIN= (0..3)
0 0 0 0 
##$XL= 0
##$YL= 0
##$YMAX_a= 87880
##$YMIN_a= -122107
##$ZGOPTNS= <>
##$ZL1= 120
##$ZL2= 120
##$ZL3= 120
##$ZL4= 120
##$ABSF1= 15.50009
##$ABSF2= -2.55176
##$ABSG= 5
##$ABSL= 3
##$ALPHA= 0
##$AQORDER= 0
##$ASSFAC= 0
##$ASSFACI= 0
##$ASSFACX= 0
##$ASSWID= 0
##$AUNMP= <proc_1d>
##$AZFE= 0.1
##$AZFW= 0.1
##$BCFW= 0
##$BC_mod= 2
##$BYTORDP= 0
##$COROFFS= 0
##$CY= -3
##$DATMOD= 1
##$DC= 0
##$DFILT= <>
##$DTYPP= 0
##$F1P= 0
##$F2P= 0
##$FCOR= 1
##$FTSIZE= 16384
##$FT_mod= 6
##$GAMMA= 0
##$GB= 0
##$INTBC= 1
##$INTSCL= 3.70164e-10
##$ISEN= 128
##$LB= 0.24
##$LEV0= 0
##$LPBIN= 0
##$MAXI= 10000
##$MC2= 0
##$MEAN= 0
##$ME_mod= 0
##$MI= 1.114404
##$NCOEF= 0
##$NC_proc= -6
##$NLEV= 6
##$NOISF1= 3.799351
##$NOISF2= 2.8
##$NSP= 0
##$NTH_PI= 0
##$NZP= 0
##$OFFSET= 15.50009
##$PC= 1
##$PHC0= -24594.51
##$PHC1= 10.05273
##$PH_mod= 1
##$PKNL= yes
##$PPARMOD= 0
##$PSCAL= 0
##$PSIGN= 0
##$REVERSE= no
##$SF= 200.13000432519
##$SI= 16384
##$SIGF1= 3
##$SIGF2= 2
##$SINO= 5.538805
##$SIOLD= 16384
##$SREGLST= <1H.CDCl3>
##$SSB= 0
##$STSI= 16384
##$STSR= 0
##$SW_p= 3612.71676300578
##$SYMM= 0
##$S_DEV= 0
##$TDeff= 16384
##$TDoff= 0
##$TI= <>
##$TILT= no
##$TM1= 0
##$TM2= 0
##$TOPLEV= 0
##$USERP1= <user>
##$USERP2= <user>
##$USERP3= <user>
##$USERP4= <user>
##$USERP5= <user>
##$WDW= 1
##$XDIM= 16384
##$YMAX_p= 307954012
##$YMIN_p= -887849
$$ End of Bruker specific parameters
$$ ---------------------------------
##NTUPLES= NMR SPECTRUM
##VAR_NAME=  FREQUENCY,     SPECTRUM/REAL,   SPECTRUM/IMAG
##SYMBOL=    X,             R,               I
##VAR_TYPE=  INDEPENDENT,   DEPENDENT,       DEPENDENT
##VAR_FORM=  AFFN,          ASDF,            ASDF
##VAR_DIM=   16384,         16384,           16384
##UNITS=     HZ,            ARBITRARY UNITS, ARBITRARY UNITS
##FACTOR=    0.220516191357247, 1,           1
##FIRST=     3102.03300777188, 0,            0
##LAST=      -510.683755233899, 0,           0
##MIN=       -510.683755233899, -887849,     0
##MAX=       3102.03300777188, 307954012,    0
$$ Real data points
##PAGE= N=1
##DATA TABLE= (X++(R..R)), XYDATA
$$ [...]
8682A24606k6001q9731j8611k0667m7197J35568R1417k819L1650p0461p6691K9020
8670F0083q1541J7524J7003p1557K5340L4221j03974J6274N331m2328k4057J9621
8658a28060N5907Q3440R3343j23266J0290M6617n0160P1815M0019m1110L6470
8647I5305J9945j2983K3656q0564o5753m2309M7657j3528K5210n2008o4891O6280
8635e3983k1554J02724r006j7558J017l4997p5614j1432J2470K78O6602k8467
8623f9520L0347m7163m711K4099J03857j7k5019O1019m897l8058q3655R2411Q7981
8610A26674j27470n18q3683Q3235J03307M3193j14257o9882J08833m6672R912
8599C2672j0961p0358l2560L8144P6603n7803L8802o2267l5505K3924P7269O0917
$$ plain form
8682 124606 98605 8874 -9737 -30404 -77601 57967 149384 146565 178215 107754 31063 60083
8670 60083 -21458 -3934 13069 -58488 -33148 1073 -102901 -86627 -81296 -123624 -147681 -128060
8658 -128060 -72153 11287 104630 -18636 -8346 38271 -11889 59926 99945 58835 95305
8647 95305 115250 102267 125923 45359 -20394 -62703 -15046 -28574 -3364 -55372 -120263 -53983
8635 -53983 -75537 27187 18181 623 1640 -33357 -108971 -120403 -107933 -107655 -41053 -69520
8623 -69520 -39173 -86336 -91047 -66948 36909 36892 11873 72892 67995 29937 -53718 38693 126674
8610 126674 -796 -1314 -84997 -1762 101545 144738 30481 -39401 69432 22760 32672
8599 32672 21711 -48647 -81207 -43063 33540 -24263 14539 -47728 -83233 -59309 17960 78877
8587G8877o3968l5710J202M909l7254K8888J0231j55260O4910M9596j5151L4090
8575c4640O6117L3748J8837p9966o817m6395N622L521K5091j18327n7364J51820
8563c8753j2995J04224l4248q162n2108L7188k5218J0173J8671m421O7163m8998
8551A2516r2193L6148j9722J22232K8364q9251J651O2864q0878M2612o3684L4089
8539e252M0668n0532m6239O9972N6813j642j4166l8046L7256o3531L090j4554
8527b6163n5489K2713J40435J0583j42542J0962P0900l3185j00421k3267N3564
8516g1910J96766j63821l226j10141N3732J24781P3100j1627j29371J2378o1371
8505i0710J29518k4834n6938j4431n622K2560K6664O0349J0654m4339K9409l8560
$$ plain form
8587 78877 14909 -20801 -19599 -14690 -51944 -23056 -12825 -168085 -103175 -53579 -68730 -34640
8575 -34640 31477 65225 84062 4096 -2721 -49116 -43494 -39973 -14882 -133209 -190573 -38753
8563 -38753 -51748 52476 18228 10066 -42042 -4854 -30072 -19899 -1228 -5649 61514 12516
8551 12516 -79677 -43529 -63251 58981 87345 -1906 -255 62609 -18269 24343 -39341 -5252
8539 -5252 35416 -15116 -61355 8617 65430 63788 49622 11576 48832 -14699 -11609 -26163
8527 -26163 -81652 -58939 81496 92079 -50463 -39501 31399 -1786 -102207 -125474 -71910
8516 -71910 124856 -38965 -42191 -152332 -98600 26181 99281 87654 -41717 -29339 -90710
8505 -90710 38808 13974 -42964 -57395 -63017 -40457 -13793 46556 57210 12871 42280 3720
8493C720Q754K126P1694p6818j04634n4338q9724J86552J04332k9742l0186q7811
8481i6075N5611O1737J6253O6495n1077q6821k7416p5902R8315r066L6996M052
8469f898J2526Q5372m3071r7287o1L5820M3508L2747L6018r3748j00339N0640
8457d4773M3191n1024M9205m4933k5883Q1904L870N0112o9772j8174k1124o2037
8445a09438P7853p714N119j2323m92M156K9520k0059Q6551l3470l7980N6148N962
8432D3833j6634l3688M6146K7959J695M0935q5643j36319P3638J76378r2490m2355
8420C455q357m4944J02466r9031j266P2103P1646j33981l1647p970m6793r591
8408a33910J03087m8190m176J7538L9139m2451M9823j8701q5428R0585r9942r1626
$$ plain form
8493 3720 12474 14600 86294 9476 -95158 -149496 -239220 -52668 51664 21922 -8264 -96075
8481 -96075 -40464 21273 37526 104021 52944 -33877 -61293 -137195 -38880 -47946 -10950 -6898
8469 -6898 5628 91000 47929 -49358 -49419 -13599 29909 62656 98674 4926 -95413 -44773
8457 -44773 -1582 -52606 -3401 -48334 -74217 7687 11557 61669 -8103 -26277 -47401 -109438
8445 -109438 -31585 -39299 -34180 -46503 -46995 -42839 -13319 -33378 53173 19703 -18277 37871 43833
8432 43833 27199 -6489 39657 67616 69311 110246 24603 -111716 -38078 138300 45810 3455
8420 3455 -4902 -49846 52620 -46411 -47677 24426 96072 -37909 -69556 -77526 -124319 -133910
8408 -133910 -30823 -79013 -83189 -65651 -26512 -68963 -19140 -37841 -123269 -32684 -132626 -224252
8396b24252N656J44625j03744P4390J81696j15437j37747L1826R3011M8142j3044
8385a4878m6471k4797n226j9787M9348k8582j3784q9490j5371Q3003J06668O0602
8373D1235p23n4939J7739O9617m4487J6596K549l1947q5570L4891J675L1589J2573
8360A0798q0488k2112L758n9895J19135n0632J1143N0857m5998L470p1686M8427
8348h3223O3071n9213R6390k494r7139R2593L5229p1031o6283p7798j8029O9826
8336a18101N5867j2510J4719m5608q9428P4565O6802J53900L2577J5587j26115
8325B2255L1350j8703k1375p9939j17503J13885Q2398J7375o3334J7232o1414
8314g7773M1646N3791n073p537J4685j33834N7831Q4562j7750o0571l9989r204
$$ plain form
8396 -224252 -218596 -73971 -177715 -103325 78371 -37066 -174813 -142987 -49976 -1834 -14878
8385 -14878 -61349 -86146 -91372 -111159 -61811 -90393 -104177 -193667 -209038 -126035 -19367 41235
8373 41235 40512 -14427 3312 72929 28442 45038 47587 15640 -69930 -35039 -33364 -1775 10798
8360 10798 -69690 -91802 -88044 -147939 -28804 -79436 -68293 -17436 -63434 -59964 -131650 -83223
8348 -83223 -20152 -79365 17025 14531 -82608 9985 45214 -25817 -92100 -169898 -187927 -118101
8336 -118101 -62234 -74744 -60025 -105633 -195061 -120496 -53694 100206 132783 148370 22255
8325 22255 53605 34902 13527 -66412 -183915 -70030 12368 29743 -33591 -16359 -77773
8314 -77773 -36127 17664 12591 5054 19739 -114095 -56264 28298 10548 -50023 -90012 -99216
8302i9216K5980O0116P7618j23832r2659P1105j3256J01386q4890m6481N8398
8291f5731Q5653l7365P7313m7859q9672r913L2965K1754j6337P0611L4357K0004
8279G5780n9219K0509J6904L3170p2328r909l5434j5133j4294o5254R6336k1106
8267d9978r4870M7133n356M3761J01406n1469o459j18599q67k9480M5904M6760
8255g2114K0702M908j7102Q6017J5990p8373M4691K6374o9136M3282j4643l5356
8243d4760n0224L9816N9116r5782Q0979p3028J5525n8865l0721J62919k0023Q6531
8231G1483l7974M032q9051n7502o2321Q8450R0464M8345J8625R475K0060p5121
8219B8965O4753O4454j62053o8720J4782J8813j34707N2381J06859m0484p3968
$$ plain form
8302 -99216 -73236 -13120 64498 -59334 -151993 -80888 -94144 7242 -77648 -124129 -65731
8291 -65731 19922 -17443 59870 12011 -77661 -87574 -54609 -32855 -49192 21419 55776 75780
8279 75780 16561 37070 53974 87144 14816 4907 -30527 -45660 -59954 -125208 -28872 -49978
8267 -49978 -144848 -97715 -103071 -59310 42096 -9373 -15832 -134431 -135298 -164778 -118874 -72114
8255 -72114 -51412 -46504 -63606 22411 38401 -39972 4719 31093 -38043 5239 -9404 -44760
8243 -44760 -94984 -55168 3948 -91834 -10855 -83883 -68358 -127223 -157944 4975 -15048 71483
8231 71483 33509 37541 -51510 -109012 -171333 -82883 7581 55926 74551 84026 104086 28965
8219 28965 93718 158172 -3881 -72601 -57819 -39006 -173713 -121332 -14473 -54957 -128925
8208a28925Q953J20409K4819M4365j4482j12871L0141M3373k192j04540K8389
8197f2561M371j32935o8503J43692j12145o59768M12319R7190J56787J71463j30212
8186a80302J45003P525J6294m7181o356Q5443L1002p7914l241q7034L1232r151
8174i4680K3187J9275L6733L2617q2332k0675l5492L5066J05112k3734N3746r1069
8162d2246m6778m637J5684k07l8710j9183K9172J5972K40j9956l1883J5526N5045
8149g1961J18734K5415j02982J5317n1238j8895M0395m3311q3230L9658Q5902
8138d6196p685m4863k7152N4855O8957K7245j58707n1371J0181L442J7459r21
8126a54756k596N9491P75n6593j273l5796K4474J45054M1201j7807j03937l1068
$$ plain form
8208 -128925 -119972 437 25256 69621 55139 -57732 -27591 15782 13590 -90950 -62561
8197 -62561 -58190 -191125 -259628 -115936 -228081 -887849 -475530 -378340 -221553 -50090 -180302
8186 -180302 -35299 -27774 -11480 -58661 -65017 20426 51428 -26486 -29727 -116761 -85529 -94680
8174 -94680 -71493 -52218 -15485 17132 -65200 -85875 -121367 -86301 18811 -4923 48823 -42246
8162 -42246 -89024 -93661 -77977 -78184 -116894 -136077 -106905 -90933 -90693 -110649 -142532 -127006 -71961
8149 -71961 46773 72188 -30794 -15477 -66715 -85610 -45215 -88526 -171756 -132098 -46196
8138 -46196 -53881 -98744 -125896 -71041 -2084 25161 -133546 -184917 -174736 -171294 -153835 -154756
8126 -154756 -157352 -97861 -97086 -153679 -154952 -190748 -166274 -21220 19981 2174 -101763 -132831
8114a32831J11593Q689k4062j6225J0425J3545M0610j5736r1095K8597n9761M2317
8102h3934j8520j3761l7075q123P9404N2135l1740Q280l9526k1757P8516k637
8090c8738k5051K4562m0471p3415k6076Q8299N0791o6871L7537n6150J25121L2289
8078C1827j67357O8721O1149n1691l7356J7708M7068j2348k0701N3818r7126j14360
8066b20648J2605P9404P1359k8792q1489R1778l0613m8190J36387p3572j31717
8055b23488J12266R8804m0381K8826l7299R5129M19m7312K778j5457r088K4340
8043a0463M479M1987l2719M624R6915q732L2595j65015r7498M1775P8178m5219
8031e9093j13699O570J22991m3657K7770L4422n7455M5285L4940p5167q1964N9653
$$ plain form
8114 -132831 -21238 -12549 -36611 -52836 -42411 -28866 11744 -3992 -95087 -66490 -126251 -83934
8102 -83934 -102454 -116215 -153290 -161413 -82009 -29874 -61614 -53334 -92860 -114617 -36101 -38738
8090 -38738 -63789 -39227 -79698 -153113 -179189 -90890 -40099 -106970 -69433 -125583 -462 31827
8078 31827 -135530 -66809 -5660 -57351 -94707 -76999 -29931 -42279 -62980 -9162 -106288 -220648
8066 -220648 -208043 -128639 -57280 -86072 -167561 -75783 -106396 -154586 -18199 -91771 -223488
8055 -223488 -111222 -12418 -52799 -23973 -61272 33857 34276 -13036 -10258 -25715 -34803 -10463
8043 -10463 -5984 36003 3284 7908 104823 96091 128686 -36329 -133827 -92052 -13874 -59093
8031 -59093 -172792 -166222 -43231 -86888 -59118 -24696 -82151 -36866 -1926 -77093 -159057 -99404
8019i9404j1450M5826j379K1654K4974k6829j29674J66837J29306J2032j94361
8008f2468l4570P4461q7932J15038J8929K928k1308j11842O4977M0699M9390J8529
7996F6831j28564L6891j0228m4226J41572l8984q1463l878L9248K4284J5211J9221
7984C5915p6806l5154J2683Q7907L057o0133O6866L2788r7284q9512l452K2946
7972a00179J30243m3156k5173j3288P4397L1603p8848Q7158R4372R755r8311o548
7960F2025o2404M8744P5737q2473k75249P6172K20231n9992o3463k557J16433
7949E3204O233L8190L5113q9934l4874J5390r7401J4514N4636p2458K3929R602
7937d3856q7684J70525O45j00220M0169l0283L38N6037O4494M0916r1230r7572
$$ plain form
8019 -99404 -110854 -65028 -66407 -44753 -19779 -46608 -176282 -9445 119861 131893 -62468
8008 -62468 -97038 -22577 -110509 4529 23458 26386 5078 -106764 -41787 -1088 48302 66831
7996 66831 -61733 -24842 -35070 -79296 62276 23292 -58171 -62049 -22801 1483 16694 35915
7984 35915 -40891 -76045 -63362 24545 27602 -32531 34335 67123 -30161 -119673 -123125 -100179
7972 -100179 30064 -13092 -38265 -51553 22844 54447 -24401 62757 157129 166884 68573 62025
7960 62025 -379 48365 124102 41629 -233620 -157448 62783 2791 -60672 -63229 53204
7949 53204 59437 97627 132740 42806 7932 23322 -74079 -59565 -4929 -77387 -53458 -43856
7937 -43856 -131540 38985 39630 -60590 -20421 -50704 -50366 5671 70165 111081 19851 -77721
7925g7721k6782k2566J12739r3376J11266R8999k6299p7756r270j013M496l3169
7913d0452L34Q007m8457q3024j05215M0234J24975M8194L5766J06324J2144n4635
7901D4195R7414r2751P1082N8847l6806r8595j00964j4829O698P0068M1778p961
7889C8176m6697l2015M6215J7600j12283k1524O2622P1862Q5332q7552n4949P242
7877b5971l5232O1846n7772K773k4550j0904p7214j9179J20944J45689Q1117j76462
7865a4915j6581J7091L9741N9075k6988K5842m4231k8273q6739l4853j6084r3355
7853b20270J44470N2862o0198J01285M0620J2302j2929k7188k8519J0256j26437
7842a13746L7134R4791L7210j80139K0860O2105P31J9762P615L7011j9250j30441
$$ plain form
7925 -77721 -104503 -127069 -14330 -107706 3560 102559 76260 -1496 -10766 -11779 -7283 -40452
7913 -40452 -40118 -32111 -80568 -163592 -268807 -228573 -103598 -55404 -19638 86686 98830 44195
7901 44195 141609 48858 119940 178787 141981 43386 -57578 -72407 -65709 4359 46137 38176
7889 38176 -8521 -40536 5679 23279 -89004 -110528 -47906 23956 109288 21736 -33213 -25971
7877 -25971 -61203 643 -57129 -54356 -78906 -89810 -167024 -186203 -65259 80430 161547 -14915
7865 -14915 -31496 -14405 25336 84411 57423 83265 39034 10761 -75978 -110831 -126915 -220270
7853 -220270 -75800 -22938 -83136 18149 58769 71071 58142 30954 2435 12691 -113746
7842 -113746 -76612 18179 55389 -124750 -103890 -41785 -41054 -21292 -13677 23334 4084 -126357
7830a26357M3079k8581N726O1849N9744O9817j17128o5744N3205L1199j0698K3268
7818f21k2555J00435J0501l0280r4407o0323m8670j43J51721N0758j32691J5345
7806f0930L8905R2146n115o8488Q8089K5780j34102n9969L0033K5647N7617P2779
7794A02392p0540M2839O9514j99545o5634N6331O0780R291l2679n906k578M4352
7782H617j722k446m3818q2786R6745l096j0752q6363q490J16521q2908l3882N6977
7769g7403J24164k1848l5466P5588J073l3878j04726J0276l3876K85m2884J22994
7757a5701m3954M834l3391k8956J25830k5373Q920p1577N8608j3472M3861o7604
7745e7975m4114N2462q552Q7185J2739K0997p299p153Q3054o8252p0973j5826
$$ plain form
7830 -126357 -83278 -111859 -106133 -44284 15460 85277 -31851 -97595 -44390 -13191 -23889 -621
7818 -621 -23176 77259 87760 57480 -36927 -97250 -145920 -146063 5658 56416 -76275 -60930
7806 -60930 -22025 70121 65006 -3482 84607 110387 -23715 -83684 -53651 -28004 29613 102392
7794 102392 31852 74691 144205 -55340 -120974 -64643 -3863 5428 -27251 -33157 -35735 8617
7782 8617 6895 4449 -39369 -122155 -25410 -28506 -39258 -125621 -134111 -17590 -100498 -134380 -77403
7769 -77403 46761 24913 -10553 65035 66108 32230 -72496 -62220 -96096 -95811 -138695 -15701
7757 -15701 -59655 -54821 -88212 -117168 8662 -16711 -7791 -79368 -20760 -34232 9629 -57975
7745 -57975 -102089 -49627 -58179 29006 41745 62742 55443 48290 131344 63092 -7881 -23707
7733b3707j8752L0072M0333K6326j7368K5184q5352o7607l7920M1981K166o978
7721i1622J54801M0709n5458l824R8447m433r4215p9442M62J32097m9938q0566
7709c2982J3938l4864M2382o3769n0425Q8210k0123M3235o184K6773K8029j42299
7697a08079O5809m1173M7287J8766p9105l0675k4243O1561O5747k6531J13876
7686F3240l8744j28830J7476j1667l0529M8872L7005k3757j49J3762M692O8066
7674A9437j3008l5402j1979M4762J8372M5443r6934o5697P7744L8576N8401k7734
7662E1981K4004k5625k0382o5294m2461J09941M9206k4798l4960O3939l4882L9695
7650I0364j04679n6403l8202N9780Q1874J1250Q1619k5953j19218n0815O200R5758
$$ plain form
7733 -23707 -42459 -12387 27946 54272 36904 62088 -23264 -90871 -128791 -86810 -84644 -91622
7721 -91622 63179 103888 48430 44606 143053 138620 44405 -35037 -34575 97522 47584 -32982
7709 -32982 -19044 -53908 -11526 -75295 -125720 -37510 -57633 -14398 -20582 6191 34220 -108079
7697 -108079 -42270 -83443 -36156 -17390 -96495 -127170 -151413 -89852 -24105 -50636 63240
7686 63240 24496 -104334 -86858 -98525 -129054 -80182 -43177 -66934 -67083 -53321 -48629 19437
7674 19437 6429 -28973 -40952 3810 22182 67625 -29309 -95006 -17262 21314 79715 51981
7662 51981 75985 50360 29978 -35316 -77777 32164 81370 56572 21612 85551 50669 90364
7650 90364 -14315 -70718 -108920 -49140 32734 43984 125603 99650 -19568 -70383 -64183 31575
7638C1575J52101j81548k0837N7250k35597P1881R1341J10570N48q1590O0070
7627E5764r2490j25685m47J12847k0499M6467j4036N4287q1812J3181O4776k5934
7615a3581n6986k100J00519J3540j33813k0586R8613R1035m2774q6555j6562o513
7603g5763n8105L0812r681K4114J8553K3671k4895R1598M9616L7422m5320r9230
7591c7208l7147J43565m7060j1617K7581m5760o0253Q0471q7698J8360J9365K7659
7579i742P2372m9332j2479r3380O8939J581M9160M2735n1971J8437k7371m7082
7567c8133K2685M3933l0909k2542l1498k2829M9089K7166O3944j0570n6452m8783
7555e4899l790L6268k2824l1998m5175K4900N4947j4538j2850n7709J26057q370
$$ plain form
7638 31575 183676 2128 -18709 38541 -197056 -125175 -33834 76736 77284 -4306 55764
7627 55764 -36726 -162411 -162858 -50011 -70510 -24043 -38079 16208 -65604 -52423 12353 -13581
7615 -13581 -70567 -72667 27852 41392 -92421 -113007 -14394 76641 33867 -52688 -69250 -75763
7603 -75763 -133868 -103056 -112737 -88623 -70070 -46399 -71294 20304 69920 107342 62022 -37208
7591 -37208 -74355 69210 22150 10533 38114 -7646 -67899 12572 -75126 -56766 -37401 -9742
7579 -9742 62630 13298 819 -92561 -23622 -22041 27119 69854 17883 36320 8949 -38133
7567 -38133 -15448 28485 -2424 -24966 -56464 -79293 -30204 -3038 60906 50336 -6116 -54899
7555 -54899 -58689 -22421 -45245 -77243 -122418 -97518 -42571 -57109 -69959 -127668 -1611 -9981
7543i981m0025l2022P3468k2320Q0765j9522j0527l0443l3132N6867J5574N6892
7531H5594r412j04448j28150m0325K29J11019N1521R1855J06828k34191o52O4400
7519e732O5602r2985J11901K1898p8227K1821l9396j6486J38356K15j22456O5489
7507G0000J4362p9253p3683r7583P1854M8321M275k0792K8095M9368Q9057n3980
7495E0041n1870P037o9368R50O5048J4869j2780L2602l5300M148O712J5553j16019
7482h8377M6686J3219p219j22322k6927J27836O1799J5388O2508j5989M0684j21078
7470a3792R9489o5549N7901O347j15972k2014q8377L6199O9239j4025L7298L2414
7458A9158m5823P901Q9883J7823n9596o7436j5207L482N2422J0208r6439J23163
$$ plain form
7543 -9981 -50006 -82028 -8560 -30880 49885 30363 19836 -10607 -43739 13128 28702 85594
7531 85594 76182 -28266 -156416 -196741 -196512 -85493 -33972 57883 164711 -69480 -70132 -5732
7519 -5732 59870 -33115 78786 100684 22457 44278 4882 -11604 126752 126967 4511 70000
7507 70000 84362 5109 -68574 -166157 -94303 -45982 -41707 -62499 -34404 14964 104021 50041
7495 50041 -1829 5208 -64160 -63210 1838 16707 3927 36529 1229 5377 12089 27642 -88377
7482 -88377 -41691 -28472 -35691 -158013 -184940 -57104 4695 20083 82591 66602 107286 -13792
7470 -13792 85697 20148 78049 84396 -31576 -53590 -141967 -105768 -36529 -50554 -13256 19158
7458 19158 -26665 -18764 71119 88942 29346 -38090 -53297 -49815 2607 12815 -83624 39539
7446C9539J6527j3868o3648j12092O0504J03391p1213J5878l8588n5143J08274
7435a0439M4042n7637o1076L1547M8206M4703o5979j18950M1542n2597L9934L8725
7423g7979m8541J60383l2151j1124J1344M0740L2248q3690m46k1342P342l7831
7411f1047J9685J4417N8967k9203l8002k3765K540K2277r156l00K1810q8891j4878
7398a25546N4155L6770j3014l0173k0920K6630J18983p3393l369M5484j6975o9658
7386g1026r72j2302P8727M7133q4731Q6359K6656r601m7834r873j5136J9958n1010
7373d3652m8919N0302r4966Q5439K9069L1067M3986R418o779k7172j1022J0271
7361B7042M2178R730r1815m2065O4993J00294j50983n6592P173N7501K0266k5430
$$ plain form
7446 39539 56066 42198 -21450 -133542 -73038 30353 -40860 -24982 -63570 -118713 -10439
7435 -10439 33603 -24034 -85110 -53563 -5357 39346 -26633 -145583 -104041 -156638 -116704 -77979
7423 -77979 -126520 33863 1712 -9412 1932 42672 74920 -8770 -9216 -30558 -23216 -61047
7411 -61047 -41362 -26945 32022 2819 -35183 -58948 -56408 -34131 -43287 -43587 -21777 -110668 -125546
7398 -125546 -71391 -34621 -47635 -77808 -98728 -72098 46885 -26508 -29877 15607 -1368 -71026
7386 -71026 -71998 -84300 -5573 41560 -43171 43188 69844 60243 12409 2536 -12600 7358 -43652
7373 -43652 -92571 -42269 -137235 -51796 -22727 8340 52326 61744 54965 27793 16771 27042
7361 27042 69220 78950 -12865 -54930 10063 110357 -40626 -97218 -90045 -32544 -12278 -37708
7349c7708q3888O7906J66944m9591n9176m012J2439P3475Q230n7647o417K8510
7337E9065J148n6795N6359j6207L0725l8893J09173r669o5284m7523R017k5911
7325E205l0791q8025J05972k9360L1285j03638o0030J02136o6985k49J70651N507
7313D1678n2538L45K0648k2177k1382j5103J8419k0315o9639J24364l7558L0667
7301b591L4467l1791K7699j3428K1941p0840k9950Q4083q2933L9121K5517k5127
7289b3832J3178R3754j40820L9469L3252K746j03243O5695R1698q4035K4382J8650
7277C0894m5067l7450N8785P9370n7053N4560J3653r7291M4903K9277n8798J2437
7265B8220Q176J9398k4263j7649q242m0453J514R7151p2903J352O2960p1688J3689
$$ plain form
7349 -37708 -121596 -53690 113254 63663 4487 475 12914 86389 94619 36972 30555 59065
7337 59065 60213 3418 59777 43570 74295 35402 144575 134906 69622 22099 31116 5205
7325 5205 -25586 -113611 -7639 -36999 -5714 -109352 -169382 -67246 -134231 -134480 36171 41678
7313 41678 -10860 -10515 10133 -12044 -33426 -48529 -30110 -50425 -120064 4300 -33258 -2591
7301 -2591 31876 85 27784 14356 36297 -34543 -64493 19590 -63343 -24222 1295 -23832
7289 -23832 -10654 83100 -57720 -18251 15001 17747 -85496 -19801 71897 -12138 12244 30894
7277 30894 -14173 -51623 7162 86532 29479 84039 97692 401 45304 74581 15783 28220
7265 28220 36396 55794 31531 13882 5640 -34813 -33299 63852 -9051 -7699 55261 -16427 -2738
7252b738M5448l6799m4665N5698r6887j8581N0678J1665K6609N9956q1439j8938
7240d9993J43477k2530j06266L9991n5863n6612N6159J0225K1011M247n311l3238
7228e4703L4706J1415k6773j1294J0236L6739r8495J58204l9282L1590m9770n6654
7216e4081K5291M0588L9972m7684M4041l5634j5882L2556N642j47565L189R4336
7204a5231O5550l049Q999P8939l0145J061O442m0461N8052l7536o0081P7607j95485
7191h5338L8829J12555j03189L4590K365J0899N9017J3506L6638m9137n2878m1081
7179b3224Q3793L5378J635q6084j13736P7718N0864l1551o788n5455j360J39862
7167G1052O0504j00351j04997M5498R3825k0842M1512J13215r7810m2832l8162
$$ plain form
7252 -2738 42710 5911 -38754 16944 -79943 -98524 -47846 -36181 -9572 50384 -31055 -49993
7240 -49993 93484 70954 -35312 4679 -51184 -107796 -51637 -41412 -20401 -16154 -21465 -54703
7228 -54703 -19997 -8582 -35355 -46649 -36413 326 -98169 60035 20753 52343 2573 -54081
7216 -54081 -28790 11798 51770 4086 48127 12493 -3389 29167 34809 -112756 -109567 -15231
7204 -15231 50319 47270 56269 135208 105063 106124 112566 72105 130157 92621 32540 110147 -85338
7191 -85338 -46509 66046 -37143 -2553 -188 10711 69728 83234 119872 70735 17857 -23224
7179 -23224 60569 95947 97582 11498 -102238 -24520 26344 -5207 -11995 -67450 -68810 71052
7167 71052 131556 31205 -73792 -28294 65531 44689 86201 199416 101606 58774 20612
7156B0612k5523m0148K8175O0354j6855n8707J8394k7853J7654r629M7737J859
7144A6070j8459l7446m325J01519l2410K4084N047N6388J9914J3849n4947n0426
7132C8858j58682P7079J06452r7098J2650j274J35878m1347j3702m3429l6599
7121b1214k9076O6801r828J05349q3102J8028j3001J9932J19548j65407n856J0507
7109A2681j805l8930J6319J70935m5311L4948r9891q7651M2265P8259l2475J5988
7097F5332O4429j5721m834r7578p5611k6595J97O0194Q5091q4381J22353o6562
7085B6314K8811j7641n030l2849J16813l260l9199p605l2136l9667o7457L2334
7073d0572J02034o552n7113O7434k7652q1097L80k9833Q7365J11262j70121n4666
$$ plain form
7156 20612 -4911 -45059 -16884 43470 26615 -32092 -13698 -41551 -23897 -33526 14211 16070
7144 16070 -2389 -39835 -44160 57359 24949 49033 54080 110468 130382 144231 89284 38858
7132 38858 -119824 -42745 63707 -33391 -20741 -22015 113863 72516 58814 15385 -21214
7121 -21214 -50290 16511 6683 112032 28930 46958 33957 53889 173437 8030 2174 12681
7109 12681 10876 -28054 -11735 159200 113889 148837 48946 -38705 3560 81819 49344 65332
7097 65332 129761 114040 109206 11628 -63983 -90578 -90381 -30187 54904 -29477 92876 26314
7085 26314 55125 37484 32454 -395 116418 113158 73959 66354 34218 -5449 -72906 -40572
7073 -40572 61462 54910 -2203 65231 37579 -43518 -43138 -72971 14394 125656 -44465 -99131
7061i9131k0914M6754J11566p4750M825k4210P1068M6414r7813K9665O2385J180
7049E7039n8247m9408J07379k9687J1726R3174n547n2868r1791N9894n1610L7644
7037B7698j5273j0260m2369O4090O6633l4389J2360m4420m4870J30770M2196p9064
7025G3102r4686J277j7938M5264j4219k2305K9874k0114O3390j4058j4210k609
7013A2768K1507M5053N3632L226n6878l3773k7197j6261k0812P2566J8420P811
7001H0062K0767p3356j5692l2325Q0418q7769m3576L8728O3524j9308L835j266
6989A4042K0606M3018L5816k455J7211L385L7600K6873q3812n2676J1310N876
6977G6794K3810p0117M6335P7030j0387K3064l4033K3935m1645k261J44036j05139
$$ plain form
7061 -99131 -120045 -73291 38275 -36475 -31650 -55860 15208 61622 -36191 -6526 55859 57039
7049 57039 -1208 -50616 56763 27076 38802 131976 126429 73561 -18230 41664 -9946 27698
7037 27698 12425 2165 -40204 23886 90519 56130 68490 24070 -20800 109970 152166 73102
7025 73102 -21584 -20307 -38245 7019 -7200 -29505 369 -19745 43645 29587 15377 12768
7013 12768 34275 79328 132960 136186 79308 45535 18338 2077 -18735 53831 72251 80062
7001 80062 100829 27473 11781 -20544 59874 -27895 -71471 -32743 30781 11473 15308 14042
6989 14042 34648 77666 113482 111027 128238 131623 169223 196096 112284 59608 70918 76794
6977 76794 100604 30487 76822 153852 143465 166529 132496 156431 114786 112525 256561 151422
6965A51422k6888K5417l0373p3583o8319l6292n9846L8915J09760m338p2347J508
6953d4964J925k2492K332R0050l3572N7357K6022L100J2529M128N4797J4885q7127
6940G8970l4502o8195J30247K5901n4238n4781P4333P4161n9261n4847L7721n8394
6928C7115n8566n3011R1458K6215n895l2277L5079k1441o1776O9112Q8342M118
6916A18473q6735p5794M441K830k5005R0093p7519j0523R7429N5554Q4691p699
6904A70236r3664o5223O078k9152K1774N5684p842J13642K5691L7305r5836K4322
6892A63015K6186j954m4166j45306n5033k3041Q1471O7146J3041M8796l0711o568
6880I2876n0367O2557j4660o209P0044M1369n4833Q969J6300j3150k2919j602
$$ plain form
6965 151422 124534 149951 119578 45995 -22324 -58616 -118462 -79547 30213 25875 -46472 -44964
6953 -44964 -43039 -65531 -63199 26851 -6721 50636 76658 79758 92287 96415 151212 166097 78970
6940 78970 44468 -23727 106520 132421 78183 23402 97735 171896 112635 57788 95509 37115
6928 37115 -21451 -74462 16996 43211 37316 5039 40118 18677 -43099 26013 114355 118473
6916 118473 31738 -44056 -39615 -36785 -61790 28303 -49216 -59739 37690 93244 177935 170236
6904 170236 76572 11349 17427 -11725 10049 65733 57891 171533 197224 234529 138693 163015
6892 163015 189201 187247 143081 -2225 -57258 -80299 1172 68318 81359 130155 99444 92876
6880 92876 42509 105066 90406 84197 154241 195610 140777 149746 166046 152896 129977 128375
6868A28375o835p0033M8694R4176k9038m5798j18289k3526N3158n4495J12178
6857H8567k8730O1015J7627p957K4237M3772N1103m0973l9812K7923o0107j54669
6845a8004P0371j4566N3227K9289L2173m9030l3846J1131L9800M4270l7085l7007
6833I0723R91O33K6263K522j8859M0409k8239J9910L0432j02080L7778M3353o5149
6820G8687R1514K9308m9419m7780N3473k6120Q9575o6455l940p2741J3477J06561
6808A96140J9029o1726k5664N222Q4295k2312R007r4768m2729P4464m5724J8207
6796A13441L9998N3789J06457p2120j84071l399l4809J69151R1816n1726j57511
6785G1016n7276M0520k3461J2853M0074K9534k0663j92812J7453J58643M2880
$$ plain form
6868 128375 121540 51507 100201 194377 165339 119541 1252 -22274 30884 -23611 88567
6857 88567 59837 120852 138479 130522 154759 198531 249634 208661 168849 196772 136665 -18004
6845 -18004 52367 37801 91028 120317 152490 103460 69614 80745 120545 164815 127730 90723
6833 90723 91714 92347 118610 121132 102273 142682 114443 134353 164785 62705 100483 143836 78687
6820 78687 170201 199509 150090 102310 155783 129663 219238 152783 148843 76102 89579 196140
6808 196140 215169 153443 127779 133001 217296 194984 203991 109223 66494 140958 95234 113441
6796 113441 153439 207228 313685 241565 57494 54095 19286 188437 280253 228527 71016
6785 71016 13740 54260 30799 43652 83726 113260 92597 -100215 -82762 75881 118761
6774A18761n034p706L3578K4024L434R3363r7807l4327M0215k5395j00917J09022
6762A51211K878n5564o0114l628N1519L6469P9822k3200m9980p607N4151L6270
6750B12227k0861m5822L287J6748L323r2529j0560j9718J77186L1473j7614J0499
6738B47639k8087L5302j07221k1785O488j5922M5557l7926J12339l8819O5899
6727B63464L702j0510J7599r2691P5237j04027R199J19005K2264q7357K5831k6270
6715B15446m5246K2870K1119J7980n9585l5466P1586j1650O6775j4743k3641J9535
6703B44980P784m3114N0048M5995j20420k3249O5941M1019J9218l9058o0041n5294
6691A33809k6874R1247J0864o7121n2034J42625j1243O8417J8047J6400m5390
$$ plain form
6774 118761 113727 106021 139599 163623 167057 260420 162613 128286 168501 143106 42189 151211
6762 151211 154089 98525 38411 34783 86302 122771 202593 179393 129413 121806 175957 212227
6750 212227 191366 145544 148831 165579 168902 76373 65813 46095 223281 254754 237140 247639
6738 247639 219552 254854 147633 125848 132336 116414 161971 124045 236384 197565 263464
6727 263464 267166 256656 274255 181564 256801 152774 161973 280978 303242 215885 241716 215446
6715 215446 170200 193070 214189 232169 172584 137118 208704 197054 263829 249086 225445 244980
6703 244980 252764 209650 259698 305693 185273 162024 227965 268984 288202 249144 189103 133809
6691 133809 106935 198182 209046 141925 89891 232516 221273 289690 307737 324137 278747
6680B78747J6701p479M8320k7820o2197P9493m0881J1746l6457K3408l4591J1949
6668B60939P8763J0891J3045L0582r0127K2544J18536R680l9788j34766j1241
6657B69058P4408J01520m0083n2229P439j0360J12972j11580J3501K6654n4463
6646C36837J9735l9939j3347j8433J20349k0882n471n8039O3921J08246K7620
6635E20597M2212m999K5611j5695n3304J0075Q7836p0087j3531n3820j06366M7476
6623D16005K08329q7518m9414o52M9906J0820k4001Q8178m9173J19273M9818n5169
6611F76402O7274k8681K2707L1168k4942O9748k0995j4562l5958O7100l6317P0006
6599H42950J78140p6580L3949j16761J7073N7405L9319K7449K5920l347m2522
$$ plain form
6680 278747 295448 287969 336289 308469 246272 325765 284884 296630 260173 283581 248990 260939
6668 260939 339702 350593 363638 394220 304093 326637 445173 454853 415065 280299 269058
6657 269058 343466 444986 404903 352674 360113 349753 462725 351145 364646 391300 336837
6646 336837 356572 316633 303286 284853 405202 384320 378849 320810 384731 492977 520597
6635 520597 562809 557810 583421 567726 514422 524497 612333 542246 528715 474895 368529 416005
6623 416005 624334 536816 487402 486750 536656 547476 523475 611653 562480 681753 731571 676402
6611 676402 743676 714995 737702 768870 743928 813676 792681 778119 742161 809261 772944 842950
6599 842950 1021090 944510 978459 861698 878771 936176 975495 1002944 1028864 1025517 982995
6588I82995J9824N1824O2582P9989j7539q5841M201J02433R5737P5529O3436o5087
6576A370083m250m5849J30810l6832L3820j0350J16519O7707J10344J9944j4897
6565A737049P2399L0082N7338j01732J37282K05296P6715M660O0115J46365K05656
6554B631225Q9935L3741R6312J21021K24402J64226J18933K07595K28481K11723
6544D127594K69911L57556L60792K63774L91295N26229L65701K99040J98926K41457
6534G402275q150k635k16204j20809k40791j79619J5503k23998L0691J48791P5571
6523F680625J86006J57235L17963L52019M18531M68087M81623P22499O50511P00933
6513A1136032P39497N03026L66086P1217k90380n02901o85786r07025r13348p56327
$$ plain form
6588 982995 1002819 1054643 1117225 1197214 1179675 1093834 1098035 1200468 1296205 1371734 1435170 1370083
6576 1370083 1365833 1319984 1450794 1413962 1447782 1437432 1553951 1621658 1732002 1751946 1737049
6565 1737049 1809448 1839530 1896868 1795136 1932418 2137714 2214429 2219089 2279204 2425569 2631225
6554 2631225 2721160 2754901 2851213 2972234 3196636 3360862 3479795 3687390 3915871 4127594
6544 4127594 4397505 4755061 5115853 5379627 5770922 6297151 6662852 6961892 7160818 7402275
6534 7402275 7394125 7391490 7175286 7054477 6813686 6634067 6649570 6425572 6456263 6605054 6680625
6523 6680625 6866631 7023866 7341829 7693848 8112379 8580466 9062089 9784588 10435099 11136032
6513 11136032 11875529 12378555 12744641 12815858 12525478 12022577 11336791 10429766 9516418 8760091
6503H760091o17221m72101m31131k99816k36479q9919j17260j02601o9394J8672
6493F342841J63331J33426K7281J99638J94182J99996J01456L584j80336l08692
6483F876707l70328n56193m23134k71296m48427m30901l85781l61493k05240j88237
6473C235677k03003j92156k16009j25806j47610j36628j44118j87977l0843j67822
6463A683705M6060o3486j03246l5576l1147l7517j30321m4516L8702n7285r7302
6452A168071Q6877K0213j32754M185r4062j01547N5338N0721l507k1766l9008
6441I92761j21360N3100l681r9375n9344M1476l7083n2250M004N6455Q2382o1239
6429G95846j26394m1788P2794K7542j23521J29484Q471l0608p3554n290k1978
$$ plain form
6503 8760091 8142870 7670769 7239638 6939822 6703343 6613424 6496164 6393563 6324169 6342841
6493 6342841 6506172 6639598 6666879 6866517 7060699 7260695 7362151 7365735 7185399 6876707
6483 6876707 6506379 5950186 5527052 5255756 4807329 4376428 3990647 3629154 3423914 3235677
6473 3235677 3032674 2840518 2624509 2498703 2351093 2214465 2070347 1882370 1851527 1683705
6463 1683705 1729765 1666279 1563033 1527457 1496310 1458793 1328472 1283956 1322658 1265373 1168071
6452 1168071 1254948 1275161 1142407 1146592 1052530 950983 1006321 1057042 1053535 1031769 992761
6441 992761 871401 924501 920820 821445 762101 803577 766494 714244 718248 774703 857085 795846
6429 795846 669452 627664 700458 728000 604479 733963 742434 711826 638272 632982 611004
6418F11004O9930p3146o6676M8029n7343j8230K0946Q8493o1696q5485M5447P9830
6406F01103o7958p4891j033l2477p0540j9654R9570L1684j3718k2551K8954R4345
6394E52834j3541j59573M3162j6986k1352R7659j60933K2204N6977J03128p2277
6383D31302K0996n7263J7166k7594J5793L7938P2129j14841k000l4250p5589O8354
6371C52141K8153q7038o005N5335J148l6854K9667O4518j2807J6472j4336o9591
6359C20803r5072P9346k0676j8789M2220J6784q2235N6433p0196K9510O8322J5164
6347C41614l3276K7629p7321k0567J04976k6583p817L8717k8876q3894J30904
6336C65506n001q2757K3927m2269L8742o7574L9111R5014m8935O9591O0704j11016
$$ plain form
6418 611004 680934 607788 541112 589141 531798 513568 534514 623007 561311 475826 521273 601103
6406 601103 533145 458254 457221 424744 354204 334550 434120 465804 452086 429535 458489 552834
6394 552834 539293 379720 422882 405896 384544 482203 321270 343474 400451 503579 431302
6383 431302 452298 395035 412201 384607 400400 438338 510467 395626 393626 359376 283787 352141
6371 352141 380294 293256 287251 342586 343734 306880 336547 401065 388258 404730 390394 320803
6359 320803 225731 305077 284401 265612 307832 324616 242381 298814 228618 258128 326450 341614
6347 341614 308338 335967 258646 238079 343055 316472 308655 347372 318496 234602 365506
6336 365506 360505 277748 301675 259406 298148 230574 269685 364699 315764 385355 446059 335043
6324C35043J0584J607m9814M2776q1743O8256J9159P1624l4232J0543J0340P8534
6312D82677N7202r8584q6194J3206O180j3120l3656p9310K1448m8452j5654L1121
6300B36864J9195K4103L2417j7178P8553n4931m4303J03660L2650j45542q5772
6289A79716m938Q0871N0344M4771n5558J0273p7914O666l7138l1008j8363n1673
6277I6049R8456K1076o3155m9404N3027P9701Q8527L127p6139k367l5244O045
6265B19699j3174K0106k5606M913j5940k4999n5308M3290M7945K5474L4903j42791
6253A18512j8936J0231Q8170m9183P1588m7608j28154K2014L8941O962p596J4972
6241A19913J36171J5715j4032j25749l3866J09034R947J411p3463J2278O2177
$$ plain form
6324 335043 345627 347234 297420 340196 258453 326709 345868 417492 383260 393803 404143 482677
6312 482677 539879 441295 355101 368307 374487 361367 327711 248401 269849 221397 205743 236864
6300 236864 256059 280162 312579 295401 373954 319023 274720 378380 411030 265488 179716
6289 179716 174778 255649 305993 350764 295206 305479 227565 234231 197093 166085 147722 96049
6277 96049 194505 215581 152426 103022 156049 235750 324277 327404 251265 248898 213654 219699
6265 219699 206525 226631 201025 205938 189998 164999 109691 152981 200926 226400 261303 118512
6253 118512 99576 109807 197977 148794 220382 172774 44620 66634 105575 112537 104941 119913
6241 119913 256084 271799 257767 132018 98152 207186 217133 218544 145081 157359 219536
6230B19536l9715P9673J2708m2K4460K6811j14970P7751k9087l7193P209l9621
6218A87520J198O0775q7420j0119J6057j22468O809R3124J12433R041o0560p93
6206B05597j114j707K1838J6390p5245N4875M5786m027n4721j50242J28376r7582
6194H8224j9878M9209N1662k9861J1271J35989l7367j09904L9225p7534Q7154
6183A88190K1167M5667l3070P7867m2018M8518k7708p0233Q9223P7461j08399
6172B66665m5708J209L3552J3614k9492J58424j0012j30749r6234R245L5659N1819
6160B57992m1659J2614R6160m2280l4240o3185L5919R5570n2208m787P8379J0711
6148C48986j01584m0648N4565l6770l1933P1977j6233j7247K0737R2435R73j7531
$$ plain form
6230 219536 179821 259494 272202 272160 296620 323431 208461 286212 257125 219932 227141 187520
6218 187520 188718 249493 162073 151954 168011 45543 52352 145476 257909 266950 206390 205597
6206 205597 204483 202776 224614 241004 165759 220634 266420 262393 207672 57430 185806 88224
6194 88224 68346 117555 169217 139356 150627 286616 249249 139345 178570 101036 188190
6183 188190 209357 255024 221954 299821 257803 306321 278613 208380 297603 375064 266665
6172 266665 220957 222166 255718 269332 239840 398264 388252 257503 161269 170514 206173 257992
6160 257992 216333 228947 325107 282827 248587 185402 221321 316891 264683 259896 338275 348986
6148 348986 247402 206754 261319 224549 192616 264593 248360 231113 251850 344285 345258 327727
6136C27727l6559N2489j34056J86r648n0470J49649r541j739L5410p0395J0230
6124B63283j02621M8535n6560O1813J08824j68367L3046J5305j00540M9889O917
6113A59524K7471J00440M5088m5990q4898J1548M2029L15l1791J5587j46579L9041
6101A31785M9438N7857k4045j29225Q7633O5267n2434J3970q2817k9442M3960
6090A31947M9793J09264p5530p9031M1960N3149M2645r272j7369J6800j16808
6079A47548L047M6973m9536j591J5039O2798L6340r2153M0445q6096Q1633Q300
6067B12747K2365J4096j4883K6599P735j4533p085n7783M4936K4859o0550M6196
6055B44699m8919o3638P3660Q9588k0194k9885j2168J9557M6230M6521j6978m7161
$$ plain form
6136 327727 291168 343657 209601 209787 200139 149669 299318 289777 288038 323448 253053 263283
6124 263283 160662 209197 152637 214450 323274 154907 187953 203258 102718 152607 159524
6113 159524 186995 287435 332523 286533 201635 213183 255212 255527 223736 239323 92744 131785
6101 131785 181223 239080 215035 85810 173443 238710 186276 200246 117429 87987 131947
6090 131947 181740 291004 215474 136443 178403 231552 274197 264925 247556 264356 147548
6079 147548 150595 197568 148032 146441 161480 224278 260618 168465 208910 122814 204447 212747
6067 212747 235112 249208 234325 260924 268659 254126 247041 189258 234194 259053 198503 244699
6055 244699 195780 132142 205802 295390 275196 245311 233143 252700 298930 345451 328473 281312
6043B81312L480r0014J3996J90609o1835Q3812j48606k5307m4579J6260L2634
6032B51762k3924R8712n7892k0694R9991L1503m0678M2205n0552k7847M2443l3298
6020C11731o0604K1313P3436o2611L9442K4634o4924K3249M7764j1886o346j8560
6008C16638l0822o3777J00081P8332p0322K5782k5926k3511n9000l6109M0285
5997B51651N3878O0406N0583r8395q449K0295J9878M0614r3015J9912R4237K6456
5985D38051j10134J1698L0346N7046M3801K7813N7274k1029M0468o4697n807J7667
5973E22497p2846k8504N9828P4881o3528P8286q2066Q938J6142n680o953R048
5961E10043j8358j9106m9449K1963R8837m4111k0715J16897M4331m3478j0144
$$ plain form
6043 281312 284792 194778 208774 399383 337548 421360 272754 247447 202868 219128 251762
6032 251762 227838 326550 268658 247964 347955 379458 338780 380985 330433 302586 345029 311731
6020 311731 251127 272440 345876 283265 322707 347341 282417 305666 353430 341544 335198 316638
6008 316638 285816 222039 322120 400452 330130 355912 329986 306475 247475 211366 251651
5997 251651 305529 365935 416518 318123 309674 329969 349847 390461 297446 317358 411595 438051
5985 438051 327917 339615 369961 427007 470808 498621 555895 534866 575334 510637 504830 522497
5973 522497 449651 421147 480975 555856 492328 570614 488548 497486 513628 507948 500995 510043
5961 510043 491685 472579 423130 445093 543930 499819 479104 596001 640332 596854 586710
5950E86710n3607J52832n5365o7391O9061m165m6739Q4219P7398K1672N198p946
5938G61877r1373O1598O5361l4234j1777L3430k0569R0198L6675m3512j7296Q4376
5926I14754K764j09756N9150k8736O230J44152M3287l4215j02887P4253m9799
5915I19197o4878P8377J60375m9333o8952M4060M5470M3701q681M30k2570l8833
5903A038363M8262k2181o9671J33721J3860j6939k940N6646M70Q1947K4103j6654
5891A268987Q3471O5881O8659Q7953k2936K6466m6302N7271L2676o118O7773n2838
5879A630943Q0811j2127J04275P3990o4016J15853L8918k7999O8493L6778Q5714
5868B131633J21299K7833J70703O76K6555R5933j6407J12775J70007J35206J81100
$$ plain form
5950 586710 533103 685935 630570 563179 632240 628075 581336 665555 742953 764625 769823 761877
5938 761877 670504 732102 797463 763229 751452 784882 764313 854511 891186 847674 830378 914754
5926 914754 917518 807762 866912 838176 844406 988558 1031845 997630 894743 968996 919197
5915 919197 854319 932696 1093071 1043738 974786 1018846 1064316 1108017 1099336 1099766 1077196 1038363
5903 1038363 1086625 1064444 994773 1128494 1142354 1125415 1122475 1179121 1179591 1261538 1285641 1268987
5891 1268987 1352458 1418339 1486998 1574951 1552015 1578481 1532179 1589450 1622126 1616008 1683781 1630943
5879 1630943 1711754 1699627 1803902 1877892 1813876 1929729 1968647 1940648 2009141 2045919 2131633
5868 2131633 2252932 2280765 2451468 2452144 2478699 2574632 2558225 2671000 2841007 2976213 3157313
5857C157313Q6696J10986J71309K04639K04151R1772K78909K71259K60617L52566
5847E190217L30344L47478M94371M36778M57311M24087L94007K89118J5166N97
5837H379474j66286j70535k25938k60785k08452k01098p4630J4479L0045J14975
5827G231249J40850J89193L75084L51241M50578N30864O44612O90755Q40410P50758
5817A2195594P48439N77958K01248j66550o47557q03666r51065r71299p80371
5808I402731o24461o27497m76150m67084k35110k69672k04576j36225q0922K8933
5798F309967N9482P5148N4306J07375J38586K60531J33336O3620j91839n1789
5788F958723k55223m24999m71765n02138l43389l87532m16572l11377k37297l05789
$$ plain form
5857 3157313 3244009 3354995 3526304 3730943 3935094 4026866 4305775 4577034 4837651 5190217
5847 5190217 5520561 5868039 6362410 6799188 7256499 7680586 8074593 8363711 8378877 8379474
5837 8379474 8213188 8042653 7816715 7555930 7347478 7146380 7071750 7086229 7116274 7231249
5827 7231249 7372099 7561292 7936376 8287617 8738195 9269059 9913671 10604426 11444836 12195594
5817 12195594 12944033 13521991 13723239 13556689 12909132 12105466 11154401 10183102 9402731
5808 9402731 8778270 8150773 7674623 7207539 6972429 6702757 6498181 6361956 6281034 6309967
5798 6309967 6369449 6444597 6498903 6606278 6744864 7005395 7138731 7202351 7010512 6958723
5788 6958723 6703500 6278501 5806736 5304598 4961209 4573677 4157105 3845728 3608431 3302642
5778C302642k00867j75104p3483m2907j845j83569k57433j42912M84O7025n4516
5767B237515j55374k9876j41999j23161O1271j6894r9843l6078k9966P5068q9976
5756A650687n3428l2114n9484N7879J1401j7496j41238r7229O2470l0594L386
5745A354240J3722k6787l5356K0797j02714r931R5827m8316j3167n551R7432q172
5733A332024J9923m387L7705L551M1726l6241p9134N3998J0129n4529J6918m3785
5721A297898J1645k9036K2560p583K0418Q7023L026k1632m0670K0232J5681J04611
5709A484173J4465k7786R0970N289Q187J14801k6348o3972K812M7002m4777j7629
5697A587187J00114R682l6319O7319N7202n2383K3487l2663J52617L3506l1793
$$ plain form
5778 3302642 3101775 2926671 2853188 2810281 2808436 2624867 2367434 2224522 2225006 2292031 2237515
5767 2237515 2082141 2052265 1910266 1787105 1848376 1831482 1731639 1695561 1665595 1740663 1650687
5756 1650687 1597259 1565145 1505661 1563540 1574941 1557445 1416207 1318978 1381448 1350854 1354240
5745 1354240 1367962 1341175 1305819 1326616 1223902 1213971 1309798 1261482 1248315 1242764 1340196 1332024
5733 1332024 1351947 1347560 1385265 1388816 1430542 1394301 1315167 1369165 1379294 1324765 1341683 1297898
5721 1297898 1309543 1280507 1303067 1295484 1315902 1402925 1405951 1384319 1343649 1363881 1379562 1484173
5709 1484173 1498638 1470852 1561822 1567111 1575298 1690099 1663751 1599779 1602591 1649593 1604816 1587187
5697 1587187 1687301 1696983 1660664 1727983 1785185 1732802 1756289 1723626 1876243 1909749 1877956
5686A877956P4085J5962j7778J0851O2343J20385Q3276k0168L9713J1615m1634
5675B216606O667k9119j3099O9740N2192K3238M9808k3740J08987J26446K770
5664B590496L7753N587J43137N9606r992J07713J74887P8515j080j3210J34126
5653C307538J52040J40534Q5500J49193J67096J42815J87054J80154K57299K62773
5643E031996J49156L12632L51299L67064L51144K65234L98329L48467L45243J08547
5633H029111M0201L6094n3841p638j01511j39100q5131o4600k4713J06221J94158
5622G929251J73131J62823K66135L30078M58559M23220M72134N37843N83396N11926
5612A1848496M97760M06292K29861J8740j52826k95059m69017n84048o58565n70572
$$ plain form
5686 1877956 1952041 1968003 1950225 1961076 2023419 2143804 2227080 2206912 2246625 2258240 2216606
5675 2216606 2223273 2194154 2181055 2250795 2302987 2326225 2376033 2352293 2461280 2587726 2590496
5664 2590496 2628249 2633836 2776973 2836579 2826587 2934300 3109187 3187702 3186622 3173412 3307538
5653 3307538 3459578 3600112 3685612 3834805 4001901 4144716 4331770 4511924 4769223 5031996
5643 5031996 5181152 5493784 5845083 6212147 6563291 6828525 7226854 7575321 7920564 8029111
5633 8029111 8069312 8105406 8051565 8043927 7942416 7803316 7718185 7653585 7628872 7735093 7929251
5622 7929251 8102382 8265205 8531340 8861418 9319977 9743197 10215331 10753174 11336570 11848496
5612 11848496 12346256 12752548 12982409 13001149 12848323 12553264 12084247 11500199 10841634 10271062
5602A0271062n41084n29778m47915k78095l01913j93858j36180q3067j68799q036
5592G582337k1531P5141J65733J92467J41582J43778J97j6908j61237k57906k22128
5581G621525m00899m35996m80989k38498m83018l66458k76081l88936j92128j79900
5571D178622k77011k15735j29543j52376q7404j28173r2400K3511j72627p6219
5561B870645j55743O0497q2515o8905J15549j21852J4883J5481j3016N11q9554
5550B545981k4812J8244j61539L208R9957K2027n114m3558p6590p5624k1121k5273
5538B255786l6862L4649n4189L3314O2118J4954Q3033M654o8779P653J3044l3891
5526B315484O4994K5211L0163L7370M2876j15078K5005P9818K9832K3129K7696
$$ plain form
5602 10271062 9729978 9200200 8752285 8474190 8172277 7978419 7842239 7759172 7590373 7582337
5592 7582337 7560806 7635947 7801680 7994147 8135729 8279507 8279704 8262796 8101559 7843653 7621525
5581 7621525 7220626 6784630 6303641 6065143 5582125 5215667 4939586 4550650 4358522 4178622
5571 4178622 3901611 3685876 3556333 3403957 3316553 3188380 3095980 3119491 2946864 2870645
5561 2870645 2714902 2775399 2692884 2623979 2739528 2617676 2632559 2648040 2635024 2635535 2545981
5550 2545981 2521169 2539413 2377874 2381082 2481039 2503066 2497952 2454394 2377804 2302180 2281059 2255786
5538 2255786 2218924 2253573 2199384 2232698 2294816 2309770 2392803 2397457 2328678 2336331 2349375 2315484
5526 2315484 2380478 2405689 2435852 2473222 2516098 2401020 2426025 2505843 2535675 2558804 2586500
5515B586500k1349l6962j6161M9006M1616j02520J01524J5221o5448l5793O6864
5504B582498J01440L4030P335K4236J5878P2656o2705p2514J25721J17666K5797
5493B972038O0450p5716R4737Q2839J196J34452J8722Q1659o0901R2736P9359
5482C481571J32265N9870m6418J12480O7610L0588j1298Q4832Q4437J78079R6904
5471D270920M8304J37960J05446O9135J56895J42840K24406J94144N3005J54953
5461E558008J6130K9375J78635M5209J43040J68179J11569J07313L7068k5155
5451F369371J31071K18120O0185J15372K5497O4439J60657J40675J31152P0339
5441G486878M1302J32969K00373K3838O5123K08632N2033N0288R1347J90331R7580
$$ plain form
5515 2586500 2565151 2528189 2512028 2561034 2602650 2500130 2601654 2616875 2551427 2515634 2582498
5504 2582498 2683938 2717968 2725303 2749539 2765417 2838073 2775368 2702854 2828575 2946241 2972038
5493 2972038 3032488 2956772 3051509 3134348 3135544 3269996 3288718 3370377 3309476 3402212 3481571
5482 3481571 3613836 3673706 3627288 3739768 3807378 3837966 3826668 3911500 3995937 4174016 4270920
5471 4270920 4319224 4457184 4562630 4631765 4788660 4931500 5155906 5350050 5403055 5558008
5461 5558008 5574138 5603513 5782148 5827357 5970397 6138576 6250145 6357458 6394526 6369371
5451 6369371 6500442 6718562 6778747 6894119 6919616 6984055 7144712 7285387 7416539 7486878
5441 7486878 7528180 7661149 7861522 7885360 7950483 8159115 8211148 8261436 8352783 8543114 8640694
5430H640694K13636J43332k5971K05685J60075J99455K20410K63135K85072J93490
5420A0499013K89659L31482K53515L29570M14716L87698M07797L46581M16925
5411A3676956O00564P34623O31568N91137P26183N87150M27402N98489O57066
5402A9231138M86780O31394O33038N78099O30250P66584P99914P40267P82156
5393B5279620Q62220O61457Q23860P34121Q57917R49126J046614J229997J357783
5384C3802715J371870J577595J947773K093327K447139K759939L447683M042143
5376E3490184M785300N439322O423531P796690R179776J1455827J4389764J7958246
5368A30918640K2141354K6927333L2699141L7843682L6154159K1269703o507311
$$ plain form
5430 8640694 8854330 8997662 8971691 9177376 9337451 9536906 9757316 10020451 10305523 10499013
5420 10499013 10788672 11120154 11373669 11703239 12117955 12505653 12913450 13260031 13676956
5411 13676956 14277520 15012143 15643711 16234848 16961031 17548181 17975583 18574072 19231138
5402 19231138 19717918 20349312 20982350 21560449 22190699 22957283 23757197 24497464 25279620
5393 25279620 26141840 26803297 27627157 28361278 29219195 30168321 31214935 32444932 33802715
5384 33802715 35174585 36752180 38699953 40793280 43240419 46000358 49448041 53490184
5376 53490184 58275484 63714806 70138337 77935027 87114803 98570630 112960394 130918640
5368 130918640 153059994 179987327 212686468 250530150 286684309 307954012 301446701
5361C01446701l4366927m8971597m7905489l6739618k5716781j8030354j3180960
5354G6534975j0181378p946796o304475n236043m390306l545058k991210k502442
5346C3437267k013740j968261j615148j618858j504619j402276j396343j321803
5338B0596219j127483r19518p53043p72981q38202p94535q09744o38611n88319
5329A3353783n13014m42572l45312m89963n08486o09347m53840k69620l97926
5320I323703k88441l85084l79200k39314k70447j87386j73472j79656k05861k25812
5310F789030l82586k54613j63949k11239j74704k21412j13509o3186j56867k15978
5300D830987k55865k61436q0466o3352j57530j81903k00068j8931j09955j71674
$$ plain form
5361 301446701 267079774 218108177 170202688 133463070 107746289 89715935 76534975
5354 76534975 66353597 58406801 52102326 46866283 42475977 38930919 35939709 33437267
5346 33437267 31423527 29455266 27840118 26221260 24716641 23314365 21918022 20596219
5338 20596219 19468736 18549218 17796175 17023194 16184992 15390457 14580713 13942102 13353783
5329 13353783 12840769 12398197 12052885 11562922 11054436 10445089 9991249 9721629 9323703
5320 9323703 9035262 8650178 8270978 8031664 7761217 7573831 7400359 7220703 7014842 6789030
5310 6789030 6406444 6151831 5987882 5776643 5601939 5380527 5267018 5203832 5046965 4830987
5300 4830987 4575122 4313686 4233220 4169868 4012338 3830435 3630367 3611436 3501481 3329807
5290C329807j32389l1101n0723j19688j14953L5805J4857p0969j59808O1425m4668
5279B717595p572j39360j02319K7391n07o8936j82830j14965l713l0544j57000
5268A937240m3195n3220o226m9364M0161j13819q2251P3175n186j27003p629k3950
5256A538733n598r2532j4230l9852k810M5229O2891n8241n9566K8674j19380n8891
5244A224427p3055N3313J06495n0969p1752m9750J5140k2904M3168J2411O7952
5233A254476o4755o7338L5170Q4710r6277j28749O4519o6652l3472J0526L4547
5222A026705j04962n1776n9076M4299r3919l4216K4920J45972j00991p3324J4480
5211G38112m5442K691J22719l7612j01397J1391m615J33933j07893m4232K795
$$ plain form
5290 3329807 3197418 3166317 3115594 2995906 2880953 2916758 2931615 2860646 2700838 2762263 2717595
5279 2717595 2710023 2570663 2468344 2495735 2495228 2426292 2243462 2128497 2124784 2094240 1937240
5268 1937240 1894045 1840825 1834599 1785235 1825396 1711577 1629326 1702501 1697315 1570312 1562683 1538733
5256 1538733 1533135 1440603 1426373 1386521 1383711 1428940 1491831 1433590 1374024 1402698 1283318 1224427
5244 1224427 1151372 1204685 1311180 1260211 1188459 1138709 1153849 1130945 1174113 1186524 1254476
5233 1254476 1189721 1122383 1157553 1242263 1145986 1017237 1081756 1015104 981632 992158 1026705
5222 1026705 921743 869967 810891 855190 761271 727055 751975 897947 796956 723632 738112
5211 738112 692670 695361 818080 780468 679071 690462 685847 819780 711887 667655 670450
5200F70450k4394J4703P7482l8178L0707Q634L2222J3908Q4138N6246r9255L3406
5188H60069r548n4848j35354m6631j62742K9172O3743M8881l7843K1620n7132
5177E19387P4768M8634j9062P5006j5575L8013j15677j1245r0865m6959M8712
5166E05137N6972k5079o1988J07593P4416j9146q8963j24927Q1144l6671k5580
5155D42908N3158J2595J4694M4671j19298K5508p801n3991J08926N2247L241l9978
5143E36880j34663J18540P9169m927j05j23348M1455p6866L2609M5778j6102j06018
5131C92402N4517M1446o1049L4012j5610j6945p0647L5543R2093k2445m8287k4451
5119C90579O2224O050n1112L8123r1502Q7743j4799k5708m5243L9951m5991Q4743
$$ plain form
5200 670450 646056 660759 738241 700063 730770 739404 771626 785534 869672 925918 826663 860069
5188 860069 850521 795673 660319 613688 450946 480118 543861 592742 554899 576519 519387
5177 519387 594155 642789 623727 698733 683158 721171 605494 594249 503384 456425 505137
5166 505137 562109 537030 475042 582635 657051 637905 548942 424015 505159 468488 442908
5155 442908 496066 508661 523355 568026 448728 474236 466435 412444 521370 573617 576858 536880
5143 536880 402217 520757 599926 594999 594894 471546 513001 436135 468744 514522 498420 392402
5131 392402 446919 488365 427316 461328 445718 428773 358126 393669 485762 463317 415030 390579
5119 390579 452803 458853 407741 445864 354362 442105 427306 401598 356355 396306 350315 435058
5107D35058J0549N4306j9848K3309J5914J4863p5747J46L6850p8085J01931P826
5095E27072M0025k0679l770j36543K4794k9391k7683L3547o8006J5535P8947o5999
5083C67849q5600J51223k0420k4753o1666m695n863k7944O3551L0726j8806Q5297
5071D48899l758o0486L8216p9960J24476l7918L4684j5525n2891m9680J40432
5060D86489k4987p001M2493Q332n293p8595o5065M1342q0932O2854L3896P5384
5048D88917m1854J5675m1979j0018J6897J7399n9853o408Q2362k1710J28096k6299
5036E41225n4437l0944L8241p3033j5348L9514r418Q8858O3665n4370O1928N6052
5024F51933N776N0581j3612j32530N2498p2691r3187K09303O0994j71912O2100
$$ plain form
5107 435058 445607 499913 480065 503374 519288 534151 458404 458550 495400 417315 519246 527072
5095 527072 567097 546418 542648 406105 430899 401508 373825 407372 339366 354901 433848 367849
5083 367849 282249 433472 413052 388299 326633 321938 316075 288131 351682 382408 363602 448899
5071 448899 445141 384655 422871 342911 467387 429469 464153 448628 395737 346057 486489
5060 486489 461502 454501 496994 505326 500033 421438 356373 397715 316783 379637 413533 488917
5048 488917 447063 462738 420759 410741 427638 445037 385184 378776 461138 439428 567524 541225
5036 541225 486788 455844 494085 421052 405704 445218 435800 524658 588323 533953 595881 651933
5024 651933 657709 708290 694678 562148 614646 541955 448768 658071 719065 547153 609253
5013F09253N2108k7540r662Q0781l8888p1512J3842j2215J39100O0161l8765l1314
5001G25349j77641J3049K25881K8483q7711R9696r7864r376P6506n9298Q3357
4990H20431L3969p6089j15789J49405J16399m3727k4512J7761N2163M1278k8691
4979I42598o0350L6357J42518o793m479p082M3740l2626L9672m4208L9123p71
4967A087699l3594N5741K182J23613j517N9597l4576O8625J400j21138O2672J19779
4955A390483L2597k1225K04860P5088J8410O4168o0544N1156O7553J43233L8518
4944B004297l9699J41721K08240L8278J38320J34531J13188P515R5811J19080
4934B961282J35411L6724J90627N6484N4470N3515L3950P8468J37854N0640J22666
$$ plain form
5013 609253 661361 633821 624159 704940 666052 594540 608382 596167 735267 795428 756663 725349
5001 725349 547708 560757 786638 815121 727410 827106 729242 719866 796372 737074 820431
4990 820431 854400 778311 662522 811927 928326 884599 860087 877848 930011 971289 942598
4979 942598 882248 918605 1061123 1054330 1049851 1042769 1086509 1053883 1093555 1049347 1088470 1087699
4967 1087699 1054105 1109846 1112028 1235641 1234124 1293721 1259145 1327770 1329170 1208032 1270704 1390483
4955 1390483 1423080 1401855 1606715 1681803 1700213 1764381 1703837 1754993 1822546 1965779 2004297
4944 2004297 1964598 2106319 2314559 2352837 2491157 2625688 2738876 2746391 2842202 2961282
4934 2961282 3096693 3133417 3324044 3380528 3434998 3488513 3522463 3600931 3738785 3789425 3912091
4923C912091O8622N8783P0107J21014J70867J55840J55698J04873J70919J14542
4913E103356M9819N3114K28844J37166J65128K54065K32224O3853K961R5689P583
4902F393802P5182M5612Q5997j3515N9065O9777o7598P0828R2560K14933K4997
4891G051640J348O4570K4997J02250J2343k5937J6607k8j0439p6600O4786k9552
4879G195985j2105p091J02501r2472r7563n3628q65k1554j47351j06075M8549
4868F808331j12681j01253m9044l5723j36097j18952o9762q3279j90422o2088
4858E849030j25813p8911o2224l8740l7156o9021q611j19564j54368q1529q8763
4847D984330j27875j82708o1014j31419j63656j65605r6657r0435l08480j90619
$$ plain form
4923 3912091 3980713 4039496 4109603 4230617 4401484 4557324 4713022 4817895 4988814 5103356
4913 5103356 5153175 5206289 5435133 5572299 5737427 5991492 6223716 6287569 6290530 6386219 6393802
4902 6393802 6468984 6514596 6600593 6587078 6646143 6715920 6648322 6719150 6811710 7026643 7051640
4891 7051640 7052988 7117558 7142555 7244805 7257148 7231211 7247818 7247790 7237351 7160751 7225537 7195985
4879 7195985 7183880 7176789 7279290 7186818 7089255 7035627 7034762 7013208 6865857 6759782 6808331
4868 6808331 6695650 6594397 6545353 6509630 6373533 6254581 6184819 6101540 5911118 5849030
4858 5849030 5723217 5644306 5582082 5543342 5506186 5437165 5428554 5308990 5154622 5073093 4984330
4847 4984330 4856455 4673747 4612733 4481314 4317658 4152053 4055396 3964961 3656481 3465862
4837C465862j05159j13530l6390l0135j46055o2077r6082r8131k5129j38941l9024
4826B575209m6705r0061n8694n4784j05665q6955P8287k00296j44137l4869r2507
4815A738823k32084o271J5258p5623l4165M239l9870m7090r3447n0976O0331m4098
4803A195027n0809n3360o5296n998k863p6708J2292r0297j17921N2281l4492P976
4791G69832P395m0374J49100N2201j30631o3416j6046n7009j9212R2568k0298
4780G24110R9977j72440o4054O5197J1778o6766m7413M1343J04407M715l8662
4769F62192k258o9069o3837K7885K7362J307K358Q5682M1529r408l646J1315j3586
4756F97826k6009p6674m6834k6043O3793l9090P0354L5863p2489O3619K4872m962
$$ plain form
4837 3465862 3360703 3247173 3210783 3180648 3034593 2972516 2876434 2778303 2753174 2614233 2575209
4826 2575209 2528504 2438443 2379749 2324965 2219300 2132345 2210632 2010336 1866199 1831330 1738823
4815 1738823 1506739 1500468 1515726 1440103 1405938 1410177 1370307 1323217 1229770 1178794 1239125 1195027
4803 1195027 1144218 1090858 1025562 1019564 1016701 939993 952285 861988 744067 796348 761856 769832
4791 769832 777227 736853 885953 938154 807523 744107 728061 671052 651840 744408 724110
4780 724110 824087 651647 587593 652790 664568 597802 550389 591732 696139 700854 662192
4769 662192 659934 590865 527028 554913 582275 583582 585940 671622 713151 703743 700097 711412 697826
4756 697826 671817 595143 548309 522266 586059 546969 617323 653186 580697 644316 669188 664226
4744F64226q2849q220Q9193l0890J40N8456L6016M0476r3389N2058r93j7713j2640
4731F93871j61702J1267J65929R469j737p0491K8974L9036R6115o0685k8430k4528
4719F97088l6782R6845L1897o2445p0888K1537Q0162n0008K710J809O0506Q3102
4707H55533n2542L0346K0643N5268N5834n8833l1818K5671J6242R419l0378N1167
4695I46552J16583m9638J247P1351J34091j43126J24207J01057n4588j8308n1722
4684A177706K9269k6631M2046l8332J13879P8866l4624q2462O9879J39498k2461
4673A446633K7910J06364m8413o5367N7471m0304J37516j3453n6785N5372O134
4662A613078l2167J25584J00652r4440r7618J8373J69613M6260L4678P9609O129
$$ plain form
4744 664226 581377 573157 662350 631460 631600 690056 726072 766548 673159 725217 724224 706511 693871
4731 693871 532169 543436 709365 718834 717097 646606 675580 714616 810731 750046 721616 697088
4719 697088 660306 757151 789048 726603 655715 677252 757414 707406 710116 711925 772431 855533
4707 855533 802991 833337 853980 909248 965082 906249 874431 900102 916344 925763 895385 946552
4695 946552 1063135 1013497 1014744 1086095 1220186 1077060 1201267 1302324 1247736 1229428 1177706
4684 1177706 1206975 1180344 1222390 1184058 1297937 1376803 1342179 1259717 1329596 1469094 1446633
4673 1446633 1474543 1580907 1532494 1467127 1524598 1484294 1621810 1608357 1551572 1606944 1613078
4662 1613078 1580911 1706495 1807147 1712707 1615089 1633462 1803075 1849335 1884013 1963622 1969751
4651A969751O0774M6876L7530O6799J13667Q5229o4745L5194J65447L0691Q4391
4640B631604J10169Q7919J15476k9718P8140J26498J18181L9844K45716Q5466
4630C609295Q0794J62328K77490J37905L7943M9615J50837J40145J48281K46361
4620E040994J64848L20703K10418L15808L69933L81054M17339M80252O44989Q18025
4610I164363R33431J108575J094730J250748R47708N80516M01108N68772Q85997
4601A6935948J288089J719689J678759J401361N92037j38363l57118J806M94484
4592B3616692J179153J480579J419212M80463j064050j956782j836495j300871
4584B2017901m59728K2345K05553j25199q30593j846987k084934j669385j302296
$$ plain form
4651 1969751 2030525 2077401 2114931 2181730 2295397 2380626 2315881 2351075 2516522 2547213 2631604
4640 2631604 2741773 2829692 2945168 2915450 2993590 3120088 3238269 3278113 3523829 3609295
4630 3609295 3690089 3852417 4129907 4267812 4305755 4355370 4506207 4646352 4794633 5040994
4620 5040994 5205842 5526545 5736963 6052771 6422704 6803758 7221097 7701349 8346338 9164363
4610 9164363 10097794 11206369 12301099 13551847 14499555 15080071 15481179 16049951 16935948
4601 16935948 18224037 19943726 21622485 23023846 23615883 23477520 23120402 23122208 23616692
4592 23616692 24795845 26276424 27695636 28176099 27112049 25155267 23318772 22017901
4584 22017901 21558173 21580518 21786071 21660872 20830279 18983292 16898358 15228973 13926677
4575A3926677o53346m65759m63685o56509j037133j169663j246724j163632o68239
4566F401987n72250n27424m02733m37619l55287k21438k79113j75486q1838k95771
4556C053028j59029j62145n7425k0858n8541q2854r1526j27765j60815j04563
4546B027507J2218j44578q1796j0629j46746k7467o5797j7332m4352p5926l3662
4535A391440M3089m8063q5084p2990o6045k274M0870j52505o5914R4149M6349
4524A123022j2327L1382l9546p4695J5983l596j66326K5967O352r0938k2284R2569
4512H85563K9950K040j07256l7438k7622O6737j9164K4471J9491j34423j734P5407
4500G76022L200r4912J4299P8723N0281l0557j18719K6745Q7503q9764N7526j03946
$$ plain form
4575 13926677 13273331 12807572 12343887 11687378 10650245 9480582 8233858 7070226 6401987
4566 6401987 5829737 5302313 4899580 4461961 4106674 3885236 3606123 3430637 3348799 3053028
4556 3053028 2893999 2731854 2674429 2653571 2595030 2512176 2420650 2292885 2132070 2027507
4546 2027507 2039725 1895147 1813351 1802722 1655976 1628509 1562712 1545380 1501028 1425102 1391440
4535 1391440 1434529 1386466 1301382 1228392 1162347 1160073 1200943 1048438 982524 1076673 1123022
4524 1123022 1110695 1142077 1102531 1027836 1043819 1040223 873897 899864 906216 815278 792994 885563
4512 885563 915513 917553 810297 772859 745237 811974 792810 817281 836772 702349 700615 776022
4500 776022 779222 684310 698609 777332 827613 797056 678337 705082 792585 702821 760347 656401
4488F56401j42492J0434J02789P0012n1528j09113l6076J47341j16773K0675L0801
4477E82471m9043n6496N3619J21720l6214q1152R4182p07M562j6393n5320K6020
4465E87249j9470k5970k1723l5317M6311M5357j15392J05973o220m1498K8344
4454E47644m4997m7958L5104q0006J3059J37345L9066L9569o4543r3122K1912
4443E03073M3222J19653o2990j41071O7319j26983N026J93j9924L1656j10115
4432C09059R1633r170R6691q504l2363O339P4977j82292M8118Q1731J44425r1909
4420E28735p7242K9672j481M6960O8937j25556k708Q6792j0271M2778k7693p1815
4408D87108K5053O302j4254l811k1740k1061N2499N5871J9038j04628p891J52133
$$ plain form
4488 656401 513909 524343 627132 697144 645616 536503 500427 647768 530995 551670 582471
4477 582471 533428 476932 530551 652271 616057 534905 629087 628380 632942 616549 561229 587249
4465 587249 567779 541809 520086 484769 531080 576437 461045 567018 560798 519300 547644
4454 547644 502647 454689 489793 409787 422846 560191 599257 638826 574283 481161 503073
4443 503073 546295 665948 602958 461887 529206 402223 407249 407442 387518 419174 309059
4432 309059 400692 391522 488213 479709 447346 453685 528662 346370 394488 476219 620644 528735
4420 528735 451493 481165 479684 526644 595581 470025 467317 554109 543838 586616 558923 487108
4408 487108 512161 518463 504209 500398 478658 457597 510096 565967 585005 480377 472486 624619
4396F24619o1267j37895J6746p6356L410Q8873q341J56469k1686q6937n6367J9702
4384D60970R024Q2234n3740p6807p2230J02507k2687J40346R8769p4916J7877
4373F11347N7699p8518J5586m0629n6619J9755R8126n8740n3249O9299J6599l4141
4361E66515N9495r2979J01078N4082m0985j3257j8783J55915Q8297m0634q9252
4350G29492L5652n4034L4907j3197q127J55232j21603j6413n4804K4309O1708
4339G73122R882p8484J73576k7819N5621o3508o1785J32768L8346j2192l4958
4328I04569J3510o3516Q3112J1070P7407P4857J6110o4707j6507l9877P7512J7515
4316A091055j36968R5814Q9011l3463Q7978M6383o832j32780K0335L0112J18747
$$ plain form
4396 624619 563352 425457 442203 365847 369257 458130 449789 606258 584572 497635 441268 460970
4384 460970 469994 552228 498488 421681 349451 451958 429271 569617 668386 593470 611347
4373 611347 669046 590528 606114 565485 508866 528621 626747 568007 514758 584057 600656 566515
4361 566515 626010 533031 634109 688191 647206 633949 615166 771081 859378 818744 729492
4350 729492 765144 711110 746017 732820 724693 879925 758322 741909 687105 711414 773122
4339 773122 783004 704520 878096 850277 905898 842390 780605 913373 951719 939527 904569
4328 904569 918079 854563 937675 948745 1026152 1101009 1117119 1052412 1035905 996028 1073540 1091055
4316 1091055 954087 1049901 1138912 1105449 1193427 1239810 1232978 1100198 1120533 1150645 1269392
4305A269392Q2118M7024l3776P4815J04853j5735M3236K1533L588K7018r0660
4294A533406N9113J9763P2631R6494J08077o985J4332K6911K4153R6907L5544
4283B080346n3312O5723q357J13633J1019K238Q1362q2715l8250K1948l2726P2000
4271B232909K22699q628L9579P9329n0691Q9647J42583k7687l3787M6697M0498
4260B773148R7800Q4898K4462J24891J90135J64007L8454P9377J80192J36654
4250C894018J2844O1618K51161J32994J67701J71811J13308R5428K21459K46469
4240E368811J63684J85994K11856K37996J98821L18637L35830L07493K34690K99046
4230G862858M15889K86023M62053L27784L77605O06267N73853N80934O41705N66554
$$ plain form
4305 1269392 1351510 1398534 1364758 1439573 1544426 1528691 1571927 1593460 1597048 1624066 1533406
4294 1533406 1592519 1612282 1684913 1781407 1889484 1882499 1896831 1923742 1947895 2044802 2080346
4283 2080346 2027034 2092757 2084400 2198033 2209052 2211290 2292652 2209937 2171687 2193635 2160909 2232909
4271 2232909 2455608 2446980 2486559 2565888 2515197 2604844 2747427 2719740 2685953 2732650 2773148
4260 2773148 2870948 2955846 2980308 3105199 3295334 3459341 3497795 3577172 3757364 3894018
4250 3894018 3906862 3968480 4219641 4352635 4520336 4692147 4805455 4900883 5122342 5368811
4240 5368811 5532495 5718489 5930345 6168341 6367162 6685799 7021629 7329122 7563812 7862858
4230 7862858 8278747 8564770 9026823 9354607 9732212 10338479 10912332 11493266 12134971 12701525
4220A2701525P72561Q73025J097593J237567J418690J907155K020192K880476
4212B4908784L684085M004375Q50001k338317l813344l511010j971815j149312
4204B0663447o19594m86889k28401k50595j40969j67953j12297r8948j57186k41234
4194A8159381k09689n6954l46375k42115l11265k81601l03590l72799l16007l21069
4184A5397917m48276m02361m35714l68422l95805n10441l37195m20375m89167
4175A1590161m60061l93528n56089n28290l77334l57926m67726l02688l40357
4166G806162m10945l77286k95472k90055k49486l10831l49850k37260k11892l20118
4156D752967k74635j18962r7405j89167j77718j67753k48282r2176j88600j06285
$$ plain form
4220 12701525 13474086 14347111 15444704 16682271 18100961 20008116 22028308 24908784
4212 24908784 28592869 32597244 33447245 31108928 27295584 23784574 21812759 20663447
4204 20663447 20043853 19556964 19328563 19077968 18936999 18769046 18656749 18557801 18400615 18159381
4194 18159381 17949692 17892738 17546363 17304248 16992983 16711382 16407792 16034993 15718986 15397917
4184 15397917 14949641 14547280 14111566 13743144 13347339 12836898 12499703 12079328 11590161
4175 11590161 11130100 10736572 10180483 9652193 9274859 8916933 8449207 8146519 7806162
4166 7806162 7395217 7017931 6722459 6432404 6182918 5872087 5522237 5284977 5073085 4752967
4156 4752967 4478332 4359370 4261965 4072798 3895080 3727327 3479045 3386869 3198269 3091984
4146C091984j22546m8094M9445j14584j99018j00131r6674L207j15907n1441j8800
4135B277441o1450j9504L5261l5140k30465l8797k4823q1838J8610o142o7184
4124A765969O6309l5767j54814j3087J06383j18955r472l4300L6885P311l0870
4113A585592n4821O958l2595L8249J18383q6113k0460j5731k2688o1884J05379
4102A560269K892n5961J4093q8626n4785J2638O0228j01566R8325M4077j3253
4091A478331o2888j7843M8937M5471l9067j520M228o6253j051L0592Q8340m9452
4079A457825Q9585O9290q4632j1526J54733p6956p3299N7372J961j6198m7881
4068A520274J0983o2581Q3563J41506p2191q7375k3913P9060J21452k4891J2520
$$ plain form
4146 3091984 2969438 2921344 2970789 2856205 2657187 2557056 2460382 2463589 2347682 2296241 2277441
4135 2277441 2215991 2196487 2231748 2196608 1966143 1927346 1902523 1820685 1839295 1833153 1765969
4124 1765969 1832278 1796511 1641697 1628610 1734993 1616038 1606566 1572266 1609151 1616462 1585592
4113 1585592 1530771 1537729 1505134 1543383 1661766 1575653 1555193 1539462 1516774 1454890 1560269
4102 1560269 1563161 1507200 1521293 1432667 1377882 1390520 1450748 1349182 1447507 1491584 1478331
4091 1478331 1415443 1397600 1446537 1492008 1452941 1451421 1455649 1389396 1388345 1418937 1507277 1457825
4079 1457825 1547410 1616700 1532068 1520542 1675275 1598319 1525020 1582392 1584353 1568155 1520274
4068 1520274 1531257 1468676 1552239 1693745 1621554 1534179 1510266 1589326 1710778 1685887 1698407
4057A698407m2012j9041k1377N5499R2819l9261M3332K0940j9204m9368P6279
4046A797013m0877M6642J70637K54j19732k4916n2349O6237Q1120J15584J7284
4035B056897j10666O6657k9150J11950N8847J807q305M2936k4201K2949l824R4056
4023B279953O3627l7756m1971J00053J32912M3707l1880j1004J17672L5325L0461
4012B681099m305Q2101Q0079J11496K8139J00421k368R247O1720K9411P5699l5720
4000C217019O5238l1833P2764J61188K1567L3277N0765m421l9469R7918J92996
3989C837009M9532M8093J14628P6754M0511K8009J16552R9598J09037J57346K9346
3978D706415j2491J60615J56973J41041J8571R3241K04123J97004Q7249J15228
$$ plain form
4057 1698407 1656395 1637354 1615977 1671476 1764295 1725034 1768366 1789306 1770102 1720734 1797013
4046 1797013 1756136 1802778 1973415 1973669 1853937 1829021 1776672 1842909 1924029 2039613 2056897
4035 2056897 1946231 2012888 1983738 2095688 2154535 2156342 2148037 2190973 2166772 2189721 2185897 2279953
4023 2279953 2343580 2305824 2263853 2363906 2496818 2540525 2508645 2497641 2615313 2650638 2681099
4012 2681099 2676794 2758895 2838974 2950470 2978609 3079030 3076662 3085909 3147629 3177040 3252739 3217019
4000 3217019 3282257 3250424 3323188 3484376 3505943 3539220 3589985 3585564 3546095 3644013 3837009
3989 3837009 3886541 3934634 4049262 4126016 4166527 4194536 4311088 4410686 4519723 4677069 4706415
3978 4706415 4693924 4854539 5011512 5152553 5171124 5264365 5468488 5665492 5752741 5867969
3968E867969J11851K27566J92058J45328J47705K22943J18256K52899L20474K61868
3958G868917J89463L16179L10729K46323K39363K54197L73285L52720L64245M67293
3948A0982714N31367L48229N32202N08966N23464P03607P23143P86687P98615
3939A6438994R44575J011608J223506J253567J225242J462636J677823J825364
3931B7063315J884607J993840K031520J975088J720521J664702J346787J091827
3923D0772207P95102M31910K10362P1579j50452k31356l00311k69598k77088m01447
3913D0650908n46490p30003q12993j171266j372378j496671j801641j951500k079277
3904B8688689j937067j810746j880918j643490j443953j333485j204396j105623
$$ plain form
3968 5867969 5979820 6207386 6399444 6544772 6692477 6915420 7033676 7286575 7607049 7868917
3958 7868917 8058380 8374559 8685288 8931611 9170974 9425171 9798456 10151176 10515421 10982714
3948 10982714 11514081 11862310 12394512 12903478 13426942 14130549 14853692 15640379 16438994
3939 16438994 17383569 18395177 19618683 20872250 22097492 23560128 25237951 27063315
3931 27063315 28947922 30941762 32973282 34948370 36668891 38333593 39680380 40772207
3923 40772207 41567309 41999219 42209581 42281160 42130708 41899352 41599041 41329443 41052355 40650908
3913 40650908 40104418 39374415 38561422 37390156 36017778 34521107 32719466 30767966 28688689
3904 28688689 26751622 24940876 23059958 21416468 19972515 18639030 17434634 16329011
3896A6329011q57684r37105r03643p56820o18917o45203n20378m61790l80322
3887A0247149m27754m14126k52109k77910k02954l03144k99641k19738j68229
3878G681544j16395j49708j66265k49611k02176n3787o5559j15778n8824j07689
3868F395752q6153N4853q0487n9365k8810o5887M783n5744R3985J67847l4363
3857F306411j4167j8605j0154Q7267J25247M7411J13709J67410J68192J30041
3847G102762J10230k0984J67373J47842J5445o3609N2098J24807J23426L3678
3837G793068M0814J56096l9J13354o4042m6349o5384J1739r5926j5398o628l3572
3825G787733K1924o9404j9918j09381n1813J07248R3837j18937o8517n6585M9223
$$ plain form
3896 16329011 15471327 14534222 13630579 12873759 12254842 11609639 11089261 10627471 10247149
3887 10247149 9819395 9405269 9153160 8875250 8672296 8369152 8069511 7849773 7681544
3878 7681544 7565149 7415441 7249176 6999565 6797389 6743602 6678043 6562265 6503441 6395752
3868 6395752 6309599 6364452 6283965 6224600 6195790 6129903 6134686 6078942 6172927 6340774 6306411
3857 6306411 6292244 6273639 6263485 6350752 6475999 6523410 6637119 6804529 6972721 7102762
3847 7102762 7212992 7192008 7359381 7507223 7522668 7459059 7511157 7635964 7759390 7793068
3837 7793068 7833882 7989978 7989939 8103293 8039251 7992902 7927518 7939257 7843331 7827933 7821305 7787733
3825 7787733 7809657 7740253 7720335 7610954 7559141 7666389 7760226 7641289 7572772 7516187 7565410
3814G565410L3658J13519J65058N2760Q9271J42413R8871J27955K08984K69116
3804H867015K78557L23441L51435L48540K79775M52416N07500M58803N06254N09063
3794A2882799N18388O05813N24012M82751N85762M97692M72127M34913M88538
3785A7492795M04070L82761L36760M50757L39176J82164J33621J97549J86183
3776B0105836L1336k2078l2445l0556j94012j88044j00325j24052j40161o9590
3766A9235909q119o1363q3131j29374j41620j31296M9759Q0993j0503q3848o6363
3755A8651044o838j7688O2910K7181K0921O7137L9109K4235Q8703j7656o0394
3744A8878664j6834p9703k5266j23982l46205l02329l83501m39160l82540m45821
$$ plain form
3814 7565410 7599068 7712587 7877645 7930405 8019676 8162089 8260960 8388915 8597899 8867015
3804 8867015 9145572 9469013 9820448 10168988 10448763 10901179 11408679 11867482 12373736 12882799
3794 12882799 13401187 14007000 14531012 15013763 15599525 16097217 16569344 17004257 17492795
3785 17492795 17896865 18279626 18616386 19067143 19406319 19588483 19722104 19919653 20105836
3776 20105836 20137172 20115094 20082649 20052093 19858081 19670037 19569712 19445660 19305499 19235909
3766 19235909 19227790 19166427 19083296 18953922 18812302 18681006 18730765 18811758 18801255 18717407 18651044
3755 18651044 18644206 18626518 18689428 18716609 18737530 18804667 18843776 18868011 18956714 18939058 18878664
3744 18878664 18861830 18782127 18756861 18632879 18286674 17984345 17600844 17161684 16779144 16333323
3734A6333323m99125m53035m74945m60486m25766m86432m86558n52951n35584
3725A1958441n28930m55046m82892n39925n11026m74109m06861l58716k77779
3716G923157m51766l38776k41308l06769j68653j64836k29915j84224l9098J96591
3706E994403j47667m9066J22167r2059L8687J56663L7185P3870j38301j41265
3696E854617M2964K0686M5324M8677N2538M7297p3478p5955N3964l3899p9354
3685E903381j7918j8612j91607k69079o3715j60450j31643j10547j43207j61113
3675D635490j88979j13597k26722j93119j439j02885k28385k03615k00153j80038
3665B996558j80612o4899r0216j29217j54191j15936j18319m8232j13060q3682
$$ plain form
3734 16333323 15834198 15381163 14906218 14445732 14019966 13533534 13046976 12494025 11958441
3725 11958441 11429511 10974465 10491573 9951648 9440622 8966513 8559652 8200936 7923157
3716 7923157 7471391 7132615 6891307 6584538 6415885 6251049 6021134 5836910 5797812 5994403
3706 5994403 5846736 5797670 5919837 5827778 5866465 6023128 6060313 6134183 5995882 5854617
3696 5854617 5897581 5918267 5963591 6012268 6064806 6112103 6038625 5962670 6016634 5982735 5903381
3685 5903381 5885463 5866851 5675244 5406165 5342450 5182000 5050357 4939810 4796603 4635490
3675 4635490 4446511 4332914 4106192 3913073 3911634 3808749 3580364 3376749 3176596 2996558
3665 2996558 2815946 2751047 2660831 2531614 2377423 2261487 2143168 2094936 1981876 1898194
3655A898194n8996l6068m8246N4135j01794j63674p5873L8M8455J3964o7757l5242
3643A427136m2099p3890K4927j8615l4146K8339o1756n7031n3734j1959m050j5307
3631A107815L3947q2164o7278K9319O3412O078n1655k7475m7279J1778o6351O2342
3619I72489L8516n503j09130l4380R6352O1995k5953j33628K7240K6616p6611
3608H38003l4052j3670M9934M3702j20331K5413m7968j5947O3887n4734o0638
3597F73599n7865j25326n8504K3639r607Q014L5932k5879n65M6257j23854K8592
3585D14433r6032j6262O4435O3492N6465o0730m9978r4024M0434M9406M9561m2722
3573C78478M6458J12178l1064n1422m9418l3154O7017o5603N2375K8433p1374
$$ plain form
3655 1898194 1839198 1803130 1754884 1809019 1707225 1543551 1467678 1467716 1516171 1530135 1462378 1427136
3643 1427136 1385037 1311147 1336074 1317459 1283313 1311652 1249896 1192865 1139131 1127172 1123122 1107815
3631 1107815 1141762 1059598 992320 1021639 1085051 1091129 1039474 1011999 964720 976498 910147 972489
3619 972489 1011005 1005502 896372 861992 958344 1020339 994386 860758 887998 914614 838003
3608 838003 803951 790281 840215 883917 763586 788999 741031 725084 788971 734237 673599
3597 673599 615734 490408 431904 455543 445936 453950 489882 464003 463438 509695 385841 414433
3585 414433 318401 302139 366574 430066 486531 425801 375823 281799 322233 371639 421200 378478
3573 378478 424936 537114 506050 454628 405210 372056 439073 373470 425845 454278 382904
3562C82904n9866o2663o0055J21600J0820n9820J2829P5634J298L4007P5347J5160
3550D87195m9890r367k8011n1653N6903m7552p9515o0747P806M4342m7359O8509
3538B90661o819J2741N1920J4169k2370j1377r0288L9485M4860k1027P9312l5939
3526C45328j03963r9029N9897J10868P2831j0514r5637j20909K8933J03980J0892
3515C02677l7238k8440p5977K4942N6218k3561L9354O5561O629o2025K1051o6291
3503B22900p637J26425j971n0144o8505J17806j9885k2122J21221k5609j49402
3492B43077j098K5327O0598j9501M1471J0407k6274j25278J4696L0421n9092K7577
3480B22331O6637N6661r6415q802M1039O6716j80205N732J10061p0341J14213
$$ plain form
3562 382904 323038 260375 200320 321920 332740 272920 285749 361383 362681 396688 472035 487195
3550 487195 437305 427938 399927 348274 405177 357625 278110 217363 225169 269511 222152 290661
3538 290661 283842 296583 348503 362672 340302 328925 238637 278122 322982 301955 381267 345328
3526 345328 241365 142336 202233 313101 385932 375418 279781 158872 187805 291785 302677
3515 302677 265439 236999 161022 185964 242182 218621 257975 323536 330165 268140 289191 222900
3503 222900 215263 341688 339717 289573 221068 338874 318989 296867 418088 392479 243077
3492 243077 241979 267306 327904 308403 349874 360281 334007 208729 223425 253846 194754 222331
3480 222331 288968 345629 249214 240412 281451 348167 167962 173694 283755 213414 327627
3469C27627j1749r4681O1495m9068O3322Q157L2518N2874l7983q230K922Q636
3457C55840j10556p6550O1382k3890J11782N4750q9636k4460j1997K4391J0657
3446B81713N3464L3481l2104R8083R2807j4060p764p8046r6317k6406N0948l3941
3434C21858j1592m2363j1358n9427k8523K2242P8048l5083M971l4538q5870P8087
3422A96452N5433L7631r1393L4869l2228o1965k0063R808j7661N502L8574J1859
3410A66818o2995J01300m633k0478O1901j26552K8460j9226m054k0406K1653k1805
3398I9983l0771m4630Q2520l968k0595m9441K0714N4261M0138j03492J15794p9020
3386H1493p326O457m1228P6482O1513l4422q1063O9179J8192O2418j2547N609
$$ plain form
3469 327627 315878 221197 282692 233624 296946 305103 337621 390495 352512 344282 347204 355840
3457 355840 245284 168734 230116 206226 318008 372758 283122 258662 246665 271056 281713
3446 281713 335177 368658 336554 434637 527444 513384 505620 427574 331257 304851 355799 321858
3434 321858 310266 267903 256545 197118 168595 190837 268885 233802 238773 204235 118365 196452
3422 196452 251885 289516 198123 232992 200764 138799 118736 128544 110883 116385 154959 166818
3410 166818 103823 205123 200490 180012 241913 115361 143821 124595 120541 100135 121788 99983
3398 99983 69212 24582 107102 103134 82539 33098 53812 108073 148211 44719 160513 81493
3386 81493 74167 80624 39396 115878 177391 142969 61906 131085 149277 211695 199148 204757
3374B04757m4993k511J64643O6830q8231P1634l9264k9279j5094l4216Q88Q4093
3362C39257P2294M249J2842K7152m7179j31650K8086J12445q3817L5289j10237
3351B58731K002O7338r4798m1054o249K00l639j72258k5725Q084L334O2570K313
3338F0849l4998M5680n1875m5675k3720m3701L9407J24954K4650k9819K2469K5630
3326A13851L7662P328l1711l643l5106M2012N7981j25558r192O2332n5896R5737
3314A55797n2730j61977K5940N1455K1599o1947k1736M020K9244J7397K0456P5629
3302A03147m762m9701p2166p767L0186r2077Q1792J0830L7685Q3220L0706j8151
3290A32942j62956l5921P7480L4155J3537j06197K2786O7529k7398O3736O8528
$$ plain form
3374 204757 159764 157253 321896 388726 300495 372129 332865 303586 288492 254276 255164 339257
3362 339257 411551 415800 428642 455794 408615 276965 305051 417496 333679 368968 258731
3351 258731 260733 328071 233273 192219 185970 186170 182531 10273 -15452 -7368 -4034 58536 60849
3338 60849 25851 71531 19656 -26019 -49739 -93440 -54033 70921 95571 65752 88221 113851
3326 113851 151513 158841 127130 123487 88381 130393 188374 62816 53624 115956 60060 155797
3314 155797 103067 -58910 -32970 18485 40084 -21863 -43599 -39579 -10335 7062 27518 103147
3302 103147 98385 48684 -23482 -31249 -1063 -93140 -11348 -518 37167 120387 151093 132942
3290 132942 -30014 -65935 11545 45700 59237 -46960 -24174 43355 15957 79693 148221
3279A48221M8089r5117k8165m9779l6045K4801p9655o5664J23410L8163K483K4402
3267E5144R5316j4941L1202L0844j20679K2959p117L1685o6207j7151n3990J6441
3255C506l1490j1515l2719J00660O5251O1513q1015K4946k3462J4655M1785k8916
3243A03199o1724N3570P2953k9410p5471K8624k7340q052P2648j11972J8635J4823
3231E0483K5665j16050m1066j5818k2915N9377J15772L4444j8386j05098Q1563
3220D7971l624J19531L0625r9941J5808j04182o2664Q540N5445L9439o4321K7723
3208A0350M7280j0544Q3424n8628m0872m6355Q8053O046K1578M1664o7391r6322
3196b1717m2803Q4199J1860Q6684m8699q4291l2485J78556N4269j0731m2476m5468
$$ plain form
3279 148221 196310 101193 73028 23249 -12796 12005 -67650 -133314 -9904 28259 30742 55144
3267 55144 150460 135519 166721 197565 76886 99845 92728 124413 58206 41055 -12935 3506
3255 3506 -27984 -39499 -72218 28442 93693 155206 74191 99137 75675 90330 132115 103199
3243 103199 41475 95045 167998 138588 63117 91741 64401 56349 128997 17025 35660 50483
3231 50483 76148 -39902 -80968 -96786 -119701 -60324 55448 89892 71506 -33592 47971
3220 47971 44347 163878 194503 94562 110370 6188 -56476 -47936 7509 46948 -17373 10350
3208 10350 57630 47086 130510 71882 31010 -15345 72708 78754 100332 141996 74605 -21717
3196 -21717 -64520 19679 31539 118223 69524 -14767 -47252 131304 185573 174842 132366 86898
3184H6898N1325K701K3637p8585L9778k6919m0343q636q752l8090R3126M9896
3172A46036l3031j1443j11040R404P8135n2079P3332O759n7047K3083L1917m5463
3160E8563j8899m5610l4010P4801r389J6175l4758o4343o999M7794P7455R927
3148G0707P9524J9320j61760L5027N3657P3025j8812l1035n7599r1596J36466
3137A06924q29j30144m592P6659Q2329r294j06062R9018K821r9017O4250K5179
3125A07242M5372K8756j2864j53918l9008J1364J03149m4020m3313J42504n3329
3114I1935j41308J8494Q9961j2766j06000J2676R0793R6664Q462m1597m8609p8428
3102a9723M5093O4324P7539o1918R5618p4493j53030O6454n1922K7576l0698J20037
$$ plain form
3184 86898 138223 140924 164561 85976 125754 98835 58492 49856 41104 3014 96140 146036
3172 146036 113005 101562 -9478 -74 78061 25982 99314 106073 49026 72109 104026 58563
3160 58563 39664 -5946 -39956 34845 25456 41631 6873 -57470 -64469 -16675 60780 70707
3148 70707 150231 169551 7791 42818 96475 169500 150688 119653 62054 -29542 106924
3137 106924 106095 -24049 -28641 48018 130347 121053 14991 114009 116830 17813 82063 107242
3125 107242 152614 181370 168506 14588 -24420 -13056 90093 46073 2760 145264 91935
3114 91935 -49373 -30879 59082 46316 -59684 -47008 43785 140449 148911 107314 58705 -19723
3102 -19723 25370 89694 167233 105315 200933 126440 -26590 39864 -12058 15518 -15180 104857
3090A04857q4143l7928K1242m8429M1766P7435J15486q9030q0967l2759m00L4589
3078B1719N1347o4568p200L5006L2468M8923q8959n1251P9810j2334o8996M9305
3066B5270o7565K6870O5960K8817J7512n2722m4987m9531K01181j1049o6914l0433
3054D2409k9177L2078j4983M4090p5208O5231l4696n4093J32365m4334p5130J400
3042a0048J0061L8361p6159l6395J20119m1782P6396l8926j44450J19996l2467
3031a5294n5507J7168N0437p1312K59J21580J5227M3714n9135j16769K1456J34499
3019H6323l7484M2875m3111K0418J9048r0802J7000J10153o7315k7313L4618l8932
3007B5478n2456m4458L3645L8555j678J0061K3746k8583n1588L3614M345N0767
$$ plain form
3090 104857 20714 -17214 4028 -44401 -2635 74800 190286 101256 20289 -12470 -12870 21719
3078 21719 73066 8498 1298 36304 68772 117695 28736 -22515 57295 44961 -24035 25270
3066 25270 -42295 -15425 50535 79352 96864 44142 -845 -50376 150805 139756 72842 42409
3054 42409 13232 45310 30327 74417 -791 64440 29744 -24349 108016 63682 -11448 -10048
3042 -10048 13 38374 -37785 -74180 45939 4157 80553 41627 -102823 17173 -15294
3031 -15294 -70801 -53633 -3196 -74508 -74249 47331 62558 106272 47137 -69632 -48176 86323
3019 86323 48839 91714 48603 69021 88069 -2733 14267 124420 57105 29792 64410 25478
3007 25478 -26978 -71436 -37791 764 -914 9147 32893 4310 -47278 -13664 -9319 41448
2995D1448R956j00920J5131J18427l1242p3799L0922k3719k0440M1297m2947m3297
2983g9183R1774M9172j07971q611M2221K8949K0180o4798J1509m2461M736k3455
2971g7938L4091O8883j13207o0300P3826K006N0527N9515k4706r6552j07325N8437
2959a32743O3303J6991L0716o2999j8373L2140n578m6562J806Q690j2633P5211
2947e0031L006Q139L9324J3749l1795n7286J74715p499r7100J2921L3636k019
2935C9760L4906q1071J024L8583l7399p9136L5859N609m7696R1384M2762j7013
2923B7572p396o2522m6815R1422J314n2601q868M120j5654J17370K0084L0204
2911I8230j2297J5951j104j35382K1304J04340m1467q8962N4067j9718j525n9957
$$ plain form
2995 41448 51404 -49516 -34385 84042 52800 -20999 9923 -13796 -34236 7061 -35886 -79183
2983 -79183 12591 61763 -46208 -54819 -12598 16351 36531 -28267 -16758 -59219 -54483 -77938
2971 -77938 -43847 25036 -88171 -148471 -74645 -72639 -22112 37403 12697 -83855 -191180 -132743
2959 -132743 -69440 -52449 -21733 -84732 -103105 -70965 -76543 -123105 -121299 -112609 -125242 -50031
2947 -50031 -47025 -38886 438 14187 -17608 -74894 99821 92322 -4778 8143 41779 39760
2935 39760 74666 -6405 -5381 33202 -4197 -83333 -47474 -41865 -89561 1823 44585 27572
2923 27572 20176 -42346 -89161 2261 3575 -49026 -57894 -53774 -69428 47942 68026 98230
2911 98230 85933 101884 100780 -34602 -13298 91042 49575 -39387 14680 -5038 -6563 -66520
2899f6520k1196N6315N4140n5486p2257k5342M2837R561L0489l5819q2462P3212
2887i2528J0883R1129N2463l1246N1830j4041r0243m7481j2732N6338L5290r9475
2875h9813k845q940L1308L6637j13643J1517P9461m1695P1097l2733J12415J14046
2863A66812k19298n3517j8071l4588k3594N7157J8792R5486P170j0870k4633m3769
2851h2923K4039J0002j3259L1114p1047Q3122q497l2063k3767J2160k7191q3253
2839a81563R7117p5723O3675K3375j0958Q346Q3236N0265r2699P1601N863l0520
2827A2015K6937l7238o1034M8098N0106j9722k7992J2331m7539R6364M4956q8480
2815H802R2661p9056o6736k9887J06498j7931J968L9819j042n5368m9428L9312
$$ plain form
2899 -66520 -87716 -31401 22739 -32747 -105004 -130346 -87509 -77948 -47459 -83278 -165740 -92528
2887 -92528 -81645 9484 61947 30701 82531 68490 -21753 -69234 -81966 -25628 9662 -89813
2875 -89813 -92658 -101598 -70290 -33653 -147296 -135779 -56318 -98013 -26916 -59649 52766 166812
2863 166812 -52486 -106003 -124074 -158662 -182256 -125099 -106307 -10821 -3651 -14521 -39154 -82923
2851 -82923 -58884 -48882 -62141 -31027 -102074 -18952 -27449 -59512 -83279 -71119 -98310 -181563
2839 -181563 -84446 -160169 -96494 -73119 -84077 -75731 7505 57770 -34929 36672 42535 12015
2827 12015 38952 1714 -59320 -11222 38884 19162 -8830 3501 -44038 52326 97282 8802
2815 8802 101463 22407 -44329 -74216 32282 14351 16319 56138 55096 -272 -49700 -10388
2803a0388l1052l8240k1774K8485l7131j8876L4144J37343L8421j00577j8300
2792c7945R8128k170r3024p5224J08770N9717J350K7380N9342j16168m6681Q9772
2780G3247n4128q870J9521J2171j6201l8386k5699l0739n1984K639J09500K5351
2768A6422m5950m0957M7470j8851O2376N5381L6105n9061p1482j2283l7270J4341
2756e3759o908Q0474O6324o9036N636L8396L3859m9220p7259k3191q156P0563
2744G723j1088k3493l3064J12868p6142n1059j09260N5663K8296o853J4938K1870
2732f9601l2870m3385J2964k887j7440L1187M6676P5014J34655j374o6512l5325
2720C1102l1136L4893l3174M7963j0391k2134K5420l2509J8300K2015n1219l26
$$ plain form
2803 -10388 -41440 -79680 -101454 -72969 -110100 -128976 -94832 42511 80932 -19645 -37945
2792 -37945 60183 58013 -35011 -110235 -1465 58252 59602 86982 146324 30156 -16525 73247
2780 73247 19119 10249 29770 41941 25740 -12646 -38345 -69084 -121068 -118429 -8929 16422
2768 16422 -29528 -70485 -23015 -41866 20510 75891 111996 52935 -18547 -30830 -68100 -53759
2756 -53759 -60667 19807 86131 17095 22731 61127 94986 45766 -31493 -54684 -62840 7723
2744 7723 -3365 -26858 -59922 52946 -23196 -74255 -183515 -127852 -99556 -106409 -91471 -69601
2732 -69601 -102471 -145856 -132892 -135779 -153219 -122032 -75356 -342 134313 132939 66427 31102
2720 31102 -34 34859 1685 49648 39257 17123 42543 10034 28334 50349 -870 -1196
2708a196J286j0435N4789p7677J18209m3652p202J2349L5385m9479j90883O9269
2696h9237M5846L7636j23722P2959J27399q3438N4882q1683J0458o0357l5951
2685a25208j162J19107l975n4960k459j3232M0580J6824M6881K4896r2675r1180
2673a36563m8791R3221O1128m0473m3246o808p003R4483n5681j8478J02283n5365
2661f1293p2400M7145J19929k8026j5970k4878l8264n2105J49100M0652p9465
2650a5575K5622K1689l9397K9698r7190K4738M499q3053l3092R3050q8448P377
2638a50082N7026j61460L80J20519P7028j5355q0491J18960j4778r7810Q7049
2627e9014O0829k5733O964K6433l881n2209n8984Q4825N495K6347m9291O9782
$$ plain form
2708 -1196 90 -10345 44444 -33233 84976 41324 34122 46471 81856 32377 -158506 -89237
2696 -89237 -43391 -5755 -129477 -56518 70881 -12557 42325 -39358 -28900 -89257 -125208
2685 -125208 -126370 -7263 -11238 -66198 -68657 -81889 -41309 -24485 22396 47292 -45383 -136563
2673 -136563 -185354 -92133 -31005 -71478 -114724 -121532 -128535 -34052 -89733 -108211 -5928 -61293
2661 -61293 -133693 -86548 33381 5355 -10615 -35493 -73757 -125862 23238 63890 -15575
2650 -15575 10047 31736 -7661 22037 -75153 -50415 -45916 -128969 -162061 -69011 -157459 -150082
2638 -150082 -93056 -254516 -254136 -133617 -56589 -71944 -152435 -33475 -48253 -146063 -59014
2627 -59014 1815 -23918 -16954 9479 5598 -46611 -105595 -20770 -15275 11072 -38219 31563
2615C1563p105o663O1416r1195m1946O1736R1595j02932r1922M3659Q7198l5896
2603d92n9691P2832j6405n838m6164O7270p745l9704J7146k8827k6399J10094
2591C6077l4247m8640M2051j8343Q3558R927p642r2649K4938m5505j60590J51483
2579e9582M5328K852k6788Q5608O5858q438p2604j14796M2539J4725q2108j17605
2567b25011j4177M1426K8828P8434L6913m5971N7060M1726m3075K0855P0733j5935
2555C1806K4681o2084j59015Q9539K9219j7240m133Q1306P0512o2839p2340j2660
2543f3248J04710o5291K0939L2000o2553j9055q309J39113R7544q8648m8659p9528
2531d0985m1782j4871m2454K3837J03080p3263O2496M2211R560J5673j3545K1586
$$ plain form
2615 31563 24458 17795 79211 -11984 -53930 7806 99401 -3531 -95453 -51794 35404 -492
2603 -492 -60183 12649 -3756 -9594 -55758 11512 3767 -35937 -18791 -47618 -74017 36077
2591 36077 1830 -46810 -4759 -23102 60456 70383 62741 -29908 -4970 -50475 -211065 -59582
2579 -59582 -14254 -11402 -38190 47418 113276 104838 32234 -82562 -40023 -25298 -107406 -225011
2567 -225011 -239188 -197762 -168934 -90500 -53587 -99558 -42498 -772 -43847 -22992 47741 31806
2555 31806 56487 -5597 -164612 -75073 -45854 -63094 -67227 14079 84591 21752 -50588 -63248
2543 -63248 41462 -23829 -2890 29110 -33443 -52498 -60807 78306 175850 87202 38543 -40985
2531 -40985 -82767 -97638 -140092 -116255 -13175 -86438 -23942 18269 27829 43502 29957 51543
2519E1543O6780J1003q5632o7149L8927M9224l9331o8464J298N730k3282M6762
2507a2591R4498j1732m8115K5926j22767k9405J40230R1198r3350O1124l4337
2496F0679n7606P9666l4936k6046L4772J0849j0002j80302K3519M7531j6261L7183
2484c0954L8256l996n6052J8957O3551j1195m2907M7292j7376r3185k6408O0601
2472e3416J2743L267L85k9028p1311N0849m7292J00055O8666N788j66724N3247
2460g2771O4317m0867P3617r2449j2799J1623J2382j6542J10127L524N6155L970
2448A00287r7500j19291K740O9664Q6402M7535j3014o5057k263K2635O7686p2058
2436B7766k6647J03920k5674q449j4268O4791J5341L2819j9493k0930n3716M6564
$$ plain form
2519 51543 118323 129326 43694 -23455 15472 64696 25365 -43099 -41801 -36071 -59353 -12591
2507 -12591 81907 70175 22060 47986 -74781 -104186 36044 127242 33892 95016 60679
2496 60679 3073 82739 47803 21757 56529 67378 57376 -122926 -99407 -51876 -68137 -30954
2484 -30954 7302 3306 -52746 -33789 29762 18567 -24340 22952 5576 -87609 -114017 -53416
2472 -53416 -40673 -37406 -37021 -66049 -137360 -86511 -133803 -33748 34918 40706 -126018 -72771
2460 -72771 -8454 -49321 24296 -68153 -80952 -69329 -56947 -73489 36638 40162 96317 100287
2448 100287 2787 -116504 -113764 -44100 42302 89837 76823 11766 9503 32138 99824 27766
2436 27766 1119 105039 79365 70916 56648 121439 136780 169599 150106 129176 75460 122024
2424A22024p5574k9260L4071k410p7499Q5285M3622j40793L8024j7405R2944K2684
2412I5713j03658N2783j9131L9268l3413o4040R1568J818J2812O0642k2957l3104
2400G8301O7607m8692l8744J133M5637m8171O9092O9025j14433o3243l3746K4679
2388H445k1277k6927N0829N7200l5200M9111j4673j6951o2371j21114M0780R7884
2376E736j35315M4254J46286k8056r47k0129J57680o7634J03178r342r8006O3005
2364A60710l986n7623n4990K8403n7683N037J30168Q3330p9637k9303R5872o7190
2352A53108p0559J7044K9337l3116J3333O0248L512m9745N8956M8248q0746R6251
2340B45871M5028j26213L5359R6417m3677k5156p6959J06376J18218M6735J4079
$$ plain form
2424 122024 46450 17190 51261 48851 -28648 56637 100259 -40534 -2510 -19915 73029 95713
2412 95713 -7945 44838 25707 64975 31562 -32478 59090 60908 73720 134362 111405 78301
2400 78301 145908 97216 58472 59605 105242 57071 126163 195188 80755 17512 -16234 8445
2388 8445 -12832 -39759 11070 68270 33070 82181 67508 50557 -11814 -132928 -92148 5736
2376 5736 -129579 -85325 60961 32905 31958 11829 169509 101875 205053 195711 97705 160710
2364 160710 156724 99101 44111 72514 14831 19868 150036 233366 153729 124426 220298 153108
2352 153108 82549 99593 128930 95814 109147 169395 172907 123162 182118 230366 149620 245871
2340 245871 290899 164686 200045 296462 252785 227629 150670 257046 375264 421999 436078
2329D36078K7586K7871P2912O9792L5687J19951P9302J06627J17867L17018M02628
2318A813319N31831K96848j53559m86130n01566l17518l75690j74770j13226j31543
2308C87996j1501R850l9327p6914R421j6486m4403q025j4128J44815o557j41307
2296A93434M0219j7128l1469k3851j0705N8854l6833n3990N0624o9683j06079
2285f607L6197k1930M3647R5895m8222j02823K4379Q7899L1898p1598o926j9561
2273D2248k507K521O8107Q527q7979P9667j4170m3714J9365r688P7125M7787j94938
2260g649K1698J9882j35448j9047J1540j380O5109O4009L01k8584N2245l6858
2248E818n5098n7017R3335Q8608n2975k1834j38718K5176R3201P3795r9554j9801
$$ plain form
2329 436078 463664 491535 564447 634239 669926 789877 869179 975806 1093673 1410691 1813319
2318 1813319 2345150 2641998 2488439 2002309 1500743 1183225 807535 632765 519539 387996
2308 387996 376495 386345 347018 270104 279525 263039 218636 210611 196483 341298 334741 193434
2296 193434 233653 216525 185056 161205 150500 209354 172521 118531 169155 99472 -6607
2285 -6607 29590 7660 51307 147202 98980 -3843 20536 108435 140333 68735 61809 42248
2273 42248 39741 42262 110369 118896 30917 110584 96414 52700 72065 62377 139502 187289 -7649
2260 -7649 14049 33931 -101517 -120564 -109024 -110404 -45295 18714 19015 -9569 42676 5818
2248 5818 -49280 -106297 -12962 75646 22671 837 -137881 -112705 -19504 54291 -45263 -65064
2236f5064n8393R5977O7867k4636o8P220P8657q1186l9502L8188j4578K2648o8730
2223d1600r92l8514m508L284Q7814J00722k3661m4473p5272o1609j4044Q2997
2211b9856J653l138l0103p0777P2063L1496l3218L0019N1392J10867m1416J0468
2199I9450J3945p5358m0737m7558J122K8363J78084n1084j33677M6133l8715K016
2187a8016Q8365K6423j20701L6726L8254K414L6216N140J3987j79783o8940O813
2175a33102j49o015N8413R3959K7889p2657p0248K9566j0629K2330J5744J12642
2163F7743J1855n8156J5170p3529Q5290n7826l5992m358J323M670m7926J24448
2151C2712j53492J39171q4784J8505J64956J4287j24182P915L1245R0113q1304
$$ plain form
2236 -65064 -123457 -27480 40387 15751 15683 22903 101560 20374 -19128 19060 4482 27130 -41600
2223 -41600 -42592 -81106 -85614 -82330 5484 106206 82545 38072 -37200 -98809 -112853 -29856
2211 -29856 -28203 -31341 -61444 -132221 -60158 -28662 -61880 -31861 19531 130398 88982 99450
2199 99450 113395 38037 -2700 -50258 -49136 -20773 157311 106227 -27450 18683 -20032 -18016
2187 -18016 70349 96772 -23929 12797 51051 53465 89681 94821 108808 -70975 -139915 -133102
2175 -133102 -133251 -139266 -80853 13106 40995 -31662 -101910 -72344 -82973 -60643 -44899 67743
2163 67743 79598 21442 36612 -36917 48373 -9453 -45445 -49803 -48480 -43810 -91736 32712
2151 32712 -120780 18391 -66393 -47888 117068 131355 7173 15088 46333 136446 55142
2140E5142n7074j4531r9176K1425R3311M9834J7786m8833j13315j2511M3210J33532
2128F8800n375K8884p0155j19882Q8981n4686N2386O2762j47798n9278M8203P2391
$$ plain form
2140 55142 -1932 -16463 -115639 -94214 -903 48931 66717 17884 -95431 -107942 -64732 68800
2128 68800 63425 92309 22154 -97728 -8747 -63433 -11047 51715 -96083 -155361 -107158 -34767
$$ [...]
##END NTUPLES=NMR SPECTRUM
##END=
