##TITLE=1H_CG-1182-3
 CDCl3
 8 sc, 
 27.12.2023
##JCAMPDX= 6.0         $$ Bruker NMR JCAMP-DX V2.0
##DATA TYPE= NMR SPECTRUM
##DATA CLASS= NTUPLES
##ORIGIN= UXNMR, Bruker Analytische Messtechnik GmbH
##OWNER= root
$$ XWIN-NMR		Version 3.5
$$ Wed Dec 27 14:43:03 2023 Russian Standard Time (UT+4h)  she@DPX200
##.OBSERVE FREQUENCY= 200.1313
##.OBSERVE NUCLEUS= ^1H
##.ACQUISITION MODE= SIMULTANEOUS
##.ACQUISITION SCHEME= undefined
##.AVERAGES= 8
##.DIGITISER RES= 18
##SPECTROMETER/DATA SYSTEM= spect
##.PULSE SEQUENCE= zg30
##.SOLVENT NAME= CDCl3
##.SHIFT REFERENCE= (INTERNAL, CDCl3, 0, 15.4549)
##AUDIT TRAIL= $$ (NUMBER, WHEN, WHO, WHERE, WHAT)
$$ ##TITLE= Audit trail, XWIN-NMR		Version 3.5
$$ ##JCAMPDX= 5.01
$$ ##ORIGIN= Bruker BioSpin GmbH
$$ ##OWNER= she
$$ F:/spectra/data/she/nmr/H-F/1/pdata/1/auditp.txt
$$ ##AUDIT TRAIL=  $$ (NUMBER, WHEN, WHO, WHERE, WHAT)
(   1,<2023-12-27 14:41:56.96 +0400>,<she>,<DPX200>,
      <created by zg, POWCHK disabled, PULCHK disabled
       configuration hash MD5:
       00 E9 B6 7A A2 85 ED C7 34 08 36 98 17 FE 4E 26
       data hash MD5: 16K
       73 B7 51 97 84 66 39 AC EA 8C BE 5E 89 09 DC 8A>)
(   2,<2023-12-27 14:41:59.98 +0400>,<she>,<DPX200>,
      <Start of raw data processing
       efp BC_mod = 2 LB = 0.24 FT_mod = 6 PKNL = 1 PHC0 = -24590.66 PHC1 = 8.05273 SI = 16K 
       data hash MD5: 16K
       CC C8 C5 F9 DA 92 8F 28 0C B3 94 9F E3 3E E9 E0>)
(   3,<2023-12-27 14:42:14.95 +0400>,<she>,<DPX200>,
      <pk PHC0 = -1.093074 PHC1 = 2.8 
       data hash MD5: 16K
       B4 E8 42 9B 32 C6 92 1B 8F 03 12 BD 3E EE 6E B3>)
(   4,<2023-12-27 14:42:18.35 +0400>,<she>,<DPX200>,
      <abs ABSG = 5 
       data hash MD5: 16K
       BB 14 2A 23 98 0E 5F D5 7F BF B2 D9 EA BC 38 DE>)
$$ ##END=
$$ 
$$ hash MD5
$$ EE D7 C6 B0 A4 23 66 56 8A 33 08 68 25 3A F6 04
##$RELAX= 
##$RELAX= 
##$RELAX= 
##$RELAX= 
##$RELAX= 
##$RELAX= 
$$ Bruker specific parameters
$$ --------------------------
##$DU= <F:/spectra>
##$EXPNO= 1
##$NAME= <H-F>
##$PROCNO= 1
##$TYPE= <nmr>
##$USER= <she>
##$AMP= (0..31)
100 100 100 100 100 100 100 100 100 100 100 100 100 100 100 100 100 100 
100 100 100 100 100 100 100 100 100 100 100 100 100 100 
##$AQSEQ= 0
##$AQ_mod= 1
##$AUNM= <au_zg>
##$AUTOPOS= <>
##$BF1= 200.13
##$BF2= 200.13
##$BF3= 200.13
##$BF4= 200.13
##$BF5= 200.13
##$BF6= 200.13
##$BF7= 200.13
##$BF8= 200.13
##$BYTORDA= 1
##$CFDGTYP= 0
##$CFRGTYP= 5
##$CHEMSTR= <none>
##$CNST= (0..31)
1 1 145 1 1 1 1 1 1 1 1 1 1 1 1 1 1 1 1 1 1 1 1 1 1 1 1 1 1 1 1 1 
##$CPDPRG= <>
##$CPDPRG1= <>
##$CPDPRG2= <>
##$CPDPRG3= <>
##$CPDPRG4= <mlev>
##$CPDPRG5= <mlev>
##$CPDPRG6= <mlev>
##$CPDPRG7= <mlev>
##$CPDPRG8= <mlev>
##$CPDPRGB= <>
##$CPDPRGT= <>
##$D= (0..31)
0 1.2 0 0 0 0 0 0 0 0.06 0 0.03 0 0 0 0 0.0002 0 0 0 0 0 0 0 0 0 0 0 0 
0 0 0 
##$DATE= 1703673716
##$DBL= (0..7)
120 120 120 120 120 120 120 120 
##$DBP= (0..7)
150 150 150 150 150 150 150 150 
##$DBP07= 0
##$DBPNAM0= <>
##$DBPNAM1= <>
##$DBPNAM2= <>
##$DBPNAM3= <>
##$DBPNAM4= <>
$$ [...]
##$SUBNAM3= <"">
##$SUBNAM4= <"">
##$SUBNAM5= <"">
##$SUBNAM6= <"">
##$SUBNAM7= <"">
##$SUBNAM8= <"">
##$SUBNAM9= <"">
##$SW= 18.0517328524113
##$SWIBOX= (0..15)
0 0 2 0 0 0 0 0 0 0 0 0 0 0 0 0 
##$SW_h= 3612.71676300578
##$TD= 16384
##$TD0= 1
##$TE= 0
##$TE2= 300
##$TE3= 300
##$TEG= 300
##$TL= (0..7)
0 120 120 120 120 120 120 120 
##$TP= (0..7)
150 150 150 150 150 150 150 150 
##$TP07= 0
##$TPNAME0= <>
##$TPNAME1= <>
##$TPNAME2= <>
##$TPNAME3= <>
##$TPNAME4= <>
##$TPNAME5= <>
##$TPNAME6= <>
##$TPNAME7= <>
##$TPOAL= (0..7)
0.5 0.5 0.5 0.5 0.5 0.5 0.5 0.5 
##$TPOFFS= (0..7)
0 0 0 0 0 0 0 0 
##$TUNHIN= 0
##$TUNHOUT= 0
##$TUNXOUT= 0
##$USERA1= <user>
##$USERA2= <user>
##$USERA3= <user>
##$USERA4= <user>
##$USERA5= <user>
##$V9= 5
##$VALIST= <valist>
##$VCLIST= <CCCCCCCCCCCCCCC>
##$VD= 0
##$VDLIST= <DDDDDDDDDDDDDDD>
##$VPLIST= <PPPPPPPPPPPPPPP>
##$VTLIST= <TTTTTTTTTTTTTTT>
##$WBST= 1024
##$WBSW= 4
##$XGAIN= (0..3)
0 0 0 0 
##$XL= 0
##$YL= 0
##$YMAX_a= 241048
##$YMIN_a= -262606
##$ZGOPTNS= <>
##$ZL1= 120
##$ZL2= 120
##$ZL3= 120
##$ZL4= 120
##$ABSF1= 15.4527
##$ABSF2= -2.59915
##$ABSG= 5
##$ABSL= 3
##$ALPHA= 0
##$AQORDER= 0
##$ASSFAC= 0
##$ASSFACI= 0
##$ASSFACX= 0
##$ASSWID= 0
##$AUNMP= <proc_1d>
##$AZFE= 0.1
##$AZFW= 0.1
##$BCFW= 0
##$BC_mod= 2
##$BYTORDP= 0
##$COROFFS= 0
##$CY= -3
##$DATMOD= 1
##$DC= 0
##$DFILT= <>
##$DTYPP= 0
##$F1P= 0
##$F2P= 0
##$FCOR= 1
##$FTSIZE= 16384
##$FT_mod= 6
##$GAMMA= 0
##$GB= 0
##$INTBC= 1
##$INTSCL= 3.70164e-10
##$ISEN= 128
##$LB= 0.24
##$LEV0= 0
##$LPBIN= 0
##$MAXI= 10000
##$MC2= 0
##$MEAN= 0
##$ME_mod= 0
##$MI= 1.114404
##$NCOEF= 0
##$NC_proc= -7
##$NLEV= 6
##$NOISF1= 3.799351
##$NOISF2= 2.8
##$NSP= 0
##$NTH_PI= 0
##$NZP= 0
##$OFFSET= 15.45491
##$PC= 1
##$PHC0= -24591.75
##$PHC1= 10.85273
##$PH_mod= 1
##$PKNL= yes
##$PPARMOD= 0
##$PSCAL= 0
##$PSIGN= 0
##$REVERSE= no
##$SF= 200.130013365753
##$SI= 16384
##$SIGF1= 3
##$SIGF2= 2
##$SINO= 5.538805
##$SIOLD= 16384
##$SREGLST= <1H.CDCl3>
##$SSB= 0
##$STSI= 16384
##$STSR= 0
##$SW_p= 3612.71676300578
##$SYMM= 0
##$S_DEV= 0
##$TDeff= 16384
##$TDoff= 0
##$TI= <>
##$TILT= no
##$TM1= 0
##$TM2= 0
##$TOPLEV= 0
##$USERP1= <user>
##$USERP2= <user>
##$USERP3= <user>
##$USERP4= <user>
##$USERP5= <user>
##$WDW= 1
##$XDIM= 16384
##$YMAX_p= 309068205
##$YMIN_p= -970645
$$ End of Bruker specific parameters
$$ ---------------------------------
##NTUPLES= NMR SPECTRUM
##VAR_NAME=  FREQUENCY,     SPECTRUM/REAL,   SPECTRUM/IMAG
##SYMBOL=    X,             R,               I
##VAR_TYPE=  INDEPENDENT,   DEPENDENT,       DEPENDENT
##VAR_FORM=  AFFN,          ASDF,            ASDF
##VAR_DIM=   16384,         16384,           16384
##UNITS=     HZ,            ARBITRARY UNITS, ARBITRARY UNITS
##FACTOR=    0.220516191357247, 1,           1
##FIRST=     3092.99140056676, 0,            0
##LAST=      -519.725362439023, 0,           0
##MIN=       -519.725362439023, -970645,     0
##MAX=       3092.99140056676, 309068205,    0
$$ Real data points
##PAGE= N=1
##DATA TABLE= (X++(R..R)), XYDATA
$$ [...]
6384E6293514m955238n163155m678146l817218l232116k731376k092723j925122
6376B7698420j930982j844718j583892j492919j239679j162108j032190j049606
6368A6362326p18893n29185p07444o42031m70099m48509j98570l32789k76205
6359A2038601j93946P209n9714j37544q4674L07012J77205M999O3331N921j64247
6348A1964153l83921m03656m24011k73892k85510l23436k53982l33015k55417
6339I027313k44353j32695j52017j006r3537j8655Q2019J15279K44198J14505
6329H941051M58219K73246L85936N32759N35575J52140K115k99067n37355n26524
6319I918095m28828k38856l30219l88966l74613j15588L0588j64086N1532p6470
$$ y = [56293514, 51338276, 46175121, 41496975, 37679757, 34447641, 31716265, 29623542, 27698420, 25767438, 23922720, 22338828, 20845909, 19606230, 18444122, 17411932, 16362326, 15643433, 15114248, 14406804, 13764773, 13294674, 12846165, 12647595, 12314806, 12038601, 11844655, 11851864, 11792150, 11654606, 11569932, 11876944, 12054149, 12059148, 12122479, 12128400, 11964153, 11580232, 11176576, 10752565, 10478673, 10193163, 9869727, 9615745, 9282730, 9027313, 8782960, 8650265, 8498248, 8497242, 8403705, 8385050, 8467069, 8582348, 8826546, 8941051, 9399270, 9672516, 10058452, 10591211, 11126786, 11278926, 11281041, 10981974, 10444619, 9918095, 9489267, 9250411, 8920192, 8531226, 8156613, 8041025, 8071613, 7907527, 7959059, 7882589]
6309G882589J9526J35256K18558J89947J97530L19749L12344K47803N10617N94728
6299A0628647L70409M07954N98775P21920M23089O26640Q19516Q00165N97329
6290A5994444J88854j35186n23958o46839q95515r78706o23874o14109n12196
6281A1252915p2557l57833N9843j13981k6251J80134L21502L99092N31415N92691
6271A2766970O31218P95131Q46103J215314J874347J885039J803974J541056N77434
6262B3936586p34222j535581j803186k002570j676642j497159j233132q42014
6254A2612080q56863q14481o96423l18566k86347j57088k30176q2630L15934m4019
6244I441421J65002N51803O95105M73551O08837P36750P90718J44858m47687p58141
$$ y = [7882589, 7902115, 8037371, 8255929, 8445876, 8643406, 8963155, 9275499, 9523302, 10033919, 10628647, 10999056, 11407010, 12005785, 12727705, 13150794, 13777434, 14596950, 15397115, 15994444, 16183298, 16048112, 15524154, 14877315, 13981800, 13003094, 12379220, 11765111, 11252915, 11180358, 10822525, 10882368, 10768387, 10742136, 10922270, 11243772, 11642864, 12174279, 12766970, 13398188, 14193319, 15039422, 16254736, 18129083, 20014122, 21818096, 23359152, 23936586, 23202364, 21666783, 19863597, 17861027, 16184385, 14687226, 13454094, 12612080, 11755217, 10940736, 10244313, 9925747, 9639400, 9482312, 9252136, 9169506, 9485440, 9441421, 9606423, 10158226, 10853331, 11326882, 11935719, 12672469, 13463187, 13608045, 13160358, 12402217]
6234A2402217r69568j110370q66716r09884p96236p94597m16611n61708n44377
6225E432150m63555l46089l98187k42665j26830j4756k64311k34045j84321j61845
6215B995546r6239q5648P4034l19267p3006L6884j18300j78040P9283q8403k42501
6204A984343j50741J55948K3817j28498N6913j9814Q9089j64624M9439r8657k95206
6193A502009K34084O497J3512k90104k7999o069N3484P014q457m0801l8081M3818
6181A448907K30621j46000j00448j05030l25813J62589K70591J1875L6687k00541
6171A283438M4455K23573K7237N4843j54638j96901j78921J90940J20465J00946
6161A515437L4185j03792l001P1930k6097l9321j8215N1158Q14K7243j14803N4678
$$ y = [12402217, 11432649, 10322279, 9455563, 8545679, 7749443, 6954846, 6538235, 5976527, 5432150, 4968595, 4622506, 4224319, 3981654, 3854824, 3840068, 3575757, 3341712, 3157391, 2995546, 2899307, 2813659, 2887693, 2568426, 2495420, 2532304, 2414004, 2235964, 2315247, 2226844, 1984343, 1833602, 1989550, 2013367, 1884869, 1941782, 1921968, 2011057, 1846433, 1895872, 1797215, 1502009, 1736093, 1742590, 1756102, 1465998, 1437999, 1431930, 1485414, 1492428, 1483971, 1443170, 1405089, 1448907, 1679528, 1533528, 1433080, 1328050, 1002237, 1164826, 1435417, 1447292, 1483979, 1283438, 1327893, 1551466, 1578703, 1633546, 1478908, 1282007, 1103086, 1294026, 1414491, 1515437, 1549622, 1445830, 1442829, 1514759, 1488662, 1449341, 1431126, 1482284, 1483098, 1510341, 1395538, 1450216]
6149A450216o1008m4201N2191J57095J14256k13603j81257K30869j32652r8795
6139A273111j5576J82378J80426j61654k07174J61823K11900N2463j7390L9780
6129A700087k737j42724j32101J23335J44416n1562k11299j2700K08882j8414
6119A605183l7104l2429J7641j07014j92136K6622P522j16709J31932J73740j6825
6108A460423k33253J37642K3166n1533R5987L1908J4754J8282K45030K5320p6656
6097A691070m0813j55250O4221j30302r5460j13726n8822j09662N1151j807N5625
6086A156225J04192m1587O6947o5784R7482k2904j35569p1715K78967J666O1588
6075A429508K3720k74820k779o2188J31579l6349P5873l9964Q8826l8276j93420
$$ y = [1450216, 1389208, 1345007, 1397198, 1554293, 1668549, 1454946, 1273689, 1504558, 1371906, 1273111, 1257535, 1439913, 1620339, 1458685, 1251511, 1413334, 1625234, 1677697, 1660307, 1700087, 1697350, 1554626, 1422525, 1545860, 1690276, 1638714, 1427415, 1414715, 1623597, 1605183, 1568079, 1535650, 1553291, 1446277, 1254141, 1280763, 1288285, 1171576, 1303508, 1477248, 1460423, 1227170, 1364812, 1387978, 1336445, 1432432, 1464340, 1479094, 1497376, 1742406, 1767726, 1691070, 1650257, 1495007, 1559228, 1428926, 1333466, 1219740, 1160918, 1051256, 1102407, 1100600, 1156225, 1260417, 1218830, 1285777, 1219993, 1317475, 1294571, 1159002, 1087287, 1366254, 1367920, 1429508, 1453228, 1178408, 1175629, 1113441, 1245020, 1208671, 1284544, 1244580, 1333406, 1295130, 1101710]
6064A101710J31410j37951j11116K34107p9383j20476Q678j04677j29261J16183
6054I09224Q7011K0884j24736K36285R7952O568J19372k2880J18951l10309k1441
6043A116881J72371j91060O2191j4164J47535j18848j46115o4994O3068J55141
6033A182006J53436l7004M9995j83385Q9757L6544j90144K17034J4775R5653j2774
6022A415893j73371J47969J23116m6552l4077n6014J25325n8517o7357l1873J86508
6011A531050j51274n5827l7824k8012O8095K4055l5361J11453J461l7314N631
6000A396133O2395j01883J66315J5952P1018N1256L4269K29178l5748j42797M6324
5989A792412Q7959n0305j48273q1187J64414q8117P3927J24368k38421k2386R9794
$$ y = [1101710, 1233120, 1095169, 984053, 1218160, 1138777, 1018301, 1026979, 922302, 793041, 909224, 996235, 1017119, 892383, 1128668, 1226620, 1233188, 1352560, 1329680, 1448631, 1138322, 1116881, 1289252, 1098192, 1160383, 1146219, 1293754, 1174906, 1028791, 963797, 1026865, 1182006, 1335442, 1298438, 1348433, 1165048, 1254805, 1291349, 1101205, 1318239, 1333014, 1428667, 1415893, 1242522, 1390491, 1513607, 1467055, 1432978, 1376964, 1502289, 1443772, 1376415, 1344542, 1531050, 1379776, 1323949, 1286125, 1258113, 1326208, 1350263, 1314902, 1426355, 1427816, 1390502, 1396133, 1458528, 1356645, 1522960, 1538912, 1609930, 1661186, 1695455, 1924633, 1888885, 1746088, 1792412, 1880371, 1830066, 1681793, 1600606, 1765020, 1676903, 1750830, 1875198, 1636777, 1614391, 1714185]
5978A714185j1605J65129L3400k08960J01559J9840M8352J34546j05348M5608
5968A936706J98324J96744J88114l59953N7622J11440j41911J01297q2532k6970
5958B178881l8713K38306R6994q5964J56136o4034P1518k336l6900P5852J30542
5947B720282J56891m4794N8094j14667k0154L33241L170l0786J92121L85087k5520
5936C612965j66255k9268J63962J82914R4683J18861j75416M8975J57622M9311
5926D058354R331R0497R8678O3325o8584J07403J55134K90954o2503j03078R0092
5915D729603P7827J26939L43908K44038n0860L22390J05488O9812j0918J8620
5905E976847L08678J92841L01035L59848K12007J30953J31222J29745K76483M36836
$$ y = [1714185, 1702580, 1867709, 1901109, 1692149, 1793708, 1813548, 1861900, 1996446, 1891098, 1936706, 2135030, 2331774, 2519888, 2159935, 2217557, 2328997, 2187086, 2288383, 2205851, 2178881, 2140168, 2378474, 2475468, 2389504, 2545640, 2481606, 2553124, 2550788, 2513888, 2589740, 2720282, 2877173, 2832379, 2890473, 2775806, 2755652, 3088893, 3092063, 3061277, 3253398, 3638485, 3612965, 3446710, 3417442, 3581404, 3764318, 3859001, 3977862, 3802446, 3851421, 4009043, 4058354, 4067685, 4158182, 4256860, 4320185, 4251601, 4359004, 4514138, 4805092, 4742589, 4639511, 4729603, 4807430, 4934369, 5278277, 5522315, 5471455, 5793845, 5899333, 5969145, 5958227, 5976847, 6285525, 6478366, 6779401, 7139249, 7351256, 7482209, 7613431, 7743176, 8019659, 8456495]
5895H456495K24289K94232J38152M50593K89185J41828M34588L66776L29848K89022
5885A1415008O43523L02885J97501L19478J17652J39145J95542K09498K25893
5876A3766125K53631N82460M72681M69594L95999M91159M60748K68046M08476
5867A7568919L86604K14048O39852N24368P08834O02917P53279N58656R19092
5858B2876569J136880J063595J073779J027757R59648J118253J023268J106392
5850C1386141J600341K070682K675464L309730L909909M668576N288736N658846
5842F0568425N011794L000639N05446j768290l308570l924407l935549l680140
5834E2469348k809049k057723j569845j285706m78114J3949N66688O83400J489600
$$ y = [8456495, 8680784, 8975016, 9113168, 9563761, 9852946, 9994774, 10429362, 10796138, 11125986, 11415008, 12058531, 12361416, 12558917, 12878395, 12996047, 13135192, 13330734, 13540232, 13766125, 14019756, 14602216, 15074897, 15544491, 15940490, 16431649, 16892397, 17160443, 17568919, 17955523, 18169571, 18809423, 19333791, 20042625, 20645542, 21398821, 21957477, 22876569, 24013449, 25077044, 26150823, 27178580, 28138228, 29256481, 30279749, 31386141, 32986482, 35057164, 37732628, 41042358, 44952267, 49620843, 54909579, 60568425, 65580219, 68580858, 69086304, 67318014, 64009444, 60085037, 56149488, 52469348, 49660299, 47602576, 46032731, 44747025, 44268911, 44282860, 44849548, 45532948, 47022548]
5825D7022548K147808K363171L610276M845315O216121P904977R347685R880838
5817I3338739Q764474M881041k48648n109038q318800r112259q941231p894246
5809F7360032o468048n101876m252030l662783l218559k445902j956269j264624
5801C8989941r79393l02403J12118P29836J166756J862627K545348L177092L597101
5792E0899023L221600J471883m69392k430024l862604m427510m566512l756224
5784C6080240l104912k709406k219150j735163j502587j553771j138693j145482
5776B0971076j115577r85902j264904p00461q27362r16293l64114q44467n80266
5767A3371730k83871l26141j80432l28369m08156j18543p687k21633j25100p5986
$$ y = [47022548, 49170356, 51533527, 55143803, 59989118, 66205239, 74110216, 83457901, 93338739, 102103213, 106984254, 106735606, 101626568, 93307768, 84195509, 75254278, 67360032, 60891984, 55790108, 51538078, 47875295, 44656736, 42210834, 40254565, 38989941, 38010548, 37708145, 37820263, 38550099, 39716855, 41579482, 44124830, 47301922, 50899023, 54120623, 55592506, 55123114, 52693090, 48830486, 44402976, 39836464, 36080240, 32975328, 30265922, 28046772, 26311609, 24809022, 23255251, 22116558, 20971076, 19855499, 18869597, 17604693, 16904232, 16076870, 15160577, 14796463, 13951996, 13371730, 13087859, 12761718, 12581286, 12252917, 11844761, 11726218, 11718531, 11496898, 11371798, 11295812]
5757A1295812j12787K15295q2379l1270K02272J64332L59622j2665L5613K27830
5747A2261675L83343r7518M4228j99481L5321K8367j87764m36355l41472O4520
5737A1554864j8134Q189R0655K19904Q7775J09054L83018K56905L60067L01091
5727A3353388M03462O03360O13141P89431Q71961Q09305P99715J193113J275479
5718B0712355J056493Q27777N188o82426q41348r83443j067794r20090q66143
5709A7240569o40363n09001l52053j72908j91O057K41380M80642N59209L34346
5699A7187687M08403K88374N97217J173176J453627J862784K195845K223955J920397
5690B9311465Q20438r19553j815957k475649k301771k180287k102812j422849
$$ y = [11295812, 11183025, 11398320, 11315941, 11284671, 11486943, 11651275, 12010897, 11998232, 12033845, 12261675, 12645018, 12547500, 12591728, 12392247, 12427568, 12455935, 12268171, 11831816, 11490344, 11554864, 11536730, 11544919, 11635574, 11855478, 11943253, 12052307, 12435325, 12692230, 13052297, 13353388, 13756850, 14360210, 14973351, 15762782, 16634743, 17444048, 18243763, 19436876, 20712355, 21768848, 22596625, 22601813, 21919387, 21078039, 20094596, 19026802, 18106712, 17240569, 16600206, 16091205, 15739152, 15566244, 15566053, 15572110, 15813490, 16294132, 16853341, 17187687, 17596090, 17884464, 18481681, 19654857, 21108484, 22971268, 25167113, 27391068, 29311465, 30131903, 29212350, 27396393, 24920744, 22618973, 20438686, 18335874, 16913025]
5682A6913025j025598j087675r44628o00211l76630n09615j04526r7550j70253
5673A1996339o4989J0307K81151K06682L31903M70407P56618P33887Q49832L45709
5663A5917846Q5119l07722j091279j267250j043360j151282r21672m36576r80782
5654H803042n61655k39266l30234l91321k97440m24804j67429j5129k11908l15382
5644E848474q5205k74611j51639R2773k54621k26758p8183J1423O5873M4533J2160
5633E004219n7949M7673J54595Q9796P2149J57449k12949j57301j6087q0641j05474
5622D895480l3947j88553N7037Q9727k8844N2114o7119Q3416N6443r5225J38114
5611D958643k12054P7353N7076j75651J19266J68416L19611m0258J32196k54226
$$ y = [16913025, 15887427, 14799752, 13855124, 13254913, 12878283, 12368668, 12264142, 12166592, 11996339, 11931350, 11941657, 12222808, 12429490, 12761393, 13231800, 13988418, 14722305, 15572137, 15917846, 16002965, 15695243, 14603964, 13336714, 12293354, 11142072, 10220400, 9783824, 8803042, 8241387, 8002121, 7671887, 7280566, 6983126, 6558322, 6390893, 6375764, 6163856, 5848474, 5763269, 5488658, 5337019, 5429792, 5175171, 4948413, 4870230, 4881653, 4947526, 4992059, 5004219, 4946270, 4993943, 5148538, 5238334, 5310483, 5467932, 5254983, 5097682, 5081595, 5000954, 4895480, 4861533, 4672980, 4730017, 4819744, 4790900, 4843014, 4775895, 4859311, 4915754, 4820529, 4958643, 4746589, 4823942, 4881018, 4705367, 4824633, 4993049, 5312660, 5272402, 5404598, 5150372]
5601E150372K22004M85451K49588N5605j55611l146J37168J91153J39035l1664
5591F439955P6696K01315K42934l0812O9827J26676K29582Q5821J40567j1938
5581G570623N13851K19609j8781Q6697K67034L38179O8582J81820L26300M30874
5571I984788J23247K22620K15929L53117K27872J27592L38178N29041L95153K99541
5561A2817078M66222L91466N45062O25391L60121L38832N20648M78604M05452
5552A6948876N22387M67944N14960O54823N21526K75448P85855O41108O10282
5543B1943209K76143K78823L39944N92382P86007P34877P97588R61075J227028
5534B7937076J414435J524163J619439K063990K209257K482782L028224L733397
$$ y = [5150372, 5372376, 5857827, 6107415, 6163020, 6007409, 6004263, 6141431, 6332584, 6471619, 6439955, 6516651, 6717966, 6960900, 6930088, 6999915, 7126591, 7356173, 7441994, 7582561, 7570623, 8084474, 8304083, 8285302, 8371999, 8639033, 8977212, 9045794, 9227614, 9553914, 9984788, 10108035, 10330655, 10546584, 10899701, 11127573, 11255165, 11593343, 12122384, 12517537, 12817078, 13283300, 13674766, 14219828, 14845219, 15205340, 15544172, 16064820, 16543424, 16948876, 17471263, 17939207, 18454167, 19108990, 19630516, 19905964, 20691819, 21332927, 21943209, 22219352, 22498175, 22838119, 23430501, 24216508, 24951385, 25748973, 26710048, 27937076, 29351511, 30875674, 32495113, 34559103, 36768360, 39251142, 42279366, 46012763]
5526D6012763M212850M512795M617576M208548K813927Q06035n50352j736095
5518F4898047k256529k040398j635614j496933j188285p08723o55382j33307q7772
5509E4695104J11810J124391J724297K903061M260268N179426N668479N467250
5501H1134086M710534L165840J429493P7006j199816k518515l443048m361664
5493G8993916n044035n226269m826343m206000l518958k619285j946895j145746
5485E0460385j036586l29039J32818J82157R77652J578471K438158K679165K821605
5476E9904786J808085k2678j834749l542325m929078n217338m708537m337636
5468C7120530l878277l182453k634697k386925k224263j980063j404177j383937
$$ y = [46012763, 50225613, 54738408, 59355984, 63564532, 66378459, 67184494, 66634142, 64898047, 62641518, 60601120, 58965506, 57468573, 56280288, 55571565, 54916183, 54782876, 54695104, 54806914, 55931305, 57655602, 60558663, 64818931, 69998357, 75666836, 81134086, 85844620, 89010460, 90439953, 90516959, 89317143, 86798628, 83355580, 78993916, 73949881, 68723612, 63897269, 59691269, 56172311, 53553026, 51606131, 50460385, 49423799, 49094760, 49227578, 49409735, 50387387, 51965858, 54404016, 57083181, 59904786, 61712871, 61690193, 59855444, 56313119, 51384041, 46166703, 41458166, 37120530, 33242253, 30059800, 27425103, 25038178, 22813915, 20833852, 19429675, 18045738]
5460A8045738j142020r51589p18287r84658q16407o86099n47844n08733m31357
5451A1258744m12575l72099l34017m17582l61219m59846j53308l95660j29476
5442H222962l42402k95358j77190k63117p9994k49728k77823l52380o9294L0755
5432F146431J17868k04495k22125l469k48430j77428j03018J35469m0511j45773
5422E254519o8713j63185j71516N3735J6153Q3114j55338j2915n9306m5060k6633
5411D704855k9988R8549O1741R779p827K3207R7318O1045P3075J69449K64274
5400E525477J86379Q9516k75812l06712k26549K3404L151o8552m5404l4008M5696
5389D916586j23273P4459j94490j0305R9651o0246j21763r0470P5397K38979P655
$$ y = [18045738, 16903718, 15952129, 15233842, 14249184, 13432777, 12746678, 12198834, 11690101, 11258744, 10846169, 10474070, 10140053, 9722471, 9361252, 8901406, 8748098, 8352438, 8222962, 7880560, 7585202, 7408012, 7144895, 7064901, 6815173, 6537350, 6184970, 6115676, 6146431, 6264299, 6059804, 5837679, 5834210, 5585780, 5408352, 5305334, 5440803, 5400292, 5254519, 5185806, 5022621, 4851105, 4904840, 4920993, 5004107, 4848769, 4835854, 4776548, 4731488, 4704855, 4674867, 4773416, 4835157, 4844936, 4837109, 4860316, 4957634, 5018679, 5091754, 5261203, 5525477, 5711856, 5801372, 5525560, 5218848, 4992299, 5015703, 5018854, 4950302, 4904898, 4870890, 4916586, 4793313, 4867772, 4673282, 4662977, 4762628, 4702382, 4580619, 4490149, 4565546, 4804525, 4812180]
5378D812180O5349M65033J86882j52173j03543m0392j99323m13240m82469l17754
5368C820550j35504n8013j85195k50142K6707p8774m3628l0342j17346j85596
5358B762717l228l0190R7655o9560j16734o0665j1472j26965N691L3058K14415
5347B694722j55463k25981j20278r6998M1331j11981J80493j04277j04539M6225
5337B043254K10506l9262K3762o9347M183O491j73949N1383L5363j82510l3458
5326A876416J92054O8377k92468j58092j84814j1681j5603J70979J33994o1773
5316A717389o4265j53970O6198m5911O1084O4099j23585j20998r938L7555M6929
5305A474587M09J08493J3161j42093q3021M0153K01935Q4548M797j45197n180
$$ y = [4812180, 4877529, 5342562, 5529444, 5377271, 5273728, 5233336, 5034013, 4620773, 4138304, 3820550, 3685046, 3627033, 3441838, 3191696, 3218403, 3139629, 3096001, 3065659, 2948313, 2762717, 2759489, 2729299, 2826954, 2757394, 2640660, 2579995, 2568523, 2441558, 2447249, 2480307, 2694722, 2539259, 2313278, 2193000, 2096002, 2137333, 2025352, 2205845, 2101568, 1997029, 2043254, 2253760, 2214498, 2238260, 2168913, 2173096, 2179587, 2005638, 2057021, 2092384, 1909874, 1876416, 2068470, 2136847, 1844379, 1686287, 1501473, 1489792, 1474189, 1645168, 1779162, 1717389, 1653124, 1499154, 1565352, 1519441, 1580525, 1644624, 1521039, 1400041, 1390103, 1427658, 1474587, 1474996, 1583489, 1596650, 1454557, 1371536, 1411689, 1613624, 1698172, 1702969, 1557772, 1552592]
5294A552592o9576k8727O4247k08568l08316j10158k9297N7936K44059j82530
5284I81662q0400J05014L7338m795L5733k609Q3899J28468L7488j81199J33718
5273A274317J4572r6451J9012p6897l9046J63573j45272N6815O3487L0735J8113
5262A282958n7949k6821O159R3841k66754l1149J26796J4579r0858l4806P1033
5251A087029r61J37587q6712M1885K52104j04280j13283J70241q0950m2195R7864
5240A358329j12147q8580J13869J25874O5432p1297n5463N2885J24377O1858m6720
5229A528417J75151l0472j34092O7576J910R279J88631O4138J33680m4664p2136
5218A887418o1081q8490J37477R1682k1861j67649q4558L09794r6400m7628J56991
$$ y = [1552592, 1483016, 1454289, 1518536, 1309968, 1001652, 891494, 862197, 920133, 1164192, 981662, 901262, 1006276, 1043614, 1038819, 1074552, 1071943, 1155842, 1284310, 1321798, 1140599, 1274317, 1288889, 1192438, 1211450, 1134553, 1095507, 1259080, 1113808, 1170623, 1234110, 1264845, 1282958, 1225009, 1198188, 1204347, 1298188, 1031434, 1000285, 1127081, 1141660, 1050802, 1015996, 1087029, 1086068, 1223655, 1136943, 1178828, 1430932, 1326652, 1213369, 1383610, 1302660, 1260465, 1358329, 1246182, 1157602, 1271471, 1397345, 1462777, 1391480, 1336017, 1388902, 1513279, 1575137, 1528417, 1703568, 1673096, 1539004, 1606580, 1608490, 1617769, 1806400, 1870538, 2004218, 1959554, 1887418, 1826337, 1737847, 1875324, 1967006, 1945145, 1777496, 1692938, 2002732, 1906332, 1858704, 2015695]
5207B015695Q4253p1811K1128L3456M4478R5971J15740j50194N4055J52725r031
5196B386465J44378K51241K30384K03680K77608j31627j02913J70440n574J29041
5186C553123j23215j22759r1073k160o566j12141o8083o6147k1718J32707K44525
5175C316493J52771j3992p740J12209L7693n476L8368J04413J63408M7644M09093
5164D354884K39123J28426J47217J71991L91329J63946M4364L4649l49941k72783
5154E053205k27263k55370j49457l11871k21192j43233k11705k15174j77572j17502
5144C022866j8016R4318j03396j64757K68298j11398L6476J02952J73420l1429
5134C269334o2797J51938J08514P8657L71375J26910K11519r3536k0890j793k49173
$$ y = [2015695, 2099948, 2028137, 2049265, 2082721, 2127199, 2223170, 2338910, 2188716, 2242771, 2395496, 2386465, 2530843, 2782084, 3012468, 3216148, 3493756, 3362129, 3259216, 3429656, 3424082, 3553123, 3429908, 3307149, 3216076, 3213916, 3207350, 3095209, 3027126, 2960979, 2939261, 3071968, 3316493, 3469264, 3455272, 3447532, 3559741, 3597434, 3591958, 3630326, 3734739, 3898147, 3945791, 4354884, 4594007, 4722433, 4869650, 5041641, 5432970, 5596916, 5641280, 5675929, 5325988, 5053205, 4825942, 4570572, 4421115, 4109244, 3888052, 3744819, 3533114, 3317940, 3140368, 3022866, 3004850, 3099168, 2995772, 2831015, 3099313, 2987915, 3024391, 3127343, 3300763, 3269334, 3206537, 3358475, 3466989, 3545646, 3917021, 4043931, 4255450, 4161914, 4141024, 4139231, 3890058]
5123C890058K1754l06710l01852j0030k65897r2843Q2302r2975L0702J94109P862
5112C156480m3422n2023M3473j6502J54513m4687j2377k4467K38680K34558q5305
5101C548921r8687M375K61953K14650M3001j00968J87382M3168J22878J40809
5091D367482J36718k533J19456J27583J96227P1271n4253J13643J51281q4961
5081E141914J02000Q6669n87K81076n4255j86361K21733P8605J17771K62271K28034
5070F278870J57263J80153J28755O7500L23095J94953N7616K60142M08752L42341
5060H399440P3615J13005K92060K28342L61880L53136J37361K48318L00873M78447
5050A0986477N03933O39514N05422Q85737J156683J245883J488670J908818K480659
$$ y = [3890058, 3911812, 3605102, 3303250, 3293220, 3027323, 2934480, 3016782, 2923807, 2954509, 3148618, 3156480, 3113058, 3061035, 3104508, 3088006, 3242519, 3197832, 3185455, 3160988, 3399668, 3634226, 3548921, 3450234, 3454609, 3716562, 3931212, 3974213, 3873245, 4060627, 4103795, 4226673, 4367482, 4504200, 4501667, 4621123, 4748706, 4944933, 5016204, 4961951, 5075594, 5226875, 5141914, 5243914, 5330583, 5329996, 5611072, 5556817, 5370456, 5592189, 5670794, 5788565, 6050836, 6278870, 6436133, 6616286, 6745041, 6812541, 7135636, 7330589, 7388205, 7648347, 8057099, 8399440, 8473055, 8586060, 8878120, 9106462, 9468342, 9821478, 9958839, 10207157, 10508030, 10986477, 11490410, 12129924, 12635346, 13521083, 14677766, 15923649, 17412319, 19321137, 21801796]
5041B1801796K558135L382249N064356P151051Q857843R809215Q466322K271307
5033F9362274o149808r215989r086235q051001n943748m612379l381099k424725
5025B0497290k095713k107331k034778j539048j380181j105341q10236r25525
5017H499137p90709o42317o8360k24981l67606k10263k99137k51769l88864k93132
5007D961999j66410o8650k49076j68788J540k38610j20034L3146j37625J615j57328
4996C691779J48970j51767k87840j59379l8098m7688j21398L2555k42315r6599
4986B728220P1554p776k00535j76113J41544O3700q0316J05358j4185j13314m9206
4975B468931j26744K36900j83272j89492k6983N0565m6975m7320K22945j12226
$$ y = [21801796, 24359931, 27742180, 32806536, 39957587, 48815430, 58624645, 67090967, 69362274, 63212466, 53996477, 44910242, 36859241, 30915493, 26303114, 22922015, 20497290, 18401577, 16294246, 14259468, 12720420, 11340239, 10234898, 9424662, 8499137, 7708428, 7066111, 6997751, 6772770, 6405164, 6194901, 5895764, 5643995, 5255131, 4961999, 4795589, 4726939, 4477863, 4309075, 4310615, 4072005, 3951971, 3985117, 3847492, 3849107, 3691779, 3840749, 3688982, 3401142, 3241763, 3203665, 3155977, 3034579, 3067134, 2824819, 2728220, 2799774, 2791998, 2591463, 2415350, 2556894, 2620594, 2540278, 2645636, 2631451, 2518137, 2468931, 2342187, 2579087, 2395815, 2206323, 2179340, 2229905, 2182930, 2135610, 2358555, 2246329]
4965B246329k7647j8257J19887k35459J88557J1859k04022p4639P3514j70865
4955A909257L404K501j07495O6764L4414j33917J84661j63402J07654l0813j18974
4944A754054R3026L6076Q7244j27638j67220j96071J99324q4605k9763K57799
4934A822226J33091J53555l02631R4750J39185o8462P4063K3974J75908Q5307
4924B330966o0908R6154K31845k02663J5227L9176k88795J34466J43946M5291
4914B484705J29197K22349j00760J39248K50516m9634L11358K09849J37226J78398
4904C912452j37233J22724L61432R5969J47501k04586L9382m06209k11397k91519
4894C428516q2284M1621k93218p5407m1456K7939J41413j12411J15841o3876q4516
$$ y = [2246329, 2218682, 2200425, 2320312, 2084853, 2273410, 2285269, 2081247, 2006608, 2080122, 1909257, 1912661, 1915162, 1807667, 1874431, 1908845, 1774928, 1959589, 1796187, 1903841, 1873028, 1754054, 1847080, 1883156, 1970400, 1842762, 1675542, 1479471, 1678795, 1594190, 1564427, 1822226, 1955317, 2108872, 1806241, 1900991, 2040176, 1971714, 2045777, 2069751, 2245659, 2330966, 2270058, 2366212, 2598057, 2395394, 2410621, 2449797, 2161002, 2295468, 2439414, 2484705, 2613902, 2836251, 2735491, 2874739, 3125255, 3075621, 3386979, 3596828, 3734054, 3912452, 3775219, 3897943, 4259375, 4355344, 4502845, 4298259, 4337641, 3931432, 3720035, 3428516, 3346232, 3387853, 3094635, 3019228, 2977772, 3005711, 3147124, 3034713, 3150554, 3086678, 3002162]
4883C002162O3159L52599J37162l167J72047L71490k6942r4799R8685J27852k47781
4872C952467j28389M2452O9958k50834o341M109j72003q263k04961n131k81797
4861C011267k0465r9454Q1467k59744k21410J25068k0509J75158k1128K9293m0944
4850B738599j41598N1978J40948J66810j22293J17505J02699p4300K38682K48536
4840C467566J22941R3641j49308J0353l3031m8339j63099k47241k27716l1191
4830B794576j81288J6627L7641K00018o3256j54378o294n3851J6296m9341J0964
4819B567714K879j68036Q9474K18293K22690k55934J37605J41861q1573j25717
4809B749256k9206J3634J89258Q5213j9886L09969O013J87467n4877l167L0144
$$ y = [3002162, 3065321, 3417920, 3555082, 3551915, 3723962, 4095452, 4068510, 3973711, 4072396, 4200248, 3952467, 3824078, 3866530, 3936488, 3685654, 3679313, 3683422, 3511419, 3503156, 3298195, 3293064, 3011267, 2990802, 2891348, 2972815, 2713071, 2491661, 2616729, 2596220, 2771378, 2750250, 2779543, 2738599, 2597001, 2648979, 2789927, 2956737, 2834444, 2951949, 3054648, 2980348, 3219030, 3467566, 3590507, 3684148, 3534840, 3545193, 3512162, 3463823, 3300724, 3053483, 2825767, 2794576, 2613288, 2629915, 2667556, 2867574, 2804318, 2649940, 2643646, 2589795, 2606091, 2556750, 2567714, 2570593, 2402557, 2492031, 2710324, 2933014, 2677080, 2814685, 2956546, 2874973, 2749256, 2720050, 2733684, 2922942, 3008155, 2988269, 3298238, 3304251, 3491718, 3436841, 3433674, 3463818]
4798C463818l2374J0515J01461j5117K41008j09042r2051K2471P6579J09870o9889
4787C707249J45272j7111Q3636J79996J449K58960K94091P9477J89815K60765
4777E183599K9766O3986L15831J95377N8274J00317L4049p937R7267M40651K13235
4766F724415L25505r2989K68814K20790J11399M25017M26370L00356K84035M36552
4756I430264M47607O57707M11882L84133K2311J79425K88080J88488K0908O7987
4746A2098792K66086P3895K82468M68159M05227L81625K88586L46086M85461M58800
4736A5555185L25486O22665P19752O54475M13991N00421M91309J45239J88003
4727A9616526M58934M41792K50856N06938N70102O01968L30098K15692P00005
$$ y = [3463818, 3431444, 3441959, 3543420, 3528303, 3769311, 3660269, 3568218, 3590689, 3667268, 3777138, 3707249, 3852521, 3835410, 3919046, 4099042, 4100491, 4359451, 4653542, 4733019, 4922834, 5183599, 5213365, 5277351, 5593182, 5788559, 5846833, 5947150, 5981199, 5973262, 6070529, 6511180, 6724415, 7049920, 6956931, 7225745, 7446535, 7557934, 7982951, 8409321, 8709677, 8993712, 9430264, 9877871, 10535578, 10947460, 11331593, 11353904, 11533329, 11821409, 12009897, 12030805, 12098792, 12364878, 12438773, 12721241, 13189400, 13594627, 13976252, 14264838, 14610924, 15096385, 15555185, 15880671, 16503336, 17223088, 17877563, 18291554, 18791975, 19283284, 19428523, 19616526, 20075460, 20517252, 20768108, 21275046, 21845148, 22447116, 22777214, 22992906, 23692911]
4718B3692911Q18274N67368P95291J211071J319061J275129J449415J850326K137238
4709C5116084K558810K710676L361360M011847M550409M811304M496509L002822
4701F4619821J523037n55996k072137k955441k965124k591801k347896j430297
4693E1224166r56504q16706m68392o7088L40466Q97967J641098K584642L874298
4684E8253947M428001M611341M821259M643971M128849L190055J892493j3433
4676H5956483j755668l615929n009798n515089n543526n294495m505042l648878
4668E1068058k857795j957906j656298j143752p66693m34870j14326M30687J220663
4659D3787768J776636K343655K505356K421424Q46463q10970k664795l666872
$$ y = [23692911, 24511185, 25078553, 25873844, 27084915, 28403976, 29679105, 31128520, 32978846, 35116084, 37674894, 40385570, 43746930, 47758777, 52309186, 57120490, 61616999, 64619821, 66142858, 65586862, 63514725, 60559284, 57594160, 55002359, 52654463, 51224166, 50267662, 49450956, 48982564, 48915476, 49255942, 50153909, 51795007, 54379649, 58253947, 62681948, 67293289, 72114548, 76758519, 80887368, 84077423, 85969916, 85956483, 84200815, 80584886, 75575088, 70059999, 64516473, 59221978, 54716936, 51068058, 48210263, 46252357, 44596059, 43452307, 42685614, 42250744, 42136418, 42567105, 43787768, 45564404, 47908059, 50413415, 52834839, 53681302, 52870332, 50205537, 46538665]
4651D6538665m123125m129384m102844l391555k903813k674199k348435j866168
4643B0999142j301757j384490j257250q82919p65594j034794n80923l97587n24757
4634A2869071k93191n02661l85951j93562m13368k66073k64596n25688l73236
4625I650745l85537l10983j78580k70311m09785l72066j42008j22877r8518j24997
4615G235083J1280k14772l88684m463M5777j47317j26239M8026o9246j34857J11657
4604F366245L38641J89151K24047m9580J24208o4796L8147M4214j22837k67553
4594F819887m58356r3940k67393k65029l11023k27300j57073k43818j38260l1409
4584D626286k01936n4339q734p6100K6887k10601k65722j20401n2745n6299M1797
$$ y = [46538665, 42415540, 38286156, 34183312, 30791757, 27887944, 25213745, 22865310, 20999142, 19697385, 18312895, 17055645, 16172726, 15407132, 14372338, 13791415, 13393828, 12869071, 12575880, 12073219, 11687268, 11493706, 11080338, 10814265, 10549669, 10023981, 9650745, 9265208, 8954225, 8775645, 8505334, 8095549, 7723483, 7581475, 7458598, 7360080, 7235083, 7246363, 7031591, 6642907, 6638444, 6684221, 6536904, 6410665, 6458691, 6389445, 6254588, 6366245, 6704886, 6894037, 7118084, 7068504, 7192712, 7127916, 7166063, 7210277, 7087440, 6819887, 6361531, 6267591, 6000198, 5735169, 5424146, 5196846, 5039773, 4795955, 4657695, 4626286, 4424350, 4370011, 4361277, 4285177, 4312064, 4101463, 3835741, 3715340, 3662595, 3606296, 3648093]
4573C648093J01369k6408N1637J68519j242k94559K7752R0864R2223l2484j84835
4562C640929k11525k67640q2270P5410o5437Q3142j84192k20385n1588j72349
4552B544095k8640r4640q8444N9874J43898k46360j96841J31077r1528k06j1742
4541B120543j1063r4663n7103j17785L5540P0299J78971j25841j55190p9505J51735
4530A915938N6207p1135J2124N9530J6846j83520j08909L24863n2173j16560Q1277
4519A934488M626j05139p171Q7120q092m2561n8555P6037j39520K8086J24381
4508A893700j95765J7092J67535L3857O1972k35043k8671J79862j44530j65628
4498A584381N8667j18854L12364j51855J8833j47987N7922J63864N2399j91974
$$ y = [3648093, 3749462, 3723054, 3774691, 3943210, 3941968, 3647409, 3675161, 3766025, 3858248, 3825764, 3640929, 3429404, 3161764, 3079494, 3154904, 3089467, 3172609, 2988417, 2768032, 2716444, 2544095, 2515455, 2420815, 2332371, 2392245, 2536143, 2289783, 2092942, 2224019, 2132491, 2132285, 2120543, 2109480, 2014817, 1957714, 1839929, 1875469, 1945768, 2124739, 1998898, 1843708, 1764203, 1915938, 1972145, 1901010, 1913134, 1972664, 1989510, 1805990, 1697081, 2021944, 1969771, 1853211, 1934488, 1939114, 1833975, 1826804, 1913924, 1905832, 1863271, 1804716, 1880753, 1741233, 1769319, 1893700, 1697935, 1715027, 1882562, 1916419, 1978391, 1743348, 1714677, 1894539, 1750009, 1584381, 1643048, 1524194, 1836558, 1684703, 1703536, 1555549, 1613471, 1777335, 1829734, 1637760]
4488A637760j58905J53900k9551J5225N7890J46154j44937o2569K02878l2117
4478A785728O4972J44512k12968j07794o2694j12497l0787K90137j16302k9357
4468A612950N5883K64257m6200j28956j9645m9753R6354K58186M1042j1222J013
4457B073909P3023J43829l62742K4002L19788J41805j46635o7814j52824N1589
4447B097930K00083j37915J06606O9009r5371P8298r4751J12833j25898j65812
4437B045012J89692J16947n8348Q9953j27185n9045j10068N8587K62838q8207
4427B320176j91318Q4186Q5290r6885K22042j63060j78696l4043K2536J4436j1141
4416B073523J90192o7507P618r9601O0967J15349k64O6108J9034K0668q8233o5214
$$ y = [1637760, 1478855, 1632755, 1603204, 1618429, 1676319, 1822473, 1677536, 1614967, 1817845, 1785728, 1850700, 1995212, 1782244, 1674450, 1611756, 1499259, 1468472, 1758609, 1642307, 1612950, 1668833, 1933090, 1886890, 1757934, 1738289, 1688536, 1784890, 2043076, 2084118, 2072896, 2073909, 2146932, 2290761, 1928019, 1952021, 2271809, 2413614, 2266979, 2199165, 2046341, 2097930, 2298013, 2160098, 2266704, 2335713, 2240342, 2318640, 2223889, 2336722, 2210824, 2045012, 2234704, 2351651, 2293303, 2383256, 2256071, 2197026, 2086958, 2145545, 2408383, 2320176, 2128858, 2213044, 2298334, 2201449, 2423491, 2260431, 2081735, 2047692, 2070228, 2084664, 2073523, 2263715, 2196208, 2203826, 2104225, 2165192, 2280541, 2280277, 2346385, 2365419, 2386087, 2297854, 2232640]
4404B232640n6583j49986q820J23814J55417J44862O0241m1875j57397j18681
4394B183632Q3741J40697j15658N3841L05674j46358n8091j86469p3532J12750
4384B300227J61857q8378k46195J56765J19969K0406j9643n6227O8245m0383P9008
4373B455651Q0852J9790l7506O6549K64192p1160n122j9967J26677K0060j69265
4362B730751Q3629K40649k06335j77869j6165J97978M273j10347Q1503P580l9009
4351B796638k5495j8427J11990K68984m5662k85971O7203K19302L8130j41327
4341B985365j41139J86294J13999j2270j54184J16778J12651j56998J46578J28828
4331C325902r1108R6760J71337O5918N2025j22136j12148K31249J21030j68409
$$ y = [2232640, 2176057, 2026071, 2017251, 2141065, 2296482, 2441344, 2501585, 2459710, 2302313, 2183632, 2267373, 2408070, 2292412, 2346253, 2651927, 2505569, 2447478, 2261009, 2187477, 2300227, 2462084, 2373706, 2127511, 2284276, 2404245, 2424651, 2405008, 2348781, 2417026, 2376643, 2455651, 2536503, 2556293, 2518787, 2585336, 2849528, 2778368, 2773246, 2753279, 2879956, 2900016, 2730751, 2814380, 3055029, 2848694, 2670825, 2654660, 2852638, 2856911, 2746564, 2828067, 2835647, 2796638, 2771143, 2752716, 2864706, 3133690, 3088028, 2802057, 2869260, 3088562, 3126692, 2985365, 2844226, 3030520, 3144519, 3132249, 2978065, 3094843, 3207494, 3050496, 3197074, 3325902, 3234794, 3331554, 3502891, 3568809, 3620834, 3498698, 3386550, 3617799, 3738829, 3570420]
4321C570420J80156K86361J08818r7042q6490J49045J04007J49236K77937l4170
4311D608278J15901K67852Q9124k17977J14371J13533J31582J01537j46431l7966
4301E139804O3108K42351K15757O7092l3920J56768J13417J81669K29866J95459
4291F571371Q3510J95713K10545n4550J07522O3785J31126R3317J17361J6221
4281G535921J03501K33617m075J5049j8347N597J56052J35633K68649K16646J67052
4270H815295J3432r3314k8281K67185Q0257R8449J71688J51795k19337L8916L0654
4259I326739l3938J16301K39223P4936K480J08371J60010J74874L2551l1562O314
4248A0176299Q6042K45038J09299p3183J22537j95215L86050K54127M6132Q3597
$$ y = [3570420, 3750576, 4036937, 4145755, 4048713, 3962223, 4111268, 4215275, 4364511, 4642448, 4608278, 4724179, 4992031, 5081155, 4863178, 4977549, 5091082, 5222664, 5324201, 5177770, 5139804, 5202912, 5445263, 5661020, 5728112, 5694192, 5850960, 5964377, 6146046, 6375912, 6571371, 6654881, 6850594, 7061139, 7006589, 7114111, 7177896, 7309022, 7402339, 7519700, 7535921, 7639422, 7873039, 7868964, 7884013, 7865666, 7871263, 8027315, 8162948, 8431597, 8648243, 8815295, 8828727, 8735413, 8707132, 8974317, 9054574, 9153023, 9324711, 9476506, 9257169, 9296085, 9326739, 9292801, 9409102, 9648325, 9723261, 9725741, 9834112, 9994122, 10168996, 10201547, 10169985, 10176299, 10262341, 10507379, 10616678, 10543495, 10666032, 10470817, 10856867, 11110994, 11157126, 11240723]
4238A1240723M9357J86889K22703k596J27520K65306J09143K66240J08177r1737
4228A2481725M07233L47974K50936k6172J94676R8695L17273K53072K32912J39963
4218A4698287L45372M55085K66818K92012L93946K48652K65800L64348M06771
4209A7737091M46475N88241L64507N29309P16688N64522L06459N45704N69427
4200B2368423M39738Q28850N72941N69407Q42320Q00853O87617Q01514Q77975
4191B8789638R80287Q44296R16509R72362J273046J428117J349075J389327J435855
4182C9378512J481432J673194J607723J646744J808198K203313K195096J928511
4174E3922723J873397K132087K372798K145337K174718K098282K150338K339146
$$ y = [11240723, 11290080, 11476969, 11699672, 11697076, 11824596, 12089902, 12199045, 12465285, 12573462, 12481725, 12888958, 13236932, 13487868, 13461696, 13656372, 13755067, 14072340, 14325412, 14558324, 14698287, 15043659, 15498744, 15765562, 16057574, 16451520, 16700172, 16965972, 17330320, 17737091, 18183566, 18771807, 19136314, 19665623, 20382311, 20946833, 21253292, 21798996, 22368423, 22808161, 23637011, 24209952, 24779359, 25621679, 26422532, 27110149, 27911663, 28789638, 29769925, 30614221, 31530730, 32503092, 33776138, 35204255, 36553330, 37942657, 39378512, 40859944, 42533138, 44140861, 45787605, 47595803, 49799116, 51994212, 53922723, 55796120, 57928207, 60301005, 62446342, 64621060, 66719342, 68869680, 71208826]
4166G1208826K619915K472836K666074K304530K351769K526570K390504K410870
4158I0951894K383817K220614J814674J908144J680186J433331J520256J453709
4150A05366625J410258J348235J066312Q57752N87614M36920L48842J103o80601
4141A10743060n91854r37731j071488j358751j291796j309506j571601j881060
4133A00729273j858301k230137k314608k373440k477438k433781k787357k860837
4125H1393374k790180l117478l089333k873837k790179k796655k829464k506903
4117E8599345k316880k160103k510959k535263k158441k232756k449286k022653
4109D0213004j930881k141987j857220j786068j595161j772189j583059j183603
$$ y = [71208826, 73828741, 76301577, 78967651, 81272181, 83623950, 86150520, 88541024, 90951894, 93335711, 95556325, 97370999, 99279143, 100959329, 102392660, 103912916, 105366625, 106776883, 108125118, 109191430, 110049182, 110636796, 111073716, 111422558, 111423661, 110743060, 110151206, 109213475, 108141987, 106783236, 105491440, 104181934, 102610333, 100729273, 98870972, 96640835, 94326227, 91952787, 89475349, 87041568, 84254211, 81393374, 78603194, 75485716, 72396383, 69522546, 66732367, 63935712, 61106248, 58599345, 56282465, 54122362, 51611403, 49076140, 46917699, 44684943, 42235657, 40213004, 38282123, 36140136, 34282916, 32496848, 30901687, 29129498, 27546439, 26362836]
4101B6362836j587580j165439j094694j289757j083933q89961j016941q86486
4093A7348045m35260p24092m43769q74211m16892l44911n02077l32946n07455
4084A2766432m81263l85712j46383k33607j71100j23938l34256j63924j72957
4075A0553292j83385k03284k58855j28238j72320j08143j52328j56190k84871
4066H905678l14219N6883Q6795k26672k61843j18837j97826m1888l1620k43635
4056G612816k44244k01095J72583K24102r0639J39752j65019l29932J1038K1709
4046G151071o4582q8852M4329k8796J4239k04225j21741R0744J3028q4396p5593
4035F645226j72429R9462j61912k2253O8796l690k67610o4147L14634J6802n1373
$$ y = [26362836, 24775256, 23609817, 22515123, 21225366, 20141433, 19251472, 18234531, 17348045, 16912785, 16188693, 15744924, 14870713, 14453821, 14108910, 13606833, 13273887, 12766432, 12285169, 11899457, 11753074, 11519467, 11348367, 11224429, 10890173, 10726249, 10553292, 10369907, 10166623, 9907768, 9779530, 9607210, 9499067, 9346739, 9190549, 8905678, 8591459, 8648342, 8735137, 8508465, 8246622, 8127785, 7929959, 7888071, 7856451, 7612816, 7368572, 7167477, 7340060, 7564162, 7473523, 7613275, 7448256, 7118324, 7129362, 7151071, 7086489, 6997637, 7041966, 7013170, 7027409, 6823184, 6701443, 6792187, 6805215, 6720819, 6645226, 6472797, 6572259, 6410347, 6388094, 6456890, 6453200, 6185590, 6121443, 6436077, 6452879, 6401506]
4024F401506O0755l12118L85871j80232N3490J35084j7282P3472l5778K18340
4014F783108J19004k14045J9562N4689J74048K93878J7587l103L71977K24840
4004G841545n6957r9158j40968J49534J143J31537k19757K3314K84326J16329
3994H030888J7208k333n6472K62189J60149L991j57256l38922M3784q6171j37519
3983G739536r9749Q7113R8147j32069j27605J75679M6503M6008q4496k95433K2564
3972G476198o9594J96601k27198L3311J58519K39159J23868k429k6178J69636
3962H071893J55575N6092O0487K19231L9994J10185K46821J00508N2577O4566
3952I177929P6617O1997K03949J64690K02964R0083J99994J88698K7529J47852
$$ y = [6401506, 6462261, 6150143, 6536014, 6355782, 6409272, 6544356, 6527074, 6600546, 6564768, 6783108, 6902112, 6688067, 6707629, 6762318, 6936366, 7230244, 7247831, 7244728, 7616705, 7841545, 7784588, 7685430, 7544462, 7693996, 7695139, 7826676, 7606919, 7630233, 7914559, 8030888, 8048096, 8045763, 7989291, 8251480, 8411629, 8415620, 8258364, 7919442, 7963226, 7877055, 7739536, 7639787, 7726900, 7825047, 7692978, 7565373, 7741052, 7787555, 7833563, 7749067, 7453634, 7476198, 7406604, 7603205, 7376007, 7409318, 7567837, 7806996, 7930864, 7928435, 7902257, 8071893, 8227468, 8283560, 8344047, 8563278, 8603272, 8713457, 8960278, 9060786, 9113363, 9177929, 9254546, 9316543, 9520492, 9685182, 9888146, 9978229, 10178223, 10366921, 10394450, 10542302]
3942A0542302L03989L69147K11160J0173p150J32275P6110J23687K61801L8467
3932A2061961L23622J42430L01329K91865j56557Q0698K82084K71661K60612L37122
3922A4196827K27626L79934K47777J02570N48286N50603L59685M34537K49494
3913A7297339K98718L68758O52634M38123M16767O47788P23204P90580O51261
3904B2285172O83566R08293R03596N93597M49831M69651M56326M73494K57537
3895B7481063K29734N41496O74671P72833P11457P00416P72667Q95097R27272
3886C3706706R22307J001081J049753P71164N41040O67887M58308N46791Q39783
3877D0504820M77324O83067M89942M97766Q01868J109722Q75739J178092J226087
$$ y = [10542302, 10846291, 11215438, 11426598, 11436771, 11429621, 11561896, 11638006, 11761693, 12023494, 12061961, 12385583, 12528013, 12829342, 13121207, 12964650, 13045348, 13327432, 13599093, 13859705, 14196827, 14424453, 14804387, 15052164, 15154734, 15703020, 16253623, 16613308, 17047845, 17297339, 17596057, 17964815, 18617449, 19055572, 19472339, 20120127, 20843331, 21633911, 22285172, 22968738, 23877031, 24780627, 25374224, 25824055, 26293706, 26750032, 27223526, 27481063, 27710797, 28252293, 28926964, 29699797, 30411254, 31111670, 31884337, 32779434, 33706706, 34629013, 35630094, 36679847, 37451011, 37992051, 38659938, 39118246, 39665037, 40504820, 40982144, 41665211, 42155153, 42652919, 43454787, 44564509, 45440248, 46618340, 47844427]
3868D7844427J198030J307447J154097J079059J274118J193563Q29327R61487
3860E6841555P57158Q13338P27002Q41591N85640J010533Q60194O19809Q42809
3851F3899629R89176Q14007O55607O67506L98754K69098J33055J35146K63811
3842F8225789p6989m70001k90472k9517k55424k44752l9590j3622K45732q8467
3832F6962687j51075J16551J67862K88412R802M41666M40194M14541P38174J033116
3822G0461930J182644J381145J355685J755994J985332K059602K489213K595744
3814H5267289L085075L147247L276116L283337L668639L795980L958972M006293
3806A13488948L505083L446943L636281L198042K920031L022375K942157L034215
$$ y = [47844427, 49042457, 50349904, 51504001, 52583060, 53857178, 55050741, 55880068, 56841555, 57598713, 58412051, 59139053, 59980644, 60566284, 61576817, 62437011, 63056820, 63899629, 64888805, 65702812, 66358419, 67025925, 67424679, 67693777, 67826832, 67961978, 68225789, 68148800, 67678799, 67388327, 67358810, 67103386, 66858634, 66819044, 66805422, 67051154, 66962687, 66811612, 66928163, 67096025, 67384437, 67394239, 67835905, 68276099, 68690640, 69428814, 70461930, 71644574, 73025719, 74381404, 76137398, 78122730, 80182332, 82671545, 85267289, 88352364, 91499611, 94775727, 98059064, 101727703, 105523683, 109482655, 113488948, 116994031, 120440974, 124077255, 127275297, 130195328, 133217703, 136159860, 139194075]
3798A39194075L006224K652585K407971K240431K143589J262449R97515N16887
3790A54421726j63719q13805j288259j523877j460120j674686j763987j829181
3782A43904092j539283j271112j147926j002167p77059j006605j023691n48778
3774A35587471m93428l66299j74038L4760J64890K31463K65706L29625L25323
3765A35905473N13921P96017P93395O84244Q81082J017749J268880Q90665J023944
3756A43775370P75358M12633K31449m73491r39520j401282j751306k256047k672131
3747A35701033l063132l078741l538491l695109l697415l845931l836979l461428
3739A07483807l270409l716236l658566l588417l636485l832011l580991l442971
$$ y = [139194075, 142200299, 144852884, 147260855, 149501286, 151644875, 152907324, 153904839, 154421726, 154258007, 153444202, 152155943, 150632066, 149171946, 147497260, 145733273, 143904092, 142364809, 141093697, 139945771, 138943604, 138166545, 137159940, 136136249, 135587471, 135094043, 134727744, 134553706, 134588466, 134753356, 134984819, 135250525, 135580150, 135905473, 136419394, 137215411, 138008806, 138693050, 139574132, 140591881, 141860761, 142751426, 143775370, 144550728, 144963361, 145194810, 144721319, 143781799, 142380517, 140629211, 138373164, 135701033, 132637901, 129559160, 126020669, 122325560, 118628145, 114782214, 110945235, 107483807, 104213398, 100497162, 96838596, 93250179, 89613694, 85781683, 82200692, 78757721]
3731G8757721l586105l556072l257325l065060k832957k403448j977146j633329
3723E6446279j424533j281433j060997n46826k77638j29451J18387j43675K17431
3714E1917544J46417J79017K01371J70896R1534n4680j53336L95650K70911J56804
3704E3322128M41069K32716P5423J39394K85052J6304j81984k39944l37097p92780
3694E2960281p20748p87748j014654q22988j010653j188221r52141o50687r66125
3685D4846316r00772r97884r69006q50516q60845q42066q95042q08577p59882
3676C6961726p07494q90059q25040o14140n43080n83054o19500n35120m56015
3667C1188224k04062j0884j35643J54494J58286k6651L52652K21396J86097M30377
$$ y = [78757721, 75171616, 71615544, 68358219, 65293159, 62460202, 60056754, 58079608, 56446279, 55021746, 53740313, 52679316, 52132490, 51854852, 51725401, 51843788, 51700113, 51917544, 52063961, 52242978, 52444349, 52615245, 52706779, 52652099, 52498763, 52894413, 53165324, 53322128, 53763197, 53995913, 54071336, 54210730, 54495782, 54512086, 54330102, 54090158, 53753061, 52960281, 52239533, 51451785, 50437131, 49614143, 48603490, 47415269, 46463128, 45812441, 44846316, 43945544, 42947660, 41978654, 41128138, 40267293, 39425227, 38530185, 37721608, 36961726, 36254232, 35364173, 34539133, 33924993, 33381913, 32798859, 32179359, 31644239, 31188224, 30984162, 30973278, 30837635, 30992129, 31150415, 31123764, 31476416, 31697812, 31883909, 32314286]
3657C2314286M76882M66646O21568O47172O80332P62019L91273O95010Q15353
3648C7870541P28925P04302P41374J126380J029124R68038Q98150R33380P26361
3639D5726575O79829O29421O28276R21644Q65346J144563J294677J287019J095448
3630E4272798J221783J253930J270384J358022J321859J268468J451283J348068
3622F4766595J072980J514995J679099J402523J898746J779776J700849K032151
3614G7847714K040919K004518K465303K503341K669113K681836K961272L334484
3606I8508500L466877L807707M459975M972843N787288O859994P919524R104737
3598A44887445J0446317J2578147J3955709J5783992J7004186J7322621J7373860
$$ y = [32314286, 32791168, 33257814, 33879382, 34526554, 35206886, 35968905, 36360178, 37055188, 37870541, 38599466, 39303768, 40045142, 41171522, 42200646, 43168684, 44066834, 45000214, 45726575, 46406404, 47035825, 47664101, 48585745, 49451091, 50595654, 51890331, 53177350, 54272798, 55494581, 56748511, 58018895, 59376917, 60698776, 61967244, 63418527, 64766595, 65839575, 67354570, 69033669, 70436192, 72334938, 74114714, 75815563, 77847714, 79888633, 81893151, 84358454, 86861795, 89530908, 92212744, 95174016, 98508500, 101975377, 105783084, 110243059, 115215902, 121003190, 127863184, 135782708, 144887445, 155333762, 167911909, 181867618, 197651610, 214655796, 231978417, 249352277]
3591B49352277J6679809J4391791J1614538Q806201N385595K441069L96925j418118
3583C07650087k287980j734355j634995j274735p40363o61613j633397l060956
3575B94621693n251956p757436j0762057j3579610j5736447j7532620j8321226
3568B05680341j8231303j7409359j6658442j4976407j3110672j1750242j0213398
3561A03330518r003189p722697o562604n643563n011821m485164m006185l324679
3553E7570616l053941k866194k648877k082439j759679j911869j704484j493106
3545D0050027j292933j160105j256664j191520q61280r27424r13564p16813p81880
3536C0947844n08211m62944n78063n38434o23249n34402n76228n76862l99690
$$ y = [249352277, 266032086, 280423877, 292038415, 300844616, 306230211, 308671280, 309068205, 307650087, 305362107, 303627752, 301992757, 300718022, 299977659, 299316046, 297682649, 294621693, 289369737, 281612301, 270850244, 257270634, 241534187, 224001567, 205680341, 187449038, 170039679, 153381237, 138404830, 125294158, 113543916, 103330518, 94327329, 86604632, 80042028, 74398465, 69386644, 64901480, 60895295, 57570616, 54516675, 51650481, 49001604, 46919165, 45159486, 43247617, 41543133, 40050027, 38757094, 37596989, 36340325, 35148805, 34287525, 33360101, 32446537, 31729724, 30947844, 30439633, 29976689, 29398626, 28860192, 28236943, 27702541, 27126313, 26549451, 26149761]
3527B6149761j58883l67328j61842j73516K8685m36800l75408o2326j9590k62194
3517B4160559k42957L1455K57884o2111k23802L8099L0453k4353j17158J76041
3507B4024110L16556K94230K75200M67862M65118M97529O01367P63299O61811
3498B8367082K88813N11032N36387K41383j72794k71449n70065o57512p95476
3489B7477401r85804j093689j135091q50931q54835o66796q79308n86172l77265
3480B0047510p52609p12227n12559m26672k95990l5389l31170j92297j73524l26277
3470A6288796l10445l00847p226j15529k89708k92927l82055j28098k846j05528
3460A4353587J58582J16827P5912m5218o8893m21229n43382m72755j57733k33088
$$ y = [26149761, 25990878, 25623550, 25461708, 25288192, 25316877, 24880077, 24504669, 24442343, 24422753, 24160559, 23917602, 23949057, 24206941, 24144830, 23921028, 23959127, 23989580, 23965227, 23848069, 24024110, 24340666, 24634896, 24910096, 25377958, 25843076, 26340605, 26941972, 27705271, 28367082, 28655895, 29166927, 29703314, 29944697, 29771903, 29500454, 28930389, 28272877, 27477401, 26491597, 25397908, 24262817, 23411886, 22557051, 21890255, 21010947, 20424775, 20047510, 19294901, 18582674, 18070115, 17643443, 17347453, 17312064, 16980894, 16788597, 16615073, 16288796, 15978351, 15677504, 15670278, 15554749, 15265041, 14972114, 14590059, 14461961, 14459115, 14353587, 14512169, 14628996, 14704908, 14659690, 14590797, 14169568, 13626186, 13153431, 12995698, 12762610]
3450A2762610l23767k54586k78433J77212j96476K2790r3788R9542n148L5158
3440A1945114K91132K9372J15595J3025Q2917L62264O10226N90768J7382p33357
3430A3324438p41312l31629m39755l07893Q7446K36967K5278m79209l77749k03126
3420A0793456k15413m60424k25150j91094m25911p9697K07754j7184J89958L47955
3410I924250K72870M23280M69832L81834N97964K82918j93914o71236n62365n70967
3400A0354466o15243m28146l01416o4590J18560n4539J05635O3020m2635m20314
3390H714798l84261l57692K28169j94755k08663J32633o8397k19296K9063J19482
3380G791081J27908J00628J97105K69687K86824J045665Q45311J109943J277474
$$ y = [12762610, 12438843, 12184257, 11905824, 12083036, 11886560, 11909350, 11815562, 11915104, 11909956, 11945114, 12236246, 12265618, 12381213, 12394238, 12477155, 12839419, 13449645, 14040413, 14057795, 13324438, 12583126, 12251497, 11811742, 11503849, 11591295, 11828262, 11853540, 11374331, 10996582, 10793456, 10578043, 10117619, 9892469, 9701375, 9275464, 9195767, 9403521, 9386337, 9576295, 9924250, 10197120, 10620400, 11090232, 11472066, 12070030, 12352948, 12159034, 11487798, 10925433, 10354466, 9739223, 9311077, 9009661, 8945071, 9063631, 9009092, 9114727, 9177747, 9135112, 8714798, 8330537, 7972845, 8201014, 8006259, 7797596, 7930229, 7861832, 7642536, 7671599, 7791081, 7918989, 8019617, 8216722, 8486409, 8773233, 9818898, 10664209, 11774152, 13051626]
3371A3051626J532979O99628L38157n17763r29496j273885j168068j022794p88376
3362I922008q75937o50887k40202m39030k08344l00941j07790J89381p1452j54110
3352G062696J98948J20394L15535L42944L85457N72681Q88051R47204J322740
3343A2156650J247927O89476k65829p76126j031429j019552j104584j034975r46984
3334G914574o56394n42788m75588m01690k56732m8885j29119j92122l14005r1049
3324D806202j60595j18801o0052l1608J01585j57478k00393N2103P058l2171k95924
3313C909926P5630O867k4042J9687L2743l4579K89769K00805j27182Q3696r6448
3302D336872Q1287P428k2196L4004j39709j56334N7682J31966J27818K9467j81059
$$ y = [13051626, 14584605, 15284233, 15622390, 15104627, 14175131, 12901246, 11733178, 10710384, 9922008, 9046071, 8395184, 8154982, 7715952, 7507608, 7206667, 7098877, 7288258, 7216806, 7062696, 7261644, 7382038, 7697573, 8040517, 8425974, 8998655, 9886706, 10833910, 12156650, 13404577, 14094053, 13828224, 13052098, 12020669, 11001117, 9896533, 8861558, 7914574, 7258180, 6715392, 6239804, 5838114, 5581382, 5532497, 5403378, 5211256, 4897251, 4806202, 4645607, 4526806, 4466754, 4435146, 4536731, 4379253, 4178860, 4230963, 4238021, 4205850, 3909926, 3985556, 3992423, 3968381, 3988068, 4020811, 3986232, 4276001, 4476806, 4349624, 4433320, 4336872, 4418159, 4425587, 4403391, 4437395, 4297686, 4141352, 4199034, 4331000, 4458818, 4488285, 4307226]
3291D307226J20185l4854Q3944o9352k78570m335k1814k32139k34014k14805K4763
3280C446235l065M4968j03099n1489j47959l69220K30859J87485q5128j9512q6746
3269C043329P4690o7238J48123K6260q7607n1916k07262L3912q5260K98825K02631
3258C328487k7097k6105j58139J93831j74142l17263o2710o0951K97922K6269
3248C020102j93624J03263n9020J16507Q4757k9141m0964L6549Q4872k2730j75749
3237B924822l7553J29099J5620P296M6034J436K03037J3131J29354J47341K31338
3226C810955M3561M1044R5638O7289L27618j47866r165j53200k61383k02892P8186
3215C689785L1282R1990n346j1228K7858L400k83683J68453L05613j65024r7159
$$ y = [4307226, 4427411, 4392557, 4476501, 4407149, 4128579, 4124244, 4102430, 3870291, 3636277, 3421472, 3446235, 3443170, 3488138, 3385039, 3333550, 3185591, 2816371, 3047230, 3234715, 3149587, 3130075, 3043329, 3118019, 3050781, 3198904, 3225164, 3137557, 3085641, 2878379, 2912291, 2827031, 3125856, 3328487, 3301390, 3275285, 3117146, 3310977, 3136835, 2819572, 2756862, 2695911, 2993833, 3020102, 2826478, 2929741, 2870721, 2987228, 3071985, 3042844, 3001880, 3038429, 3123301, 3100571, 2924822, 2887269, 3016368, 3031988, 3039284, 3085318, 3086754, 3289791, 3302922, 3432276, 3579617, 3810955, 3854516, 3895560, 3991198, 4058487, 4386105, 4238239, 4229074, 4075874, 3814491, 3611599, 3689785, 3721067, 3813057, 3807711, 3796483, 3824341, 3827741, 3544058, 3712511, 4018124, 3853100, 3755941]
3204C755941K25173j32912P2502l2119J53286K26705K38960L10771J93475O7751
3194E079533K54609K25950J44345O6351Q8866L1503J1563j64386j20204o9280
3184E548850j54438P5818J03499J23103j44103r2006P6182R2719j254J7592J67026
3173E812988J02570Q680J21189J04123J0704j40193N5041J51707J88239K20505
3163F635553K54696L49423K44769J46000J90154K20490K44395O0010k5161j16321
3153H204008L0982j80379j84833m12440o3062p9538k99661j85492l48638j56424
3143F324523j91831J95892M5977L6984J21595L2973K99864N8199m9991L28387
3133G202572N4359J97169P5459J30885Q5776j74902p9423O2260j65232l50413
$$ y = [3755941, 3981114, 3848202, 3920704, 3888585, 4041871, 4268576, 4507536, 4818307, 5011782, 5079533, 5334142, 5560092, 5704437, 5770788, 5859654, 5891157, 5902720, 5738334, 5618130, 5548850, 5394412, 5470230, 5573729, 5696832, 5552729, 5460723, 5536905, 5629624, 5628370, 5645962, 5812988, 5915558, 5924238, 6045427, 6149550, 6160254, 6020061, 6075102, 6226809, 6415048, 6635553, 6890249, 7239672, 7484441, 7630441, 7820595, 8041085, 8285480, 8345490, 8320329, 8204008, 8234990, 8054611, 7869778, 7457338, 7394276, 7314738, 7015077, 6829585, 6480947, 6324523, 6132692, 6328584, 6374561, 6411545, 6533140, 6566113, 6865977, 6924176, 6874185, 7202572, 7256931, 7454100, 7529559, 7660444, 7746220, 7571318, 7491895, 7554155, 7388923, 7038510]
3123G038510m6405j0865k57551l75122j82067l94534l4324m09226k6549N4980
3113E356847j812k02961j90217L0736J06269l2298j13846J82161r530j03540K7720
3102E049529N9034n557k90417j00810l99433j29626k02053j58899k13192k38605
3092C369971j11199j0814O6168j94444k3745m7982K5045j18830m8127j94927k02233
3081B508883K5989j48192k2250J66347r4908k74762J71543R5027j48475j23703
3071B155499r8669r951L935p5203m5640j8686k79849J2682K4911M9704Q1447j12637
3059A687543P506J3249m3119L0542L3583K4712q3133j55172l16320m3681P5333
3048A231043J87389j98437k56O9051M1095J4013n6683p5134p9045k28564J64074
$$ y = [7038510, 6992105, 6981240, 6723689, 6348567, 6166500, 5771966, 5737642, 5328416, 5301867, 5356847, 5355035, 5152074, 4961857, 4992593, 5098862, 5066564, 4952718, 5134879, 5125349, 5021809, 5049529, 5108563, 5103006, 4812589, 4711779, 4312346, 4182720, 3980667, 3821768, 3608576, 3369971, 3258772, 3247958, 3314126, 3119682, 3095937, 3047955, 3073000, 2954170, 2906043, 2711116, 2508883, 2534872, 2386680, 2364430, 2530777, 2435869, 2161107, 2332650, 2427677, 2279202, 2155499, 2056830, 2046879, 2050814, 1975611, 1929971, 1911285, 1631436, 1644118, 1669029, 1718733, 1800180, 1687543, 1695049, 1708298, 1665179, 1695721, 1729304, 1754016, 1670883, 1515711, 1199391, 1155710, 1231043, 1418432, 1219995, 1219739, 1288790, 1329885, 1343898, 1287215, 1212081, 1133036, 904472, 1068546]
3037A068546N9326j17151N2175J08899j09845M293R3675k9521P0482k00887j38025
3026H61967R8889M0346J53678o3298L1327j50639k70387R3072M1726j82613Q9797
3015G43865P0692o3014J74994k71646j15787J22157N3235k7547j01180J55349
3005G41118j93027m8975K5952p3012J40448j34189K43403J8185l8093k02521Q3225
2994E62514K1625j9032j50514J10591p3690p6145M7506j21774J87046j05923N3737
2983D35941J04538j19542J07285N2460K899l0662J41471L8361n8245j54236l5064
2972D85206l2856K1819K2180R1692P8475k23846k1596m1718J3342k72010L9220
2961A59908J54924o2873r1273K15987j9057m6527k51908j16504K18338J20111
$$ y = [1068546, 1127872, 1010721, 1062896, 1171795, 1061950, 1066243, 1159918, 1130397, 1200879, 999992, 861967, 960856, 1001202, 1154880, 1091582, 1122909, 972270, 701883, 794955, 836681, 654068, 743865, 814557, 751543, 926537, 654891, 539104, 661261, 714496, 686949, 585769, 741118, 548091, 499116, 525068, 452056, 592504, 458315, 701718, 719903, 681810, 479289, 562514, 584139, 565107, 414593, 525184, 451494, 375349, 422855, 301081, 488127, 382204, 435941, 540479, 420937, 528222, 580682, 583581, 552919, 694390, 732751, 674506, 520270, 485206, 452350, 474169, 496349, 588041, 666516, 442670, 421074, 379356, 392698, 120688, 159908, 314832, 251959, 160686, 376673, 357616, 311089, 59181, -57323, 161015, 281126]
2951B81126n0129M7745K04043j39286m7795Q4725p5381j7052l6965Q4996j02182
2940B33845K3816J0801K11533j60755j40926J01687K16634Q6328j28128l4392
2930D20443r2342R8353p1379o1336j44856J12595K30443j59560j00608K7568j49763
2919A09558R040J49238K31053l3586N577n8120J5895j86965L1862l9413p0914
2908A63225J69411K5792l9850j01357q9085K41520K6231j85478p8221M0973P691
2897A80852O1633L0736Q4284q4023k81512K42717J3401O9935p8102M2519k08316
2886G4124j86317K06447n5605J7869J8154Q5411O0598J76450j34755j9338J720
2875B44758r9138J74510l2139j02252J29014J19675j3915q7444j40261p0028n7844
$$ y = [281126, 230997, 278742, 482785, 343499, 295704, 380429, 305048, 287996, 251031, 336027, 233845, 257661, 268462, 479995, 319240, 178314, 280001, 496635, 582963, 454835, 420443, 328101, 426454, 355075, 293739, 148883, 261478, 491921, 332361, 231753, 259321, 109558, 118598, 267836, 498889, 465303, 470880, 412760, 428655, 241690, 273552, 234139, 163225, 332636, 358428, 318578, 217221, 128136, 369656, 395887, 210409, 132188, 173161, 180852, 242485, 273221, 357505, 273482, -8030, 234687, 248088, 318023, 239921, 282440, 74124, -112193, 94254, 38649, 56518, 74672, 160083, 220681, 397131, 262376, 243038, 244758, 145620, 320130, 287991, 185739, 314753, 434428, 420513, 333069, 192808, 122780, 64936]
2864F4936j133l7122P3152J39768m8837n0190j3543K22251j92518q0954J25805
2853B01615J36418O0469k31419J63672p4321o6119J55810r7647j5449J88046l1804
2842C89271k0988J43375j23549j6210k1980O0968o6120j86426j59378q7734j00586
2831a89357J37648M0404l7117K22838L4232l3088R4575M1076n9206l7005N6861
2820B71861p7478k0585j56600N3972K48194p6823l4655R6960J2481l55614P1825
2809C3538k03775K22291P1157J35024J694j09455k1294m910k38774K4319R6601
2798F416l041R7545Q8806R6876k54165J43990K43659n793k73236K9851J3434j0716
2786A73626l2855l9433n6329K49173j43445r7395L35622k23737L4238j68004l3004
$$ y = [64936, 63803, 26681, 99833, 239601, 190764, 140574, 127031, 349282, 156764, 75810, 201615, 338033, 398502, 167083, 330755, 256434, 190315, 346125, 248478, 233029, 421075, 389271, 368283, 511658, 388109, 371899, 349919, 410887, 344767, 158341, -1037, -88771, -189357, -51709, -11305, -48422, 174416, 208648, 175560, 270135, 311211, 252005, 215000, 271861, 194383, 173798, 17198, 71170, 319364, 242541, 207886, 304846, 317327, -38287, 33538, -170237, 52054, 123211, 258235, 259929, 150474, 129180, 124270, -114504, -90185, 6416, 3375, 100920, 189726, 286602, 32437, 176427, 420086, 414293, 141057, 170908, 184342, 173626, 140771, 101338, 45009, 294182, 150737, 53342, 388964, 165227, 199465, 31461, -1543]
2775a543O5335o9000J39923J01212r9897O4649K75800j2048j90207j05139L26460
2764D95545r8754p0474M2719j90609M0567l5307k88J57563p2390j55229l3212
2753H0131O8884M5429r6370O7779r751P7270j26239j48851R504M5182Q9669J5811
2741A18448J74699J7664l07369j6214O4855P466M5827k6632J53975J8894N3425
2730C05038q7322J04612k24200n8158p9002P2780J93433k998k8759j97888P3742
2719G1278J39554q6307m1025J39297j08858J7046J29156J26443k66743k48997
2709a29156K77861j30842k11582J92499J5096J31365Q5486j32405L6247l5595
2699I8974j77334L3797M8983P4366J45407n3953M2139k3888j33559m6372K11549
$$ y = [-1543, 63792, -5208, 134715, 235927, 136030, 200679, 476479, 464431, 274224, 169085, 495545, 396791, 326317, 369036, 178427, 218994, 183687, 183399, 340962, 268572, 113343, 80131, 149015, 194444, 98074, 165853, 156102, 233372, 107133, -41718, -32214, 12968, 102637, 118448, 293147, 310811, 3442, -12772, 52083, 59549, 105376, 78744, 232719, 251613, 305038, 217716, 322328, 98128, 39970, -39032, 33748, 227181, 224183, 195424, -2464, 71278, 210832, 124525, 83500, 222797, 113939, 130985, 260141, 386584, 119841, -129156, 148705, 17863, -193719, -1220, 13876, 145241, 230727, 98322, 134569, 98974, -78360, -44563, 4420, 78786, 224193, 170240, 212379, 188491, 54932, 8560, 220109]
2688B20109J36824o0706k40023k55716L1692K34742l4684J48074o6054q4701j5230
2677A4327l5753L8177N57Q8480O0599j12633o0785K98252k07769K22745J81440
2666D87637k02627j45949k4925r5242K64140l1212M4482L8701j20553K01286j1463
2655D04275n7653Q389q3229n3006l8593L5962p0086n5500O4463M6546O0848J10463
2643C72879m6125L2351j02107J8263P1988k12892R0002J53307J3505J53329j9378
2632E25122k26604O7343j18933q8491r4567K63191K67353O2283O8109P436K0636
2621G52878q1048k12802j17738j15524n7807o908r4642J19497m2251J09216N4688
2610C07559R5444j64049n1345J58895k59032K55984O675j55222P4457j0090q5998
$$ y = [220109, 356933, 296227, 56204, -199512, -167820, 66922, 32238, 180312, 114258, 29557, 14327, -21426, 16751, 17308, 105788, 166387, 53754, -7031, 291221, 83452, 306197, 487637, 285010, 139061, 114136, 18894, 283034, 251822, 296304, 335005, 214452, 415738, 404275, 346622, 355011, 271782, 218776, 180183, 216145, 146059, 90559, 155022, 201568, 262416, 372879, 326754, 359105, 256998, 275261, 347249, 134357, 224359, 377666, 391171, 544500, 525122, 298518, 365861, 246928, 158437, 63870, 327061, 594414, 656697, 724806, 732242, 752878, 671830, 459028, 341290, 225766, 167959, 161051, 66409, 185906, 143655, 252871, 307559, 403003, 238954, 187609, 346504, 87472, 343456, 350131, 194909, 269366, 259276, 173278]
2599A73278P1147K4771m7975Q64L0780k39030j41756m4418J16238M2333K6753
2588A2985j94614J21511Q8196j6134J75258o8411J29449K2768p0056r2931J1923
2577A19944n5446j3044J26046k3843k2871j22770R8401k8067K55554j02507p0750
2566A60647K6100J06850k26727j07074J66797K3853L7977k6298j4950J402j04827
2555D3750k5872J49327k950J00445l0979L8289l0885k25718O9478J54904k0886
2544B18903M6013o9778j01163O4917J68664J9656O2430k51306J2924P945J33099
2533C12304j23519K81750o239j7394J29135k46058k1017J42300k3229J4384j82776
2522B59641p4151M8030M5304K45560J33829k36548P2346J15225j4037K9105J6126
$$ y = [173278, 244425, 269196, 221221, 222085, 252865, 13835, -127921, -172339, -56101, -13768, 12985, -181629, -60118, 28078, 11944, 187202, 118791, 248240, 271008, 200952, 108021, 119944, 64498, 51454, 177500, 153657, 130786, 8016, 106417, 78350, 333904, 231397, 160647, 186747, 293597, 66870, -40204, 126593, 150446, 188423, 162125, 147175, 148577, 43750, 17878, 167205, 164255, 264700, 233721, 272010, 241125, 15407, 84885, 239789, 218903, 264916, 195138, 93975, 158892, 327556, 347212, 409642, 158336, 171260, 179205, 312304, 188785, 470535, 464296, 446902, 576037, 329979, 308962, 451262, 428033, 442417, 259641, 185490, 233520, 278824, 524384, 658213, 421665, 494011, 609236, 595199, 624304, 640430]
2511F40430j80178L4479j20728r0638P8189k0987J70881O9481Q1843l66452N6870
2500C53190L85119K32509j69277j55010j2286J09099J04789p3605P35j64884P7742
2489F88121Q260n6250j5361O2822N7712J87491j60192q0034O4866J84971k01165
2478G41241m5370K13764N9965Q312J27267N064k74285O8552J7455J49610J08574
2467A180149k4550j5266M3876J15771r3082O290l928k9069K3483K941Q9894n9544
2455A236965P4179J5101N3680K65197l1412O0860R2459J55539q3860j72698J66458
2444A832468J39935J76526J14385j01045J4195K32044l1578J55396j1773Q0502
2434B601055L13530J15908Q3036O7420L6635J83241j7437J72835J14376J34394
$$ y = [640430, 460252, 494731, 374003, 283365, 361554, 340567, 511448, 580929, 662772, 296320, 353190, 738309, 970818, 801541, 646531, 634245, 743344, 848133, 774528, 775263, 610379, 688121, 696381, 640131, 624770, 687592, 745304, 932795, 772603, 692569, 757435, 942406, 741241, 695871, 909635, 969600, 977912, 1105179, 1110243, 835958, 904510, 921965, 1071575, 1180149, 1155599, 1140333, 1184209, 1299980, 1206898, 1213188, 1209260, 1180191, 1203674, 1206615, 1296509, 1236965, 1311144, 1326245, 1379925, 1645122, 1613710, 1674570, 1767029, 1922568, 1838708, 1666010, 1832468, 1972403, 2148929, 2263314, 2162269, 2176464, 2408508, 2376930, 2532326, 2520553, 2601055, 2914585, 3030493, 3113529, 3180949, 3217584, 3400825, 3383388, 3556223, 3670599, 3804993]
2424C804993J01768K09160K10093L66639O8851K12235L33905L75737N044m4614
2414E643811J53959M30127J7533K67364L09629J53460J63606J68346J87475J63012
2404G658322K35728L08069j1506L95571J56634L15836L10531L60922J17936J66922
2394A0014965J36371R7732M49141N00522K64621K54775M68683N58304N49330M99775
2384A3794219P53196P32656L94425N05804N17870M69517O47131N98222Q39644
2375A9252684J008053J193247J369250J282660J056717R36588J113105R64168
2367B8176472J649449K276331K709133L981485N550106P822429J1075329J5317631
2359G8558365J7912044J7775499J0369732J073431o331466p691578j2556188j5534134
$$ y = [3804993, 3906761, 4115921, 4326014, 4692653, 4761504, 4973739, 5307644, 5683381, 5688425, 5643811, 5797770, 6227897, 6245430, 6512794, 6822423, 6975883, 7139489, 7307835, 7495310, 7658322, 7894050, 8202119, 8190613, 8586184, 8742818, 9058654, 9369185, 9730107, 9848043, 10014965, 10151336, 10249068, 10698209, 11198731, 11463352, 11718127, 12186810, 12745114, 13294444, 13794219, 14547415, 15280071, 15674496, 16180300, 16698170, 17167687, 17814818, 18413040, 19252684, 20260737, 21453984, 22823234, 24105894, 25162611, 26099199, 27212304, 28176472, 29825921, 32102252, 34811385, 38792870, 44342976, 52165405, 63240734, 78558365, 96470409, 114245908, 124615640, 125689071, 119357605, 111666027, 99109839, 83575705]
2351H3575705j5111972j3543800j0301236p455917n454516m317939k923965k445867
2343B2020493j576082j548063j450442j470789j212723j114397q82088j124890
2335A1641019j143693j069053p44837m02813n50061m97915l60211j20524o78231
2326F073681m73626k16024k84676k52758j39458q1147j87367k40449k12403q7720
2316C898053j83790j79019n7954j96199J87091j02467m7055j14789k62534j62209
2306B779128j38357p5248j46888R0978k3954m2987k26935o7098J13937J2658q6036
2295B189198l26638j49077j22946j4629l013m6747J15777m0594O6476j90136k043
2284A475628k14910J45756O9167j25392o4835L1201o3267j30880l57992L4876
$$ y = [83575705, 68463733, 54919933, 44618697, 37162780, 31708264, 27390325, 24466360, 22020493, 20444411, 18896348, 17445906, 15975117, 14762394, 13647997, 12765909, 11641019, 10497326, 9428273, 8683436, 8280623, 7730562, 7232647, 6872436, 6751912, 6073681, 5600055, 5384031, 5099355, 4846597, 4707139, 4625992, 4438625, 4198176, 3985773, 3898053, 3714263, 3535244, 3477290, 3281091, 3468182, 3365715, 3318660, 3203871, 2941337, 2779128, 2640771, 2565523, 2418635, 2509613, 2485659, 2442672, 2215737, 2148639, 2262576, 2275234, 2189198, 1862560, 1713483, 1590537, 1575908, 1572895, 1526148, 1641925, 1601331, 1667807, 1477671, 1475628, 1260718, 1406474, 1475641, 1350249, 1285414, 1316615, 1253348, 1122468, 764476, 799352]
2274G99352R2327J21874L1453j0302L1029r2846j57221K1561p379j57479q7654
2263E84715J29652l9004m007j20536L9062K26343k20415j1451k13944k49449J67521
2252B88487R5397O1837J521K399j33583J20415J22451K0450j89340J18853n049
2241E03838j65134J42231j4506p2912p6354J02294o3916l2025n8486m9579J06500
2230C21951O8931j22712l9194J64971j1549l0203R8498O9146k77095K12136j87423
2219B67457J566j39303j91488L46179n8049J47980j23933J76491r1948k32328
2209A02624J17219m9283j07453Q7048R8745r4558j10149J9432k4786P507k8606
2198A7740j31647N3440n1143K24668M8694J59635J3314M9625J34224j56431l7161
$$ y = [799352, 891679, 1013553, 1045006, 1034704, 1065733, 972887, 815666, 837227, 829848, 672369, 584715, 714367, 675363, 671356, 550820, 589882, 816225, 595810, 584359, 370415, 120966, 288487, 383884, 445721, 447242, 449641, 316058, 436473, 558924, 579374, 390034, 508887, 503838, 338704, 480935, 466429, 393517, 317163, 419457, 355541, 323516, 265030, 215451, 321951, 390882, 268170, 228976, 393947, 382398, 352195, 450693, 519839, 242744, 454880, 267457, 269023, 129720, -61768, 284411, 226362, 374342, 250409, 426900, 334952, 102624, 219843, 170560, 63107, 150155, 248900, 154342, 44193, 63625, 38839, 46346, 17740, -113907, -60467, -111610, 113058, 161752, 321387, 334701, 384326, 518550, 362119, 324958]
2187C24958j41916M9276J9987N8877k5248k8186p7548j70717K05571K32306k55201
2176A92159j91374K9676J52133k1390j57973j3308J60540j3779J8370L04444M7877
2165E07375l57428j9965o4523q0606l6360J47509O1085p2182j15676J28542M4414
2154A42185k35874k06465J43289L82054n1049j87861K77937j97919r4341J55813
2144A27769J39546P1082j47050j6096j46748J56749j04814k5407J69346k7296
2134A97081j11810P5066K28598N427j56944k31122r4349O6396o1750R1122J27487
2123A35202K7230l4110J4826N8020J61329K9674k35688M5696k66332n1048J44249
2112B9048N8266L8816l9080p1265q835J49648j63324j40331n4173J12907J36788
$$ y = [324958, 183042, 232318, 252305, 311182, 285934, 257748, 180200, 9483, 215054, 447360, 192159, 785, 30461, 182594, 161204, 3231, -10077, 150463, 136684, 155054, 459498, 507375, 149947, 129982, 65459, -15147, -51507, 96002, 157087, 84905, -30771, 97771, 142185, -93689, -300154, -156865, 225189, 174140, -13721, 264216, 66297, -28044, 127769, 267315, 338397, 191347, 175251, 28503, 185252, 80438, 55031, 224377, 197081, 85271, 160337, 388935, 394362, 237418, 6296, -88053, -21657, -83407, 7715, 135202, 162432, 128322, 143148, 201168, 362497, 392171, 156483, 202179, -64153, -115201, 29048, 87314, 126130, 87050, 15785, 6950, 156598, -6726, -147057, -201230, -88323, 48465]
2101D8465R7080r5147m9402J23906J64192m4562j08402j955J85926J35348j53882
2090C01567m1909R2751J77172l2629n128k9099J18880l3899l50426j45029N3731
2079A05982P9691j5674M6451J7205l40020J49799J43151J50042l4866n1629j20700
2068A29432q5115l04223N7142J82010J30865N282N6292j57498Q0205n6717p4225
2057c6550K17978n3935p3910k05780J02812M2038J81589q3820Q2779j39225k2647
2046A1329k4677K2975j73364J00818J98401k19319k5407J23910p6911R7767N919
2035D1441J4775j00391l6135n3278J12819J30010L9602l2585k31924N2552J29958
2024F6844k86861j7517n0353M9951L03837j4914n370j27834k01377J9756N6107
$$ y = [48465, 145545, 50398, 996, 124902, 289094, 244532, 136130, 134175, 320101, 455449, 301567, 259658, 352409, 529581, 496952, 491824, 462725, 581605, 547706, 197280, 52251, 105982, 185673, 169999, 216450, 233655, -106365, 43434, 186585, 336627, 301761, 250132, 129432, 44317, -259906, -202764, -20754, 110111, 115393, 171685, 14187, 94392, 37675, -36550, 181428, 127493, 53583, -152197, -49385, -7347, 174242, 90422, 173201, 33976, 11329, -13348, 9627, -163737, -62919, 135482, -83837, -109244, 14666, -62245, 35522, 41441, 56216, -44175, -80310, -133588, -20769, 109241, 148843, 116258, -115666, -63114, 66844, -220017, -237534, -287887, -237936, 65901, 50987, 45617, -82217, -283594, -263838, -207731]
2013b07731m413Q1585K22062L9730j63632k0526J47724K8692j2720j80331M1062
2002b8498J25497j12993l5617N1237k31721K66346K1027j02666r4303j50511K77070
1991a5132j25683M0910J55387l4810o5728L6J63822k02976j79538Q5301J09773
1980f8638n3044J51944o2744n7071J41294M8879Q2825r9677j51299n2823M7444
1969g2910J6159r6464o5351J31877J98807N6180j46747j64363J34946j52209j2111
1958a72186K2263j3939J79939r6652J46481p8497O6184q9540p7079L04081J45524
1947C36579l01390k16244J6783j0895k18766J90782K21938m2133j08667M2901
1937h9112K39890R8731q966j79551P5179R038j07898J08062j26445j5542P6008
$$ y = [-207731, -212144, -130559, 91503, 131233, -32399, -52925, 94799, 123491, 110771, -69560, -28498, 96999, -15994, -51611, -374, -232095, 34251, 55278, -47388, -141691, -292202, -15132, -140815, -99905, 55482, 20672, -45056, -45020, 118802, -84174, -263712, -178411, -68638, -121682, 30262, -32482, -89553, 51741, 100620, 183445, 83768, -67531, -120354, -72910, -56751, -153215, -218566, -86689, 112118, 168298, 21551, -142812, -7866, -160075, -172186, -149923, -163862, 16077, -80575, 65906, -12591, 53593, -35947, -113026, 191055, 336579, 35189, -181055, -164272, -175167, -393933, -203151, 18787, -23346, -132013, -89112, 150778, 249509, 240543, 60992, 136171, 145209, 37311, 145373, 18928, 3386, 79394]
1926G9394K4952j8580K5271j36933Q592J59244O2989k30891l469j29867n794j4909
1914a80001K59653l6171k5800p3285R0414m0320J04078k06527j39417q376k5187
1903b80939J93149k9079L1924J19037n5142P3566J64369N3379p2923j30896o6299
1892A46L1592K7778r3456O3798J6315L2320m9365k05176m4607O2932J14816Q4883
1880D1976o5003n7571J65921R3019j06156q8574j08913J35219L8365J7214k32568
1869a67071N052L2379p352k9345L15114J1667j35009n7944J02231p2950k40828
1858b44056J20499K66707p0503k11169k9100J40432J9515K55740l8144k37498
1848b7577p6659j46804j12223J51729K27570O5632J7360O3975l03712R4258J88759
$$ y = [79394, 104346, 85766, 111037, -25896, -17304, 141940, 204929, -25962, -29431, -159298, -165092, -180001, 79652, 43481, 17681, -55604, 34810, -5510, 98568, -107959, -247376, -255752, -280939, -87790, -116869, -84945, 34092, -21050, 52516, 216885, 270264, 197341, 66445, 146, 31738, 59516, -33940, 29858, 46173, 78493, 29128, -176048, -220655, -157723, -42907, 41976, -23027, -80598, 85323, 178342, 72186, -16388, -125301, 9918, 48283, 65497, -167071, -162019, -129640, -136992, -166337, 148777, 160444, 25435, -32509, 69722, -3228, -244056, -123557, 143150, 72647, -138522, -167622, -27190, -7675, 248065, 209921, -27577, -104236, -251040, -363263, -211534, 16036, 81668, 99028, 163003, -140709, -46451, 142308]
1837A42308j20963k12274R5707j66629J5949K05140L9185M349n7110N2031j5338
1826a7645J8687K5097k63240l9311K87038n0960J30222k4538j92061J89137J25897
1815A88323n7621j04924j7870n1786L5757m2068K14543k08364l3940J80223O8936
1804A71209l9024j93114P2385Q2082Q7766j61030O6442j48383p5366j24621K28530
1793c3124Q8379j20829L3793M351l6770n1272O098j76371J33744J20912j90482
1782b21571Q0328J45788j7654j02803q199j1981o1682K6112J3697j2272M029q4749
1770b50957J07497l6103r478J02442j08448o247J28198m1870J27089m107N7479
1759F5495j04556K6232J38245j94614L0204j17550o2744Q8397Q9834J28141r9779
$$ y = [142308, 21345, -190929, -95222, -261851, -245902, -40762, -1577, 2772, -54338, -2307, -17645, 1042, 26139, -237101, -276412, 10626, -40334, 89888, 65350, -126711, 62426, 188323, 130702, 25778, 7908, -43878, -8121, -50189, 164354, -44010, -77950, 102273, 171209, 132185, -60929, 11456, 93538, 181304, 20274, 86716, -61667, -137033, -261654, -33124, 55255, -65574, -31781, -27430, -64200, -115472, -109374, -285745, -152001, -31089, -221571, -141243, 4545, -13109, -115912, -124111, -136092, -197774, -171662, -157965, -170237, -166208, -250957, -143460, -179563, -189041, -86599, -195047, -201294, -73096, -114966, 12123, 8016, 65495, -39061, -12829, 125416, -69198, -38994, -156544, -219288, -130891, -41057, 87084, -12695]
1748a2695k19337L9740R0113J51111K52810l14641k42575J76272j7078K3378p4718
1737a47620Q793J34919q4833O9509K14227J03126l53546K14445q1070j20616q2682
1726a25348p5819K7154M6603j0498L9274M9741p6816J64059k4381j1774q9679
1715h7484j39887P0622J23735l7187p6658Q3696O6026Q855L0848N4639k01074
1704a03869q3120k1374k3564J40778j83785K38278J16561n7933m9378o5286k19001
1693c11693Q0454R4416J24637J00493k816j12663o1818J34144J42063r5460o8130
1682B3627L2408k17297n0847P4584J25640N7278p4391j61643J11956j33333J07870
1671a04148J49717o6966R466R5017K63823j9949q2522j25791P7483N9296j60252
$$ y = [-12695, -232032, -192292, -102179, 48932, 301742, -12899, -255474, -79202, -96280, -72902, -147620, -138827, -3908, -88741, -19232, 194995, 298121, -55425, 159020, 77950, -42666, -125348, -201167, -174013, -127410, -137908, -98634, -48893, -125709, 38350, 13969, 2195, -87484, -227371, -156749, -33014, -70201, -146859, -63163, 2863, 11718, 42566, 97205, -103869, -186989, -208363, -231927, -91149, -274934, -36656, 79905, 21972, -27406, -92692, -311693, -231239, -136823, -12186, 88307, 85491, -27172, -88990, 45154, 187217, 91757, 23627, 56035, -161262, -212109, -137525, -11885, 45393, -28998, -190641, -78685, -212018, -104148, 45569, -21397, -11931, 83086, 346909, 326960, 244438, 118647, 196130, 255426, 95174]
1660I5174j89920o7926m1065R0232M5603j21203K38916k58313O8625J32044M9486
1649D1653r5881p9619J21952j26508p01j72605J37798P2145J3964j46378K48214
1638A4034j0652K13725j33453m1490p4106n3782q7907M950K19749k27261J26126
1627e0067J11388l09853L7753J74278k12522J79498M2515R9298M7258k43044j10993
1616b34491Q5868k6902Q0086L3347j59040P4525J88401j64949Q4099L9884j68809
1605a67981Q6287R4317O196m6572j10156J1171l2098J56519J4413j89750m1371
1594b19025K27328k31225K5931J97637n0828j30789M4993K35753r8129Q908k6154
1583a5600m0330j8952L5652J38603p3627j78629J79482j19388o0257n3641O2731
$$ y = [95174, -94746, -162672, -203737, -113505, -67902, -189105, 49811, -208502, -139877, -7833, 41653, -54228, -133847, -11895, -138403, -139104, -311709, -173911, -101766, -87802, -234180, 14034, 3382, 217107, 83654, 42164, -31942, -85724, -173631, -168681, 51068, -176193, -50067, 61321, -248532, -210779, -36501, -249023, -69525, -27010, 72288, 119546, -123498, -234491, -148623, -175525, -95439, -62092, -221132, -146607, 41794, -123155, -39056, 828, -167981, -81694, 12623, 18819, -27753, -137909, -126738, -158836, -2317, 12096, -177654, -219025, 8303, -222922, -196991, 646, -50182, -180971, -135978, 99775, 1646, 10554, -15600, -55930, -74882, -39230, 99373, 25746, -152883, 26599, -92789, -153046, -206687, -143956]
1572a43956J71389j30909j5000j47412n3060L26280q6413J28447J24530k37787
1562f3891J61897o0118p4932M9793J669k09778J02633m9856R2859n6269q1239
1551a87232J06000P654J5461q4233J26229O1465N9368Q6754j64654l17572O4700
1540b26060N3037L147J5444K869j14502J36774P3366J80982k86643n3108L33364
1529A18670J12181j02488J57186l0552j80769r8650l6868P0603J89419o6535j82183
1518d9986O8465J487Q3286k7976o8567j9078L7711k47360K43119j16984j20714
1507b16597L4314J4294R8328J02843j97769k42921K55297Q5558L407L8636k18551
1496b43161L4583N0223j02526K0530m34j8764K68618M1134j31510j18835R5591
$$ y = [-143956, 27433, -103476, -118476, -265888, -318948, 7332, -79081, 49366, 173896, -63891, 98006, 37888, -37044, 12749, 14418, -195360, -92727, -142583, -49724, -105993, -187232, -81232, -73578, -58117, -142350, -16121, 45344, 104712, 191466, 26812, -290760, -226060, -173023, -169876, -154432, -151563, -266065, -129291, -55925, 125057, -161586, -214694, 118670, 230851, 128363, 285549, 254997, 74228, -24422, -61290, 9313, 198732, 132197, -49986, 18479, 19966, 103252, 75276, 6709, -12369, 25342, -222018, 21101, -95883, -216597, -182283, -167989, -69661, 33182, -164587, -407508, -152211, -66653, -63246, -24610, -243161, -208578, -158355, -260881, -240351, -240785, -259549, 9069, 50203, -81307, -200142, -104551]
1485a04551j8563n3270J53099r6319p7642Q2478J7612p2943K11759n5102r7179
1474a10621r1120L4028q462P4686q4487K7898J88139n4243r3210k44408J02291
1463b59509J57663K58105Q9761l0092k27111j70790M8013J41373K28748k98521
1453f2360j02703J21065R8212K5988j68543n1561k1722n8270Q7611k8244n3870
1442b14397P9282P884M5426J60268j84814K0499J6957l8320k31829O1407J87383
1431i0254j7033K13210J55418r3344j88981J53438j45514j23212R3337p350N7836
1420G551o0779o31l7227J9463J47839k8864j10039j01083L4869J00538q4142j30214
1408b42719J04847M6722J10518o4478J2835M7081P5183l19888R5216J19606j03983
$$ y = [-104551, -123114, -176384, -23285, -119604, -197246, -114768, -97156, -170099, 41660, -13442, -110621, -201741, -167713, -176175, -101489, -185976, -158078, 30061, -24182, -117392, -361800, -259509, -101846, 156259, 246020, 215928, -11183, -181973, -133960, 7413, 236161, -62360, -165063, -43998, 54214, 80202, -88341, -139902, -161624, -219894, -132283, -160527, -214397, -135115, -127231, -81805, 78463, -106351, -85852, -68895, -107215, -339044, -277637, -90254, -107287, 105923, 261341, 167997, -20984, 132454, -13060, -136272, -42935, -50285, 7551, -53228, -53859, -91086, -71623, 76216, 47352, -62687, -163770, -128901, -28363, -112505, -242719, -137872, -91150, 19368, -45110, -32275, 14806, 89989, -229899, -134683, -15077, -119060]
1397a19060J18963k6889k781o3638o9756N7909o7489N72J53322N8686j32665J3071
1385g9755J27180j41093N1955J2049k6938J57617j8647j39948k5514l2201P9024
1374c6271o7708p4092l0037L2327J35637k4392j13384j38239J46160J37782P088
1363b5129O3232N9948j71157j19188P409R9308o3953j65038J72109r4764J1447
1352b25776K80657P035k93231J26970J66544J24184J04626j45100j03404j23250
1342h0745m7466r2430J8678O6373j50660M4622P0671N1125J8993j83773L6189
1331b48423O2998r8510j9921N2279R7016R2986L214J18529q5875k21216J62179
1320h4744P397M9807r1096M5799R1189k0867n8531j846k26100m4035o7101K58570
$$ y = [-119060, -97, -26986, -29767, -93405, -163161, -105252, -172741, -172169, -18847, 39839, -92826, -79755, 47425, -93668, -41713, -29664, -56602, 101015, 82368, -57580, -83094, -115295, -36271, -103979, -178071, -208108, -175781, -40144, -64536, -177920, -316159, -169999, -32217, -25129, 38103, 98051, -73106, -192294, -184885, -85577, -149530, -314568, -142459, -237223, -225776, 54881, 61916, -231315, -104345, 62199, 186383, 291009, 145909, 42505, -80745, -128211, -220641, -201963, -135590, -286250, -241628, -170957, -119832, -100839, -284612, -248423, -185425, -283935, -303856, -251577, -154561, -61575, -58361, 60168, -25707, -246923, -84744, -77347, -27540, -118636, -72837, 18352, -2515, -61046, -62892, -288992, -333027, -400128, -141558]
1308a41558J31269p1462Q460j08248N6248J26140o2012j1472P3921j16136O6900
1297d7950Q2341N093l81545J16755R0577R6934l0681k28276j4858K39285Q0963
1286H638j5502O1592J3711J96426q8273j97819O4009p7227k46897j42694O1038
1275c62998L26911p7494J17519L1297k7034j9652q5763L9081P0579M504q814j68834
1263a60698J9097m7993j33743M2420J65791l1450N5540J82622k2945O9511j48777
1252a0625J76878j7932j94825j44717J28561J0804p4933O7350l6370n5973K71760
1241A19978p7905O7773K9010j48871o7979Q0088K5312j03441m3882P7223L4546
1230h148m2726K9480j0086j17583n975L7300k3694N2487K50258k156l21042n3802
$$ y = [-141558, -10289, -81751, -73291, -181539, -125291, 849, -61163, -72635, 1286, -114850, -47950, 34391, 39484, -342061, -225306, -134729, -37795, -68476, -296752, -311610, -72325, 8638, -6864, 54728, 68439, 264865, 176592, -21227, 42782, -34445, -281342, -424036, -362998, -36087, -113581, 3938, 35235, 8201, -11451, -97214, -58133, 12446, 16950, 8136, -160698, -141601, -189594, -323337, -280917, -115126, -146576, -91036, 91586, 68641, 138152, -10625, 166253, 148321, -46504, -191221, -62660, -51856, -126789, -59439, -95809, -151782, 119978, 42073, 109846, 138856, -10015, -77994, 2094, 27406, -76035, -119917, -42694, -8148, -50874, -21394, -31480, -149063, -155038, -117738, -141432, -88945, 161313, 159157, -161885, -215687]
1218b15687O0911J2086Q2120L1153J2999j44911j1906J60925k6035j08783Q9880
1207e7248j6096m1000o6643J38393Q0969o6835J1734m0621n3118K9793J3949N0390
1195a6333L068J13100J02748o3031l4206j56938l7414k38052J02600K63668J05864
1184A45074K0143j27549l85826R5382k1902J68711J93278K5978j46001M7343O4061
1173G8692j94472k6182O4369J07929j01276R730J35237j03916o7863J16362l2180
1162a3570M1717j47443K23401j787j86285J82467q6162n0297p7856K0442Q4453
1151a0920J9463J41967l2652j40924M5048q3106O3006q1488r0292N6294P1656
1140d1948k5781r8497K1142K73642j13890j29896L7467P7835j22327n1881J66104
$$ y = [-215687, -154776, -142690, -60570, -29417, -16418, -161329, -173235, -12310, -38345, -147128, -57248, -73344, -114344, -180987, -42594, 38375, -28460, -16726, -57347, -110465, -80672, -66723, -16333, -13265, 99835, 202583, 139552, 105346, -51592, -89006, -327058, -224458, 39210, 145074, 165217, 37668, -348158, -252776, -274678, -105967, 87311, 113289, -32712, 14631, 78692, -115780, -141962, -77593, 30336, -70940, -61210, 74027, -29889, -97752, 18610, -13570, 28147, -119296, 104105, 102318, -83967, 98500, 12338, -37959, -115815, -95373, -10920, 8543, 150510, 117858, -23066, 21982, -61124, 1882, -79606, -169898, -113604, -41948, -67729, -166226, -145084, 128558, 14668, -115228, -77761, 74, -122253, -174134, -8030]
1129h030J38977j62698j54320R2841J06915K32338J12418p3139j37269o4530j53585
1118g0082J72522k3320q1732J72157N330j44714n4124q257j16742j42197K49102
1107d2057Q3697J9173J37833j05551q6202L2203J1516L6102j33823k9310J11024
1096C4605K16108j96616m11652M7856K57572J05792k60899k1610M0957J61116
1086b6771J48877j79077J13889P8772N1986j62302O078J99328n6525j90547k22718
1075b39010P6356k0407J29991J64673J48113j19055L74J51174j76488j11081K1589
1064B6229r4648L9001Q7038n0008N9207J23644n124l2165K07422r2501j87227
1053H0868k41334M8403K12536q7916J44839J52869j75298k25941j24240J24423
$$ y = [-8030, 130947, -31751, -186071, -93230, 13685, 246023, 358441, 285302, 148033, 83503, -70082, 102440, 79120, -2612, 169545, 174875, 30161, -23963, -32220, -148962, -291159, -42057, 41640, 60813, 198646, 93095, 6893, 39096, 50612, 86714, -47109, -76419, 34605, 250713, 54097, -357555, -309699, -52127, 53665, -207234, -228844, -187887, -26771, 122106, -56971, 56918, 135690, 187676, 25374, 31452, 230780, 174255, -16292, -239010, -162654, -183061, -53070, 111603, 259716, 140661, 141035, 292209, 115721, 4640, 26229, -68419, -29418, 57620, 7612, 66819, 190463, 185339, 153174, 360596, 268095, 80868, -160466, -112063, 100473, 12557, 157396, 310265, 134967, -90974, -215214, -90791]
1043i0791N3193R3898L537n6518j04998K9581J05686k72100p665k7060K9764K65011
1031B1538k62954k37513J38841L4113J64119P3797q4018N206J04258q8203K13
1020a30603O6972k1371j19559Q4310J00021J88809j34859P7708J51492j92848
1010G0072j42404J6650J99845M9017J16918o0749J44217l28698k08590N2202o9883
999a61403j52514K12899J1856J60273K3294j58018J46525R0101j93572J69734
989A49175P2071N6886J8888j64052Q7729j23071k5262j45482L056J39662J8333
978H7933k96811J3507O9252O617O6196N5242L3320j45291P186K75039n469n0075
966A16646j1441o5521k62437j3612J71612J87090p7896J5657j9459r6973n9634
$$ y = [-90791, -37598, 56300, 59837, 3319, -101679, -72098, 33588, -238512, -246177, -273237, -243473, 21538, -241416, -478929, -340088, -305975, -141856, -68059, -152077, -146871, -42613, -130816, -130603, -63631, -85002, -204561, -120251, -20230, 168579, 33720, 111428, 262920, 70072, -72332, -55682, 144163, 193180, 310098, 249349, 393566, 64868, -143722, -91520, -161403, -313917, -101018, -89162, 71111, 94405, -63613, 82912, 173013, -20559, 149175, 221246, 278132, 297020, 132968, 220697, 97626, 72364, -73118, -70062, 69600, 87933, -208878, -195371, -126119, -119502, -53306, 1936, 35256, -110035, -102849, 172190, 166721, 116646, 105205, 39684, -222753, -236365, -64753, 122337, 44441, 60098, 40639, -56334, -115968]
955a15968O5536J7784j46978j89613J72776P9723j30540J40198Q0386K42549k38745
944b2892j12119J76455o6060K1615J89809Q1279j14652k12243L6107k7948Q8743
933C8094l6113j76863j31485J25715R9766K7076m7841J29694R6707q5401j89881
922a50532n7718J15698J12241r656k00787p5205k3040K45090R0130O7295m0218
911G3298j54674n1986O6913q8848M4689K16796m5529k6595P5530M4134k3072j16293
899A4363m5519j4872J2692r9497P4063m9018J14838L9640n6484R1143n0075M9624
887H0898L1657p2701K4973q8863Q8504j16456J54574K78831k17019j29154O480
876D1724P0062J13795K0316K9620m7410K9381q4611j82205M4292j9875n3284J32138
$$ y = [-115968, -50432, -32648, -179626, -369239, -196463, -116740, -247280, -107082, -26696, 215853, -22892, -135011, 41444, -24616, -3001, 186808, 268087, 153435, -58808, -22701, -50649, 38094, 1981, -174882, -306367, -180652, -80886, -53810, -101651, 28043, 124750, 39349, -150532, -208250, -92552, 19689, 10033, -190754, -265959, -288999, -43909, 46221, 113516, 73298, -81376, -133362, -66449, -155297, -110608, 106188, 60659, 34064, 109594, 153728, 130656, 14363, -31156, -46028, -33336, -132833, -58770, -107788, 7050, 46690, -9794, 81349, 31274, 80898, 112555, 39854, 64827, -24036, 64468, -51988, 102586, 381417, 164398, 35244, 41724, 111786, 225581, 245897, 275517, 228107, 257488, 172877, -9328, 34964, 15089, -38195, 93943]
864I3943j84926J89025J84377m19477j61194K21912J44987j62053J19779J9580
854D5953r926k38070O6472J4908P3989q1656J14363l8945J5106J75412o9340o7017
842A249j78679J21625J69784q6290q9692M116J38194R4209q049l459j28281j84654
830a49927m1248M5798L0861K33292q752M5438k18081K9214k6769L5333k1866o6612
818a13319K10828j52356j128l2680N770J43793p4347N5913J5698q0177r4070j33113
806b49188K04424j0479Q7417j09853J79104Q9072j62829n6296q612j39036L8178
795a38098J10924R0832O9556k38573p4334R8484J14120l5764k0347K8439K03510
784B08749j63475J01279Q4488j80871r395O5367K2207k20833O4492K5210j38079
$$ y = [93943, -90983, 98042, 282419, -137058, -298252, -76340, 68647, -93406, 26373, 45953, 36027, -202043, -135571, -120663, -46674, -128330, -13967, -52912, -37806, 137606, 68266, 1249, -177430, -55805, 113979, 27689, -62003, -57887, 80307, 174516, 166467, 163008, 34727, -149927, -191175, -145377, -114516, 118776, 110024, 155462, -62619, -33405, -60174, -24841, -46707, -113319, 97509, -54847, -55975, -88655, -82885, 60908, -13439, 42474, 58172, -22005, -116075, -249188, -44764, -55243, 32174, -77679, 101425, 190497, 27668, -28628, -37240, -176276, -138098, -27174, 63658, 133214, -105359, -179693, -81209, 32911, -2853, -23200, 5239, 208749, 45274, 146553, 231041, 50170, 40775, 106142, 128349, -92484, -27992, -2782, -140861]
773a40861K7863J14041M2224q8027j34694q8511q8758R3661J27048J12323R0390
762F6699R3301n5509j43105N3055j47927j3387J33549p3121l1780J82833m1208
751B3400j04236Q6628r0774l948j43958J73401L73487j70783l32638K62690R5366
740A68635j13342j20377R7993K6010q6249L9198M7050J8572k89078N0626Q6601
729g4361J11639j17294R3691m2763J49330N3811k24319j66188k0406J61363M3503
718c1994l1645r5179m6840J1848q8510J0952J08357q0961k2933K42527J9150j53515
706a58743n8367j910L1452J02463M1407k2202p0060L5348n6165K5088J0224n4126
694a75591M2074J33538J7440L2922p5046L3866j29296j30438K16358j2327o5077
$$ y = [-140861, -112998, 1043, 43267, -44760, -179454, -267965, -356723, -263062, -136014, -23691, 66699, 160000, 104491, -38614, 14441, -133486, -146873, -13324, -86445, -118225, 64608, 23400, -80836, 5792, -84982, -88930, -232888, -59487, 314000, 143217, -189421, 73269, 168635, 55293, -65084, 32909, 58919, -27330, 11868, 58918, 77490, -211588, -160962, -74361, 37278, -80016, 13675, -29088, 120242, 174053, -50266, -216454, -236860, -75497, -31994, -63639, -158818, -205658, -193810, -282320, -271368, -163011, -243972, -266905, -24378, -5228, -158743, -217110, -219020, -187568, -85105, -43698, -65900, -135960, -100612, -156777, -131689, -121465, -175591, -133517, 21, 17461, 50383, -24663, 9203, -120093, -250531, -34173, -46500, -111577]
683a11577J83184J21984j8003j34184n6847J55346j75801q0609q016J29144j97052
672a92431P4901J57995J7220j35296P9101J73839N1826n7750j11187Q1117p1040
661F8295J5680Q6622p5348J8474J01896q1126p1026n0855p9713J45259M9614J2004
649A39776N3264N6632j03773l49935J32912K3453J8455J3494K0180J24016l7670
638I0804n9226j34375r9639P5456K08576M5682l7086k40642j33997N1781J31560
627a01106J36920J2173l7277j6670N5030O3242Q9440m1205n1965m3250j0240L6323
615I1415j44643R7677m784O3622J61895j62249J5567J20151K469J3400K9763q7644
603A96639o9813M0753k39021j8600j73875K63983M1234n0885R8386o8188j06102
$$ y = [-111577, 71607, 193591, 175588, 41404, -15443, 139903, -35898, -116507, -124523, 4621, -192431, -117530, 40465, 57685, -77611, 1490, 175329, 227155, 169405, 58218, 139335, 68295, 83975, 170597, 95249, 113723, 215619, 134493, 63467, 12612, -67101, 78158, 127772, 139776, 193040, 249672, 145899, -204036, -71124, -47671, -29216, -15722, 4458, 128474, 90804, 31578, -102797, -202436, -126980, 81596, 127278, 90192, -150450, -284447, -232666, -101106, 35814, 47987, 10710, -5960, 49070, 112312, 201752, 160547, 108582, 65332, 55092, 91415, -53228, 44449, 39665, 103287, 265182, 102933, 118500, 238651, 241120, 254520, 284283, 196639, 126826, 167579, -71442, -90042, -263917, 66, 41300, -9585, 88801, 20613, -85489]
592h5489J1085p2327k8839K03587P032K25659k68575k6017o390j33366L01078
581A27438n6275j87073K06690Q158l7021O8046j31419n9686J23212k7154L7200
570G2116N1589J26720j08454P4680o2472Q84j92937J28897l7459L4490k35851
559a47797P3392K43251j57481J16830m3343n0351R3556K5748j64446L9864r013
548B0210o5140O5935p3030o1978J04537p2996J29302l9879o1362Q209J3770K06629
536A74207m7532j33682o5385l1619O8027q3962P8026O2911K83955m4039Q2316
525C43223j10726l15468N9895Q4174p3064l4070n3147j00826M0276J22217N5225
514A7709M6704r3483j077P3603Q9598p7531K05584p1585n8741j68423j08718J12982
$$ y = [-85489, -74404, -146731, -175570, 28017, 35049, 260708, -7867, -33884, -40274, -173640, 127438, 71163, -115910, 90780, 98938, 61917, 129963, -1456, -61142, 62070, 34916, 72116, 123705, 250425, 141971, 216651, 154179, 155063, -37874, 91023, 53564, 88054, -147797, -74405, 168846, 11365, 128195, 84852, 34501, 128057, 153805, -10641, 29223, 20210, -44930, 21005, -52025, -114003, -9466, -82462, 46840, 6961, -54401, -46192, -32422, 174207, 126675, -7007, -72392, -104011, -35984, -119946, -41920, 20991, 304946, 260907, 343223, 232497, -82971, -23076, 61098, -11966, -46036, -99183, -200009, -159733, -37516, 17709, 64413, -29070, -30147, 43456, 133054, 55523, 261107, 189522, 130781, -37642, -146360, -33378]
502c3378J65804O7648k19126o467m4981J31521Q0460j1524L2981p6855k11795
491a25712q2642J34954q0106j20251K09026k839M4144P1306L7639j31626L5669
480a0438j45438j57359J95406Q052j36007P1113J60231J26188j94962O9883p0893
469h4224J58068L7676m5409o0352J9883J41428j34642m1116J31637p7057j858
$$ y = [-33378, 132426, 200074, -19052, -25519, -70500, 61021, 141481, 129957, 162938, 86083, -125712, -208354, -73400, -153506, -273757, -64731, -67570, -23426, 47880, 85519, -46107, -10438, -155876, -313235, -117829, -109777, -245784, -174671, -14440, 111748, -83214, -13331, -84224, 73844, 111520, 66111, 5759, 25642, 167070, 32428, -8688, 122949, 45892, 44034]
$$ [...]
##END NTUPLES=NMR SPECTRUM
##END=
