##TITLE=1H_CG-1182-2x
 DMSO
 8 sc, 
 12.1.2024
##JCAMPDX= 6.0         $$ Bruker NMR JCAMP-DX V2.0
##DATA TYPE= NMR SPECTRUM
##DATA CLASS= NTUPLES
##ORIGIN= UXNMR, Bruker Analytische Messtechnik GmbH
##OWNER= root
$$ XWIN-NMR		Version 3.5
$$ Fri Jan 12 13:56:39 2024 Russian Standard Time (UT+4h)  she@DPX200
##.OBSERVE FREQUENCY= 200.1313
##.OBSERVE NUCLEUS= ^1H
##.ACQUISITION MODE= SIMULTANEOUS
##.ACQUISITION SCHEME= undefined
##.AVERAGES= 8
##.DIGITISER RES= 18
##SPECTROMETER/DATA SYSTEM= spect
##.PULSE SEQUENCE= zg30
##.SOLVENT NAME= DMSO
##.SHIFT REFERENCE= (INTERNAL, DMSO, 0, 15.5012)
##AUDIT TRAIL= $$ (NUMBER, WHEN, WHO, WHERE, WHAT)
$$ ##TITLE= Audit trail, XWIN-NMR		Version 3.5
$$ ##JCAMPDX= 5.01
$$ ##ORIGIN= Bruker BioSpin GmbH
$$ ##OWNER= she
$$ F:/spectra/data/she/nmr/H-F/1/pdata/1/auditp.txt
$$ ##AUDIT TRAIL=  $$ (NUMBER, WHEN, WHO, WHERE, WHAT)
(   1,<2024-01-12 13:55:21.34 +0400>,<she>,<DPX200>,
      <created by zg, POWCHK disabled, PULCHK disabled
       configuration hash MD5:
       00 E9 B6 7A A2 85 ED C7 34 08 36 98 17 FE 4E 26
       data hash MD5: 16K
       EA 77 7E 39 E3 2F 6B 66 FC F9 A6 C2 A6 27 E3 46>)
(   2,<2024-01-12 13:55:23.50 +0400>,<she>,<DPX200>,
      <Start of raw data processing
       efp BC_mod = 2 LB = 0.24 FT_mod = 6 PKNL = 1 PHC0 = -24738.06 PHC1 = 17.2527 SI = 16K 
       data hash MD5: 16K
       F7 B7 8D E6 CA E6 55 0E 5F D5 71 F4 39 39 37 8E>)
(   3,<2024-01-12 13:55:51.37 +0400>,<she>,<DPX200>,
      <pk PHC0 = 161.4286 PHC1 = -10.8 
       data hash MD5: 16K
       D5 12 75 3E 5B 5D F8 80 E9 14 18 B9 C9 38 EF 3F>)
(   4,<2024-01-12 13:55:54.65 +0400>,<she>,<DPX200>,
      <abs ABSG = 5 
       data hash MD5: 16K
       85 AD 47 84 13 7A 42 64 6B 0C D4 2E 25 01 ED 97>)
$$ ##END=
$$ 
$$ hash MD5
$$ 22 22 28 E3 5F AA 1B 10 FC 09 BD B0 3E 61 86 5F
##$RELAX= 
##$RELAX= 
##$RELAX= 
##$RELAX= 
##$RELAX= 
##$RELAX= 
$$ Bruker specific parameters
$$ --------------------------
##$DU= <F:/spectra>
##$EXPNO= 1
##$NAME= <H-F>
##$PROCNO= 1
##$TYPE= <nmr>
##$USER= <she>
##$AMP= (0..31)
100 100 100 100 100 100 100 100 100 100 100 100 100 100 100 100 100 100 
100 100 100 100 100 100 100 100 100 100 100 100 100 100 
##$AQSEQ= 0
##$AQ_mod= 1
##$AUNM= <au_zg>
##$AUTOPOS= <>
##$BF1= 200.13
##$BF2= 200.13
##$BF3= 200.13
##$BF4= 200.13
##$BF5= 200.13
##$BF6= 200.13
##$BF7= 200.13
##$BF8= 200.13
##$BYTORDA= 1
##$CFDGTYP= 0
##$CFRGTYP= 5
##$CHEMSTR= <none>
##$CNST= (0..31)
1 1 145 1 1 1 1 1 1 1 1 1 1 1 1 1 1 1 1 1 1 1 1 1 1 1 1 1 1 1 1 1 
##$CPDPRG= <>
##$CPDPRG1= <>
##$CPDPRG2= <>
##$CPDPRG3= <>
##$CPDPRG4= <mlev>
##$CPDPRG5= <mlev>
##$CPDPRG6= <mlev>
##$CPDPRG7= <mlev>
##$CPDPRG8= <mlev>
##$CPDPRGB= <>
##$CPDPRGT= <>
##$D= (0..31)
0 1.2 0 0 0 0 0 0 0 0.06 0 0.03 0 0 0 0 0.0002 0 0 0 0 0 0 0 0 0 0 0 0 
0 0 0 
##$DATE= 1705053320
##$DBL= (0..7)
120 120 120 120 120 120 120 120 
##$DBP= (0..7)
150 150 150 150 150 150 150 150 
##$DBP07= 0
##$DBPNAM0= <>
##$DBPNAM1= <>
##$DBPNAM2= <>
##$DBPNAM3= <>
##$DBPNAM4= <>
##$DBPNAM5= <>
$$ [...]
##$SUBNAM3= <"">
##$SUBNAM4= <"">
##$SUBNAM5= <"">
##$SUBNAM6= <"">
##$SUBNAM7= <"">
##$SUBNAM8= <"">
##$SUBNAM9= <"">
##$SW= 18.0517328524113
##$SWIBOX= (0..15)
0 0 2 0 0 0 0 0 0 0 0 0 0 0 0 0 
##$SW_h= 3612.71676300578
##$TD= 16384
##$TD0= 1
##$TE= 0
##$TE2= 300
##$TE3= 300
##$TEG= 300
##$TL= (0..7)
0 120 120 120 120 120 120 120 
##$TP= (0..7)
150 150 150 150 150 150 150 150 
##$TP07= 0
##$TPNAME0= <>
##$TPNAME1= <>
##$TPNAME2= <>
##$TPNAME3= <>
##$TPNAME4= <>
##$TPNAME5= <>
##$TPNAME6= <>
##$TPNAME7= <>
##$TPOAL= (0..7)
0.5 0.5 0.5 0.5 0.5 0.5 0.5 0.5 
##$TPOFFS= (0..7)
0 0 0 0 0 0 0 0 
##$TUNHIN= 0
##$TUNHOUT= 0
##$TUNXOUT= 0
##$USERA1= <user>
##$USERA2= <user>
##$USERA3= <user>
##$USERA4= <user>
##$USERA5= <user>
##$V9= 5
##$VALIST= <valist>
##$VCLIST= <CCCCCCCCCCCCCCC>
##$VD= 0
##$VDLIST= <DDDDDDDDDDDDDDD>
##$VPLIST= <PPPPPPPPPPPPPPP>
##$VTLIST= <TTTTTTTTTTTTTTT>
##$WBST= 1024
##$WBSW= 4
##$XGAIN= (0..3)
0 0 0 0 
##$XL= 0
##$YL= 0
##$YMAX_a= 72112
##$YMIN_a= -92753
##$ZGOPTNS= <>
##$ZL1= 120
##$ZL2= 120
##$ZL3= 120
##$ZL4= 120
##$ABSF1= 15.49788
##$ABSF2= -2.553969
##$ABSG= 5
##$ABSL= 3
##$ALPHA= 0
##$AQORDER= 0
##$ASSFAC= 0
##$ASSFACI= 0
##$ASSFACX= 0
##$ASSWID= 0
##$AUNMP= <proc_1d>
##$AZFE= 0.1
##$AZFW= 0.1
##$BCFW= 0
##$BC_mod= 2
##$BYTORDP= 0
##$COROFFS= 0
##$CY= -3
##$DATMOD= 1
##$DC= 0
##$DFILT= <>
##$DTYPP= 0
##$F1P= 0
##$F2P= 0
##$FCOR= 1
##$FTSIZE= 16384
##$FT_mod= 6
##$GAMMA= 0
##$GB= 0
##$INTBC= 1
##$INTSCL= 3.70164e-10
##$ISEN= 128
##$LB= 0.24
##$LEV0= 0
##$LPBIN= 0
##$MAXI= 10000
##$MC2= 0
##$MEAN= 0
##$ME_mod= 0
##$MI= 1.114404
##$NCOEF= 0
##$NC_proc= -7
##$NLEV= 6
##$NOISF1= 3.799351
##$NOISF2= 2.8
##$NSP= 0
##$NTH_PI= 0
##$NZP= 0
##$OFFSET= 15.50119
##$PC= 1
##$PHC0= -24576.63
##$PHC1= 6.452701
##$PH_mod= 1
##$PKNL= yes
##$PPARMOD= 0
##$PSCAL= 0
##$PSIGN= 0
##$REVERSE= no
##$SF= 200.130004104573
##$SI= 16384
##$SIGF1= 3
##$SIGF2= 2
##$SINO= 5.538805
##$SIOLD= 16384
##$SREGLST= <1H.CDCl3>
##$SSB= 0
##$STSI= 16384
##$STSR= 0
##$SW_p= 3612.71676300578
##$SYMM= 0
##$S_DEV= 0
##$TDeff= 16384
##$TDoff= 0
##$TI= <>
##$TILT= no
##$TM1= 0
##$TM2= 0
##$TOPLEV= 0
##$USERP1= <user>
##$USERP2= <user>
##$USERP3= <user>
##$USERP4= <user>
##$USERP5= <user>
##$WDW= 1
##$XDIM= 16384
##$YMAX_p= 539950925
##$YMIN_p= -677069
$$ End of Bruker specific parameters
$$ ---------------------------------
##NTUPLES= NMR SPECTRUM
##VAR_NAME=  FREQUENCY,     SPECTRUM/REAL,   SPECTRUM/IMAG
##SYMBOL=    X,             R,               I
##VAR_TYPE=  INDEPENDENT,   DEPENDENT,       DEPENDENT
##VAR_FORM=  AFFN,          ASDF,            ASDF
##VAR_DIM=   16384,         16384,           16384
##UNITS=     HZ,            ARBITRARY UNITS, ARBITRARY UNITS
##FACTOR=    0.220516191357247, 1,           1
##FIRST=     3102.25325545926, 0,            0
##LAST=      -510.463507546517, 0,           0
##MIN=       -510.463507546517, -677069,     0
##MAX=       3102.25325545926, 539950925,    0
$$ Real data points
##PAGE= N=1
##DATA TABLE= (X++(R..R)), XYDATA
$$ [...]
8510A73684j73752l6068j13428J03659p3267j18492J43242l9153J45932Q4536
$$ 173684 -68 -36136 -149564 -45905 -119172 -237664 -94422 -133575 12357 96893
8500I6893k46729K57987m3828l3366k4866j52938J04591J21754K724r4499o4703
$$ 96893 -149836 108151 64323 30957 6091 -146847 -42256 79498 82222 -12277 -76980
8489g6980J41520r444j12194n4569R8303p2533q5051Q3421j321l8616O4069l7934
$$ -76980 64540 55096 -57098 -111667 -13364 -85897 -170948 -87527 -88848 -127464 -63395 -101329
8477a01329O7945J01686j11197q4097j38884M6084J2343J01950j36442K1611o4549
$$ -101329 -33384 68302 -42895 -126992 -265876 -219792 -207449 -105499 -241941 -220330 -284879
8466b84879J89461J07674J16211J97347q2374k01252K4584n5808L8289R6205K2045
$$ -284879 -95418 12256 128467 325814 243440 42188 66772 10964 49253 145458 167503
8455A67503j00373R1332k23752r5149L8655P3152J28841o4800k35725R3468J36001
$$ 167503 67130 158462 -65290 -160439 -121784 -48632 80209 15409 -220316 -126848 9153
8444I153L7353Q3416j26298j73114J18786l5137m6322K00460q0964K7512K5906
$$ 9153 46506 129922 3624 -169490 -50704 -85841 -132163 68297 -12667 14845 40751
8433D0751j1753J47484j35669k16645k7248N8412j21535r5141J43787L06669Q094
$$ 40751 28998 176482 40813 -175832 -203080 -144668 -266203 -361344 -217557 89112 97206
8422I7206k32494K07313m4155o3147k9373j40475O1673j9180J2159Q0721j29330
$$ 97206 -135288 72025 27870 -35277 -64650 -205125 -143452 -162632 -150473 -69752 -199082
8411a99082J22327J07276p2071J6690p4733j14676Q5379k27935m5270J83501J66644
$$ -199082 -76755 30521 -41550 -24860 -99593 -214269 -128890 -356825 -402095 -218594 -51950
8400e1950M5197K2064j29300P0593M2992l21461K19714Q7103o6145L5475k5794
$$ -51950 -6753 15311 -113989 -43396 -404 -321865 -102151 -15048 -81193 -45718 -71512
8389g1512R5764M6196j79529q7754L39059n637j8306j6226m3399p2188j44793
$$ -71512 24252 70448 -109081 -196835 142224 136587 118281 102055 58656 -13532 -158325
8378a58325P7954j3413J22100k66805l3204R9167R0567L5725p6397m2752J21833
$$ -158325 -80371 -93784 28316 -238489 -271693 -172526 -81959 -46234 -122631 -165383 -43550
8367d3550j1256O5719j4343j5580L16184r6226j36847j11544P4409n8979M6812
$$ -43550 -54806 10913 -3430 -19010 297174 200948 64101 -47443 26966 -32013 14799
8356A4799N5265j68315O3335K8503J02243n5609j06267J73156P6129k26349J4283
$$ 14799 70064 -98251 -34916 -6413 95830 40221 -66046 107110 183239 -43110 -28827
8345b8827l4296k48488K19830M5120p530K5197J10193j51066k38305J86376J282
$$ -28827 -63123 -311611 -91781 -46661 -54191 -28994 81199 -69867 -308172 -121796 -120514
8334a20514j2261J34005j09182r3555J04530k5442J40828k5164l4134j33559m6456
$$ -120514 -132775 1230 -107952 -201507 -96977 -122419 18409 -6755 -40889 -174448 -220904
8323b20904J94053P4497J90552l7743o4135j05470q6148j48551r5168J38455J39167
$$ -220904 -26851 47646 238198 200455 136320 30850 -55298 -203849 -299017 -160562 -21395
8312b1395k02620j15336K70458P6775k25430J6336j12126R8015L21664k73970
$$ -21395 -224015 -339351 -68893 7882 -217548 -201212 -313338 -215323 106341 -167629
8302a67629n3111J70287J2615N5678K8146j66684M1843R2172n1392R5503P022
$$ -167629 -220740 -50453 -37838 17840 45986 -120698 -78855 13317 -38075 57428 64450
8291F4450J6139j03017K3433j64173M8187J09617Q0010j74784p4410O5729N8981
$$ 64450 80589 -22428 1005 -163168 -114981 -5364 74646 -100138 -174548 -108819 -49838
8280d9838J7009J59384M852k05534N3546q3924p2713J18484J45828l1211K3019
$$ -49838 -32829 126555 131407 -74127 -20581 -104505 -177218 -58734 87094 55883 78902
8269G8902j88989k7894O855n0835J64709J47443j58418K0257j6121j44666J47270
$$ 78902 -110087 -137981 -131126 -181961 -17252 130191 -28227 -7970 -24091 -168757 -21487
8258b1487q2003p8360P8009J04868J23911o4937k16592o1529K18841k5477r6774
$$ -21487 -103490 -181850 -103841 1027 124938 60001 -156591 -218120 721 -24756 -121530
8247a21530q733P418N7558O1281j54147n6886L21367M9175j66155P5032j09151
$$ -121530 -130263 -122845 -65287 -4006 -158153 -215039 106328 155503 -10652 64380 -44771
8236d4771j65562r0389J65397L95J11055p1666L3325L2387O1473J10643k78060
$$ -44771 -210333 -300722 -135325 -134930 -23875 -95541 -62216 -29829 31644 142287 -135773
8225a35773j66005K30822J37532k74279J75847l506j62911O0923P4951n6706q701
$$ -135773 -301778 -70956 66576 -207703 -31856 -35362 -198273 -137350 -62399 -119105 -127806
8214a27806P7346k04666M722Q4018K18598j12925J33746k02840j23839K73155
$$ -127806 -50460 -255126 -250404 -166386 52212 -60713 73033 -129807 -253646 19509
8204A9509k83932j142J25448o2284l818j11572O5059j70619j0015J22859Q4826
$$ 19509 -264423 -265565 -140117 -202401 -206219 -317791 -252732 -423351 -433366 -310507 -225681
8193b25681j78798k72590P54027Q0458k357j04239o7811j77828J74428J35641
$$ -225681 -404479 -677069 76958 157416 155059 50820 -16991 -194819 -20391 115250
8183A15250r9809J5184j99135K09024j9781j25917J53524j3056J12279j24093
$$ 115250 15441 30625 -168510 40514 20733 -105184 48340 35284 147563 23470
8173B3470O1013j01327k08197L01458k18088K02603M4044k48173J2393j2839J58005
$$ 23470 84483 -16844 -225041 76417 -141671 60932 104976 -143197 -130804 -143643 14362
8162A4362r9204n8126K11196o5672J20302P396n3942p8422m7077Q1058j30970
$$ 14362 -84842 -142968 68228 2556 122858 130254 76312 -2110 -49187 31871 -99099
8151i9099J77378n5203J5494m2147o621M5588j52784k80Q1918R0176q2333J9061
$$ -99099 78279 23076 38570 -3577 -10198 35390 -117394 -117674 -35756 54420 -27913 -8852
8139h852q9623M7010O6582p6103j46824n399K80193q3335r3695N4559J20423j08751
$$ -8852 -98475 -51465 15117 -60986 -207810 -213209 66984 -16351 -110046 -55487 64936 -43815
8127d3815j25444L04583j0995j05383j75388k8977j05554M4038R4640o0559J02285
$$ -43815 -169259 135324 124329 18946 -156442 -185419 -290973 -246935 -152295 -212854 -110569
8116a10569j06142M4018j42764n4207K80145R91q4375j37348p1676j17331K18238
$$ -110569 -216711 -172693 -315457 -369664 -89519 -88528 -172903 -310251 -381927 -499258 -281020
8105b81020K74747Q6289M8338j83839J28569O483n8849J07894K8356k82443j7106
$$ -281020 -6273 80016 128354 -55485 73084 79567 20718 128612 156968 -125475 -142581
8094a42581j49288j13660L97817N2917n2346o039j25322J34941M4278k9676J678
$$ -142581 -291869 -405529 -7712 45205 -7141 -13180 -138502 -3561 40717 11041 12719
8083A2719k6754k9006p078J82626k24539L6953J72063K1129k85634j9191P0256
$$ 12719 -14035 -43041 -50119 132507 -92032 -55079 116984 138113 -147521 -166712 -96456
8072i6456q522J05841L416p5819j2242K2641L0450o1340k1723O2515j81108J30996
$$ -96456 -104978 863 4279 -71540 -83782 -61141 -30691 -92031 -113754 -51239 -232347 -101351
8060a01351j38166J04891J10230q5277r5628J26009p6011P5113J04148j22597
$$ -101351 -239517 -134626 -24396 -109673 -205301 -79292 -155303 -80190 23958 -98639
8050i8639o216J22214m0275j32475n5505m6509K05183N7621r0911j50729P4397
$$ -98639 -104855 17359 -22916 -155391 -210896 -257405 -52222 5399 -85512 -236241 -161844
8039a61844J92751k1015r0001j35121J06208J2203P1061k44025J16528L75491
$$ -161844 30907 9892 -80109 -215230 -109022 -96819 -25758 -269783 -153255 222236
8029B22236j63728P3188k6210J18993o9388k78265P2220j24361J0424P4015k7491
$$ 222236 58508 131696 105486 224479 155091 -123174 -50954 -175315 -164891 -90876 -118367
8018a18367k21771J44393K84246Q7705k6781k49550L8053J20744J3866j71948
$$ -118367 -340138 -195745 88501 176206 149425 -100125 -62072 58672 72538 -99410
8008i9410K40245l1930k12370j96621l9176r3124P9914J13410M20157j75227j35266
$$ -99410 140835 108905 -103465 -300086 -339262 -432386 -352472 -239062 181095 5868 -129398
7997a29398Q7199J66247l4824j19954M5948m3251m6236j34919J92063R0836j04751
$$ -129398 -42199 124048 89224 -30730 15218 -28033 -74269 -209188 -17125 73711 -31040
7986c1040j48632R1764J88541R0257j28754k01669n8518n5580J48559J14276j17680
$$ -31040 -179672 -87908 100633 190890 62136 -139533 -198051 -253631 -105072 9204 -108476
7975a08476J2184p3422J81558Q733k26532Q0830K64451j95752n9298k5966l2734
$$ -108476 -96292 -169714 11844 20577 -205955 -125125 139326 -56426 -115724 -141690 -174424
7964a74424K15438r0299j59500j1102J69533J2847k77237J99001L4035r3206J11775
$$ -174424 41014 -49285 -208785 -219887 -50354 -37507 -314744 -115743 -81708 -174914 -63139
7953f3139Q6262M3849m1233j98182J18888k01656N0573R8240j1294j40103J45355
$$ -63139 23123 66972 25739 -172443 -53555 -255211 -204638 -106398 -117692 -257795 -112440
7942a12440J24026j35222M6786P2880J00649j76597j17792J98018j2861L1864
$$ -112440 11586 -123636 -76850 -3970 96679 -79918 -197710 308 -12553 19311
7932A9311J20675k06741l0162N8964o4678n8000K74359J27926M8035l33970Q2771
$$ 19311 139986 -66755 -96917 -37953 -102631 -160631 113728 241654 289689 -44281 38490
7921C8490R5731N8559j65341k5339o8517j36981J3910j87492K3795K70733j34151
$$ 38490 134221 192780 27439 2100 -66417 -203398 -189488 -376980 -353185 -82452 -216603
7910b16603N6303P4057M7156M0333J81635k01514m7828N6502j63552L9605J22067
$$ -216603 -160300 -86243 -39087 1246 182881 -18633 -66461 -9959 -173511 -133906 -11839
7899a1839J32431j05048q42j79840P3822P6093k6946J7351n9520K36229j0732
$$ -11839 120592 15544 14702 -165138 -91316 -15223 -42169 -24818 -84338 151891 141159
7888A41159q5786n7440j14415K9863p1093J55388J80048J1970j19771J12764p5
$$ 141159 55373 -2067 -116482 -86619 -157712 -2324 177724 189694 69923 182687 182612
7877A82612j5166j25936L7387J43323j55540q5845L3217J4698K5305n4914r2373
$$ 182612 167446 41510 78897 222220 66680 -19165 14052 28750 54055 -859 -93232
7866i3232J41089j11379M7052J22614L4038j90186j15845K39888L6918l3092k39865
$$ -93232 47857 -63522 -16470 106144 140182 -50004 -165849 74039 110957 77865 -162000
7855a62000j7520l2099J25184J40039r2830j54641L62477k04561j21295O7211
$$ -162000 -179520 -211619 -86435 53604 -39226 -193867 168610 -35951 -157246 -90035
7845i0035J27482p8705k33305j4839J77714J78169j88087q4045q9635n8801J49975
$$ -90035 37447 -41258 -274563 -289402 -111688 66481 -121606 -205651 -295286 -354087 -204112
7834b04112Q188L7205J46495j9509R1814N7385L6208j86348P6965L5089k71178
$$ -204112 -195924 -158719 -12224 -31733 60081 117466 153674 -32674 44291 79380 -191798
7823a91798J22396J07132j45030p5287j13029j62368J41440O7654J52881J2681
$$ -191798 -69402 37730 -107300 -182587 -295616 -457984 -316544 -248890 -96009 -83328
7813h3328p0417k60535J72570K70915K2140j3644k3478j22881k40292P0663K7128
$$ -83328 -153745 -414280 -241710 29205 51345 37701 14223 -108658 -348950 -278287 -251159
7802b51159J1949J15372K44444j173j58394m6529N0319j93683p6572J27388K31573
$$ -251159 -239210 -123838 120606 119433 -38961 -85490 -35171 -228854 -305426 -178038 53535
7791E3535j75418P125r1503j25902N9566J27481p664o1800o4646J62367P5876
$$ 53535 -121883 -114758 -206261 -332163 -272597 -145116 -152780 -214580 -279226 -116859 -40983
7780d0983q287p1135J46855J59809j10934n2844j11848p7619J58494M6760r5496
$$ -40983 -49270 -120405 26450 186259 75325 22481 -89367 -166986 -8492 38268 -57228
7769e7228J64582M0287q4504j20759l9787J1763j6039J06961J4304N9014L3429
$$ -57228 107354 147641 63137 -57622 -97409 -85646 -101685 5276 19580 78594 112023
7758A12023j96578j74296j6337Q6475J10542N7755r0994q6754J22977M3169j50783
$$ 112023 -84555 -258851 -275188 -188713 -78171 -20416 -111410 -198164 -75187 -32018 -182801
7747a82801J47061R6941j71243J71619J0475k15090J47857J89944k37970m2798
$$ -182801 -35740 61201 -110042 61577 72052 -143038 4819 194763 -43207 -86005
7737h6005J03414j22944M2861M9558L0231o0530p5165J15867J34213k44593K4135
$$ -86005 17409 -105535 -62674 -13116 17115 -43415 -118580 -2713 131500 -113093 -88958
7726h8958P0599Q68J54914q5666j23503o3030J54538J30181j12978L5834J01126
$$ -88958 -18359 -17491 137423 51757 -71746 -134776 19762 149943 36965 72799 173925
7715A73925p5007j27399J7026J5494P6225l2048O9303o6028o140R7410j13003
$$ 173925 98918 -28481 -11455 4039 80264 48216 117519 51491 45351 142761 29758
7704B9758N6599k37036J31233R0049j24079L4070N7873j35077O8214n613l3753
$$ 29758 86357 -150679 -19446 70603 -53476 -19406 38467 -96610 -28396 -34009 -67762
7693f7762m0458j39771J67745J31996O9376j23713J11277l9218j07588p3337O2872
$$ -67762 -108220 -247991 -80246 51750 121126 -2587 108690 69472 -38116 -111453 -48581
7682d8581R6060m2499K6503j22865R8486p7481j65304M933J95660k2238r6445
$$ -48581 47479 4980 31483 -91382 7104 -70377 -235681 -230748 -35088 -57326 -153771
7671a53771j28369m6294J50125Q117J39400J11373m5316j6939K40027J12243M2765
$$ -153771 -282140 -328434 -178309 -170192 -30792 80581 35265 18326 258353 370596 413361
7660D13361l14063L7318K31118k07971j00547M2051k01517J88269k07218J12158
$$ 413361 99298 136616 367734 159763 59216 101267 -100250 88019 -119199 -7041
7650g041j57664M3280K80920N765q2204p5877M7795j06663N6018p1519J83487
$$ -7041 -164705 -121425 159495 165260 83056 7179 54974 -51689 4329 -67190 116297
7639A16297J4412j72389O2391J3166m5519K30684n0317j28056L4402j013j48322
$$ 116297 130709 -41680 20711 33877 -11642 219042 168725 40669 75071 74058 -74264
7628g4264J38134L864k1145p7125o5110K0787k1962N1388o2586l0391O7414j0355
$$ -74264 63870 67734 46589 -30536 -95646 -74859 -96821 -45433 -108019 -138410 -70996 -81351
7616h1351q2630O7696l0437J63626p5721k57668j0637j51338P6848J52296J45250
$$ -81351 -163981 -96285 -126722 36904 -38817 -296485 -307122 -458460 -381612 -229316 -84066
7605h4066K2216L7468P6454j17356j0957J61468o4483j65916J75157J48492k03088
$$ -84066 -61850 -24382 52072 -65284 -76241 85227 20744 -145172 29985 178477 -24611
7594b4611l8160m6592O703J99583q9742n5857Q2099l45878P8506P7522K06227
$$ -24611 -62771 -109363 -102660 96923 7181 -48676 33423 -312455 -233949 -156427 49800
7583D9800K21385j72845j58096j22903O5136L77570l3769j54510j86212n1589
$$ 49800 271185 98340 -59756 -182659 -117523 260047 226278 71768 -114444 -166033
7573a66033J46783p8272J34270j24990N3976M5264p9364J83941J30970Q800n9738
$$ -166033 -19250 -97522 36748 -88242 -34266 10998 -68366 115575 246545 255345 195607
7562A95607j97813O7841k81524P3575O4904m1748M9119R4208O8992o3996j26425
$$ 195607 -2206 65635 -215889 -142314 -77410 -119158 -70039 24169 93161 29165 -97260
7551i7260J27168j548p1685l1723p334k3333K3053K1770J39818N1622j4803q7939
$$ -97260 29908 28360 -43325 -75048 -82382 -105715 -82662 -60892 78926 130548 115745 27806
7539B7806L0843J10652m9193j40165j69404J93241j53641L8401N3295L5245k45126
$$ 27806 58649 169301 120108 -20057 -189461 3780 -149861 -111460 -58165 -22920 -268046
7528b68046K15862m409O0517J66886j91902J73278k6880j02997J15554j06617
$$ -268046 -52184 -56593 3924 170810 -21092 152186 125306 22309 137863 31246
7518C1246K06043p7142j05683j32454P8207j34263o3650L8246K63350j38051m2323
$$ 31246 237289 160147 54464 -77990 217 -134046 -197696 -159450 103900 -34151 -76474
7507g6474J09759j83469l5436N8065J99777n5106n727L432K1831m914k4587j01579
$$ -76474 33285 -150184 -185620 -127555 72222 17116 11389 14821 36652 31738 7151 -94428
7495i4428J80733j35542O0586N2455m0983m0219m8067R0715J23850j0970l9377
$$ -94428 86305 -49237 11349 63804 22821 -17398 -65465 25250 149100 138130 98753
7484I8753j2840l6321N2239l8381k1621Q8233j39775o3484j62972O2240l4198
$$ 98753 85913 49592 101831 63450 41829 130062 -9713 -73197 -236169 -173929 -208127
7473b08127p6915J658L16837J00553l3053o6218j6667n3512j08904J61361J9984
$$ -208127 -285042 -283384 33453 134006 100953 34735 18068 -35444 -144348 17013 36997
7462C6997j28611J24121L0419j55488k6607N3750m2440Q9999M6515J64130o5381
$$ 36997 -91614 32507 62926 -92562 -119169 -65419 -107859 -17860 28655 192785 127404
7451A27404k84983Q9083r136j161J06731O1820O026j0205J4643P6653k43870J1694
$$ 127404 -157579 -68496 -77632 -78793 27938 89758 95784 85579 100222 176875 -66995 -55301
7439e5301J09472j69083k6940J83378O3145j65834R0578m8883R05k9047M8033
$$ -55301 54171 -114912 -141852 41526 104671 -61163 29415 -19468 -18563 -47610 423
7428D23N0205j03088m3099O1581J27366j13118R2801k7641m1079P4960M271q1103
$$ 423 50628 -52460 -95559 -33978 93388 -19730 73071 45430 4351 79311 83582 2479
7416B479K0954m2255o7992J07084o1673Q7832O3002r0754P860L4689K13335n9085
$$ 2479 23433 -18822 -86814 20270 -41403 46429 109431 18677 26537 61226 274561 215476
7404B15476k21888j54682J07830M3269q8246M1475J12679j89028J17588M698J27361
$$ 215476 -6412 -161094 -53264 -9995 -98241 -56766 55913 -133115 -15527 -10829 116532
7393A16532J19816n7571j8441m6814m1777J17556l0992j73099L9700p1063J69728
$$ 116532 236348 178777 160336 113522 71745 189301 158309 -14790 24910 -46153 123575
7382A23575k6144k03952J16993K8614p1059j58944l7615J70255O2913P1451J8374
$$ 123575 97431 -106521 10472 39086 -31973 -190917 -228532 -58277 4636 76087 94461
7371I4461k01572R8630j11549j37652J2415J46058J01382Q3170J30125K0079l2815
$$ 94461 -107111 -8481 -120030 -257682 -245267 -99209 2173 85343 215468 235547 202732
7360B02732J4582j247j72313j72172R6929J59754n9329R5308j17190J26976q9581
$$ 202732 217314 216067 43754 -128418 -31489 128265 68936 164244 47054 174030 84449
7349H4449j02709j04099J36198l5637j62331J45910O0857j76342m9846M7340J11869
$$ 84449 -18260 -122359 13839 -21798 -184129 -38219 22638 -153704 -203550 -156210 -44341
7338d4341q6944O7317J91980r4882J6303K97095m8505L5490J5987j83003P529
$$ -44341 -131285 -63968 128012 33130 49433 346528 298023 333513 349500 166497 174026
7327A74026r2616K1878n7279o6846l2949M3681R7061O0720m0496k95779k780M2295
$$ 174026 81410 103288 46009 -20837 -53786 -10105 86956 147676 107180 -188599 -191379 -149084
7315a49084j0996Q2531J91347R7608j82763K4243Q952J20455R274j42312M3606
$$ -149084 -160080 -77549 113798 211406 28643 52886 61838 182293 191567 49255 92861
7304I2861K5984j37892m7467K7067P5954j00102P8366j00280n4661K1139j68833
$$ 92861 118845 -19047 -66514 -39447 36507 -63595 14771 -85509 -140170 -119031 -287864
7293b87864J79314j48962J11442O7587n8626J26309q1132L0612O9505R00n561
$$ -287864 -108550 -257512 -146070 -78483 -137109 -10800 -91932 -61320 8185 9085 3524
7282C524J87511k51443l1831K65832p1146N0410J04130m2981J4n3452M3394k5263
$$ 3524 191035 -60408 -92239 173593 102447 152857 256987 214006 214020 160568 203962 178699
7270A78699o9309j08898N3240J46086j48608k0321j73481J48192n5310P5481R283
$$ 178699 109390 492 53732 199818 51210 30889 -142592 5600 -49710 25771 35054
7259C5054j87333K46816R6587O359k18656r0099J59446q0429L1936M6318l2072
$$ 35054 -152279 94537 191124 197483 -21173 -111272 48174 -32255 -319 45999 13927
7248A3927j45855j92482J26954O6393k7575j31663K31059m3833n6933m4977L1739
$$ 13927 -131928 -324410 -197456 -131063 -158638 -290301 -59242 -103075 -160008 -204985 -173246
7237a73246J36080K3287m7208k2769Q0093N4629J1606R0738j21264J20378l7434
$$ -173246 -37166 -13879 -61087 -83856 -3763 50866 62472 153210 31946 152324 114890
7226A14890k1035J77100j67140o3637l25381K7487L38419n5286q5934n4924k9154
$$ 114890 93855 270955 103815 40178 -285203 -257716 80703 25417 -60517 -115441 -144595
7215a44595Q8353P7903O2252L4429J27209p2600n2646J6023J36242q6107j56954
$$ -144595 -56242 21661 83913 118342 245551 172951 120305 136328 272570 186463 29509
7204B9509J7064J61286N2014K8352j00093j94486J57687L2424j38977K07016j79943
$$ 29509 46573 207859 259873 288225 188132 -6354 151333 183757 44780 251796 71853
7193G1853l2704J38124q9045k21645Q5619P6646j2468j32096Q5273J98287N7187
$$ 71853 39149 177273 88228 -133417 -47798 28848 16380 -115716 -30443 167844 225031
7182B25031k12957m9615O1091j59689L5284K04155K37629K5940j08981l7350k4871
$$ 225031 12074 -37541 23550 -136139 -100855 103300 340929 366869 257888 220538 195667
7171A95667j14507N5169l3380j665j22780j25178j75530K63536Q0492k0817J73412
$$ 195667 81160 136329 102949 101284 -21496 -146674 -322204 -58668 21824 1007 174419
7160A74419J05230j1157k745k55969j7528m9398j77105J52858j02279Q7960J70909
$$ 174419 279649 268492 265747 9778 -7750 -57148 -234253 -81395 -183674 -95714 75195
7149G5195j01981j20690j04626J06506L0673J47161K58293j71772n6274J31510
$$ 75195 -26786 -147476 -252102 -145596 -114923 32238 290531 118759 62485 193995
7139A93995n1204r782O8514R9193j54635p7551K09019q1646j8650j20295q1365
$$ 193995 142791 133009 201523 300716 146081 68530 277549 195903 177253 56958 -24407
7128b4407Q7933Q3220J13563j017j03048j37195J07587l4550J08270R0830j86342
$$ -24407 63526 146746 260309 259292 156244 19049 126636 92086 200356 291186 104844
7117A04844j25508J27335l9966k7979m6414Q7928j4050k4622j13825q464J07928
$$ 104844 -20664 106671 66705 38726 -7688 80240 66190 41568 -72257 -80721 27207
7106B7207j06434j01868Q5107O2197Q6097N7075l21539L52J51657m0508J33629
$$ 27207 -79227 -181095 -95988 -33791 52306 109381 -212158 -211806 -60149 -100657 32972
7095C2972k6213Q8111J04408Q9054Q2701q4841j00699j99055j54160j35151K19235
$$ 32972 6759 94870 199278 288332 371033 286192 185493 -13562 -167722 -302873 -83638
7084h3638q908k11714J92603J00851p4071Q0678j11919o6683J07847J65803j06622
$$ -83638 -92546 -304260 -111657 -10806 -84877 -4199 -116118 -182801 -74954 90849 -15773
7073a5773O7961p2315Q469R355J09883r6418M3179j2619O670k2596j27836J57745
$$ -15773 52188 -20127 -11658 -2303 107580 11162 54341 41722 48392 25796 -102040 55705
7061E5705Q1013j79751l233J10115L3240j27265J9219K4240P0534M7997K04366
$$ 55705 136718 -43033 -46266 63849 97089 -30176 -10957 13283 83817 131814 336180
7050C36180l9504j0502n6634q4093j22369j19403K23260j54756J98531n8164J12246
$$ 336180 296676 286174 229540 145447 23078 -96325 126935 -27821 170710 112546 224792
7039B24792p2429M5457J4513j75805r8585J35794L4684k36367J55156n8852R0639
$$ 224792 152363 197820 212333 36528 -62057 73737 108421 -127946 27210 -31642 58997
7028E8997N4878J12056j7069n2963r957k1411J74706j08106j21514J19311K18970
$$ 58997 113875 225931 208862 155899 145942 124531 299237 191131 69617 188928 407898
7017D07898r3694l54051O2214J09788R9539j88479j11867O9364o3816K2899J74608
$$ 407898 314204 -39847 22367 132155 231694 43215 -68652 712 -63104 -40205 134403
7006A34403K07082l2946k17137j5473r8519o3335j33511Q593L62578J4489j00985
$$ 134403 341485 308539 91402 75929 -22590 -85925 -219436 -210843 151735 166224 65239
6995F5239J33867J4006K1498K7178k33154J40474m2655k15931J1732J47201L1738
$$ 65239 199106 213112 234610 261788 28634 169108 126453 -89478 -77746 69455 101193
6984A01193r1166m725J01298p9465J87693l3658P2175j75661J6286j86537m5450
$$ 101193 10027 5302 106600 27135 214828 181170 253345 77684 93970 -92567 -138017
6973a38017J25801r1073J3533N823J97922o9939r6644J88593l666J50833k16589
$$ -138017 -12216 -103289 -89756 -83933 113989 44050 -52594 135999 132333 283166 66577
6962F6577l8756J11920K09626j8305L9751o4366j30024l1280j17546O92J7399
$$ 66577 27821 139741 349367 331062 370813 306447 176423 145143 27597 28289 45688
6951D5688j4296J94432P8405k22362J21269o6970j32520P7582J53892M638M8804
$$ 45688 31392 225824 304229 81867 203136 136166 3646 81228 235120 239758 288562
6940B88562p8459j28088n3816m9344K09843O5508J2048q102j58395J12082j12403
$$ 288562 210103 82015 28199 -21145 188698 254206 266254 258152 99757 211839 99436
6929I9436K811J07286p1103M6468o63k6972J63324j39713J29889j53790j48081
$$ 99436 102247 209533 138430 184898 184235 157263 320587 180874 310763 156973 8892
6918H892n4642r7808J25761J79640j51953N2061J50101Q7668j33317j50979J63918
$$ 8892 -45750 -143558 -17797 161843 9890 61951 212052 299720 166403 15424 179342
6907A79342r781r2197J25252q2620J54740j05233j03376m285Q9839N2745l5061
$$ 179342 169561 77364 202616 119996 274736 169503 66127 61842 151681 204426 169365
6896A69365l4863k29115O2581J58799J65761K3968L938o9697K1714l9160L7774
$$ 169365 134502 -94613 -32032 126767 292528 316496 320434 250737 272451 233291 271065
6885B71065q1736N5902L318r7079J0432L0425M770j7390O7708r2524m0289j35387
$$ 271065 189329 245231 248549 151470 161902 192327 197097 179707 247415 154891 114602 -20785
6873b0785K08292L9694L0118n3462j28366J72528J31468J20974j81421L9301j34237
$$ -20785 187507 227201 257319 203857 75491 248019 379487 500461 319040 358341 224104
6862B24104p8265k6889j0554K2016K6909K53739k26918O5025M5450Q4339J66620
$$ 224104 145839 118950 108396 130412 157321 411060 184142 249167 294617 378956 545576
6851E45576m9611k10256j18307L359L5258K2128M5511O9333p8483J1387L07878
$$ 545576 495965 285709 167402 170761 206019 228147 273658 342991 264508 275895 583773
6840E83773j10899k05133p5277r3115K3312J7063j0923q9905J35807j12504M4825
$$ 583773 472874 267741 192464 99349 122661 139724 128801 38896 174703 62199 107024
6829A07024J30606J25455j10606Q6497M5318j5328n8785j19993n4125j6787J86075
$$ 107024 237630 363085 252479 338976 384294 368966 310181 190188 136063 119276 305351
6818C05351r7908N0495m1199r3060K08573q3951J94954L8115k67699j1977R4322
$$ 305351 207443 257938 216739 123679 332252 248301 443255 481370 213671 201694 296016
6807B96016j51189q5390r1772L3673J57302K01445j13045o9755K45129k7207k8569
$$ 296016 144827 59437 -32335 1338 158640 360085 247040 177285 422414 395207 366638
6796C66638j66017J1339m6032j9786k9690J0017N6061q3899l2264J16496J42657
$$ 366638 200621 211960 165928 146142 116452 126469 182530 98631 66367 182863 325520
6785C25520n7932J2595L550O6829k0444j51902p165j22020J77851R4750l2741
$$ 325520 267588 280183 283733 350562 330118 178216 171051 49031 226882 321632 288891
6774B88891J92505j31322k4272q1148J51718J04995Q365p6721p5042p476n0223
$$ 288891 481396 350074 325802 244654 396372 501367 509732 433011 357969 350493 300270
6763C00270R7127k42618J02848k6567q6453N9397j75193Q2159J05505J33865L4825
$$ 300270 397397 154779 257627 231060 144607 204004 28811 110970 216475 350340 385165
6752C85165o6785O8434M7825q8052J6947o7733r2571J19450l2821p8395N7665
$$ 385165 318380 386814 434639 346587 363534 295801 203230 322680 289859 211464 269129
6741B69129j04216J24168J15170p4380l5837M6825m9522Q5873J7058J22634n1440
$$ 269129 164913 289081 404251 329871 294034 340859 291337 377210 394268 516902 465462
6730D65462q731P389J5800M5641L8807q0086j14754j08945K41867J60850j97229
$$ 465462 456731 464120 479920 525561 564368 484282 369528 260583 502450 663300 466071
6719D66071L1703N5642K7429R1833m7403K9530J1753l41950J26092N1306l24006
$$ 466071 497774 553416 580845 672678 625275 654805 666558 324608 450700 502006 178000
6708A78000p2592L00849K2563o4567o4510p7490J42108P4833j79726J42435K16568
$$ 178000 105408 406257 428820 364253 299743 222253 364361 439194 259468 401903 618471
6697F18471j53409l2492K46690J41517j16845m1084j05413J52904J3150j55608
$$ 618471 465062 432570 679260 820777 703932 662848 557435 710339 723489 567881
6687E67881P0547p0840o5080j40587K60622p729k26844k38816K29145j7043k1967
$$ 567881 638428 567588 502508 361921 622543 614814 387970 149154 378299 361256 339289
6676C39289M9765N7338n1634L3806K22244k9362l44377K4749P519J29109O0633
$$ 339289 389054 446392 394758 428564 650808 621446 277069 301818 309337 438446 499079
6665D99079R5067N3370r4618J5147J08431j1484M1047k89135M3113M7693J2292
$$ 499079 594146 647516 552898 568045 676476 664992 706039 416904 460017 507710 520002
6654E20002J88299j25760j678N3515J18652J40810r7971j11776M2426L4285K4354
$$ 520002 708301 582541 580863 634378 753030 893840 795869 684093 726519 760804 785158
6643G85158k5888k00140K6110J29614j07533J1612o3482P1030k4148J15792O9741
$$ 785158 759270 559130 585240 714854 607321 618933 555451 626481 602333 718125 787866
6632G87866K0898l8488N2181m3499J1732J99004N0477k22069J34571l3010R6512
$$ 787866 808764 770276 822457 778958 790690 989694 1040171 818102 952673 919663 1016175
6621A016175k47704K16167j17051J00057J84113o0725M7622n1246m6689P4248
$$ 1016175 768471 984638 867587 967644 1151757 1091032 1138654 1087408 1040719 1114967
6611A114967J61082m8896K45406o9864m3033J04283O352j41980J9283N7153J26455
$$ 1114967 1276049 1227153 1472559 1402695 1359662 1463945 1470297 1328317 1347600 1404753 1531208
6600A531208n3252p2877R363m0228J91431o0660R8083J70968K22215j80300j49859
$$ 1531208 1477956 1405079 1414442 1374214 1565645 1504985 1603068 1774036 1996251 1815951 1666092
6589A666092m6009J78717j12906J74874L31369k4934J26823J47134o3035k7981
$$ 1666092 1620083 1798800 1685894 1860768 2192137 2167203 2294026 2441160 2378125 2350144
6579B350144o4695J63827r036N7733Q5332N061M03172J30409K2667j84122J96962
$$ 2350144 2285449 2449276 2440240 2497973 2583305 2588366 2991538 3121947 3144614 2960492 3157454
6568C157454K28462K01538k11878J45778J01903J68762J76838O5483M1235K36987
$$ 3157454 3385916 3587454 3375576 3521354 3623257 3792019 3968857 4034340 4075575 4312562
6558D312562N7143J72740K41591J85871K58494L36035K48093L55070M24747L85007
$$ 4312562 4369705 4542445 4784036 4969907 5228401 5564436 5812529 6167599 6592346 6977353
6548F977353L25072M91444N95519M28623L68662R07587Q87531N80962M49482O21595
$$ 6977353 7302425 7793869 8389388 8818011 9186673 10094260 10981791 11562753 12012235 12633830
6538A2633830N40795K29270K42541N5541o7775k59421k6812k68738m7841j09926
$$ 12633830 13174625 13403895 13646436 13701977 13634202 13374781 13347969 13079231 13031390 12921464
6528A2921464K2164o4875R1767L86383L61474M03813N89109P11351P62493R41180
$$ 12921464 12943628 12878753 12970520 13356903 13718377 14122190 14711299 15422650 16185143 17126323
6518A7126323J102725R09759J254317J214223J379285P23276J73620n4943o31709
$$ 17126323 18229048 19138807 20393124 21607347 22986632 23709908 23883528 23828585 23196876
6509B3196876j123216j396931j442115j098330j298311j031107p81555o82175
$$ 23196876 22073660 20676729 19234614 18136284 16837973 15806866 15025311 14343136
6501A4343136o03075o82595j44004j05294J4009J00815J09526j49525K22595L98578
$$ 14343136 13740061 13057466 12913462 12808168 12822177 12922992 13032518 12882993 13105588 13504166
6491A3504166M58491J67797j41710j38521j33775m18048m97011q42059o39097
$$ 13504166 13962657 14130454 13988744 13850223 13716448 13298400 12801389 11959330 11320233
6482A1320233q01110o26952o50059q69017o02577m34563l51825o78358m91326
$$ 11320233 10519123 9892171 9242112 8373095 7770518 7335955 6984130 6305772 5814446
6473E814446k44430l53020k04009k96806l67417o0782k79108L0867k91795k66785
$$ 5814446 5570016 5216996 5012987 4716181 4348764 4287982 4008874 4039741 3747946 3481161
6463C481161K2080j52800k02029k43637M126k439P4565k39944M956N1820k22685
$$ 3481161 3503241 3350441 3148412 2904775 2908901 2906462 2981027 2741083 2746039 2797859 2575174
6452B575174p1073K8248R4430j10875j84417l4210j63495o7162L4320J624j33414
$$ 2575174 2504101 2532349 2626779 2515904 2331487 2297277 2133782 2066620 2100940 2102564 1969150
6441A969150k27134j52848K43892Q7925k09786j36354J44317p4176r9281K7619
$$ 1969150 1742016 1589168 1833060 1920985 1711199 1574845 1719162 1644986 1545705 1573324
6431A573324K4377o0052k636J51097l03332J75894J2078j63208J13717j07286
$$ 1573324 1597701 1537649 1535013 1686110 1382778 1558672 1570750 1407542 1521259 1413973
6421A413973k0308K7743j34125j27510L3712J75467m3128n1150O4636M1045n3955
$$ 1413973 1393665 1421408 1287283 1159773 1193485 1368952 1325824 1274674 1339310 1380355 1326400
6410A326400j64838q813j9841L19881o5743l43311K6761N8281j38794M1663Q1035
$$ 1326400 1161562 1152749 1132908 1452789 1387046 1043735 1070496 1128777 989983 1031646 1112681
6399A112681J70463j08496j04700Q3078M5015p9109k37971M7769J5161J15071
$$ 1112681 1283144 1174648 1069948 1153026 1198041 1118932 880961 928730 943891 1058962
6389A058962j31131K18477O6374j87141P6111j03241k45886J65697J1592N8732
$$ 1058962 927831 1146308 1212682 1025541 1101652 998411 752525 918222 929814 988546
6379I88546L6352p1456j91006k7687k9365K4637L29591j03019r3450J56264j52998
$$ 988546 1024898 953442 762436 734749 705384 730021 1059612 956593 863143 1019407 866409
6368H66409j55031K13211l7097K3467k27896m7377L61731J24641k16460j6997
$$ 866409 711378 924589 887492 910959 683063 635686 997417 1122058 905598 888601
6358H88601N1486m6881Q4336j89836J9578J34279k7830j39456o7816O049P0760
$$ 888601 940087 893206 977542 787706 807284 941563 913733 774277 706461 712510 783270
6347G83270M8191M8024p5550P9600k45142J19949L1044M2642J22142j12197o8986
$$ 783270 831461 879485 803935 883535 638393 758342 789386 832028 954170 841973 772987
6336G72987r5898K3993K38427M4712k88930j05973K09713J05322k48158J17099
$$ 772987 677089 701082 939509 984221 695291 589318 799031 904353 656195 773294
6326G73294O9709K31139j10462O0852p1118l0262J42600j05548J43676J8697n0464
$$ 773294 843003 1074142 963680 1024532 953414 923152 1065752 960204 1103880 1122577 1072113
6315A072113K8808O2132k00858Q4704J48270p9143j62028j07931P6913k28110
$$ 1072113 1100921 1163053 962195 1046899 1195169 1116026 953998 846067 922980 694870
6305F94870O9023M0644j94322o6557l3021l3223K9511J08786K31444M296j18370
$$ 694870 763893 804537 610215 543658 510637 477414 506925 615711 847155 851451 733081
6294G33081J748M8832j19922J5012J42152J0162j05090k84741Q4649J17619K2018
$$ 733081 734829 783661 663739 678751 820903 831065 725975 441234 525883 643502 665520
6283F65520j19145o405L3441J34926J23270j39670o6408P1070m6537K5529o4038
$$ 665520 546375 539970 573411 708337 831607 691937 625529 696599 650062 675591 611553
6272F11553j70399J00583O1842k04144k8194M6544l3372L4859Q2502R5447j10546
$$ 611553 441154 541737 603579 399435 371241 417785 384413 419272 501774 597221 486675
6261D86675r0069J2159j80354j22928J40720q5973J40367l9396J63603r3462j67415
$$ 486675 396606 408765 228411 105483 246203 160230 300597 261201 424804 331342 163927
6250A63927J40744o984k2928j20208K3564L40535J44151j33367j40611j63334
$$ 163927 304671 297687 274759 154551 178115 518650 662801 529434 388823 225489
6240B25489K0502L4938J08795J72094j21155J52787j74808j12436L06791k28511
$$ 225489 245991 280929 389724 561818 440663 593450 418642 306206 612997 384486
6230C84486R7346o223k37391J01996K80700n8794k9516q0894j09663J23553l4020
$$ 384486 481832 475609 238218 340214 620914 562120 532604 451710 342047 465600 431580
6219D31580j11996O0585o1167O4982M6222n6353J11461J49428j95624J07482M2902
$$ 431580 319584 380169 319002 383984 430206 373853 485314 634742 439118 546600 589502
6208E89502k01294K00014R4867j10721j73432J13258m574M9205r77N6754n4082
$$ 589502 388208 588222 683089 572368 398936 512194 507620 556825 555848 612602 558520
6197E58520K6418O835k00762p313J09029L4313R9946j93714j018Q8771j14116
$$ 558520 584938 591773 391011 383698 492727 527040 626986 433272 432254 521025 406909
6186D06909O5682J13840P68R0820o1729m6405K9646j2728r1519J3257J90368l04849
$$ 406909 472591 586431 587199 678019 616290 569885 599531 586803 495284 508541 698909 394060
6174C94060j7732j0307J23136j00947k2045r1156J25003K68699k92748j35501
$$ 394060 376328 366021 489157 388210 366165 275009 400012 668711 375963 240462
6164B40462K00224L15536n4599k04937n7034M4403J02464j92868p6845K74998
$$ 240462 440686 756222 701623 496686 439652 484055 586519 393651 316806 591804
6154E91804M5317j59083M280k0921o7471J2573K03495J8978j20008K0984j39093
$$ 591804 637121 478038 482318 461397 393926 406499 609994 628972 508964 529948 390855
6143C90855J04520J29349q2092n325p1734o9926k1267l6322J79137l71k23882
$$ 390855 495375 624724 542632 537307 465573 395647 374380 338058 517195 516824 292942
6132B92942k4582K08212M8789j24399j1845J25324j04468Q2824k8216l4914K9582
$$ 292942 268360 476572 525361 400962 389117 514441 409973 492797 464581 429667 459249
6121D59249N0580P6927q70o5927j760r2954P1752o509o8002O8686k77074J86386
$$ 459249 509829 586756 585886 519959 518199 425245 496997 490488 422486 491172 214098 400484
6109D00484O8254J49493R7204k594j23166j80676J15953J41643k5762j1383j0609
$$ 400484 468738 618231 715435 712841 589675 408999 524952 666595 640833 629450 618841
6098F18841l5958J41294n4702p2998j6903J20502L612o6858p0529O3635k3231
$$ 618841 582883 724177 669475 596477 579574 700076 703688 636830 566301 629936 606705
6087F06705j82256J38645K21637m443r670N6512j32859j61601J7687k4472j26911
$$ 606705 424449 563094 784731 780288 770618 827130 694271 532670 550357 525885 398974
6076C98974M2297j4898Q8263n1941K6680n7571m5555N5683Q8573J44639m0296
$$ 398974 441271 426373 514636 462695 489375 431804 386249 441932 530505 675144 634848
6065F34848k06178n5398J71636j0027m3287k9031J82329o2726j05317N3908n5370
$$ 634848 428670 373272 544908 534881 491594 462563 644892 582166 476849 530757 475387
6054D75387J73274k71444m728N6108J17143m6026j28871J61349L4115J33350j31851
$$ 475387 648661 377217 372489 428597 545740 499714 370843 532192 566307 699657 567806
6043E67806j29683J24106L9272J39113k3084m1183j15484O8492M0052j14358M7530
$$ 567806 438123 562229 601501 740614 717530 676347 560863 629355 669407 555049 602579
6032F02579J8996j66140J7263n3688J54203J32689j412L2698j27441j181j81778
$$ 602579 621575 455435 472698 419010 573213 705902 704490 737188 609747 608566 426788
6021D26788J41127q8861Q0570K02316M3093j65058J67751m9880l8263o5558L1549
$$ 426788 567915 479054 559624 761940 805033 639975 807726 757846 719583 654025 685574
6010F85574j2693K02739r9962j2371k1261N924J83186m4865Q6892j56560q442
$$ 685574 672881 875620 775658 763287 742026 747950 931136 886271 973163 816603 808161
5999H08161k9562K10679j52918l7914L2677k7460j08021K794J4613j4950K5944
$$ 808161 778599 989278 836360 798446 831123 803663 695642 698436 713049 698099 724043
5988G24043Q0232O7145j24058l0214Q4980P4175l1872l3754L7989K7004j78011
$$ 724043 804275 871420 747362 717148 802128 876303 844431 810677 848666 875670 697659
5977F97659K308J88271J2278j2020K10431r2348j27542L1539M6293j19731n400
$$ 697659 699967 888238 900516 888496 1098927 1006579 879037 910576 956869 837138 831738
5966H31738J28778L04706j21285j87297j43922J00345P0627M698o5844j2484j0494
$$ 831738 960516 1265222 1143937 956640 812718 913063 983690 988388 922544 910060 899566
5955H99566R6636J09411k84929Q352L69376J19898l55363r5871M4578R7742Q6025
$$ 899566 996202 1105613 820684 829036 1198412 1318310 962947 867076 911654 1009396 1095421
5944A095421k27526J53890N3899k04976j0798K39839R3759o375J36812j54759
$$ 1095421 867895 1021785 1075684 870708 859910 1099749 1193508 1187133 1323945 1169186
5934A169186J07086j04286J26614M9089n390j03996O9408j2542O8310K30364j45540
$$ 1169186 1276272 1171986 1298600 1347689 1342299 1238303 1307711 1295169 1363479 1593843 1448303
5923A448303k03728p3843J53032K33130P8706m0123P858m8905q5211J46870j7875
$$ 1448303 1244575 1170732 1323764 1556894 1635600 1595477 1603335 1554430 1469219 1616089 1598214
5912A598214L1264M2750J4690r1222j22953J80605J67801J60166j39324o712k6552
$$ 1598214 1629478 1672228 1686918 1595696 1472743 1653348 1821149 1981315 1841991 1835279 1808727
5901A808727J5367M4949P7805J57317K3952r0045k37322K60992J50108M0460j07551
$$ 1808727 1824094 1869043 1946848 2104165 2128117 2038072 1800750 2061742 2211850 2252310 2144759
5890B144759L11717l2648j39653K47853M2501M262L1235Q6278L4195J20065M830
$$ 2144759 2456476 2423828 2284175 2532028 2574529 2578791 2610026 2696304 2730499 2850564 2855394
5879B855394J12360J5178l4213J70806P8937k7771J37596K97200J11289m548R7550
$$ 2855394 2967754 2982932 2948719 3119525 3198462 3170691 3308287 3605487 3716776 3712228 3809778
5868C809778m952M6512P5604K50301J615K69434L31479j47307O6145K87645R0810
$$ 3809778 3804826 3851338 3926942 4177243 4178858 4448292 4779771 4632464 4698609 4986254 5077064
5857E077064p7386L23468Q4995K08550L70559J25804K40264L55452M57940M57393
$$ 5077064 4999678 5323146 5408141 5616691 5987250 6113054 6353318 6708770 7166710 7624103
5847G624103M55733M87719N13432L97089N90626P72077Q47804P20604R05745Q86376
$$ 7624103 8079836 8567555 9080987 9478076 10068702 10840779 11688583 12409187 13314932 14201308
5837A4201308P25471O96046L39880J16199j60447j09437o10622m38694j04330
$$ 14201308 14926779 15622825 15962705 16078904 15918457 15809020 15198398 14759704 14655374
5828A4655374l00262m39920l520J85594o1766M29920M50889L33066N06613R15913
$$ 14655374 14355112 13915192 13911672 14097266 14035500 14465420 14916309 15249375 15755988 16671901
5818A6671901J075253J010361J141079J423703J449629J366869R20009N56469
$$ 16671901 17747154 18757515 19898594 21322297 22771926 24138795 25058804 25615273
5810B5615273j19098p64200j043474j355456j486716j386470j447779j087160
$$ 25615273 25496175 24731975 23688501 22333045 20846329 19459859 18012080 16924920
5802A6924920j017473o36206o13269p09241n69933n57116j48464o9776o510K64312
$$ 16924920 15907447 15271241 14657972 13948731 13378798 12821682 12673218 12603442 12596932 12861244
5792A2861244K42020Q6736K11956M97365J20329j41202k18197m59049m14780p04274
$$ 12861244 13103264 13190000 13401956 13899321 14019650 13878448 13660251 13201202 12786422 12082148
5782A2082148o06773o91574p99014o05712o62729p43412m54192l50947m48831
$$ 12082148 11475375 10783801 9984787 9379075 8716346 7972934 7518742 7167795 6718964
5773F718964k20092k61481m95451j17841k54075k24537k33312j83155m1248j88379
$$ 6718964 6498872 6237391 5741940 5624099 5370024 5145487 4912175 4729020 4687772 4499393
5763D499393k06878k1780j68423l15210k7705r3704n4649j29383k21895k7955
$$ 4499393 4292515 4270735 4102312 3787102 3759397 3665693 3611044 3481661 3259766 3231811
5753C231811J6589j25141j46606P9562M8497j18346j24123j43734J53759q6450
$$ 3231811 3248400 3123259 2976653 3056215 3104712 2986366 2862243 2718509 2872268 2785818
5743B785818J62846q4187l4295j12875k95222l8658j4443R3618k4312N7331N6837
$$ 2785818 2948664 2864477 2830182 2717307 2422085 2383427 2368984 2462602 2438290 2495621 2552458
5732B552458J25257N711J64068m7654j61222N4107p7207o6051l5760J43299N9730
$$ 2552458 2677715 2683426 2847494 2799840 2638618 2692725 2615518 2549467 2513707 2657006 2716736
5721B716736k21279j16985J06216P271j1160M9725k4144J4775j44921J18329j92293
$$ 2716736 2495457 2378472 2484688 2491959 2480799 2530524 2506380 2521155 2376234 2494563 2302270
5710B302270K5611k4473L0878K82554M5765m7090N9909J05906j17009K20699J34309
$$ 2302270 2327881 2303408 2334286 2616840 2662605 2615515 2675424 2781330 2664321 2885020 3019329
5699C019329J09022m4910o1478J92197Q286j78172L7042j83142o1871J41592p8945
$$ 3019329 3128351 3083441 3021963 3214160 3222446 3044274 3081316 2898174 2836303 2977895 2898950
5688B898950J50138K45447J44478K1522K22827R494m8204N6686J75462J23896
$$ 2898950 3049088 3294535 3439013 3460535 3683362 3692856 3644652 3701338 3876800 4000696
5678D000696N5488J59477P8342J07198k0354J06527P4706J56167n7051N2600n4302
$$ 4000696 4056184 4215661 4294003 4401201 4380847 4487374 4562080 4718247 4661196 4713796 4659494
5667D659494r7835K01491J22205N7036J2894K5321J77849L41045j9987J26073
$$ 4659494 4561659 4763150 4885355 4942391 4955285 4980606 5158455 5499500 5479513 5605586
5657E605586J27987K45038K84664j6899L33059J71608L60777K36221J94479K20340
$$ 5605586 5733573 5978611 6263275 6246376 6579435 6751043 7111820 7348041 7542520 7762860
5647G762860J44148M46276L44833K53902L14712L67058Q54411P32813N81341N31894
$$ 7762860 7907008 8353284 8698117 8952019 9266731 9633789 10488200 11221013 11802354 12334248
5637A2334248M85351P77999O84065L41118L39617L65269R4418M8091l01209k7539
$$ 12334248 12819599 13597598 14281663 14622781 14962398 15327667 15422085 15470176 15168967 15141428
5627A5141428k26700J53195M6546J70826N2600J48105L64182K83540M56576N58687
$$ 15141428 14914728 15067923 15114469 15285295 15337895 15486000 15850182 16133722 16590298 17148985
5617A7148985Q58731Q17586P93640J022483J016915O84833P63049P62770N10260
$$ 17148985 18007716 18825302 19618942 20641425 21658340 22343173 23106222 23868992 24379252
5608B4379252K49117k03032k76101o74558r52517r31452p37176j017088r71234
$$ 24379252 24628369 24425337 24149236 23474678 22522161 21590709 20853533 19836445 18865211
5599A8865211p62874p71258m28488l70190k77139m45028j66866j21045p2910K8707
$$ 18865211 18102337 17331079 16902591 16532401 16255262 15810234 15643368 15522323 15449413 15478120
5589A5478120Q5469K70336K46069K23463p6123j27606L071l89316n27886q88251
$$ 15478120 15563589 15833925 16079994 16303457 16227334 16099728 16102799 15713483 15185597 14297346
5579A4297346r31504p16086p52608n17113k93655o40137n01682m69742o11683
$$ 14297346 13365842 12649756 11897148 11380035 11086380 10446243 9944561 9474819 8863136
5570H863136m09918m64911m51869k76877l98367j74834q7634k22123j52882l36840
$$ 8863136 8453218 7988307 7536438 7259561 6861194 6686360 6598726 6376603 6223721 5886881
5560E886881j90502q2275j40384J04674P6150q0796j59426l7930k58633K8902
$$ 5886881 5696379 5614104 5473720 5578394 5654544 5573748 5414322 5376392 5117759 5146661
5550E146661R1727k41830K31526N2747l13873j95385O1222P5463K8763m1864j9467
$$ 5146661 5238388 4996558 5228084 5280831 4966958 4771573 4832795 4908258 4937021 4895157 4875690
5539D875690N0944k74365j57670O5046L32760j68910k0155k8739j64476N1416
$$ 4875690 4926634 4652269 4494599 4559645 4892405 4723495 4703340 4674601 4510125 4561541
5529D561541J17145r6705o4371m9703L2117l7183J07541J92472l9058j6314O5212
$$ 4561541 4678686 4581981 4517610 4467907 4500024 4462841 4570382 4762854 4723796 4707482 4772694
5518D772694R4973R66R7352j06883N8940K1033K93294J24808j9346J22501n5661
$$ 4772694 4867667 4868633 4965985 4859102 4918042 4939075 5232369 5357177 5337831 5460332 5404671
5507E404671L2891Q1022P4932J06076j1333Q1333J10977Q9863J45671J37113J43169
$$ 5404671 5437562 5518584 5593516 5699592 5688259 5769592 5880569 5970432 6116103 6253216 6396385
5496F396385O7119M8041J44363K93168J47245K37364J30638j3150K8367J84466
$$ 6396385 6463504 6511545 6655908 6949076 7096321 7333685 7464323 7451173 7479540 7664006
5486G664006M29543K5628K69828K71129K70967M63381L98353K17044L12345J15459
$$ 7664006 8093549 8119177 8389005 8660134 8931101 9394482 9792835 10009879 10322224 10437683
5476A0437683K27791K04456Q5457K19733J6946N9683K58057M59817M05100P6263
$$ 10437683 10665474 10869930 10955387 11175120 11192066 11251749 11509806 11969623 12374723 12450986
5466A2450986L94891J01883J49475J95159K50887M61532L64891N06015K68073
$$ 12450986 12845877 12947760 13097235 13292394 13543281 14004813 14369704 14875719 15143792
5457A5143792J46991L08264M71265L74696N38345K56304L82502L68323N30076
$$ 15143792 15290783 15599047 16070312 16445008 16983353 17239657 17622159 17990482 18520558
5448A8520558N86095L84129P08929M23180N32554N86502P13927Q65591P72559
$$ 18520558 19106653 19490782 20199711 20622891 21155445 21741947 22455874 23321465 24094024
5439B4094024O67521O41668R58445J101849J046138P87082J457534J110295J332201
$$ 24094024 24761545 25403213 26361658 27463507 28509645 29296727 30754261 31864556 33196757
5430C3196757J585841J530022J596979J415407J734624J573460J913781J785399
$$ 33196757 34782598 36312620 37909599 39325006 41059630 42633090 44546871 46332270
5422D6332270J747936J634923J604553J500638J920515K131371K127465K425218
$$ 46332270 48080206 49715129 51319682 52820320 54740835 56872206 58999671 61424889
5414F1424889K559362K831713L138200L537394M153662M839958N703428O883085
$$ 61424889 63984251 66815964 69954164 73491558 77645220 82485178 88188606 95071691
5406I5071691Q133722R619479J1100198J3407928J6348873K0005402K4937306
$$ 95071691 103205413 112824892 123925090 137333018 153681891 173687293 198624599
5399A98624599L1196007M0052030N1249857O5189111P6792860O5279786J1566675
$$ 198624599 229820606 269872636 321122493 386311604 463104464 528384250 539950925
5392E39950925m9308109p6602369p6918395o3534127m8507544l6350294k7459231
$$ 539950925 490642816 414040447 337122052 273587925 225080381 188730087 161270856
5385A61270856k0813284j6425260j3825514j1640858r540223q017872o846248
$$ 161270856 140457572 124032312 110206798 98565940 89025717 81007845 74161597
5378G4161597n626801m742581m359740l943805l284251k642742k510799k627659
$$ 74161597 68534796 63792215 59432475 55488670 52204419 49561677 47050878 44423219
5370D4423219k352238k097506k247688k155504j886658j554921j787666j805731
$$ 44423219 42070981 39973475 37725787 35570283 33683625 32128704 30341038 28535307
5362B8535307j507700j170967j176119j128732j103729r79003o33883r53954o50006
$$ 28535307 27027607 25856640 24680521 23551789 22448060 21469057 20835174 19881220 19231214
5353A9231214n55577q83799q14851l34650n35986m65654o44630m37103m06491
$$ 19231214 18675637 17791838 16976987 16642337 16106351 15640697 14996067 14558964 14152473
5344A4152473k83520m13217n30771k91697j77618l13886m56856j60717j29112
$$ 14152473 13868953 13455736 12924965 12633268 12455650 12141764 11684908 11524191 11395079
5335A1395079l06027O9743j50666l25218l12381l91616n62381p20805m47520j01825
$$ 11395079 11089052 11158795 11008129 10682911 10370530 9978914 9416533 8695728 8248208 8146383
5325H146383l76158k49509k45486l12907k49720l15125l90356M3599l02827l10488
$$ 8146383 7770225 7520716 7275230 6962323 6712603 6397478 6007122 6050721 5747894 5437406
5315E437406K40627k97509n1439l04402k44645j05333N2216J3067l1378o1312
$$ 5437406 5678033 5380524 5329085 5024683 4780038 4674705 4726921 4739988 4708610 4647298
5305D647298l18370r3422J61508r0276n3124l3124j63808m25190J58916L9615
$$ 4647298 4328928 4235506 4397014 4306738 4253614 4220490 4056682 3631492 3790408 3830023
5295C830023o7952l1246j03374q7880k56456J23330r7457R4911j54527j8372p7693
$$ 3830023 3762071 3730825 3627451 3539571 3283115 3406445 3308988 3403899 3249372 3231000 3153307
5284C153307j78994Q9501j7354r484M431K0685k51905m0407k35357J37705J07639
$$ 3153307 2974313 3063814 3046460 3036976 3041407 3062092 2810187 2769780 2534423 2672128 2779767
5273B779767k84456j35854J48995j91256m1887K4755P7463q8108j97946K3055
$$ 2779767 2495311 2359457 2508452 2317196 2275309 2300064 2377527 2289419 2091473 2114528
5263B114528N8681r0893K4130j00582j50175O982L2766N369j23910k11507K7553
$$ 2114528 2173209 2082316 2106446 2005864 1855689 1862671 1895437 1900806 1776896 1565389 1592942
5252A592942J055l2884l0662r1003J99857l7830M4228k11019J16520J55174j79465
$$ 1592942 1593997 1561113 1530451 1439448 1639305 1601475 1645703 1434684 1551204 1706378 1526913
5241A526913k4796j70330k4256K3321R9241o3644K3816K0037k83974m6085J92300
$$ 1526913 1502117 1331787 1307531 1330852 1430093 1366449 1390265 1410302 1126328 1080243 1272543
5230A272543J41837p3263j14792l11115J39117K03533J8346j19381k0552n7945
$$ 1272543 1414380 1341117 1226325 915210 1054327 1257860 1276206 1156825 1136273 1078328
5220A078328K0118j02862k7148j62267k21486m5766Q8112J4322K98500q6419j14505
$$ 1078328 1098446 995584 968436 806169 584683 538917 627029 641351 939851 853432 738927
5209G38927K62627j02398J15370j05627n8836j09119j001K01560j41102P8521
$$ 738927 1001554 899156 1014526 908899 850063 740944 739943 941503 800401 878922
5199H78922R4227k61201k56470M19039J25942m8427k03262j92784K9946K35850
$$ 878922 973149 711948 455478 874517 1000459 952032 748770 555986 585932 821782
5189H21782q9075J06851j07515k0359k3879J519J20049l24336p156J60118J17836
$$ 821782 732707 839558 732043 711684 687805 689324 809373 485037 477881 637999 755835
5178G55835o3512P401j33595j1281j9363j26572m1840J45210k6614j30541P7048
$$ 755835 692323 699724 566129 554848 535485 408913 367073 512283 485669 355128 432176
5167D32176J48711k6656O7272j07020Q0027j7016J1325J80636j49498j57303K0441
$$ 432176 580887 554231 621503 514483 594510 577494 588819 769455 619957 462654 483095
5156D83095R6909K77P1596Q7550o4294k13839j30724k9466k3126N3726j51796
$$ 483095 580004 580281 651877 739427 675133 461294 330570 301104 277978 331704 179908
5145A79908Q5491N9237J13141k57344L8567j0229q9770K30366K11335J9448p5636
$$ 179908 265399 324636 437777 180433 219000 208771 119001 349367 560702 580150 504514
5134E04514j48336j07644Q1569N2111o2628J05848K20455j64578j44262r8392
$$ 504514 356178 248534 330103 382214 319586 425434 645889 481311 337049 238657
5124B38657N9173K35197m6785m4349K545j71839J27798J03732K296n4387l6284
$$ 238657 297830 533027 486242 441893 444438 272599 400397 504129 506425 452038 415754
5113D15754J67307J29335o6793p4839j0582J78766J69483j72421R3380j16144
$$ 415754 583061 712396 645603 570764 560182 738948 908431 736010 829390 713246
5103G13246k54499k4703L18916P1892P7207j53453j59634K09760o4384j11036
$$ 713246 458747 434044 752960 824852 902059 748606 588972 798732 734348 623312
5093F23312j40164J25681O0444J45762p1692j1108p7080j1140j04666m371J98047
$$ 623312 483148 608829 669273 815035 743343 732235 655155 644015 539349 534978 733025
5082G33025q8998l2266P1925j66868k61293K05117J54989P4366J2760j04126j663
$$ 733025 644027 611761 683686 516818 255525 460642 615631 689997 702757 598631 596968
5071E96968J3722o6404k62063J23598K85196L2897k32361P6739Q5318r2482k5692
$$ 596968 610690 544286 282223 405821 691017 723914 491553 568292 653610 561128 535436
5060E35436j36227l3952M9454K28336J82151j76670O2080k7102l2037l5364J8253
$$ 535436 399209 365257 414711 643047 825198 648528 710608 683506 651469 616105 634358
5049F34358J75945q893j057k67917J0385L69076K05j43786k9983q5480J31583
$$ 634358 810303 801410 800353 532436 542821 911897 912102 768316 738333 652853 784436
5038G84436P3063m9533k41704M4403J90205l0974k22195K58294P1412k16737J68914
$$ 784436 857499 807966 566262 610665 800870 769896 547701 805995 877407 660670 829584
5027H29584L8316p1025K5139j31121J25427m5327K7412K20075q6787j24446J37676
$$ 829584 867900 796875 822014 690893 816320 770993 798405 1018480 931693 807247 944923
5016I44923R2743p3315J60791r9743L9749k2069k8828p1755J27450J60672k51193
$$ 944923 1037666 964351 1125142 1025399 1065148 1043079 1014251 942496 1069946 1230618 979425
5005I79425j26681L6785n1509J36176K26159J34446k81516o0677J64911M8270
$$ 979425 852744 889529 838020 974196 1200355 1334801 1053285 992608 1157519 1205789
4995A205789K3936o2729k5166N810J03028J8919n6275J34535L0362M0308j2742
$$ 1205789 1229725 1166996 1141830 1147640 1250668 1269587 1213312 1347847 1378209 1418517 1405775
4984A405775k54351K9976k0817K17090J47027j53117J90752m0308j268P6066N4848
$$ 1405775 1151424 1181400 1160583 1377673 1524700 1371583 1562335 1522027 1520759 1596825 1651673
4973A651673m3451R6306j96092J62838K27670m1414P5328J15855P0695j2737l4798
$$ 1651673 1608222 1704528 1508436 1671274 1898944 1857530 1932858 2048713 2119408 2106671 2071873
4962B071873j4905K09547M8056L1605o8981j22548J47269K23959j08677J0762
$$ 2071873 2056968 2266515 2314571 2346176 2277195 2154647 2301916 2525875 2417198 2427960
4952B427960O9076M8056J09888L37670J62107o9004R9768J96876L6439M1011N2439
$$ 2427960 2497036 2545092 2654980 2992650 3154757 3085753 3185521 3382397 3418836 3459847 3512286
4941C512286N5004J54867J55711J70892K35420n466K75924L47391M6377K05823
$$ 3512286 3567290 3722157 3877868 4048760 4284180 4278714 4554638 4902029 4948406 5154229
4931E154229J95829J22176L55935K01983M4096P8946L12277K49285P2991J30070
$$ 5154229 5350058 5472234 5828169 6030152 6074248 6153194 6465471 6714756 6787747 6917817
4921F917817J57149J69280J92540K43654K78914J55116K51484L43521J64834L14198
$$ 6917817 7074966 7244246 7436786 7680440 7959354 8114470 8365954 8709475 8874309 9188507
4911I188507J82674K07332M81911K51933J71676K13074K51030J35228K04882P5705
$$ 9188507 9371181 9578513 10060424 10312357 10484033 10697107 10948137 11083365 11288247 11363952
4901A1363952n4393K48492L24146J67891J99250r101R9245J70472J12524J69312
$$ 11363952 11309559 11558051 11882197 12050088 12249338 12240237 12339482 12509954 12622478 12791790
4891A2791790M9294J2831K55569O6641o9482K36042L4377K37486j7026J57626
$$ 12791790 12841084 12853915 13109484 13176125 13106643 13342685 13377062 13614548 13597522 13755148
4881A3755148J84403q0918k73048O5347O4699K19641L85l71226J13744j2535k33919
$$ 13755148 13939551 13858633 13585585 13650932 13715631 13935272 13935657 13564431 13678175 13665640 13431721
4870A3431721j64798p7997J2506j57338p3037J71064j46906j57732q8200l01537
$$ 13431721 13266923 13188926 13201432 13044094 12971057 13142121 12995215 12837483 12749283 12447746
4860A2447746k27721q8817K6966l10553o4253j48885k57437l41750p8962r7551
$$ 12447746 12220025 12131208 12158174 11847621 11783368 11634483 11377046 11035296 10956334 10858783
4850A0858783j43865k11186l91605O4681k77214k21118j67112j32600k84902m09722
$$ 10858783 10714918 10503732 10112127 10176808 9899594 9678476 9511364 9378764 9093862 8684140
4840H684140l88612j92173l72632k13899o8529q7825k54002l31311k15601j62785
$$ 8684140 8295528 8103355 7730723 7516824 7448295 7360470 7106468 6775157 6559556 6396771
4830F396771k38985l07184j58984j86087k54137j38166j43495j58582m8213k62104
$$ 6396771 6157786 5850602 5691618 5505531 5251394 5113228 4969733 4811151 4762938 4500834
4820D500834j40743M9356k70963q653p61k39988l15254k70514j40713j06969l8687
$$ 4500834 4360091 4409447 4138484 4129831 4129070 3889082 3573828 3303314 3162601 3055632 3016945
4809C016945o3310k25220j14849P5546m8548q5830j89577K057j28093k31268J13443
$$ 3016945 2953635 2728415 2613566 2689112 2640564 2554734 2365157 2367214 2239121 2007853 2121296
4798B121296L5086r7610j39644j41994j02735P4668J24281m0273p3369n5406m8819
$$ 2121296 2156382 2058772 1919128 1777134 1674399 1749067 1873348 1833075 1759706 1704300 1655481
4787A655481n5990m0000N3304k9817J19937M8652k96452M0977p2717p4743N1605
$$ 1655481 1599491 1559491 1612795 1582978 1702915 1751567 1455115 1496092 1423375 1348632 1400237
4776A400237Q468n1539L4621J61517j68441j34135j06841j8742K1611J43019r9040
$$ 1400237 1408705 1357166 1391787 1553304 1384863 1250728 1143887 1125145 1146756 1289775 1190735
4765A190735j4711J05895P706j45280J05010R2009l66336J54371J38182q0677
$$ 1190735 1176024 1281919 1289625 1144345 1249355 1341364 975028 1129399 1267581 1186904
4755A186904J06734J43418J1474k46139r4975p7449j12837K5010J2693J12325
$$ 1186904 1293638 1437056 1448530 1202391 1107416 1029967 917130 942140 954833 1067158
4745A067158J34852J0853p3413J10911K3704n1756n5102K29761j47366j97454
$$ 1067158 1202010 1212863 1139450 1250361 1274065 1222309 1167207 1396968 1249602 1052148
4735A052148j47830J12286J45966p0385J10628j11308p900J52704j3067j42388
$$ 1052148 904318 1016604 1162570 1092185 1202813 1091505 1083605 1236309 1223242 1080854
4725A080854K2038N353k02316N8841J6133J15959q9696o4532J57095r2131J68325
$$ 1080854 1102892 1108245 905929 964770 980903 1096862 1007166 942634 1099729 1007598 1175923
4714A175923M8162k45930L8399l817R1294K81067j9521r5160l4023M6091R3116
$$ 1175923 1224085 978155 1016554 1012737 1104031 1385098 1365577 1270417 1236394 1282485 1375601
4703A375601M5396k9815j09609j60612J57147o0316K3239J88703J45679J07024
$$ 1375601 1420997 1391182 1281573 1120961 1278108 1217792 1241031 1429734 1575413 1682437
4693A682437k18387k3303Q5314r3409j28899O2154L6078J05198j25237K83495
$$ 1682437 1464050 1440747 1526061 1432652 1303753 1365907 1401985 1507183 1381946 1665441
4683A665441R2765J39727J24060j09782K17236m7715l1739k9891J34923R3653
$$ 1665441 1758206 1897933 2021993 1912211 2129447 2081732 2049993 2020102 2155025 2248678
4673B248678K4693j74010N9141J15980n9912j09860m4322L01110J90516P8177
$$ 2248678 2273371 2099361 2158502 2274482 2214570 2104710 2060388 2361498 2552014 2630191
4663B630191J37488O5493O1256k2410J10933J49828P2217j36169J9278J23923
$$ 2630191 2767679 2833172 2894428 2872018 2982951 3132779 3204996 3068827 3088105 3212028
4653C212028J22933M7882P4855J81814P7337N4259J26773j9044J63210Q0544l2776
$$ 3212028 3334961 3382843 3457698 3639512 3716849 3771108 3897881 3878837 4042047 4122591 4089815
4642D089815M54136n2188O8485L57032K25580J21599P2225K39078J53014J48710
$$ 4089815 4543951 4491763 4560248 4917280 5142860 5264459 5336684 5575762 5728776 5877486
4632E877486K26281N2877K30794K95973K36804L69362M2561K64184M03176J66970
$$ 5877486 6103767 6156644 6387438 6683411 6920215 7289577 7332138 7596322 7999498 8166468
4622H166468K56143O02773N90680M29159K07808O50348P54132O84053R09116Q20951
$$ 8166468 8422611 9025384 9616064 10045223 10253031 10903379 11657511 12341564 13250680 14071631
4612A4071631J159898J505268J609093K156947K492887K031928J149710J002721
$$ 14071631 15231529 16736797 18345890 20502837 22995724 25027652 26177362 27180083
4604B7180083R22416J177506K113010K750239L253868L070788J807463K15105
$$ 27180083 28102499 29280005 31393015 34143254 37397122 40467910 42275373 42490478
4596D2490478o39443n42657N19877J806044K491441K864631J880494p99652k749381
$$ 42490478 41851035 41308378 41828255 43634299 46125740 48990371 50870865 50071213 47321832
4587D7321832l164121k767190j622213m62447L46781K91304r84432k774081l606894
$$ 47321832 44157711 41390521 39768308 39305861 39652642 39943946 38959514 36185433 32578539
4578C2578539l203682k533434j643774j121198p77604r95999j762836k186164
$$ 32578539 29374857 26841423 25197649 24076451 23298847 22302848 20540012 18353848
4570A8353848k138968j995625j544212j390345j062269p78913q18880o33750o52966
$$ 18353848 16214880 14219255 12675043 11284698 10222429 9443516 8624636 7990886 7337920
4561G337920k22483l50914n15151k84300m44053m10830p6824j48294k18815o2771
$$ 7337920 7115437 6764523 6249372 5965072 5521019 5110189 5033365 4885071 4666256 4603485
4551D603485k74657j78412k31117k67529k26151P775O695J53770k48652k93844
$$ 4603485 4328828 4150416 3919299 3651770 3425619 3433394 3440089 3593859 3345207 3051363
4541C051363j10954M9130j99912j08806M5274j44179q7915j34194r0969o7619
$$ 3051363 2940409 2989539 2789627 2680821 2726095 2581916 2494001 2359807 2268838 2201219
4531B201219J75435k85893j01404m563j16024m3885m9514J97806j10372j40981
$$ 2201219 2376654 2090761 1989357 1984794 1868770 1824885 1775371 1973177 1862805 1721824
4521A721824l5833l829q082k18503r2693J5203n4303j86735J98155J93654r4620
$$ 1721824 1685991 1682162 1674080 1455577 1362884 1378087 1323784 1137049 1335204 1528858 1434238
4510A434238j87910o1259J74847K23112O6733j80666j09840j0722J97359J46424
$$ 1434238 1246328 1185069 1359916 1583028 1649761 1469095 1359255 1348533 1545892 1692316
4500A692316O0291o3707k46720K3528N4568k0514j27641l4281n6691j88117J84589
$$ 1692316 1752607 1688900 1442180 1465708 1520276 1499762 1372121 1337840 1281149 1093032 1277621
4489A277621k4245j09315l7300J92056j06882m1366J7976j69976J34278P1521
$$ 1277621 1253376 1144061 1106761 1298817 1191935 1150569 1168545 998569 1132847 1204368
4479A204368j24922p6940J0189r4630L0485L1783K3408L4201R7250j65300M1860
$$ 1204368 1079446 1002506 1012695 918065 948550 980333 1003741 1037942 1135192 969892 1011752
4468A011752j09252J4493J18811J1922k26304M076M2340K9416j08156m8672K70610
$$ 1011752 902500 916993 1035804 1047726 821422 825498 867838 897254 789098 740426 1011036
4457A011036j30185M5562q5916J09477N373j10530R998J07411j7439j46561J51363
$$ 1011036 880851 926413 840497 949974 955347 844817 854815 962226 944787 798226 949589
4446I49589J0088j26968Q2369M8190j4197J60325L7187j90058j39667K24476m4513
$$ 949589 959677 832709 915078 963268 949071 1109396 1146583 956525 816858 1041334 996821
4435I96821l16993J16325n9040O7102J81042j5525j8361j22731k90227K0296K36525
$$ 996821 679828 796153 737113 804215 985257 969732 951371 828640 538413 558709 795234
4424G95234J99220J10419j36184j17449p1780J13139J11417k7377K0333l0067
$$ 795234 994454 1104873 968689 851240 779460 892599 1004016 976639 996972 966905
4414I66905L1078r0408j26312J39933k03425p0885R4432J4322N2570M2382K259
$$ 966905 997983 907575 781263 921196 717771 646886 741318 755640 808210 850592 852851
4403H52851n3798k22797K9720J93280J4816j26157r6544K12495L704Q3381p8668
$$ 852851 799053 576256 605976 799256 814072 687915 591371 803866 807570 890951 812283
4392H12283j194p0394R9339Q8966k1843P6208N6699L2652j47197J5661j9487Q4216
$$ 812283 811089 740695 840034 929000 907157 983365 1040064 1072716 925519 941180 921693 1005909
4380A005909J40303o2988j15927j35492O1992J04186p592M650p7081Q9409k1411
$$ 1005909 1146212 1083224 967297 831805 893797 997983 990391 995041 917960 1007369 985958
4369I85958J31281n5761M5423p5808J71510R3436j80793j9489J96511o8919P6377
$$ 985958 1117239 1061478 1106901 1031093 1202603 1296039 1115246 1095757 1292268 1223349 1299726
4358A299726j18844j93665j0485J40895k0526q2009J7954J60866J80859r1616
$$ 1299726 1180882 987217 976732 1117627 1097101 1015092 1033046 1193912 1374771 1283155
4348A283155J29155o486l5315k27796k9359p6096O4027J68398M4442p7308J46200
$$ 1283155 1412310 1405824 1370509 1142713 1113354 1037258 1101285 1269683 1314125 1236817 1383017
4337A383017k91950J36779J67966k60909m0581R3630L7894Q5890J21192j04018
$$ 1383017 1091067 1227846 1395812 1134903 1094322 1187952 1225846 1311736 1432928 1328910
4327A328910R647K19420l617K2599k15316K513K68738K6032O7106R4934j8005
$$ 1328910 1338557 1557977 1554360 1576959 1361643 1364156 1632894 1658926 1726032 1820966 1802961
4316A802961l5875j07947P4569J01711r6438M5022J26259J12199j86240J63047
$$ 1802961 1767086 1659139 1733708 1835419 1738981 1784003 1910262 2022461 1836221 1999268
4306A999268O2192K9264q2997Q7723J38899N5276J9942L8671j825Q1571K10899
$$ 1999268 2061460 2090724 2007727 2095450 2234349 2289625 2309567 2348238 2346413 2427984 2638883
4295B638883j00193n1858J69998r7542N2577J61603J72576N1817r978L77308N7840
$$ 2638883 2538690 2486832 2656830 2559288 2611865 2773468 2946044 2997861 2987883 3365191 3423031
4284C423031J34059j8988J20528K8889K1276l8564J16131J55751J22382J8494
$$ 3423031 3557090 3538102 3658630 3687519 3708795 3670231 3786362 3942113 4064495 4082989
4274D082989J09928N8994P5023K61606Q2752R241O9538J63079q0964J07027R8841
$$ 4082989 4192917 4251911 4326934 4588540 4671292 4680533 4750071 4913150 4832186 4939213 5038054
4263E038054K58990J30150j6509K62092O2667j17546K69507K72543J894K67507
$$ 5038054 5297044 5427194 5410685 5672777 5735444 5617898 5887405 6159948 6161842 6429349
4253F429349K48503K11536M31460K41759K27897L57833J69555Q3728M47228N94372
$$ 6429349 6677852 6889388 7320848 7562607 7790504 8148337 8317892 8401620 8848848 9443220
4243I443220L84962K47593L65800M18297N79748N96070K92446M27582K13029N08675
$$ 9443220 9828182 10075775 10441575 10859872 11439620 12035690 12328136 12755718 12968747 13477422
4233A3477422P62288M48901O88003P46445P91225O16647Q86937R63242R28485
$$ 13477422 14239710 14688611 15376614 16123059 16914284 17530931 18417868 19381110 20309595
4224B0309595J043657J392173J426184J469380J485660J870612K047110K449092
$$ 20309595 21353252 22745425 24171609 25640989 27126649 28997261 31044371 33493463
4216C3493463K986372L858096M570562P003226R756548J3826229O264741p730383
$$ 33493463 36479835 40337931 44908493 51911719 61668267 75494496 81759237 74028854
4208G4028854j0139726r385603n982683l898140k412391j545855r35490p19035
$$ 74028854 63889128 54503525 48520842 44622702 42210311 40664456 39728966 39009931
4200C9009931m58715o30819m76479k33576l45159j59553k31625n51746l79690
$$ 39009931 38551216 37920397 37443918 37210342 36865183 36705630 36474005 35922259 35542569
4191C5542569k48922o27665n41337n79192l32444o56323o57320o83414o50659
$$ 35542569 35293647 34665982 34124645 33545453 33213009 32556686 31899366 31215952 30565293
4182C0565293p33039q73371p72582o68664r40973r98593q09785r57032q61882
$$ 30565293 29832254 28958883 28186301 27517637 26576664 25578071 24768286 23811254 22949372
4173B2949372q27920q85779q88468p77807p82725q56787q77629p43324o49959
$$ 22949372 22121452 21235673 20347205 19569398 18786673 17929886 17052257 16308933 15658974
4164A5658974q69696n41145n39121o35293p06097q09084l05959l51193n34855
$$ 15658974 14789278 14248133 13709012 13073719 12367622 11558538 11252579 10901386 10366531
4155A0366531m49058l98854m44011m93069n62558l27548j31221l58083l24688
$$ 10366531 9917473 9518619 9074608 8581539 8018981 7691433 7560212 7202129 6877441
4146F877441k57832r1421l50494j35023l67344k21036j86471k64223o4128j61727
$$ 6877441 6619609 6528188 6177694 6042671 5675327 5454291 5267820 5003597 4939469 4777742
4136D777742k18660k1455p8900j4740j01577O8224k31064N6591j37482l10896
$$ 4777742 4559082 4537627 4458727 4443987 4342410 4410634 4179570 4236161 4098679 3787783
4126C787783l2305J61183l58310j10454J03509L8286k0020l46914j000m9116P8115
$$ 3787783 3755478 3916661 3558351 3447897 3551406 3589692 3569672 3222758 3221758 3172642 3250757
4115C250757k2747j88740J47052n2010j02812L1933j46218j02130m3975J94680
$$ 3250757 3228010 3039270 3186322 3134312 3031500 3063433 2917215 2815085 2771110 2965790
4105B965790L0617j8732j90486K68823l8477j87321p3734K16926Q1415k44240
$$ 2965790 2996407 2977675 2787189 3056012 3017535 2830214 2756480 2973406 3054821 2810581
4095B810581J3795j7517J12059k16474l6702j19355n0929L22074N6061n5235n4284
$$ 2810581 2824376 2806859 2918918 2702444 2665742 2546387 2495458 2817532 2873593 2818358 2764074
4084B764074j01866k10637J25919Q6941M6923p8260L20854L4363r8160k18729
$$ 2764074 2662208 2451571 2577490 2664431 2711354 2633094 2953948 2988311 2890151 2671422
4074B671422J11906j18179J10420k6282k8376o0374R9538P4461J37397O0077l68
$$ 2671422 2783328 2665149 2775569 2749287 2720911 2660537 2760075 2834536 2971933 3032010 3031642
4063C031642j4235j09995j9817r8082J21251J52767Q7354j94748J27644o6739
$$ 3031642 3017407 2907412 2887595 2789513 2910764 3063531 3150885 2956137 3083781 3017042
4053C017042j20411m0727N88J24747k4935j0369N5270J53059K4477j30261M6241
$$ 3017042 2896631 2855904 2856492 2981239 2956304 2945935 3001205 3154264 3178741 3048480 3094721
4042C094721K66096L3476p4708P5171P1331q1864J08161l2455j18024J83440J93367
$$ 3094721 3360817 3394293 3319585 3394756 3466087 3384223 3492384 3459929 3341905 3525345 3718712
4031C718712j85445J09420J21700r7543Q4458L0249O2903o5840Q1344J06988O5866
$$ 3718712 3533267 3642687 3764387 3666844 3751302 3781551 3844454 3778614 3859958 3966946 4032812
4020D032812j33791K46574J44055K47782o4578K23367j91292K44400J77432k37154
$$ 4032812 3899021 4145595 4289650 4537432 4472854 4696221 4504929 4749329 4926761 4689607
4010D689607k32077K37188M08808K29033n216l7289J50688j90692j2986M27340
$$ 4689607 4457530 4694718 5103526 5332559 5327343 5290054 5440742 5250050 5237064 5664404
4000E664404J94645m4945R5727K45257O18K36658p1250M2255K57326J43335K06236
$$ 5664404 5859049 5814104 5909831 6155088 6155706 6392364 6321114 6363369 6620695 6764030 6970266
3989F970266J26402K34315l5620J42032Q0497J63318m1756L59525K92139K98550
$$ 6970266 7096668 7330983 7295363 7437395 7517892 7681210 7639454 7998979 8291118 8589668
3979H589668J07380J29921k1421K31069K91193L38218L57174K3324N49153K55543
$$ 8589668 8697048 8826969 8805548 9036617 9327810 9666028 10023202 10046526 10595679 10851222
3969A0851222N9840J62271L60601N48612M73100L10006M56622L03627M19542N21201
$$ 10851222 10911062 11073333 11433934 11982546 12455646 12765652 13222274 13525901 13945443 14466644
3959A4466644M26632M51796N60803M78122N64543Q71290O50085N86928N01814
$$ 14466644 14893276 15345072 15905875 16383997 16948540 17819830 18469915 19056843 19558657
3950A9558657R94545P84747Q65262J237423Q81461J086168J071768J343709J629800
$$ 19558657 20553202 21337949 22203211 23440634 24322095 25408263 26480031 27823740 29453540
3941B9453540J494992J481577J748142K074074K248128K259272K548728K992129
$$ 29453540 30948532 32430109 34178251 36252325 38500453 40759725 43308453 46300582
3933D6300582L018954L285243L333548L667015L552559L462805L082313K691191
$$ 46300582 49319536 52604779 55938327 59605342 63157901 66620706 69703019 72394210
3925G2394210K428529J818327J411639Q87131N34617K51837j30482m26518n37568
$$ 72394210 74822739 76641066 78052705 78939836 79474453 79726290 79595808 79169290 78631722
3916G8631722k45776p18472j007533j102636j253464j670306k168576k758283
$$ 78631722 78385946 77667474 76659941 75557305 74303841 72633535 70464959 67706676
3908F7706676l038771l226908l416178l552540l473795l466151l321517k853889
$$ 67706676 64667905 61440997 58024819 54472279 50998484 47532333 44210816 41356927
3900D1356927k649288k641033k120323j990635k034280j384054j661983j495440
$$ 41356927 38707639 36066606 33946283 31955648 29921368 28537314 26875331 25379891
3892B5379891j221746j026199j165910j028748j103802q24026o75044m79453m89904
$$ 25379891 24158145 23131946 21966036 20937288 19833486 19009460 18334416 17854963 17365059
3883A7365059o14566o02861n59934n36533k86778l10764k88896j61326l85055
$$ 17365059 16750493 16147632 15587698 15051165 14764387 14453623 14164727 14003401 13618346
3874A3618346m23309k68363j11891k10546k65043k67566k61919k25602k723j25845
$$ 13618346 13195037 12926674 12814783 12604237 12339194 12071628 11809709 11584107 11581384 11455539
3864A1455539j45058l6120J02289n2527K2346o7042k61926m8509J19701J49096
$$ 11455539 11310481 11274361 11376650 11324123 11346469 11279427 11017501 10968992 11088693 11237789
3854A1237789o0536k9909K41656J58549J36695K26057L07225J86120O1820M5249
$$ 11237789 11177253 11147344 11389000 11547549 11684244 11910301 12217526 12403646 12465466 12510715
3844A2510715M48881K44556K74879L39231J50707Q6332j23701J70910K23935J25765
$$ 12510715 12959596 13204152 13479031 13818262 13968969 14055301 13931600 14102510 14326445 14452210
3834A4452210R6050J50369J45083K88245M874l2724K4092R520k95527q7474p5493
$$ 14452210 14548260 14698629 14843712 15131957 15136831 15104107 15128199 15137719 14842192 14754718 14679225
3823A4679225q3698J27298J33008k37746j50680O6435j49270Q1783k6208j04428
$$ 14679225 14595527 14722825 14855833 14618087 14467407 14533842 14384572 14466355 14440147 14335719
3813A4335719m3418p5860Q4718K41361J68540L47809J31372J86674J54482N39875
$$ 14335719 14292301 14216441 14301159 14542520 14711060 15058869 15190241 15376915 15531397 16071272
3803A6071272O04901L59386N66352P29561N97672P97827O69633O39695P51065
$$ 16071272 16676173 17035559 17601911 18331472 18929144 19726971 20396604 21036299 21787364
3794B1787364R77241R72204R43408J083037J122590R71790J079539R47387O86407
$$ 21787364 22764605 23736809 24680217 25763254 26885844 27857634 28937173 29884560 30570967
3785C0570967R07230P53209Q26121P01996O16355O86524R46469Q54826M96326
$$ 30570967 31478197 32231406 33057527 33759523 34375878 35062402 36008871 36863697 37360023
3776C7360023M46156M87165Q0113q0448M6751J52953n8453k81122j75966k11267
$$ 37360023 37806179 38293344 38373457 38293009 38339760 38492713 38434260 38153138 37977172 37765905
3766C7765905l23445q5424j20169q2609n4517K5731j00315k12451m08281q7661
$$ 37765905 37442460 37357036 37236867 37154258 37099741 37125472 37025157 36812706 36404425 36316764
3756C6316764O6351K8884L4247P8911j21553n0565N7740q1472J70508P0514o7300
$$ 36316764 36383115 36411999 36446246 36525157 36403604 36353039 36410779 36329307 36499815 36570329 36503029
3745C6503029L167L4816m8191q0159J11749k51823o40559l53177m15704n45751
$$ 36503029 36506196 36541012 36492821 36412662 36524411 36272588 35632029 35278852 34863148 34317397
3735C4317397o63126p89331q43073p06078r19211r60016q04618p68828j139468
$$ 34317397 33654271 32864940 32021867 31315789 30396578 29436562 28631944 27863116 26723648
3726B6723648p71730p87580j072584q69710j049110j063779q03541r45348j010491
$$ 26723648 25951918 25164338 24091754 23222044 22172934 21109155 20305614 19360266 18349775
3717A8349775p79210o21123q05739o75090o71008o93078o65153l44042l11295
$$ 18349775 17570565 16949442 16143703 15468613 14797605 14104527 13439374 13095332 12784037
3708A2784037j97504p7944l53444p8465j00131n4794j53871P3838J05117m5726
$$ 12784037 12586533 12508589 12155145 12076680 11976549 11921755 11767884 11841722 11946839 11901113
3698A1901113m9645J23245q9768M6118j8944n1898m9253J54136J93359k63662
$$ 11901113 11851468 11974713 11884945 11931063 11912119 11860221 11810968 11965104 12158463 11894801
3688A1894801N5115J6997n368M5681j74315k38059j65846j03242k76712l62627
$$ 11894801 11949916 11966913 11961545 12007226 11832911 11594852 11429006 11325764 11049052 10686425
3678A0686425j39012j53230l69405n75061l89013j05327j95477l58026l00891
$$ 10686425 10547413 10394183 10024778 9449717 9060704 8955377 8759900 8401874 8100983
3669H100983j94830k62034l43157k09346l55564l73708k47566j41027k04295m27590
$$ 8100983 7906153 7644119 7300962 7091616 6736052 6362344 6114778 5973751 5769456 5341866
3659E341866l02712k09836j05508j90485k43266k90650k24019j97168j28287K1045
$$ 5341866 5039154 4829318 4723810 4533325 4290059 3999409 3775390 3578222 3449935 3470980
3649C470980o3413N9104j15313o1107k02468r4302l9367j19591m3665o670n9425
$$ 3470980 3407567 3466671 3351358 3290251 3087783 2993481 2954114 2834523 2790858 2784188 2724763
3638B724763j62985k43K48506K4169k53158k36245J7251k5295O0584N8974l82126
$$ 2724763 2561778 2561535 2810041 2834210 2581052 2344807 2362058 2336763 2397347 2456321 2074195
3627B074195Q0200O4955k0543k58436L252J32471J3246k21458J02406m1807m6401
$$ 2074195 2154395 2219350 2198807 1940371 1943623 2076094 2089340 1867882 1970288 1928481 1882080
3616A882080O1846k05559K3239O5124k461k01368m7951k20386J70981o0509j23940
$$ 1882080 1943926 1738367 1761606 1826730 1824269 1622901 1574950 1354564 1525545 1465036 1341096
3605A341096P3402j11161J5548q0586j04605M6859M1439J27573j16480j87612
$$ 1341096 1414498 1303337 1318885 1238299 1133694 1180553 1221992 1349565 1233085 1045473
3595A045473j26317O3251m4211K843R1917j3782j9735j5118J8284J07320L948
$$ 1045473 919156 982407 938196 941039 1032956 1019174 999439 984321 1002605 1109925 1113873
3584A113873j98346k2970j30653r1214j17709J91092j45186l0570J10130m6328
$$ 1113873 915527 892557 761904 670690 552981 744073 598887 568317 678447 632119
3574F32119M8624K259J43119k11494j88897J54886J60904L0534l40621K3131J18202
$$ 632119 680743 683002 826121 614627 425730 580616 741520 772054 431433 454564 572766
3563E72766p0500J26670k32418j37914l6135J21410J98741p2492k37384m2506
$$ 572766 502266 628936 396518 258604 222469 343879 542620 470128 232744 190238
3553A90238J89121J28294J17496m8556j30859N5707J17315J43877P2234j63951
$$ 190238 379359 507653 625149 576593 445734 501441 618756 762633 834867 670916
3543F70916j71757Q382k3265k5523J7245k08349r8025J76863J81794N8601o6985
$$ 670916 499159 507541 484276 458753 475998 267649 169624 346487 528281 586882 519897
3532E19897j98393N4192J65640L5014o4539l10903j60443J53312K15871n5177
$$ 519897 321504 375696 541336 576350 511811 200908 40465 193777 409648 354471
3522C54471n2825J03106J63640L3301j57566J20855K16561j36125l53240L8108
$$ 354471 301646 404752 568392 601693 444127 564982 781543 645418 292178 330286
3512C30286R2294J59314j12722k0208j0131n9483J94795l3516j583P2787j23156
$$ 330286 422580 581894 469172 448964 438833 379350 574145 540629 539046 611833 488677
3501D88677K2804j09325j27233o1954J3637J08367J0738j13371N8142L11406k5252
$$ 488677 511481 402156 274923 212969 226606 334973 345711 232340 290482 601888 576636
3490E76636k04771p7188M0067k52383K26592J19197k04788M8671J57637r5284
$$ 576636 371865 294677 334744 82361 308953 428150 223362 272033 429670 334386
3480C34386R6027q9343J79496m77N445l2812J3786O2103p7911j77535j9326K51967
$$ 334386 430413 341070 520566 520089 525534 492722 506508 568611 490700 313165 293839 545806
3468E45806O955j30j13214N0658k92567l2593O3676J82190O1851J8527J21871
$$ 545806 552761 552631 439417 490075 197508 164915 228591 410781 472632 491159 613030
3457F13030l26136K0221J23256J3269p535k8390n5321k50458o0309K88433J61014
$$ 613030 286894 307115 430371 443640 436105 407715 352394 101936 41627 330060 491074
3446D91074P4123j26451q2808Q3435K2989J01891J38987P8272j47673J39977o2209
$$ 491074 565197 438746 355938 439373 462362 564253 703240 781512 633839 773816 711607
3435G11607M0905j06147n0738O6497n1076j36356n3684j01825q3153m0441Q0182
$$ 711607 752512 646365 595627 662124 611048 474692 421008 319183 236030 195589 275771
3424B75771J743j6771J35997J62143M3304j46374k13189k374J10817N2116k4392
$$ 275771 277514 260743 396740 558883 602187 455813 242624 240250 351067 403183 378791
3413C78791l33868J80670K27783k26040o7442r2680j56954K34993J17591r4828
$$ 378791 44923 225593 453376 227336 159894 67214 -89740 145253 262844 168016
3403A68016P7113J29492k13504J0445o0557q1989q0837J55788r4102O3098K84822
$$ 168016 245129 374621 161117 171562 111005 29016 -51821 103967 9865 72963 357785
3392C57785j85340L1110j70111j1125M6633o643n132q0350j63303J43720K73274
$$ 357785 172445 203555 33444 22319 68952 62309 57177 -23173 -186476 -42756 230518
3381B30518o6495n6957K57028k8192Q8669l9791j20350n9849q6130j44049K6231
$$ 230518 164023 107066 364094 335902 424571 384780 264430 204581 118451 -25598 633
3370F33J09425J41003k2384k53952J34902J66806J29570J12459j12801Q8383o9869
$$ 633 110058 251061 228677 -25275 109627 276433 406003 518462 405661 494044 424175
3359D24175N6965L15153j66547J1063j52797r3123J8590K9129m6954R4361r4348
$$ 424175 481140 796293 629746 640809 488012 394889 413479 442608 395654 490015 395667
3348C95667j30521m3139K37451J9342j13557K2303K0596j79526M0567j69165R47
$$ 395667 265146 222007 459458 478800 365243 387546 408142 228616 269183 100018 100965
3337A00965l103J33862j11697k06128P8324k209j51167M474J01820o8771J18703
$$ 100965 97862 231724 120027 -86101 -7777 -9986 -161153 -156679 -54859 -123630 -4927
3326d927J17443J50909l0650J88899j60409q8040j95728K9825L5835l9323k19882
$$ -4927 112516 263425 232775 421674 261265 173225 -22503 7322 43157 3834 -216048
3315b16048j37994R1146M5390J40248m7201J18493L4447j88816Q1750J74530p5360
$$ -216048 -354042 -262896 -217506 -77258 -124459 -5966 28481 -160335 -78585 95945 20585
3304B0585j61453K03042l0426j93617N5840K40150P4622j50474K5709j6176p5659
$$ 20585 -140868 62174 31748 -161869 -106029 134121 208743 58269 83978 67802 -7857
3293g857o5419m5388q0831o0354J24418J49954J6919L6743o6918o563q2786J60942
$$ -7857 -73276 -118664 -199495 -259849 -135431 14523 31442 68185 1267 -5296 -88082 72860
3281G2860J65912n0682j16269r7720N4393M2658N3168j42226o0345N1590j8439
$$ 72860 238772 188090 71821 -25899 28494 71152 124320 -17906 -78251 -26661 -45100
3270d5100m9967r2495Q2188K835P1915K17028q1964j02000o9445r061j46129J43260
$$ -45100 -95067 -187562 -105374 -102539 -30624 186404 104440 2440 -67005 -76066 -222195 -78935
3258g8935o456j11387j65060J51039J63667p7389J45188j12713k592J95239k95611
$$ -78935 -85391 -196778 -361838 -210799 -47132 -124521 20667 -92046 -94638 100601 -195010
3247a95010p6489K22160J15416K41570j85805j45309P5955j2519j8918l984J17254
$$ -195010 -271499 -49339 66077 307647 121842 -23467 52488 39969 21051 17067 134321
3236A34321l0314J6343k6911N78j45814Q660J50237P7824p9514j6202J26125L2942
$$ 134321 104007 120350 93439 94017 -51797 -43137 107100 184924 105410 89208 215333 248275
3224B48275k66903j29545K09001L5622J61612M1716k26041O1609M5095q6061J63242
$$ 248275 -18628 -148173 60828 96450 258062 299778 73737 135346 180441 94380 257622
3213B57622j44599j27296n3510j30717J48126l5879j30225Q0912k9707O3212J55865
$$ 257622 113023 -14273 -67783 -198500 -50374 -86253 -216478 -135566 -165273 -102061 53804
3202E3804K37522k58990l7132J45008J07975k26835p2096j11174j40698J77432
$$ 53804 291326 32336 -4796 140212 248187 21352 -50744 -161918 -302616 -125184
3192a25184J44427R342L3784j05429P292K13101L0180K31631j12154j58209p134
$$ -125184 19243 28585 62369 -43060 -35768 177333 207513 439144 326990 168781 161647
3181A61647n1093k07478N1831K32279M9636j17136j21523K49720r0330m6231k4577
$$ 161647 110554 -96924 -45093 187186 236822 119686 -1837 247883 157553 111322 86745
3170H6745j18734K26388J03769l2035j661r8021j7160K18630q6207j69392J45206
$$ 86745 -31989 194399 298168 266133 264472 166451 149291 367921 281714 112322 257528
3159B57528M4338Q583O1464p8367k51686R5500J13606o4694j66826P9999k4820
$$ 257528 301866 310449 371913 293546 41860 137360 250966 186272 19446 99445 74625
3148G4625m4630K18365j95707k12889J245m4112j9915J54717r4894J10424J82061
$$ 74625 29995 248360 52653 -160236 -158991 -203103 -223018 -68301 -163195 -52771 129290
3137A29290m9973o642K11587k03975j34443J17210j998K12923O0779j89696M3327
$$ 129290 79317 72675 284262 80287 -54156 63054 61056 273979 334758 145062 188389
3126A88389p0015k8931Q7512k7822L383j37306j12851Q9229P0087N626J53792
$$ 188389 118374 89443 176955 149133 152516 15210 -97641 -8412 61675 67301 221093
3115B21093l3904J05310j61045k71488J01305Q0783k2610K2427n4596O4635O7600
$$ 221093 187189 292499 131454 -140034 -38729 42054 19444 41871 -12725 51910 119510
3104A19510j04891K1868Q696j50841K83877p5752L9073J07202N5323o3201l63773
$$ 119510 14619 36487 45183 -105658 178219 102467 141540 248742 304065 240864 -122909
3093a22909o989N113M8187Q5136M497k8613N8671j5220j22915Q4536P6826o2311
$$ -122909 -129898 -124785 -76598 8538 13035 -15578 43093 27873 -95042 -10506 66320 4009
3081D009j67656N4264J96338j35777Q7587j1415K6380p5658K16397R8612j91494
$$ 4009 -163647 -109383 86955 -48822 38765 27350 53730 -21928 194469 293081 101587
3070A01587k35120K27303P5305R7529o6650q9430J13900J0606q1272j07255Q5912
$$ 101587 -133533 93770 169075 266604 199954 110524 224424 235030 153758 46503 132415
3059A32415J00139k24540j25861q624R3528J06275j6937j37090n0542n9404P123
$$ 132415 232554 8014 -117847 -126471 -32943 73332 56395 -80695 -131237 -190641 -183518
3048a83518R1348K2736J3315J17710L475r8847j81204R2597k7036R501l505K8011
$$ -183518 -92170 -69434 -56119 61591 65066 -33781 -214985 -122388 -149424 -139923 -143428 -115417
3036a15417L4076r3434p0891J08899N6439j57437J52794M6539P3369O8318j74470
$$ -115417 -81341 -174775 -245666 -136767 -80328 -237765 -84971 -38432 34937 103255 -71215
3025g1215j76377j4516M5396P7481J5551K04629j50844o807k5083K28103j63712
$$ -71215 -247592 -262108 -216712 -139231 -123680 80949 -69895 -76702 -101785 126318 -37394
3014c7394l33114J73685J05385O9658j22468j06964J83249q4895P14p404R4986
$$ -37394 -370508 -196823 -91438 -21780 -144248 -251212 -67963 -152858 -152144 -159548 -64562
3003f4562n920n6851k4803P9403k08084K0017J92989j77764j39723L69169L4253
$$ -64562 -70482 -127333 -152136 -72733 -280817 -260800 -67811 -245575 -385298 -16129 18124
2992A8124p9830j19090J37508k0526P3473O4760k75581m7936J56511N669J65578
$$ 18124 -61706 -180796 -43288 -63814 9659 74419 -201162 -249098 -92587 -86918 78660
2981G8660K4491j40005j19229p589N1390L0058J49761j45667J61744k1663j03811
$$ 78660 103151 -36854 -156083 -163672 -112282 -82224 67537 -78130 83614 61951 -41860
2970d1860m9254P0246k8010P464J27356j28531J24973p7816j97355J06888J20171
$$ -41860 -91114 -20868 -48878 -41414 85942 -42589 82384 4568 -192787 -85899 34272
2959C4272j39097L3615J68116j21931k220J53580j25803O5825m657k91797o1726
$$ 34272 -104825 -71210 96906 -25025 -27245 126335 532 66357 61700 -230097 -291823
2948b91823j06685J85251K20299J43872j09732k581p8364p2598K8328n8960O5748
$$ -291823 -398508 -213257 7042 150914 41182 38601 -39763 -112361 -84033 -142993 -77245
2937g7245K31604R708j52058M6409J49849l08014q0076J63712R0273k9305j03452
$$ -77245 154359 164067 12009 58418 208267 -99747 -179823 -16111 74162 44857 -58595
2926e8595m0319Q0467l8098J8850k6073L5224L0878p5593j76620K2135K02283
$$ -58595 -98914 -18447 -56545 -37695 -63768 -28544 2334 -73259 -249879 -227744 -25461
2915b5461l1068k56456J82986o1568o0665P4820L6492K26031o2012L4685j06918
$$ -25461 -56529 -312985 -129999 -191567 -252232 -177412 -140920 85111 23099 57784 -49134
2904d9134Q6103Q2120q1062R668k35870j62945J35880R4939J01965o4010j08752
$$ -49134 36969 119089 38027 47695 -188175 -351120 -215240 -120301 -18336 -82346 -191098
2893a91098o324K7040K7760j4437J27165r4950P8205J07619r8361k37956R7093
$$ -191098 -197422 -170382 -142622 -157059 -29894 -124844 -46639 60980 -37381 -275337 -178244
2882a78244m3806J47395q0970O0579n8336L2973k4690k3970P8129N5765j01845
$$ -178244 -222050 -74655 -155625 -95046 -153382 -120409 -145099 -169069 -90940 -35175 -137020
2871a37020j86318J22260p2468O4885J57335n8489k69438J63880m1089o8707K0746
$$ -137020 -323338 -201078 -273546 -208661 -51326 -109815 -379253 -215373 -256462 -325169 -304423
2860c04423J48353M4105J12569J00790m3056k96514n8877j46679Q9076R4787L1862
$$ -304423 -156070 -111965 604 101394 58338 -238176 -297053 -443732 -354656 -259869 -228007
2849b28007J07172K6130J41862Q729m1653J38610j38254Q0977N7527j72359r8523
$$ -228007 -120835 -94705 47157 55886 14233 152843 14589 95566 153093 -19266 -117789
2838a17789k2021O2349J45945p9016p1927q1548J3464L7775P7439j2805J04898
$$ -117789 -139810 -77461 68484 -10532 -82459 -164007 -150543 -112768 -35329 -48134 56764
2827E6764j09254j25845J43880m4635R8297L1476N2802J01925k94827n4655K14201
$$ 56764 -52490 -178335 -34455 -79090 19207 50683 103485 205410 -89417 -144072 70129
2816G0129j63657k0198k6613k751J60985j78573l8130R3207k6390N7157p5052
$$ 70129 -93528 -113726 -140339 -143090 17895 -160678 -198808 -105601 -131991 -74834 -149886
2805a49886J44025J46804p1916K09510m7615k63206n8844J26169K7157l259p0568
$$ -149886 -5861 140943 69027 278537 230922 -32284 -91128 35041 62198 58939 -11629
2794a1629L7284N7424j40713J7604P8510o7814J60744n123k16399J84836m1568
$$ -11629 25655 83079 -57634 -40030 38480 -29334 131410 126287 -90112 94724 53156
2783E3156o4227l5895j28272k7479o4912K2521r440J72320K3261k7215j17163
$$ 53156 -11071 -46966 -175238 -202717 -267629 -245108 -254548 -82228 -58967 -86182 -203345
2772b03345J55111R8896j98564J01283O4889n7158Q7560K47311j89144k52096
$$ -203345 -48234 50662 -147902 -46619 18270 -38888 48672 295983 106839 -145257
2762a45257K8822J2400n2150J05439k40721K64215j8183J0445K899J38907j65303
$$ -145257 -116435 -104035 -156185 -50746 -291467 -27252 -45435 -34990 -32091 106816 -58487
2751e8487j92440J11905J13357R8430j35918k1805J04942l2801J8463j7359M6463
$$ -58487 -250927 -139022 -25665 72765 -63153 -84958 19984 -12817 5646 -11713 34750
2740C4750K2984J14422j82163j28917j0831k69J83994j04968J89539Q6651j58073
$$ 34750 57734 172156 -10007 -138924 -149755 -150024 33970 -70998 118541 205192 47119
2729D7119R3358j91325r503L9783O494r717K5328l4783j25554N7583Q5829J19423
$$ 47119 140477 -50848 -60351 -20568 -14074 -23791 1537 -33246 -158800 -101217 -15388 104035
2717A04035j30449K27738j22771J6939L1512n4394m0667L5052r873k21851J04240
$$ 104035 -26414 201324 78553 95492 127004 72610 31943 66995 57122 -164729 -60489
2706f0489m1832k5342m1389K9057J73652p5713r9398M4147J65555q3231L355q1947
$$ -60489 -102321 -127663 -169052 -139995 33657 -42056 -141454 -97307 68248 -14983 -11628 -93575
2694i3575J58371q9089j2312j23469p0028J96103J03501j94236p5387j71660j657
$$ -93575 64796 -24293 -36605 -160074 -230102 -33999 69502 -124734 -200121 -371781 -373438
2683c73438K64164L00953k9660M352P218j62944k3169O6770j43889k28418J46764
$$ -373438 -109274 191679 162019 166371 173589 10645 -12524 54246 -89643 -318061 -171297
2672a71297J4618J38089M4938o1964j06320r4932j68986K10357R0677K89553q6131
$$ -171297 -156679 -18590 26348 -35616 -141936 -236868 -405854 -195497 -104820 184733 98602
2661I8602j59163O5587k7454m8065J1525l9541J26709l0956j17778O8347j07655
$$ 98602 -60561 5026 -22428 -70493 -58968 -98509 28200 -2756 -120534 -52187 -159842
2650a59842J2808j06318J02677j17921m0906N1667k532J627K04250K34943K4695
$$ -159842 -147034 -253352 -150675 -268596 -309502 -257835 -260367 -258740 -54490 180453 205148
2639B05148r3321k93247K4866j02360J33205J88934j67481k939R9732j22400Q762
$$ 205148 111827 -181420 -156554 -258914 -125709 63225 -104256 -107195 -7463 -129863 -121101
2628a21101j46445P3496M9953k832L9970j20159J37365L2089r2208o4530J4427
$$ -121101 -267546 -194050 -144097 -146929 -106959 -227118 -89753 -57664 -149872 -214402 -199975
2617a99975o6583m841K60185J7349j2250L1856j10971n8572K6454L5559O5278
$$ -199975 -266558 -271399 -11214 6135 -6115 25741 -85230 -143802 -117348 -81789 -16511
2606a6511J42352m8224o2574o5601j29153j80376m725K08415J61050N5543J20768
$$ -16511 125841 77617 15043 -50558 -179711 -360087 -364812 -156397 4653 60196 180964
2595A80964j2349j74015k2429J6471J89670j03414n3614j61846J79006K2380r57
$$ 180964 168615 -5400 -27829 -11358 178312 74898 21284 -140562 38444 60824 59867
2584E9867Q1149j73136K17022j45384o7398p7881J21318j91465j81257P9716J24085
$$ 59867 141016 -32120 184902 39518 -27880 -105761 15557 -175908 -357165 -277449 -153364
2573a53364J41578j17990K7199J04232k09375l5237o2376K02461k270j09838J43147
$$ -153364 -11786 -129776 -102577 1655 -207720 -242957 -305333 -102872 -105142 -214980 -71833
2562g1833j03088K17994N2206o0329j07930n5246J92208n0793M871j89820J01986
$$ -71833 -174921 43073 95279 34950 -72980 -128226 63982 13189 18060 -171760 -69774
2551f9774J69778J08996k12209j24242J52025J4599k06667R6800K35242l15199
$$ -69774 100004 209000 -3209 -127451 24574 39173 -167494 -70694 164548 -150651
2541a50651J18732l7700j04183R6685Q0038J45427n2353j92171j78552K2524k5978
$$ -150651 -31919 -69619 -173802 -77117 2921 148348 95995 -96176 -274728 -252204 -278182
2530b78182m1402M0745P6070O045p071o3463P3298p890Q9454j0929j20664J56470
$$ -278182 -319584 -278839 -202769 -196724 -203795 -267258 -193960 -201850 -112396 -123325 -243989 -87519
2518h7519J00078j27527N9759O1762n8471M7586j5831o4648R3689Q1125p5912
$$ -87519 12559 -114968 -55209 6553 -51918 -4332 -20163 -84811 8878 90003 14091
2507A4091o7068j97077J21014M8176K27929q4762p8203N2539L1652j7752j70438
$$ 14091 -52977 -250054 -129040 -80864 147065 62303 -15900 36639 68291 50539 -119899
2496a19899J3962j31153P2978K19462J06295r3518r3484J88005l8309o9273k5928
$$ -119899 -105937 -237090 -164112 55350 161645 68127 -25357 162648 124339 55066 29138
2485B9138J8267p88k03784M5349m3294r905J69261l7288L3919o8301J84108j25219
$$ 29138 47405 46617 -157167 -111818 -155112 -165017 4244 -33044 875 -67426 116682 -8537
2473h537R5982Q7368k16890n9939P9289P4252k08169J37168r8573k1977O2304
$$ -8537 87445 174813 -42077 -102016 -22727 51525 -156644 -19476 -118049 -140026 -77722
2462g7722j46347K8554p5004K26416Q079N4872q3187K27126J2411p7797j97175
$$ -77722 -224069 -195515 -270519 -44103 -36024 18848 -64339 162787 175198 97401 -99774
2451i9774J7476j27366Q8929Q4550k095O6898k57638M42K9481J63336J57336Q4440
$$ -99774 -82298 -209664 -120735 -36185 -38280 28618 -229020 -228578 -199097 -35761 121575 206015
2439B06015j22216l7570P9180J34015j85161O3352m4916K7689n874j96277P1714
$$ 206015 83799 46229 125409 259424 74263 137615 92699 120388 114514 -81763 -10049
2428a0049J21125n8949j26608r1357L868L0447N5644l4962J6685r3854J22909
$$ -10049 111076 52127 -74481 -165838 -161970 -131523 -75879 -110841 -94156 -188010 -65101
2417f5101J2547O2464N2159n8608n8415N0986M3695O225K47460k8810k1489p1125
$$ -65101 -52554 9910 62069 3461 -54954 -3968 39727 45952 293412 264602 243113 171988
2405A71988j57841j02184M6725K97122K3574J24206k37846j75350P7486Q5487
$$ 171988 14147 -88037 -41312 255810 279384 403590 165744 -9606 67880 153367
2395A53367M6644k55997k2928J22613K47964k9428j55234O8539o8337r2294J04460
$$ 153367 200011 -55986 -78914 43699 291663 262235 107001 175540 107203 14909 119369
2384A19369J30133l00519J14320J3672J9038r1960k2215n1444J85870J245j74196
$$ 119369 249502 -51017 63303 76975 96013 4053 -18162 -69606 116264 117509 -56687
2373e6687o6548J25892Q5854q1732o0814O9913L6317j05190O6113k6874M2443
$$ -56687 -123235 2657 88511 6779 -54035 15878 52195 -52995 13118 -13756 28687
2362B8687K32881j04412Q3635J37897k52456J46510K25926k59409r2637J02084
$$ 28687 261568 157156 240791 378688 126232 272742 498668 239259 146622 248706
2352B48706j25010J98824o0773j15739j95314J91137n3663J33157J77152q351
$$ 248706 123696 322520 261747 146008 -49306 141831 88168 221325 398477 390126
$$ [...]
##END NTUPLES=NMR SPECTRUM
##END=
