##TITLE=1H_CG-1182-2
 CDCl3
 8 sc, 
 27.12.2023
##JCAMPDX= 6.0         $$ Bruker NMR JCAMP-DX V2.0
##DATA TYPE= NMR SPECTRUM
##DATA CLASS= NTUPLES
##ORIGIN= UXNMR, Bruker Analytische Messtechnik GmbH
##OWNER= root
$$ XWIN-NMR		Version 3.5
$$ Wed Dec 27 14:36:09 2023 Russian Standard Time (UT+4h)  she@DPX200
##.OBSERVE FREQUENCY= 200.1313
##.OBSERVE NUCLEUS= ^1H
##.ACQUISITION MODE= SIMULTANEOUS
##.ACQUISITION SCHEME= undefined
##.AVERAGES= 8
##.DIGITISER RES= 18
##SPECTROMETER/DATA SYSTEM= spect
##.PULSE SEQUENCE= zg30
##.SOLVENT NAME= CDCl3
##.SHIFT REFERENCE= (INTERNAL, CDCl3, 0, 15.4527)
##AUDIT TRAIL= $$ (NUMBER, WHEN, WHO, WHERE, WHAT)
$$ ##TITLE= Audit trail, XWIN-NMR		Version 3.5
$$ ##JCAMPDX= 5.01
$$ ##ORIGIN= Bruker BioSpin GmbH
$$ ##OWNER= she
$$ F:/spectra/data/she/nmr/H-F/1/pdata/1/auditp.txt
$$ ##AUDIT TRAIL=  $$ (NUMBER, WHEN, WHO, WHERE, WHAT)
(   1,<2023-12-27 14:34:36.84 +0400>,<she>,<DPX200>,
      <created by zg, POWCHK disabled, PULCHK disabled
       configuration hash MD5:
       00 E9 B6 7A A2 85 ED C7 34 08 36 98 17 FE 4E 26
       data hash MD5: 16K
       21 E6 71 32 81 87 FE D1 CA 10 AD EB 7E EE CC FA>)
(   2,<2023-12-27 14:34:39.10 +0400>,<she>,<DPX200>,
      <Start of raw data processing
       efp BC_mod = 2 LB = 0.24 FT_mod = 6 PKNL = 1 PHC0 = -24592.84 PHC1 = 11.05273 SI = 16K 
       data hash MD5: 16K
       5F 1C 7B 41 FD 54 AD D3 18 17 A5 AB 52 F4 D9 5D>)
(   3,<2023-12-27 14:34:59.48 +0400>,<she>,<DPX200>,
      <pk PHC0 = 2.175931 PHC1 = -3 
       data hash MD5: 16K
       DF 8C 8F B1 28 05 19 2D 81 41 79 26 29 59 37 B2>)
(   4,<2023-12-27 14:35:02.76 +0400>,<she>,<DPX200>,
      <abs ABSG = 5 
       data hash MD5: 16K
       4D 7E 12 9D E8 0B F0 58 7B ED 82 FC 1D F3 34 7B>)
$$ ##END=
$$ 
$$ hash MD5
$$ 99 DA D3 18 D3 62 24 DC 56 CF FF 26 92 F9 88 36
##$RELAX= 
##$RELAX= 
##$RELAX= 
##$RELAX= 
##$RELAX= 
##$RELAX= 
$$ Bruker specific parameters
$$ --------------------------
##$DU= <F:/spectra>
##$EXPNO= 1
##$NAME= <H-F>
##$PROCNO= 1
##$TYPE= <nmr>
##$USER= <she>
##$AMP= (0..31)
100 100 100 100 100 100 100 100 100 100 100 100 100 100 100 100 100 100 
100 100 100 100 100 100 100 100 100 100 100 100 100 100 
##$AQSEQ= 0
##$AQ_mod= 1
##$AUNM= <au_zg>
##$AUTOPOS= <>
##$BF1= 200.13
##$BF2= 200.13
##$BF3= 200.13
##$BF4= 200.13
##$BF5= 200.13
##$BF6= 200.13
##$BF7= 200.13
##$BF8= 200.13
##$BYTORDA= 1
##$CFDGTYP= 0
##$CFRGTYP= 5
##$CHEMSTR= <none>
##$CNST= (0..31)
1 1 145 1 1 1 1 1 1 1 1 1 1 1 1 1 1 1 1 1 1 1 1 1 1 1 1 1 1 1 1 1 
##$CPDPRG= <>
##$CPDPRG1= <>
##$CPDPRG2= <>
##$CPDPRG3= <>
##$CPDPRG4= <mlev>
##$CPDPRG5= <mlev>
##$CPDPRG6= <mlev>
##$CPDPRG7= <mlev>
##$CPDPRG8= <mlev>
##$CPDPRGB= <>
##$CPDPRGT= <>
##$D= (0..31)
0 1.2 0 0 0 0 0 0 0 0.06 0 0.03 0 0 0 0 0.0002 0 0 0 0 0 0 0 0 0 0 0 0 
0 0 0 
##$DATE= 1703673276
##$DBL= (0..7)
120 120 120 120 120 120 120 120 
##$DBP= (0..7)
150 150 150 150 150 150 150 150 
##$DBP07= 0
##$DBPNAM0= <>
##$DBPNAM1= <>
##$DBPNAM2= <>
##$DBPNAM3= <>
##$DBPNAM4= <>
$$ [...]
##$SUBNAM3= <"">
##$SUBNAM4= <"">
##$SUBNAM5= <"">
##$SUBNAM6= <"">
##$SUBNAM7= <"">
##$SUBNAM8= <"">
##$SUBNAM9= <"">
##$SW= 18.0517328524113
##$SWIBOX= (0..15)
0 0 2 0 0 0 0 0 0 0 0 0 0 0 0 0 
##$SW_h= 3612.71676300578
##$TD= 16384
##$TD0= 1
##$TE= 0
##$TE2= 300
##$TE3= 300
##$TEG= 300
##$TL= (0..7)
0 120 120 120 120 120 120 120 
##$TP= (0..7)
150 150 150 150 150 150 150 150 
##$TP07= 0
##$TPNAME0= <>
##$TPNAME1= <>
##$TPNAME2= <>
##$TPNAME3= <>
##$TPNAME4= <>
##$TPNAME5= <>
##$TPNAME6= <>
##$TPNAME7= <>
##$TPOAL= (0..7)
0.5 0.5 0.5 0.5 0.5 0.5 0.5 0.5 
##$TPOFFS= (0..7)
0 0 0 0 0 0 0 0 
##$TUNHIN= 0
##$TUNHOUT= 0
##$TUNXOUT= 0
##$USERA1= <user>
##$USERA2= <user>
##$USERA3= <user>
##$USERA4= <user>
##$USERA5= <user>
##$V9= 5
##$VALIST= <valist>
##$VCLIST= <CCCCCCCCCCCCCCC>
##$VD= 0
##$VDLIST= <DDDDDDDDDDDDDDD>
##$VPLIST= <PPPPPPPPPPPPPPP>
##$VTLIST= <TTTTTTTTTTTTTTT>
##$WBST= 1024
##$WBSW= 4
##$XGAIN= (0..3)
0 0 0 0 
##$XL= 0
##$YL= 0
##$YMAX_a= 207268
##$YMIN_a= -216306
##$ZGOPTNS= <>
##$ZL1= 120
##$ZL2= 120
##$ZL3= 120
##$ZL4= 120
##$ABSF1= 15.59815
##$ABSF2= -2.453701
##$ABSG= 5
##$ABSL= 3
##$ALPHA= 0
##$AQORDER= 0
##$ASSFAC= 0
##$ASSFACI= 0
##$ASSFACX= 0
##$ASSWID= 0
##$AUNMP= <proc_1d>
##$AZFE= 0.1
##$AZFW= 0.1
##$BCFW= 0
##$BC_mod= 2
##$BYTORDP= 0
##$COROFFS= 0
##$CY= -3
##$DATMOD= 1
##$DC= 0
##$DFILT= <>
##$DTYPP= 0
##$F1P= 0
##$F2P= 0
##$FCOR= 1
##$FTSIZE= 16384
##$FT_mod= 6
##$GAMMA= 0
##$GB= 0
##$INTBC= 1
##$INTSCL= 3.70164e-10
##$ISEN= 128
##$LB= 0.24
##$LEV0= 0
##$LPBIN= 0
##$MAXI= 10000
##$MC2= 0
##$MEAN= 0
##$ME_mod= 0
##$MI= 1.114404
##$NCOEF= 0
##$NC_proc= -8
##$NLEV= 6
##$NOISF1= 3.799351
##$NOISF2= 2.8
##$NSP= 0
##$NTH_PI= 0
##$NZP= 0
##$OFFSET= 15.45271
##$PC= 1
##$PHC0= -24590.66
##$PHC1= 8.05273
##$PH_mod= 1
##$PKNL= yes
##$PPARMOD= 0
##$PSCAL= 0
##$PSIGN= 0
##$REVERSE= no
##$SF= 200.13001380858
##$SI= 16384
##$SIGF1= 3
##$SIGF2= 2
##$SINO= 5.538805
##$SIOLD= 16384
##$SREGLST= <1H.CDCl3>
##$SSB= 0
##$STSI= 16384
##$STSR= 0
##$SW_p= 3612.71676300578
##$SYMM= 0
##$S_DEV= 0
##$TDeff= 16384
##$TDoff= 0
##$TI= <>
##$TILT= no
##$TM1= 0
##$TM2= 0
##$TOPLEV= 0
##$USERP1= <user>
##$USERP2= <user>
##$USERP3= <user>
##$USERP4= <user>
##$USERP5= <user>
##$WDW= 1
##$XDIM= 16384
##$YMAX_p= 442494142
##$YMIN_p= -1235167
$$ End of Bruker specific parameters
$$ ---------------------------------
##NTUPLES= NMR SPECTRUM
##VAR_NAME=  FREQUENCY,     SPECTRUM/REAL,   SPECTRUM/IMAG
##SYMBOL=    X,             R,               I
##VAR_TYPE=  INDEPENDENT,   DEPENDENT,       DEPENDENT
##VAR_FORM=  AFFN,          ASDF,            ASDF
##VAR_DIM=   16384,         16384,           16384
##UNITS=     HZ,            ARBITRARY UNITS, ARBITRARY UNITS
##FACTOR=    0.220516191357247, 1,           1
##FIRST=     3092.55109603417, 0,            0
##LAST=      -520.165666971606, 0,           0
##MIN=       -520.165666971606, -1235167,    0
##MAX=       3092.55109603417, 442494142,    0
$$ Real data points
##PAGE= N=1
##DATA TABLE= (X++(R..R)), XYDATA
$$ [...]
6295D7602987L244578L221275J167684M60052j540314l524213l882663l847946
$$ 47602987 50847565 54068840 55236524 55696576 54156262 50632049 46749386 42901440
6287D2901440l437062k272042j531207j042090n23693p36060k38722L55828J005654
$$ 42901440 39464378 37192336 35661129 34619039 34095346 33359286 33120564 33476392 34482046
6278C4482046J246067J658429J681008K764872K356175K914109L301829M235017
$$ 34482046 35728113 37386542 39067550 41832422 44188597 47102706 50404535 54639552
6270E4639552N988037P051291P835902P438183M826423L48304n165620q101610
$$ 54639552 60627589 67678880 75514782 82952965 87779388 88127692 82962072 74860462
6262G4860462q698272q763456p125545n467031m295888k696108k407001j993547
$$ 74860462 66162190 57398734 50273189 44806158 40510270 37814162 35407161 33413614
6254C3413614j546489q51244n35439l72884J20527L07839Q11723J484219J467907
$$ 33413614 31867125 31015881 30480442 30107558 30228085 30535924 31347647 32831866 34299773
6245C4299773K100228J874655K688340L471576L548370J745150p05639k566411
$$ 34299773 36400001 38274656 40962996 44434572 47982942 49728092 49022453 46456042
6237D6456042m114899m515006m305100m159085l491144k823586j938738j772724
$$ 46456042 42341143 37826137 33521037 29361952 25870808 23047222 21108484 19335760
6229A9335760j524102j335269r26231j369788r46999l45874p17053o01461n93013
$$ 19335760 17811658 16476389 15550158 14180370 13233371 12887497 12170444 11568983 10975970
6220A0975970l71564o17742n03698k43989k62212m65398k57607n84871l12301
$$ 10975970 10604406 9986664 9482966 9238977 8976765 8511367 8253760 7668889 7356588
6211G356588J055l45117m57556J74422n6060J5974m23242m19511k88311K66569
$$ 7356588 7357643 7012526 6554970 6729392 6673332 6689306 6266064 5846553 5558242 5824811
6201E824811l06433l30889J6283j15059l09307n1228r4870K86838j75777j49530
$$ 5824811 5518378 5187489 5203772 5088713 4779406 4728178 4633308 4920146 4744369 4594839
6191D594839j39837j14218k59053j14194K96625l67531J3388p0642L5674l41071
$$ 4594839 4455002 4340784 4081731 3967537 4264162 3896631 3910019 3839377 3875051 3533980
6181C533980j37241j07865J44462L60949J4603j84787L42130J6946k05651r1026
$$ 3533980 3396739 3288874 3433336 3794285 3808888 3624101 3966231 3983177 3777526 3686500
6171C686500n15146j21798k44183O1870L89309Q0119l86428l4807L24629L9066
$$ 3686500 3171354 3049556 2805373 2867243 3256552 3336671 2950243 2915436 3240065 3279131
6161C279131N2436J18814l36896J15173Q1178j64568k12387k3850J76285O0839
$$ 3279131 3331567 3450381 3113485 3228658 3309836 3145268 2932881 2909031 3085316 3146155
6151C146155l04858j85594l75000K5615J21732L28929k12669L757n3207R0144
$$ 3146155 2841297 2655703 2280703 2306318 2428050 2756979 2544310 2548067 2494860 2585004
6141B585004J93546J38452K66987n8468L10283R9339k33858k13532k25331J92408
$$ 2585004 2778550 2917002 3183989 3125521 3435804 3535143 3301285 3087753 2862422 3054830
6131C054830K36217J05857m03653J98474l69262k96300L45475J078J18599m9051
$$ 3054830 3291047 3396904 2993251 3191725 2822463 2526163 2871638 2872716 2991315 2942264
6121B942264l55314j95568L93315O3928j96721J94561l6311j03892o5313R9328
$$ 2942264 2586950 2391382 2784697 2848625 2651904 2846465 2810154 2706262 2640949 2740277
6111B740277J94886k15467K83728k67797k6905R5144R1688p7215k1761K24352
$$ 2740277 2935163 2719696 3003424 2735627 2708722 2803866 2895554 2818339 2796578 3020930
6101C020930K02786l80898k23778K76826j01642J81867K28071k40015j26246L06726
$$ 3020930 3223716 2842818 2619040 2895866 2794224 2976091 3204162 2964147 2837901 3144627
6091C144627l51921j47244m9574j96727J66336q8084K12157l58057M29218k61695
$$ 3144627 2792706 2645462 2595888 2399161 2565497 2477413 2689570 2331513 2760731 2499036
6081B499036j10529L97437K44389l72448J98821q1975J48291l25615J16219J56851
$$ 2499036 2388507 2785944 3030333 2657885 2856706 2774731 2923022 2597407 2713626 2870477
6071B870477m07489J76740k64253K3766K07314q6105o8478K33146j57225p4237
$$ 2870477 2462988 2639728 2375475 2399241 2606555 2520450 2451972 2685118 2527893 2453656
6061B453656J12155l54370K03621j51298j6624J66569K73986k91651m6958Q9693
$$ 2453656 2565811 2211441 2415062 2263764 2247140 2413709 2687695 2396044 2349086 2438779
6051B438779j09163L53579o3375k30493j95938j7735J95603J18530r1068J6735
$$ 2438779 2329616 2683195 2619820 2389327 2193389 2175654 2371257 2489787 2398719 2415454
6041B415454j02548M09810L5151j83791J07476P4540k23525J81849K3539k95102
$$ 2415454 2312906 2722716 2757867 2574076 2681552 2756092 2532567 2714416 2737955 2442853
6031B442853J59674J26174l30306J52360J25059j76152J95249K55343J54394o4939
$$ 2442853 2602527 2728701 2398395 2550755 2675814 2499662 2694911 2950254 3104648 3039709
6021C039709j17317K58302j54955o4015J31489m06294N574L90806R5570J79727
$$ 3039709 2922392 3180694 3025739 2961724 3093213 2686919 2692493 3083299 3178869 3358596
6011C358596J44034J09572L07295K24151r04656J42021n5017j54133j35187p2902
$$ 3358596 3502630 3612202 3919497 4143648 3238992 3381013 3325996 3171863 3036676 2963774
6001B963774N1579M57625r3404p5986m87239J64933K20970J32171L00855j12280
$$ 2963774 3015353 3472978 3379574 3303588 2816349 2981282 3202252 3334423 3635278 3522998
5991C522998l4518m8946k04560L2396L28458J46967K50486m29597Q6516L77941
$$ 3522998 3488480 3439534 3234974 3267370 3595828 3742795 3993281 3563684 3650200 4028141
5981D028141j38566l6266R5272j59430l5971m57959k68700J75876L14760M80244
$$ 4028141 3889575 3853309 3948581 3789151 3753180 3295221 3026521 3202397 3517157 3997401
5971C997401J13515P0087J99897Q7767l35009m13671L65396P5831J15660J49133
$$ 3997401 4110916 4181003 4380900 4468667 4133658 3719987 4085383 4161214 4276874 4426007
5961D426007k11744N9990L89739k25344L25567M98625K45042K57392k53865K69133
$$ 4426007 4214263 4274253 4663992 4438648 4764215 5262840 5507882 5765274 5511409 5780542
5951E780542j6031j44321K89202L05375l4449P2584K40520k60807k70579N10384
$$ 5780542 5764511 5620190 5909392 6214767 6180318 6252902 6493422 6232615 5962036 6472420
5941F472420k4206L011M67608l14493m5744J4443K62934k51338P22320K19688
$$ 6472420 6448214 6451225 6918833 6604340 6558596 6573039 6835973 6584635 7306955 7526643
5931G526643J92907j3388Q9462O34989M49485j88664J96227M965P08698l59967
$$ 7526643 7719550 7706162 7795624 8430613 8880098 8691434 8887661 8892626 9601324 9241357
5921I241357k9823M66966N370L75191j8343j07386N3857r5107j60000q8538O4485
$$ 9241357 9211534 9678500 9683870 10059061 10040718 9933332 9987189 9892082 9732082 9643544 9708029
5910I708029J48938k15641M99706M59244N42196M2561J54598j14180M05618M07628
$$ 9708029 9856967 9641326 10141032 10600276 11142472 11185033 11339631 11225451 11631069 12038697
5900A2038697L09036K93155M87531L87198N85286L36308N86803O61859O32199
$$ 12038697 12347733 12640888 13128419 13515617 14100903 14437211 15024014 15685873 16318072
5891A6318072O63069P47431R39753J189158Q63099O78220M73335j30762m14154
$$ 16318072 16981141 17728572 18668325 19857483 20720582 21398802 21872137 21741375 21327221
5882B1327221m60406k01472r7609L52182p8092q107L73462j84656N10465R88165
$$ 21327221 20866815 20665343 20567734 20919916 20841824 20833717 21207179 21022523 21532988 22521153
5872B2521153M44776J13452K65913O15338P38321N74010J145511J005120J084879
$$ 22521153 22965929 23079381 23345294 23960632 24698953 25272963 26418474 27423594 28508473
5863B8508473J737329J971106K424070K971077K828324K182709Q52067K05611
$$ 28508473 30245802 32216908 34640978 37612055 40440379 42623088 43475155 43680766
5855D3680766m76219K22659J644202J102757K330735L282106M292040N313727
$$ 43680766 43204547 43427206 45071408 46174165 48504900 51787006 56079046 61392773
5847F1392773O542596P693992P879360P975578M590024k11636m507277o267266
$$ 61392773 67935369 75629361 83508721 91484299 96074323 95862687 91355410 85088144
5839H5088144p310937o281312m326450l547667k484943r13514m45658J80963J328662
$$ 85088144 77777207 71495895 67169445 63621778 61136835 60223321 59777663 59958626 61287288
5830F1287288R69289J650406J912229K415447M267234N320364O621047Q879088
$$ 61287288 62256577 63906983 65819212 68234659 72501893 77822257 84443304 93322392
5822I3322392J1059799J3954988J5440238J3251543P497556k571711j1248774
$$ 93322392 104382191 118337179 133777417 147028960 154526516 151954805 140706031
5815A40706031j4656225j5215982j3462200j0490243q393862n944025m668451
$$ 140706031 126049806 110833824 97371624 86881381 78487519 72543494 67875043
5808F7875043l750022k844017k500524j947111j430844m91939k55555L18897J062689
$$ 67875043 64125021 61281004 58780480 56833369 55402525 54910586 54655031 54973928 56036617
5799E6036617K319607K946619L754655N367059N169537M635126K356681j250080
$$ 56036617 58356224 61302843 65057498 70424557 75594094 80229220 82585901 81335821
5791H1335821m358525p118698p534733o359507m730127m037760k916927k134377
$$ 81335821 76977296 69858598 62323865 55964358 51234231 47196471 44279544 42145167
5783D2145167j344334o63841o96433j832006j537547j412709j449968j709076
$$ 42145167 40800833 40136992 39440559 37608553 36071006 34658297 33208329 31499253
5775C1499253j877501j520232q24227j276371r00621r17200r28000m58105K82177
$$ 31499253 29621752 28101520 27277293 26000922 25100301 24183101 23255101 22796996 23079173
5766B3079173o73535m98182l97659k52242J8002J09254M94091M43904M56573J56582
$$ 23079173 22405638 21907456 21509797 21257555 21275557 21384811 21878902 22322806 22779379 22935961
5756B2935961O8434K03194P49267M31990K86663O65251J68122K41360K76512p7752
$$ 22935961 23004395 23207589 23956856 24388846 24675509 25340760 25508882 25750242 26026754 25949002
5746B5949002p1729m35438k60536n92310k58738J27159N6958m2678N58704Q26868
$$ 25949002 25877273 25441835 25181299 24588989 24330251 24457410 24514368 24471690 25030394 25857262
5736B5857262P34231J124358N11131O93277J688590J498316J761271J912081K063134
$$ 25857262 26591493 27715851 28226982 28920259 30608849 32107165 33868436 35780517 37843651
5727C7843651K371145K477086L176791L865468M726050N593450N210247N180833
$$ 37843651 40214796 42691882 45868673 49734141 54460191 60053641 65263888 70444721
5719G0444721K541719n68843l558186m691732n140444m904009l535884k912327
$$ 70444721 72986440 72417597 68859411 64167679 59027235 54123226 50587342 47675015
5711D7675015j907953j144494j001997K49657L48995P22816J208560K090348J496897
$$ 47675015 45767062 44622568 43620571 43870228 44219223 44942039 46150599 48240947 49737844
5702D9737844J536161K650820K868557L830172N644032P652449R158356J0952315
$$ 49737844 51274005 53924825 56793382 60623554 66267586 73920035 83078391 94030706
5694I4030706J1413463P615130N71190n991488j0063260j0993280j1066609r026083
$$ 94030706 105444169 113059299 113630489 107639001 97575741 86582461 75515852 66489769
5686F6489769p324471n764822m286185l531417k700962j733788j479733p03784
$$ 66489769 59165298 53400476 49114291 45582874 42881912 41148124 39668391 38964607
5678C8964607n62684k09932K42665J75040Q13263O69909J063062K395085L144719
$$ 38964607 38401923 38191991 38434656 38609696 39422959 40092868 41155930 43551015 46695734
5669D6695734L469971L710033K530713R13056j408765l958956n198005m593890
$$ 46695734 50165705 53875738 56406451 57319507 55910742 51951786 46753781 42159891
5661D2159891l933092l497994k660604j903590j704793j681793j868282j573744
$$ 42159891 38226799 34728805 32068201 30164611 28459818 26778025 24909743 23335999
5653B3335999j400025q71478j119103q69991o56510q34853q71588q00700n67650
$$ 23335999 21935974 21064496 19945393 19075402 18418892 17584039 16712451 15911751 15344101
5644A5344101l42655l69318o14465p52796l31647l50710m08078M9799K8157k63492
$$ 15344101 15001446 14632128 14017663 13264867 12933220 12582510 12174432 12224231 12252388 11988896
5634A1988896l03841j38076l54835K86637K27025q7311K81414K69419k06403k90061
$$ 11988896 11685055 11546979 11192144 11478781 11705806 11618495 11899909 12169328 11962925 11672864
5624A1672864R0259n99411m01420l0228m85082Q7473k26729J18661q1132r4937
$$ 11672864 11763123 11163712 10762292 10732064 10246982 10334455 10107726 10226387 10145255 10050318
5614A0050318K39434M6876J27962l944r197k04181J47155K09892N21516j03899
$$ 10050318 10289752 10336628 10464590 10460646 10451449 10247268 10394423 10604315 11125831 11021932
5604A1021932L74520R4770L78514l44132m4157J35374k7304M54604m09304J50011
$$ 11021932 11396452 11491222 11869736 11525604 11481447 11616821 11589517 12044121 11634817 11784828
5594A1784828J11385O64291N4146K90751k02399M94809M45804K47060M0129L3700
$$ 11784828 11896213 12560504 12614650 12905401 12703002 13197811 13643615 13890675 13930804 13964504
5584A3964504K68184j83845j26884M07779r9523K66918N51858m4427K62451K32333
$$ 13964504 14232688 14048843 13921959 14329738 14230215 14497133 15048991 15004564 15267015 15499348
5574A5499348N41751P85200k86861K46096Q77165P01301M64090M90015M88008
$$ 15499348 16041099 16826299 16539438 16785534 17662699 18364000 18828090 19318105 19806113
5565A9806113L25064R18236R03568N61247R09956J042077Q05502M36583N40176
$$ 19806113 20131177 21049413 21952981 22514228 23424184 24466261 25271763 25708346 26248522
5556B6248522m0321P73607P71254Q78317Q60316Q13528O03620O20181N30582P90023
$$ 26248522 26208201 26981808 27753062 28631379 29491695 30305223 30908843 31529024 32059606 32849629
5546C2849629Q05530P60150R24625L06049J329551J863482J789126J807198K454305
$$ 32849629 33655159 34415309 35339934 35645983 36975534 38839016 40628142 42435340 44889645
5537D4889645K099692K398858K692788L803984M301136M408987N811514O593645
$$ 44889645 46989337 49388195 52080983 55884967 60186103 64595090 70406604 77000249
5529G7000249O917110P225443N416163K615713j257025k587791l929850l645822
$$ 77000249 83917359 91142802 96558965 99174678 97917653 95329862 91400012 87754190
5521H7754190j833070j030980m97275k80686M1587l00618l53181j9045L7139P92047
$$ 87754190 85921120 84890140 84392865 84112179 84153766 83853148 83499967 83480922 83518061 84310108
5511H4310108K468019L724139N626632P741726Q892055P968877O123120L751930
$$ 84310108 86778127 90502266 96128898 103870624 112762679 120731556 126854676 130606606
5503A30606606J010551k309566l466153m193430n679113o396407o319402o406160
$$ 130606606 131617157 129307591 125841438 121648008 115968895 109572488 103253086 96846926
5495I6846926n725591m425449l246534k315559k586056k001661j339594o16504
$$ 96846926 91121335 86695886 83449352 81133793 78547737 76546076 75206482 74589978
5487G4589978m4724O32418J878884L323021M446117M036302L399273J999633j257263
$$ 74589978 74545254 75177672 77056556 80379577 84825694 88861996 92261269 94260902 93003639
5478I3003639m828776p114480p458286p775070o724488n774181m610680l925715
$$ 93003639 88174863 81060383 73602097 65827027 59102539 53328358 48717678 44791963
5470D4791963l624519l220235l240024k322020j835414j333447j522586j486020
$$ 44791963 41167444 37947209 34707185 32385165 30549751 29216304 27693718 26207698
5462B6207698j020291j842673j145978l94700l23129n38044q60963q34805o33230
$$ 26207698 25187407 23344734 22198756 21804056 21480927 20942883 20081920 19247115 18613885
5453A8613885p02356p02381j30431j44461k26878l56540o48655k72206o55576
$$ 18613885 17911529 17209148 17078717 16934256 16707378 16350838 15702183 15429977 14774401
5444A4774401k16257k25975j12782l38081Q0196M44461L37902M96712L49707k28031
$$ 14774401 14558144 14332169 14219387 13881306 13961502 14405963 14743865 15240577 15590284 15362253
5434A5362253j311752j004482o41167p78766m96870k25257r1412k78834l12801
$$ 15362253 14050501 13046019 12404852 11626086 11129216 10903959 10812547 10533713 10220912
5425A0220912k12584j35434j38361L1715m65412m23434j0606J85253k88493K54421
$$ 10220912 10008328 9872894 9734533 9766248 9300836 8877402 8866796 9052049 8763556 9017977
5415I017977N55145l59411J6926l650j73198k14619j05963k80072J74171M24937
$$ 9017977 9573122 9213711 9230637 9226987 9053789 8839170 8733207 8453135 8627306 9052243
5405I052243L68529M24241O0452j31428j0648K05720J67174L0650J43888L50M58057
$$ 9052243 9420772 9845013 9905465 9774037 9763389 9969109 10136283 10166933 10310821 10311171 10769228
5394A0769228L77660J65782J4838K58020K41891J287n0808M7680K82021L82014
$$ 10769228 11146888 11312670 11327508 11585528 11827419 11828706 11777898 11825578 12107599 12489613
5384A2489613K73459M26631M68949P76088Q63345O49619J058371K12637j282203
$$ 12489613 12763072 13189703 13658652 14434740 15298085 15947704 17006075 17218712 15936509
5375A5936509j186730j283072j279999r90772p05181j034857j63109l90771q0191
$$ 15936509 14749779 13466707 12186708 11195936 10490755 9455898 9292789 8902018 8821827
5366H821827m62476m56383J52488k02649k88439q9051j19201l92362l43919J98409
$$ 8821827 8359351 7902968 8055456 7852807 7564368 7475317 7356116 6963754 6619835 6818244
5356F818244j23475j12754K95984J2768J01133m07051k83525J23624k55486o04271
$$ 6818244 6694769 6582015 6877999 6890767 6991900 6584849 6301324 6424948 6169462 5565191
5346E565191q30621j03293n0261K57841M28844K23390j15467k51773O8106k08893
$$ 5565191 4734570 4631277 4581016 4838857 5267701 5491091 5375624 5123851 5191957 4983064
5336D983064j33599R6297O2452P5299L17884Q5978l92913p7639k59121j52163
$$ 4983064 4849465 4945762 5008214 5083513 5401397 5487375 5094462 5016823 4757702 4605539
5326D605539k69383k36404n040p04054J74078M31440k76701r9013K75849p0811
$$ 4605539 4336156 4099752 4094712 3390658 3564736 3996176 3719475 3620462 3896311 3825500
5316C825500j62995o804L25157j72246m03502r1835l82787L55300J69978m2850
$$ 3825500 3662505 3655701 3980858 3808612 3405110 3313275 2930488 3285788 3455766 3412916
5306C412916L21082J21359j93640J02294K71997K23543m15197l5959L7339N7072
$$ 3412916 3733998 3855357 3661717 3764011 4036008 4259551 3844354 3808395 3845734 3902806
5296C902806Q4896l84866L5253j27002N1468j54162J73134k34023L0585l3020
$$ 3902806 3987702 3602836 3638089 3511087 3562555 3408393 3581527 3347504 3378089 3345069
5286C345069J20957r5855J51625j4545k70520J81977L41591j30142l90441q4138
$$ 3345069 3466026 3370171 3521796 3507251 3236731 3418708 3760299 3630157 3239716 3155578
5276C155578M8019k78500O44896P3988l39617j8636N3933R0415N73679q3597N7034
$$ 3155578 3203597 2925097 3569993 3643981 3304364 3285728 3339661 3430076 4003755 3920158 3977192
5265C977192n24006O674J26913J6123m21213j02217J76698O759J50600l0473j09518
$$ 3977192 3453186 3459860 3586773 3602896 3181683 3079466 3256164 3262923 3413523 3383050 3273532
5254C273532J44384O691k42300O3329J43108L50081k28129j6232K43488K87730
$$ 3273532 3417916 3424607 3182307 3245636 3388744 3738825 3510696 3494464 3737952 4025682
5244D025682j26959J98119O0350m3718L02335P7932K03062K2407l16842K26416
$$ 4025682 3898723 4096842 4157192 4113474 4415809 4493741 4696803 4719210 4402368 4628784
5234D628784J61204K85035J44046j57550r4695J1112J14836L09825l04845N72395
$$ 4628784 4789988 5075023 5219069 5061519 4966824 4977936 5092772 5402597 5097752 5670147
5224E670147N09405j13210Q3925k83863l67116J53054j96765K31042K61256k73623
$$ 5670147 6179552 6066342 6150267 5866404 5499288 5652342 5455577 5686619 5947875 5674252
5214E674252M1096l36279j28727O87106M35118r8446P222L89412J84928j09200
$$ 5674252 5715348 5379069 5250342 5937448 6372566 6274120 6281342 6670754 6855682 6746482
5204F746482L26732O03375M70839N51088K60033M75792P47829N42220O71068R21038
$$ 6746482 7073214 7676589 8147428 8698516 8958549 9434341 10182170 10724390 11395458 12316496
5194A2316496J77951K46092R5693m47319n36834k62101j24860k3613q09437J7441
$$ 12316496 12494447 12740539 12836232 12388913 11852079 11589978 11465118 11441505 10632068 10649509
5184A0649509L6198J45921k8124l57673k70298K35601L98385J22364L89396n46
$$ 10649509 10685707 10831628 10803504 10445831 10175533 10411134 10809519 10931883 11321279 11320733
5174A1320733N7533Q13323M18557P60334N92869J060779R70554O91065J366512
$$ 11320733 11378266 12191589 12610146 13370480 13963349 15024128 15994682 16685747 18052259
5165A8052259J199852Q65347P81834O33902P05280l28133j203528j178044j688883
$$ 18052259 19252111 20117458 20899292 21533194 22238474 21910341 20706813 19528769 17839886
5156A7839886j145635q53542j307908j334978o17659n74698P0890n05723p43612
$$ 17839886 16694251 15840709 14532801 13197823 12580164 12005466 12076356 11570633 10827021
5147A0827021J22644L78238k68651j21289k28644L55026J48586M4535K09108P43055
$$ 10827021 10949665 11327903 11059252 10937963 10709319 11064345 11212931 11257466 11466574 12209629
5137A2209629L79180L61121L71494O74270Q92138P56375N06758M65460j23671
$$ 12209629 12588809 12949930 13321424 13995694 14887832 15644207 16150965 16616425 16492754
5128A6492754k910r45983n55798r80805j144268k48632o49764o09668m23735l79771
$$ 16492754 16489844 15543861 14988063 14007258 12862990 12614358 11964594 11354926 10931191 10551420
5118A0551420j77000j47795M3491j40302l10485m4115j6231r696K90782K41859
$$ 10551420 10374420 10226625 10270116 10129814 9819329 9775214 9758983 9749287 10040069 10281928
5108A0281928l67191k61109P8857j5268k40259J25736L24719J14746J40278O8701
$$ 10281928 9914737 9653628 9732485 9717217 9476958 9602694 9927413 10042159 10182437 10251138
5098A0251138J74318M48397j09337K46252J09700N15950j72460N27387K97320
$$ 10251138 10425456 10873853 10764516 11010768 11120468 11636418 11463958 11991345 12288665
5089A2288665k59208k79674N62874M75133M09272J10972O08787J05332M18574
$$ 12288665 12029457 11749783 12312657 12787790 13197062 13308034 13916821 14022153 14440727
5080A4440727Q13318N64294K29315M05085L16958L84683L84486N04526O86530
$$ 14440727 15254045 15818339 16047654 16452739 16769697 17154380 17538866 18043392 18729922
5071A8729922J22232N36697N72237N84878M77921J153197N93978L22514Q07725
$$ 18729922 18852154 19388851 19961088 20545966 21023887 22177084 22771062 23093576 23901301
5062B3901301M04808K80714M85494Q06263J080599Q75877J463185J454916K114381
$$ 23901301 24306109 24586823 25072317 25878580 26959179 27835056 29298241 30753157 32867538
5053C2867538K014910K112974K591797L524352L752449M660200O032953P673316
$$ 32867538 34882448 36995422 39587219 43111571 46864020 51524220 57557173 65230489
5045F5230489R555229J1587856J6420060K2268191K7724100L6166949M3808234
$$ 65230489 74785718 86373574 102793634 125061825 152785925 188952874 232761108
5038B32761108L3603511p780027m0246648m2752789l6936018k8210459k0094273
$$ 232761108 266364619 258584592 218337944 175585155 138649137 110438678 90344405
5031I0344405j4643141j0839867q014307o407416n177528m293996m255439l581807
$$ 90344405 75701264 64861397 56847090 50439674 45262146 40968150 36712711 33130904
5023C3130904k600181k179039j411821j319100j619763j162524n74532j387102
$$ 33130904 30530723 28351684 26939863 25620763 24001000 22838476 22263944 20876842
5015B0876842j540134j214795j192251o18107r97671n93731j61308n41485o53745
$$ 20876842 19336708 18121913 16929662 16311555 15313884 14720153 14558845 14017360 13363615
5006A3363615n94307n26600m04833j80068j13101m68280k10858j38701m22056
$$ 13363615 12769308 12242708 11837875 11657807 11544706 11076426 10865568 10726867 10304811
4997A0304811n34410p68593l32230n42686o6470j99897J50147P2055k83631n25340
$$ 10304811 9770401 9001808 8669578 8126892 8060422 7860525 8010672 8082727 7799096 7273756
4987G273756k32598j75549J11298L79513k69756k32732k17965j83266N879k57163
$$ 7273756 7041158 6865609 6976907 7356420 7086664 6853932 6635967 6452701 6458580 6201417
4977F201417n95048J558J73422j02675k4954j46007K0410j15441j5846P4066m22114
$$ 6201417 5606369 5607927 5781349 5678674 5653720 5507713 5528123 5412682 5396836 5470902 5048788
4966E048788k80733k7170j96120j07713M8854K52403L02350K1399m43598l12156
$$ 5048788 4768055 4740885 4544765 4437052 4485906 4738309 5040659 5062058 4618460 4306304
4956D306304L2272Q4506n76796M02229l02490J75226M62174n22233P1540m3022
$$ 4306304 4338576 4423082 3846286 4248515 3946025 4121251 4583425 4061192 4132732 4089710
4946D089710L17521j33014m6627k04570N57666j97149l38016k09593L0038m6805
$$ 4089710 4407231 4274217 4227590 4023020 4580686 4383537 4045521 3835928 3865966 3819161
4936C819161J92769K44383J27400J12828p7289L05061l960N50597j62977L82802
$$ 3819161 4011930 4256313 4383713 4496541 4419252 4724313 4720353 5270950 5107973 5490775
4926E490775N18127l80371J4392k37991j41573K58891j80988M64803J92584K92252
$$ 5490775 6008902 5628531 5642923 5404932 5263359 5522250 5341262 5806065 5998649 6290901
4916F290901N15563K96122L58193R2216O07674R2100J30132k11294O7449K12517
$$ 6290901 6806464 7102586 7460779 7552995 8160669 8252769 8382901 8171607 8239056 8451573
4906H451573J33818Q04960N61431Q00630O544m5488m88917j153939n94886p02780
$$ 8451573 8585391 9390351 9951782 10752412 10758956 10713468 10224551 9070612 8475726 7772946
4896G772946n46688m10499l95152n50631L3138N72350M54067l62712M15231J82423
$$ 7772946 7226258 6815759 6420607 5869976 5903114 6475464 6929531 6566819 6982050 7164473
4886G164473K69436k82230J05718Q70707r7855K66223M96091L82740k53333Q1837
$$ 7164473 7433909 7151679 7257397 8128104 8030249 8296472 8792563 9175303 8921970 9003807
4876I003807j87424p11209o39796n2719m4591J5363q600k66994n47908j48885
$$ 9003807 8816383 8105174 7465378 7412659 7368068 7383431 7374831 7107837 6559929 6411044
4866F411044J00053m96950n41102O750o31491K46934L68829j14497m15502L9424
$$ 6411044 6511097 6014147 5473045 5479795 4848304 5095238 5464067 5349570 4934068 4973492
4856D973492J79910k54388p233N99359j96698L83192J71453M50688K83306j3188
$$ 4973492 5153402 4899014 4891781 5491140 5294442 5677634 5849087 6299775 6583081 6569893
4846F569893M46603k57748k18984o5076K11777l00735r0517l60606K14290j87652
$$ 6569893 7016496 6758748 6539764 6474688 6686465 6385730 6295213 5934607 6148897 5961245
4836E961245k95130R8758m73137j17702j26429j66893M79526k65441k34849J28373
$$ 5961245 5666115 5764873 5291736 5174034 5047605 4880712 5360238 5094797 4859948 4988321
4826D988321J546J85267m1897k92732K0404l04891K68107K01590K1642J92673
$$ 4988321 4989867 5175134 5133237 4840505 4860909 4556018 4824125 5025715 5047357 5240030
4816E240030r8442k15226j00582J4258O6274o6615K54960m940O1314m70751K75665
$$ 5240030 5141588 4926362 4825780 4840038 4906312 4839697 5094657 5089717 5151031 4680280 4955945
4805D955945q0174J62115N2713K94587K57306L08844K24659m82325J18722L70866
$$ 4955945 4875771 5037886 5090599 5385186 5642492 5951336 6175995 5693670 5812392 6183258
4795F183258k39990Q8209K79487j9857K8527J26756K40742p434j35963L16143
$$ 6183258 5943268 6031477 6310964 6291107 6319634 6446390 6687132 6679698 6543735 6859878
4785F859878M21500j71552N41251M45201l35170J17644J67043K64139O7351L0852
$$ 6859878 7281378 7109826 7651077 8096278 7761108 7878752 8045795 8309934 8377285 8408137
4775H408137J28183K33826J42928K47905L79296P1334M18205r0146N8593o0551
$$ 8408137 8536320 8770146 8913074 9160979 9540275 9611609 10029814 9939668 9998261 9937710
4765I937710L74290O43590J83493L22680P88121N94283R63585K71883O72286Q25558
$$ 9937710 10312000 10955590 11139083 11461763 12249884 12844167 13807752 14079635 14751921 15577479
4755A5577479O27041m67605J72778m4417l1066K96824K93660K57333M08799N81552
$$ 15577479 16204520 15736915 15909693 15865276 15834210 16131034 16424694 16682027 17090826 17672378
4745A7672378O40240M17458L96382j19374N59606N56235O80648Q65160P38943
$$ 17672378 18312618 18730076 19126458 19007084 19566690 20122925 20803573 21668733 22407676
4736B2407676P18540R0979M58288K83759K66395J51933L16582Q84017J76337O37268
$$ 22407676 23126216 23217195 23675483 23959242 24225637 24377570 24694152 25578169 25754506 26391774
4726B6391774J193423O96760Q61459Q38836J199646R83230J002247J212614J331001
$$ 26391774 27585197 28281957 29143416 29982252 31181898 32165128 33167375 34379989 35710990
4717C5710990K555850K728722K834153L378284L404347L980852M754743O144187
$$ 35710990 38266840 40995562 43829715 47207999 50612346 54593198 59347941 65492128
4709F5492128O414062O613175O575595L632333m30807l115877n059361n293390
$$ 65492128 71906190 78519365 85094960 88727293 88296486 85180609 80121248 74827858
4701G4827858m650970l367016k301729n91713r94507l07386L95190J12174R78310
$$ 74827858 70176888 66809872 64508143 63916430 62921923 62614537 63009727 63121901 64100211
4692F4100211K087313L160312M885279N824354O774308P471242P156130O158456
$$ 64100211 66187524 69347836 74233115 80057469 86831777 94303019 101459149 107617605
4684A07617605M778325L469037J094994j591883m437183p137194q454000q690573
$$ 107617605 112395930 115864967 116959961 115368078 110930895 103793701 95339701 86649128
4676H6649128p750430o810307m937934l393337k216392j284775j025577q02168
$$ 86649128 78898698 72088391 67150457 63757120 61540728 60255953 59230376 58428208
4668E8428208n59101m04431J61005J296850K058792L614316M272861M150079L289083
$$ 58428208 57869107 57464676 57625681 58922531 60981323 64595639 68868500 73018579 76307662
4659G6307662L03212k654192n374742o943408o339678n931881n061226m115782
$$ 76307662 76610874 73956682 68581940 61638532 55298854 49366973 44305747 40189965
4651D0189965l489993l203266k285697j959668j841406j293861j007687j148500
$$ 40189965 36699972 33496706 31211009 29251341 27409935 26116074 25108387 23959887
4643B3959887j188978l35774m78997l41404k99044K52863K74502J12540M23878
$$ 23959887 22770909 22435135 21956138 21614734 21315690 21568553 21843055 21955595 22379473
4634B2379473K22598k63064k20893n98834n79050o40052q07707q87879p38711
$$ 22379473 22602071 22339007 22118114 21519280 20940230 20300178 19492471 18604592 17865881
4625A7865881p24131n28647n05926p10874l16054o92853J56629m82095k96219
$$ 17865881 17141750 16613103 16107177 15396303 15080249 14387396 14544025 14061930 13765711
4616A3765711P4042j04225J12534M32224o660q3831O04994K67732N42586P18026
$$ 13765711 13839753 13735528 13848062 14280286 14273626 14189795 14794789 15062521 15605107 16323133
4606A6323133O81690J333346J270120P85655J040979M98592l9435p1960j030452
$$ 16323133 17004823 18338169 19608289 20393944 21434923 21933515 21894080 21822120 20791668
4597B0791668r67205j496231q29718j379563j211457q54223l91379j036451r99105
$$ 20791668 19824463 18328232 17498514 16118951 14907494 14053271 13661892 12625441 11626336
4588A1626336o89862L7411l20274m85418K68596j34114k12797k37771L6311R1034
$$ 11626336 10936474 10973885 10653611 10168193 10436789 10302675 10089878 9852107 9888418 9979452
4578I979452K24601j21463P0766m08160M05188Q09079N44525P53098K33277m54142
$$ 9979452 10204053 10082590 10153356 9745196 10150384 10959463 11503988 12257086 12490363 12036221
4568A2036221n31751O6463m7116m04761l61451q50906o97716m45946l15718n62176
$$ 12036221 11504470 11570933 11523817 11119056 10757605 9906699 9208983 8763037 8447319 7885143
4558G885143k40688o59789l28591m49088J90327L5840n07041j49676j55855n1660
$$ 7885143 7644455 6984666 6656075 6206987 6397314 6433154 5926113 5776437 5620582 5568922
4548E568922K32535j92808j48089l36245j87930k57291Q7216L07687j30083k77051
$$ 5568922 5801457 5608649 5460560 5124315 4936385 4679094 4766310 5073997 4943914 4666863
4538D666863M05041J53975r88173j32767M21585j4237j36111k55182l7795n8698
$$ 4666863 5071904 5225879 4237706 4104939 4526524 4512287 4376176 4120994 4083199 4024501
4528D024501j12333R1134K30207j57687N0086J587m58915L35842l20091m7528
$$ 4024501 3912168 4003302 4233509 4075822 4125908 4127495 3668580 4004422 3684331 3636803
4518C636803Q6703K22304K05564m39154L6636J85252k7414j78139N0339j87466
$$ 3636803 3723506 3945810 4151374 3712220 3748856 3934108 3906694 3728555 3778894 3591428
4508C591428l68124J39348K37411K95675j55473m03259P4148O2944J04241M314
$$ 3591428 3223304 3362652 3600063 3895738 3740265 3337006 3411154 3474098 3578339 3582653
4498C582653l11130n9395J71433K65298k63026J99352K90838j81626l87913K48285
$$ 3582653 3271523 3212128 3383561 3648859 3385833 3585185 3876023 3694397 3306484 3554769
4488C554769M96204l15289j21790n6023M52183k82929j7074J51312j14252j947
$$ 3554769 4050973 3735684 3613894 3557871 4010054 3727125 3710051 3861363 3747111 3745164
4478C745164K69872m18967l04455M67403j60755J32216M18231K90288j61674l7960
$$ 3745164 4015036 3596069 3291614 3759017 3598262 3730478 4148709 4438997 4277323 4239363
4468D239363O3846k78045j15284K05847j91996J33630l81337K74981K99101n1342
$$ 4239363 4303209 4025164 3909880 4115727 3923731 4057361 3676024 3951005 4250106 4198764
4458D198764p3691J51500J49013j59235l40004K11530L06315N558l63965L35438
$$ 4198764 4125073 4276573 4425586 4266351 3926347 4137877 4444192 4449750 4085785 4421223
4448D421223J99495J49113m74887L00340o1830J37498J10186j02487J80989Q6314
$$ 4421223 4620718 4769831 4294944 4595284 4533454 4670952 4781138 4678651 4859640 4945954
4438D945954j15158p36612N856o9800l59726N01175M55245o9701j62976m66716
$$ 4945954 4830796 4094184 4100040 4030240 3670514 4171689 4626934 4557233 4394257 3927541
4428C927541K41012K34984N33400m22320N5284J80200L54128l3217n66040j93030
$$ 3927541 4168553 4403537 4936937 4514617 4569901 4750101 5104229 5071012 4504972 4311942
4418D311942K33841L83050J14746m04970j24107M0863k16258K19985O62161J52026
$$ 4311942 4545783 4928833 5043579 4638609 4514502 4555365 4339107 4559092 5221253 5373279
4408E373279n42434r0854K15650l90567K11474P67O06M58595O8804j83326n0194
$$ 5373279 4830845 4739991 4955641 4565074 4776548 4777315 4777921 5236516 5305320 5121994 5071800
4397E071800j93143Q1341j16870j23391M88115p8100j60767R0638j05873L38234
$$ 5071800 4878657 4959998 4843128 4719737 5207852 5129752 4968985 5059623 4953750 5291984
4387E291984j08596j16601l08596M08962M7963J35827J03396O186M4920O1402
$$ 5291984 5183388 5066787 4758191 5167153 5215116 5350943 5454339 5460525 5505445 5566847
4377E566847O33M09398P4925l62854k38696M45491n5050K88843J65015l86008
$$ 5566847 5567480 5976878 6051803 5688949 5450253 5895744 5840694 6129537 6294552 5908544
4367E908544K79503P1681J71447l38362k16840Q1904K3338J93406j08888k49390
$$ 5908544 6188047 6259728 6431175 6092813 5875973 5957877 5981215 6174621 6065733 5816343
4357E816343K9687J93911N13136k29863m78682K86453N98908n04429j90557M69981
$$ 5816343 5846030 6039941 6553077 6323214 5844532 6130985 6729893 6225464 6034907 6504888
4347F504888j45762j74494M02250Q9838O5658j70409k03721j13251L91326J5527
$$ 6504888 6359126 6184632 6586882 6676720 6742378 6571969 6368248 6254997 6646323 6661850
4337F661850l4351J95562K07689K5756L08778O5774P4807j43771r8134O9319K62527
$$ 6661850 6627499 6823061 7030750 7056506 7365284 7431058 7505865 7362094 7263960 7333279 7595806
4326G595806K84476J43118O708J95739j91150L13852J7871J17647j15767L43606
$$ 7595806 7880282 8023400 8030108 8225847 8034697 8348549 8366420 8484067 8368300 8711906
4316H711906K4004J21821J2500K06188L08724o3845r9533M64011R3096K21155
$$ 8711906 8735910 8857731 8870231 9076419 9385143 9321298 9221765 9685776 9778872 10000027
4306A0000027R9229M05076J3449o5589p0024J45979L80701J45004L51161k20872
$$ 10000027 10099256 10504332 10517781 10452192 10382168 10528147 10908848 11053852 11405013 11184141
4296A1184141M19226L34958J54275N44M13793j79058K09370M41810J45598r1877
$$ 11184141 11603367 11938325 12092600 12093144 12506937 12327879 12537249 12979059 13124657 13032780
4286A3032780L99300L88117J22191L6232J91302k03451o0485J90977J64200J4259
$$ 13032780 13432080 13820197 13942388 13978620 14169922 13966471 13905986 14096963 14261163 14275422
4276A4275422J68224L50863J06935k28749M32179L7012K45902j21771P7115J29212
$$ 14275422 14443646 14794509 14901444 14672695 15104874 15141886 15387788 15266017 15343132 15472344
4266A5472344r1779K95837L34218K7889K88213L92578J73769N2531k7324K21861
$$ 15472344 15380565 15676402 16010620 16038509 16326722 16719300 16893069 16945600 16918276 17140137
4256A7140137L05273K20369O943j63599N39057J16376J98323J86754j33268l15639
$$ 17140137 17445410 17665779 17672722 17509123 18048180 18164556 18362879 18549633 18416365 18100726
4246A8100726j77876L22776N41477O08368j53244M3334N54008k86086j62867K4379
$$ 18100726 17922850 18245626 18787103 19395471 19242227 19285561 19839569 19553483 19390616 19414995
4236A9414995M70696O3279K53182J36325J11544K61961K98439L26319O01605m39
$$ 19414995 19885691 19948970 20202152 20338477 20450021 20711982 21010421 21336740 21938345 21937906
4226B1937906j53519N07416m1087L31401K80218N53198m9719J90015L33221L68821
$$ 21937906 21784387 22291803 22250716 22582117 22862335 23415533 23365814 23555829 23889050 24257871
4216B4257871M61582N84053J00526M82549O19065P52452N64327L65594N16931
$$ 24257871 24719453 25303506 25404032 25886581 26505646 27258098 27822425 28188019 28704950
4207B8704950K95046O31071N21096N89775Q94118O01918R18565P55439O50300
$$ 28704950 28999996 29631067 30152163 30741938 31636056 32237974 33156539 33911978 34562278
4198C4562278Q67909J253554J311867J139401R18585J293970J636670J424095
$$ 34562278 35430187 36683741 37995608 39135009 40053594 41347564 42984234 44408329
4190D4408329J340337J302224J494123J949601K260382J995378K199680K390737
$$ 44408329 45748666 47050890 48545013 50494614 52754996 54750374 56950054 59340791
4182E9340791K295383K737944K828918K767213K608873K469631K622137K776531
$$ 59340791 61636174 64374118 67203036 69970249 72579122 75048753 77670890 80447421
4174H0447421K978454K970747L032154K932631K642751K848341L369058L854652
$$ 80447421 83425875 86396622 89428776 92361407 95004158 97852499 101221557 105076209
4166A05076209L651555L733930L928569L261335L617721L533761K967800L025917
$$ 105076209 108727764 112461694 116390263 119651598 123269319 126803080 129770880 132796797
4158A32796797L024064K458410K287854K086679K389881K580890K327253J831895
$$ 132796797 135820861 138279271 140567125 142653804 145043685 147624575 149951828 151783723
4150A51783723J880932J982108J180578M60406M72524k39047o20480o14015j293332
$$ 151783723 153664655 155646763 156827341 157287747 157760271 157521224 156900744 156286729 154993397
4141A54993397j412143j782118j788554j954752j552782j784084k332682k875217
$$ 154993397 153581254 151799136 150010582 148055830 146503048 144718964 142386282 139511065
4133A39511065l267742k859486l466409l524912l675835l574070l720652m094292
$$ 139511065 136243323 133383837 129917428 126392516 122716681 119142611 115421959 111327667
4125A11327667l450044l877244l732297l024851k867161l873158l278095l111727
$$ 111327667 107877623 104000379 100268082 97243231 94376070 90502912 87224817 84113090
4117H4113090l501817l477655l149410l443924k344076k449697k780585l053996
$$ 84113090 80611273 77133618 73984208 70540284 68196208 65746511 62965926 59911930
4109E9911930k481844k102145k349714k578870k177774j923703j986631j597419
$$ 59911930 57430086 55327941 52978227 50399357 48221583 46297880 44311249 42713830
4101D2713830j828561j391719j569947j685560j311176r84161j147479r25187
$$ 42713830 40885269 39493550 37923603 36238043 34926867 33942706 32795227 31870040
4093C1870040q75663r90599n03018k49413j166197j094323k25365j24218j70406
$$ 31870040 30994377 30003778 29500760 29251347 28085150 26990827 26765462 26641244 26470838
4084B6470838m76114n68156k79630j33060m3275q45771j52686l16180N3091k11522
$$ 26470838 25994724 25426568 25146938 25013878 24970603 24124832 23972146 23655966 23709057 23497535
4074B3497535k88536l63914m8975m52129m71275K2867l18459m29892k6728J08392
$$ 23497535 23208999 22845085 22796110 22343981 21872706 21895573 21577114 21147222 21120494 21228886
4064B1228886p9571k56914J35610L34259o2075k11881m16866m071J18510k46716
$$ 21228886 21149315 20892401 21028011 21362270 21300195 21088314 20671448 20667377 20785887 20539171
4054B0539171K9133j24084n3971J4801k91762L01691P7580j81468K8570L10517
$$ 20539171 20568304 20444220 20390249 20405050 20113288 20414979 20492559 20311091 20339661 20650178
4044B0650178K42256J0590L85031j16580o28193o6090j06260L61844Q0790J62517
$$ 20650178 20892434 20903024 21288055 21171475 20543282 20477192 20370932 20732776 20813566 20976083
4034B0976083J15207j62920K14997j30702J71895J21979J25869k52278Q3536M18922
$$ 20976083 21091290 20928370 21143367 21012665 21184560 21306539 21432408 21180130 21263666 21682588
4024B1682588j74992j16046Q4295L13194J56870J64316K98804j84223o1912j2297
$$ 21682588 21507596 21391550 21475845 21789039 21945909 22110225 22409029 22224806 22162894 22150597
4014B2150597N15702N30611K93101K96111L15924R5212J01866K07093p8565Q7167
$$ 22150597 22666299 23196910 23490011 23786122 24102046 24197258 24299124 24506217 24427652 24514819
4004B4514819K08962L31744j88972o1945K11267K19041M38953L49575M4394j65964
$$ 24514819 24723781 25055525 24866553 24804608 25015875 25234916 25673869 26023444 26067838 25901874
3994B5901874L74047R9369k25338J33098j07593l46600M13375j6207k83922J37555
$$ 25901874 26275921 26375290 26149952 26283050 26175457 25828857 26242232 26226025 25942103 26079658
3984B6079658n7300K14107k17961k79720n23650J52878J31639O264M91430j9573
$$ 26079658 26022358 26236465 26018504 25738784 25215134 25368012 25499651 25505915 25997345 25977772
3974B5977772L02408o39965l26208N68233L4042N3425J27157L26711k56186r6609
$$ 25977772 26280180 25640215 25314007 25882240 25916282 25969707 26096864 26423575 26167389 26070780
3964B6070780m0175O9444J58365K36977J52535K58061M00252r4974K41178J77957
$$ 26070780 26030605 26100049 26258414 26495391 26647926 26905987 27306239 27211265 27452443 27630400
3954B7630400Q2178J30451J10563N1963l6q1251J31858O06649K95798L09175K72708
$$ 27630400 27712578 27843029 27953592 28005555 28005519 27924268 28056126 28662775 28958573 29267748 29540456
3943B9540456k6255k96278M40133K96311k24906j02070J77094J8874O5872K11101
$$ 29540456 29514201 29217923 29658056 29954367 29729461 29627391 29804485 29823359 29889231 30100332
3933C0100332K26632j80541N51505k8788N7251K83104K40416m47351J58757M77012
$$ 30100332 30326964 30146423 30697928 30669140 30726391 31009495 31249911 30802560 30961317 31438329
3923C1438329O78098K58823N88876O47376J70228M01673Q57353K40280O2084J052846
$$ 31438329 32116427 32375250 32964126 33611502 33781730 34183403 35040756 35281036 35343120 36395966
3913C6395966M40664P12364N86601J130175J019782N33592Q75817J021086M52485
$$ 36395966 36836630 37548994 38135595 39265770 40285552 40819144 41694961 42716047 43168532
3904D3168532O49642K91540N85050K89991K86738Q63285N32753L03395J006812
$$ 43168532 43818174 44109714 44694764 44984755 45271493 46134778 46667531 46970926 47977738
3895D7977738N02157Q04605J022691J435979J241222J001550P25922J075433J368853
$$ 47977738 48479895 49284500 50307191 51743170 52984392 53985942 54711864 55787297 57156150
3886E7156150P76223J22930O91828J315177O63949Q34618O51088J91815L37741
$$ 57156150 57932373 58055303 58747131 60062308 60726257 61560875 62211963 62403778 62741519
3877F2741519M68782O64765R78456R36537J182099J477443J527164J952595R66162
$$ 62741519 63210301 63875066 64853522 65790059 66972158 68449601 69976765 71929360 72895522
3868G2895522Q07185J359194J197767P84707J246570J098979J139713J179905
$$ 72895522 73702707 75061901 76259668 77044375 78290945 79389924 80529637 81709542
3860H1709542M22779M63653N74725J206217J001378O41055Q71327J090755J486370
$$ 81709542 82132321 82595974 83170699 84376916 85378294 86019349 86890676 87981431 89467801
3851H9467801J088230N61684M38729M8707n48403k43002m81554k29401l45873
$$ 89467801 90556031 91117715 91556444 91605151 91056748 90813746 90332192 90102791 89756918
3842H9756918l48340l01242o90672k53616k91424o24157p42950j29060N9211J84207
$$ 89756918 89408578 89107336 88416664 88163048 87871624 87247467 86504517 86375457 86434668 86618875
3832H6618875n70020o97725k60440K80513o5639M25116R65291J132582J367606
$$ 86618875 86048855 85351130 85090690 85371203 85305564 85730680 86695971 87828553 89196159
3823H9196159J152118J712278K261338K038842K427072K511611L133854L553891
$$ 89196159 90348277 92060555 94321893 96360735 98787807 101299418 104433272 107987163
3815A07987163L779583M477568M395131M803943M799313N241600N109420M845112
$$ 107987163 111766746 116244314 120639445 125443388 130242701 135484301 140593721 145438833
3807A45438833M744879M368312L560060L925807M266947L875005M036914L258839
$$ 145438833 150183712 154552024 158112084 162037891 166304838 170179843 174216757 177475596
3799A77475596L432562L434679L566038K734931K135890J898877N99024k87539
$$ 177475596 180908158 184342837 187908875 190643806 192779696 194678573 195277597 194990058
3791A94990058p94785j304537j775142k372533k325358k480557k376971j893133
$$ 194990058 194195273 192890736 191115594 188743061 186417703 183937146 181560175 179667042
3783A79667042j173269j495839j438020j475454j247921j073071j018393m90148
$$ 179667042 178493773 176997934 175559914 174084460 172836539 171763468 170745075 170254927
3775A70254927k00622j12061l6521M42384Q60770J222511P13602J354057P46154
$$ 170254927 170054305 169942244 169905723 170348107 171208877 172431388 173144990 174499047 175245201
3766A75245201J233975J157706Q20850J478994J395031K016000J598631J525280
$$ 175245201 176479176 177636882 178457732 179936726 181331757 183347757 184946388 186471668
3758A86471668J356612J185903R75142O29255m03795j227249k248370k912814
$$ 186471668 187828280 189014183 189989325 190618580 190214785 188987536 186739166 183826352
3750A83826352l404889l574223l735353m743712n060592m834339m963075n199262
$$ 183826352 180421463 176847240 173111887 168368175 163307583 158473244 153510169 148310907
3742A48310907n071422m836121m423483m438277m099925n188071m730089m905862
$$ 148310907 143239485 138403364 133979881 129541604 125441679 120253608 115523519 110617657
3734A10617657m645233m512353m855244m650645m034856l909893l607597k429151
$$ 110617657 105972424 101460071 96604827 91954182 87919326 84009433 80401836 77972685
3726G7972685k184709j622500j137659j433056r86756l38642j67740K55823J71977
$$ 77972685 75787976 74165476 73027817 71594761 70608005 70269363 70101623 70357446 70529423
3717G0529423Q10646L83644L94177Q34066J24008J90824j81611J64926O9529K62351
$$ 70529423 71340069 71723713 72117890 72951956 73075964 73266788 73085177 73250103 73319632 73581983
3707G3581983K30937M33865N84586P09117M21394M91969J21765o41724q36275
$$ 73581983 73812920 74246785 74831371 75540488 75961882 76453851 76575616 75933892 75097617
3698G5097617n5703j44994r07786r82902j213590j230359j245086r52595j422652
$$ 75097617 75041914 74896920 73989134 73006232 71792642 70562283 69317197 68364602 66941950
3689F6941950j223536j163980j464889j242572j196283p02634j54707j203341
$$ 66941950 65718414 64554434 63089545 61846973 60650690 59948056 59793349 58590008
3681E8590008q18550r57298l43585m65265r36194r69602j086345j231892j262713
$$ 58590008 57771458 56814160 56470575 56005310 55069116 54099514 53013169 51781277 50518564
3672E0518564j398892o00836m03491j91535n46156K39323j09380r908P3706J96332
$$ 50518564 49119672 48518836 48115345 47923810 47377654 47616977 47507597 47497689 47571395 47767727
3662D7767727N30817N66602L49736K45017J001186N00698N28067L49836R45881
$$ 47767727 48298544 48865146 49214882 49459899 50461085 50961783 51489850 51839686 52785567
3653E2785567M77627N45026Q98870N51558J166028J373987J874192K122438J479107
$$ 52785567 53263194 53808220 54707090 55258648 56424676 57798663 59672855 61795293 63274400
3644F3274400J543845J226650L80092L64295N99116J334100J116684J713833K026087
$$ 63274400 64818245 66044895 66424987 66789282 67388398 68722498 69839182 71553015 73579102
3635G3579102J743770K291744K986191K866446K435095K565516K356935K119113
$$ 73579102 75322872 77614616 80600807 83467253 85902348 88467864 90824799 92943912
3627I2943912K164025J741776J270798J564599K098408K381057J973224J903168
$$ 92943912 95107937 96849713 98120511 99685110 101783518 104164575 106137799 108040967
3619A08040967K575638K753067J933191K775731K817187K679569K710510K889429
$$ 108040967 110616605 113369672 115302863 118078594 120895781 123575350 126285860 129175289
3611A29175289K503207K422728K866409L981134M902344N661714O995301Q749833
$$ 129175289 131678496 134101224 136967633 140948767 145851111 151512825 158508126 167257959
3603A67257959R761690J2156552J4288886J6856773J9665118K2197605K3960611
$$ 167257959 177019649 189176201 203465087 220321860 239986978 262184583 286145194
3596B86145194K5249331K4847711K3205968K0476835J6214790J0641321O183050
$$ 286145194 311394525 336242236 359448204 379925039 396139829 406781150 412964200
3589D12964200J385417j315596k643010m023562k688233j729542m37099N27586
$$ 412964200 414349617 413034021 410391011 406367449 403679216 401949674 401512575 402040161
3581D02040161R37567j80486k799085o071871j0563203j5732942j9926469k2997152
$$ 402040161 402977728 402797242 399998157 393926286 383363083 367630141 347703672 324706520
3573C24706520k5032386k5528360k5027106k3405912k1350740j9233647j6462350
$$ 324706520 299674134 274145774 249118668 225712756 204362016 185128369 168666019
3566A68666019j3999739j1939880j0407792r106354q187961o659181o726218n016262
$$ 168666019 154666280 142726400 132318608 123212254 115024293 108365112 101638894 96622632
3558I6622632m691480m587103l632484l213221l070954k874065k379499k534545
$$ 96622632 91931152 87344049 83711565 80498344 77427390 74553325 72173826 69639281
3550F9639281k299620k146456j153662j557486r26556j182955j151274q73214
$$ 69639281 67339661 65193205 64039543 62482057 61555501 60372546 59221272 58348058
3542E8348058r65808r64823p37311m40461l67728j025358n25520J21259o18744
$$ 58348058 57382250 56417427 55680116 55239655 54871927 53846569 53321049 53442308 52823564
3533E2823564j032267m12005j00256l7861m64888J02466N68882j09660k22884
$$ 52823564 51791297 51379292 51279036 51241175 50776287 50878753 51447635 51337975 51115091
3524E1115091M72924K80150N1193L34212K23919P25239K28797M73524Q25727M47674
$$ 51115091 51588015 51868165 51919358 52253570 52477489 53202728 53431525 53905049 54730776 55178450
3514E5178450N98722J656957J095589J775155J628806K122506J749709J596790
$$ 55178450 55777172 57434129 58529718 60304873 61933679 64056185 65805894 67402684
3506F7402684K520304K913657K981737L305028L506411K860349K214196K647087
$$ 67402684 69922988 72836645 75818382 79123410 82629821 85490170 87704366 90351453
3498I0351453J750570J154115m28831j734943k616368l520992m144543l720007
$$ 90351453 92102023 93256138 92827307 91092364 88475996 84955004 80810461 77090454
3490G7090454l948225l375043k677060k414125k251978k208473k134933j642300
$$ 77090454 73142229 69767186 67090126 64676001 62424023 60215550 58080617 56438317
3482E6438317j448821j743551j175452m02872o92083r373M70621k24631r39342
$$ 56438317 54989496 53245945 52070493 51667621 50975538 50966165 51436786 51212155 50272813
3473E0272813j282305j079686j542315r29938j173422r26099o78803l01629o03930
$$ 50272813 48990508 47910822 46368507 45438569 44265147 43339048 42660245 42358616 41754686
3464D1754686n93526j58876j078420j097934o17283j091219p33452q03085n49516
$$ 41754686 41161160 41002284 39923864 38825930 38208647 37117428 36383976 35580891 35031375
3455C5031375l40172K6538o88130m89599L44722l06201j77124M95788O64630J466737
$$ 35031375 34691203 34717741 34029611 33540012 33884734 33578533 33401409 33897197 34561827 36028564
3445C6028564K033068K516687J14611k163759k181786j903782j978939k086580
$$ 36028564 38061632 40578319 40692930 38529171 36347385 34443603 32464664 30378084
3437C0378084j765572r08367l59534l87541q62000m40858k35361m64346l62067
$$ 30378084 28612512 27704145 27344611 26957070 26095070 25654212 25418851 24954505 24592438
3428B4592438j83884j99778n9092m81731K2416Q3823n52692L39224N31803M70238
$$ 24592438 24408554 24208776 24149684 23667953 23690369 23774192 23221500 23560724 24092527 24562765
3418B4562765P68071J131863Q97292j41586p55172l24565M73496K112n07229m24495
$$ 24562765 25330836 26462699 27359991 27218405 26463233 26138668 26612164 26614276 26107047 25682552
3408B5682552j200895n04822l69041o29129q9408n04706l15416l15134k71877
$$ 25682552 24481657 23976835 23607794 22978665 22889257 22384551 22069135 21754001 21482124
3399B1482124n64614l12844j96655K13802n03658k26350j93420n2822L03067k77689
$$ 21482124 20917510 20604666 20408011 20621813 20118155 19891805 19698385 19645563 19948630 19670941
3389A9670941K98041O69835K79369J22669N50039M21204N93918J133909J169580
$$ 19670941 19968982 20638817 20918186 21040855 21590894 22012098 22606016 23739925 24909505
3380B4909505J146131J505946K381738L105710M091740N181128O232023Q038917
$$ 24909505 26055636 27561582 29943320 33049030 37140770 42321898 48553921 56592838
3372E6592838N128011k488393p049322p466561o691530m763271l137434j620197
$$ 56592838 61720849 59232456 52183134 44716573 38025043 33261772 30124338 28504141
3364B8504141j745310j513993j008822q54905l11860j75829m04185j52940J41325
$$ 28504141 26758831 25244838 24236016 23381111 23069251 22893422 22489237 22336297 22477622
3355B2477622J30900O29396P33105J103814J658827J980506L171627L992942N342055
$$ 22477622 22608522 23237918 23971023 25074837 26733664 28714170 31885797 35878739 41220794
3346D1220794O513361P244901L184174m692409p919489p248496o110945l952607
$$ 41220794 47734155 54979056 58163230 53470821 45551332 38302836 32191891 28239284
3338B8239284k909856k537442j549814j335767j198393r85877j399124l99196
$$ 28239284 25329428 22791986 21242172 19906405 18708012 17722135 16323011 15923815
3330A5923815k58510n16719o64075k29466n08737k40406L07084L0283k47469m96715
$$ 15923815 15665305 15148586 14484511 14255045 13746308 13505902 13812986 13843269 13595800 13099085
3320A3099085J8502n47792q90785k18259r5547j33185k50288n7228J14408J62693
$$ 13099085 13117587 12569795 11679010 11460751 11365204 11232019 10981731 10924503 11038911 11201604
3310A1201604L90937n17203j48011N1613l16866O2698P8531p4558M81436L14350
$$ 11201604 11592541 11075338 10927327 10978940 10662074 10724772 10803303 10728745 11210181 11524531
3300A1524531k93941J60319l4918l10008l6786L59250k34003j83087l61818l99322
$$ 11524531 11230590 11390909 11355991 11045983 11009197 11368447 11134444 10951357 10589539 10190217
3290A0190217j84806L62141k94294n59324j66257L63012l02127l20421o3579o80932
$$ 10190217 10005411 10367552 10073258 9513934 9347677 9710689 9408562 9088141 9024562 8343630
3280H343630J19928o7476j76636j25011P2062l91260j17223r3700j98773L60356
$$ 8343630 8463558 8396082 8219446 8094435 8166497 7775237 7658014 7564314 7365541 7725897
3270G725897j11128m23433l07026N17971P79584M603k21597P0109N24212K97752
$$ 7725897 7614769 7191336 6884310 7402281 8181865 8186468 7964871 8034980 8559192 8856944
3260H856944J82456m0825J28271j68965L4149n67586K07870J14629l38429k40798
$$ 8856944 9039400 8998575 9126846 8957881 8992030 8424444 8632314 8746943 8408514 8167716
3250H167716K68130l56612k55157K335L44579j71026L32765M06373k17413l90651
$$ 8167716 8435846 8079234 7824077 7826412 8170991 7999965 8332730 8739103 8521690 8131039
3240H131039L31665L65004J44246K50838j29304J62761O4232L55500L83470N13085
$$ 8131039 8462704 8827708 8971954 9222792 9093488 9256249 9320481 9675981 10059451 10572536
3230A0572536M82373L83966O59382J133469N93193L50694n3483p01548j168339
$$ 10572536 11054909 11438875 12098257 13231726 13824919 14175613 14122130 13420582 12252243
3221A2252243o57716n38552j60628J4012k82145J36541J52089O23705L25304j91820
$$ 12252243 11594527 11055975 10895347 10909359 10627214 10763755 10915844 11539549 11864853 11673033
3211A1673033K3644K17170K55465j27299j69015N2572J90421M20936P23732O6741
$$ 11673033 11696677 11913847 12169312 12042013 11872998 11925570 12115991 12536927 13260659 13327400
3201A3327400l2620M92048P09805O96742L04773J280960J216627Q1084k06300
$$ 13327400 13294780 13786828 14496633 15193375 15498148 16779108 17995735 18076819 17870519
3192A7870519j77105k98972k84553m13658M70366M20526r1920J66155m60002J74326
$$ 17870519 17693414 17394442 17109889 16696231 17166597 17587123 17495203 17661358 17201356 17375682
3182A7375682K70958p0449J54130N7356J3039L16083N9910J99320N93392K23759
$$ 17375682 17646640 17576191 17730321 17787677 17800716 18116799 18176709 18376029 18969421 19193180
3172A9193180k6855N77555K67564Q40545J67503J098868O62554Q80243O45533
$$ 19193180 19166325 19743880 20011444 20851989 21019492 22118360 22780914 23661157 24306690
3163B4306690M80900M57023J468278J224550N44640N40690J77480j39498l53084
$$ 24306690 24787590 25244613 26712891 27937441 28482081 29022771 29200251 29060753 28707669
3154B8707669q84248j316649p93518r87108n58406l00204l79015n48485R9224
$$ 28707669 27823421 26506772 25713254 24726146 24167740 23867536 23488521 22940036 23039260
3145B3039260k01064R5787K27087K01499N33846J07064O86843O09638O25649O90723
$$ 23039260 22838196 22933983 23161070 23362569 23896415 24003479 24690322 25299960 25925609 26616332
3135B6616332K5522N38232P28314M42433J54761Q727n93039l71501k44493o52107
$$ 26616332 26641854 27180086 27908400 28350833 28505594 28514321 27921282 27549781 27305288 26653181
3125B6653181j038565j036825j235779o79741n63218n84361p48078o12428J1282
$$ 26653181 25614616 24577791 23342012 22662271 22099053 21514692 20766614 20154186 20165468
3116B0165468k02774l76364j91580l29663P732j32375o5756L1628j20590J0021
$$ 20165468 19962694 19586330 19394750 19065087 19072819 18940444 18874688 18906316 18785726 18795747
3106A8795747k96778l47597l31852l50463P9886p94693n32173o61544j154570
$$ 18795747 18498969 18151372 17819520 17469057 17548943 16754250 16222077 15560533 14405963
3097A4405963r50253n41694k25144n09631q07634o10288k36476j37797m24114
$$ 14405963 13455710 12914016 12688872 12179241 11371607 10761319 10524843 10387046 9962932
3088I962932j38069l40869k46349j06531Q55p9242j92437l14091o05628j03J04570
$$ 9962932 9824863 9483994 9237645 9131114 9131969 9052727 8860290 8546199 7940571 7940468 8045038
3077H045038l16003l74105k19703L41621j83178n77762m90150r2531l5434k96632
$$ 8045038 7729035 7354930 7135227 7476848 7293670 6715908 6225758 6133227 6097793 5801161
3067E801161n6033m35680J31646r5038l82079j42653k01468r1394j07312K22385
$$ 5801161 5745128 5309448 5441094 5346056 4963977 4821324 4619856 4528462 4421150 4643535
3057D643535j11019J92526J76173o8885k42284k43135k76507K4979K24469j98869
$$ 4643535 4532516 4725042 4901215 4832330 4590046 4346911 4070404 4095383 4319852 4120983
3047D120983L58991m43424j41150J4905n5742q2869R8793m79481m1364K05586
$$ 4120983 4479974 4036550 3895400 3910305 3854563 3771694 3870487 3391006 3349642 3555228
3037C555228j94448o4870k83270m90632L21117J92995Q4480j59331o55343R9705
$$ 3555228 3360780 3295910 3012640 2522008 2843125 3036120 3120600 2961269 2305926 2405631
3027B405631j69717l38431L6881L86302q8550k64114L00908J76979n68851K52685
$$ 2405631 2235914 1897483 1934364 2320666 2232116 1968002 2268910 2445889 1877038 2129723
3017B129723k81484K27933L74848m05297K93011l48878j05922M92359q3403m85073
$$ 2129723 1848239 2076172 2451020 2045723 2338734 1989856 1883934 2376293 2292890 1807817
3007A807817l68388K69679K45520p8040k90209k82176K76339j0258J84430k01088
$$ 1807817 1439429 1709108 1954628 1876588 1586379 1304203 1580542 1570284 1754714 1553626
2997A553626n56367K32262M42058n34729J8202M22899k56382j09860J49833K02442
$$ 1553626 997259 1229521 1671579 1136850 1155052 1577951 1321569 1211709 1361542 1563984
2987A563984k22134k55625m86326L46723J34499j47778p2448k57918K31887n0008
$$ 1563984 1341850 1086225 599899 946622 1081121 933343 860895 602977 834864 784856
2977G84856J75955j70465L3549M42950j23534j43453l6916j2382Q2518j04609
$$ 784856 960811 790346 823895 1266845 1143311 999858 962942 950560 1033078 928469
2967I28469K73872q3393j63437R875q0631j8736k8349k84915J98274J64246l15979
$$ 928469 1202341 1118948 955511 965386 884755 866019 837670 552755 751029 915275 599296
2956E99296Q7670K62167l62012K47757O9736K89674n9734m06904j79172P1564
$$ 599296 686966 949133 587121 834878 904614 1194288 1134554 727650 548478 620042
2946F20042j16015L05899j85439m5158L13897j30910K8693j36890J84811k27359
$$ 620042 504027 809926 624487 579329 893226 762316 791009 654119 838930 611571
2936F11571j09107R5430l07314R9291K03730n84541J29233L47268R4584k85304
$$ 611571 502464 597894 290580 389871 593601 9060 138293 485561 580145 294841
2926B94841J91925j83978K65823N9052M2987k11323l91532L80844o6062K29694
$$ 294841 486766 302788 568611 627663 670650 459327 67795 448639 382577 612271
2916F12271J71578j46569P0095j45021k10490J0654L8810J94038l0194q4243J19370
$$ 612271 783849 637280 707375 562354 351864 362518 401328 595366 565172 480929 600299
2905F00299j7617j96105L934M7714m21625K51500q1387L217k2269p2657J04095
$$ 600299 582682 386577 390511 438225 16600 268100 186713 189930 167661 95004 199099
2894A99099K81750o3973K6124L19437l58718l75175q0595O7917J02564K02517
$$ 199099 480849 416876 443000 762437 403719 28544 -52051 15866 118430 320947
2884C20947j30454K04645J50118j89859K40163K50816J14219m03651J93313Q985
$$ 320947 190493 395138 545256 355397 595560 846376 960595 556944 750257 759242
2874G59242m60233m4713P0960r8431K5801j14509j72973m1624R8648J99241K81152
$$ 759242 299009 254296 325256 226825 252626 138117 -34856 -76480 22168 221409 502561
2863E02561j9982J98842q1035n11179p9899k4001j7445j82026L19039o840j36307
$$ 502561 482579 681421 600386 89207 9308 -14693 -32138 -214164 104875 98035 -38272
2852c8272J70828L76827k845k10559l66898K06970M31376n0575k47505k5582J57808
$$ -38272 132556 509383 506538 295979 -70919 136051 567427 516852 269347 243765 401573
2841D01573o3815L1147k49501k6233L12610j68850k14805K77442J89100O3540
$$ 401573 337758 368905 119404 93171 405781 236931 22126 299568 488668 552208
2831E52208k04860k53584j33057l27166K37719K39467P5391M94841J6951k96802
$$ 552208 347348 93764 -39293 -366459 -128740 110727 186118 680959 697910 401108
2821D01108l35025L14271J4682J84098j61450q27616j7228J77170K5542N99497
$$ 401108 66083 380354 395036 579134 417684 -409932 -427160 -249990 -224448 375049
2811C75049k00860l62319K39257l9619j04516J55353L64454K21765j53589o53730
$$ 375049 174189 -188130 51127 11508 -93008 62345 426799 648564 494975 -158755
2801a58755P7234L76124K53933k81105r3287K34644J59577n30606L5868K33241
$$ -158755 -81521 294603 548536 267431 174144 408788 568365 37759 73627 306868
2791C06868j3912j84949j48509R4023N7757n7351L6340l99670J00302J75222K64294
$$ 306868 292956 108007 -40502 53521 111278 53927 90267 -309403 -209101 -33879 230415
2780B30415l16873p4462L773K3111J5452j87213O83443L27923j96573j7983j57606
$$ 230415 -86458 -160920 -157147 -134036 -118584 -305797 377646 705569 508996 491013 333407
2769C33407r7883j87215R5895M07512l50730l82378L13229J97081L5383M7578
$$ 333407 235524 48309 144204 551716 200986 -181392 131837 328918 364301 411879
2759D11879l75320P57721k39482q6453j55811j11974K41586k59142j04536k34808
$$ 411879 36559 794280 554798 468345 312534 200560 442146 183004 78468 -156340
2749a56340N24530J718J83024k22077l66715J16605O0509j90604k78985Q4178
$$ -156340 368190 369908 552932 330855 -35860 80745 141254 -49350 -328335 -244157
2739b44157J68018j48708M32227J51926J56714k47480k38754O1878j7090r3792
$$ -244157 -76139 -224847 207380 359306 516020 268540 29786 91664 74574 -19218
2729a9218k68581L80664m08449J38673M246P4878J6360J98418m0479J24621J83772
$$ -19218 -287799 92865 -315584 -176911 -172665 -97787 -81427 116991 76512 201133 384905
2718C84905n9328J33340k17948K385j00041j93247o9099K59621M3718j25018J1635
$$ 384905 325577 458917 240969 243354 143313 -49934 -119033 140588 184306 59288 70923
2707G0923l45710L69469r2608k79955L71412k99370j9772J87417l0197p2246l58008
$$ 70923 -274787 94682 2074 -277881 93531 -205839 -225611 -38194 -68391 -140637 -498645
2696d98645R2627p0634J52848M94480J42004n8510k00272j09986j51535K55876
$$ -498645 -406018 -476652 -323804 170676 312680 254170 53898 -56088 -207623 48253
2686D8253r1505J02338J26202O2902j52066j37032J78553k14585K15336k29734
$$ 48253 -43252 59086 185288 248190 96124 -40908 137645 -76940 138396 -91338
2676i1338n7583P8870L24230J75936k02867N54333J81486l81639p1755o9660q1724
$$ -91338 -148921 -70051 254179 430115 227248 781581 963067 581428 509673 440013 358289
2665C58289q2707j86071k94773K03921L6993r6316q6154M03767L05543l90583
$$ 358289 275582 89511 -205262 -1341 35652 -60664 -146818 256949 562492 171909
2655A71909K8364k58858O0137m7540l03589p1311L01390O96479j67879k16324
$$ 171909 200273 -58585 1552 -45988 -349577 -420888 -119498 576981 409102 192778
2645A92778j8876l584L45618J62901j5889k84755k76093J4740K58600K030j26558
$$ 192778 173902 170318 515936 678837 662948 378193 102100 116840 375440 377470 250912
2634B50912L51545k44503P3747j08006N10152K41495L74741N93485N650N7494
$$ 250912 602457 357954 431701 323695 833847 1075342 1450083 2043568 2049218 2106712
2624B106712l71360j89533k62073l50581m36324l39849K79642l8186L56705m3393
$$ 2106712 1735352 1545819 1283746 933165 496841 156992 436634 398448 755153 711760
2614G11760m7355n4135j86200J67925J9143j45620k26555M95697m53234J97073
$$ 711760 664405 610270 424070 591995 611138 465518 238963 734660 281426 478499
2604D78499M8399k83737J81485L6806P2166j78063j35116Q6452n6265j66489j72383
$$ 478499 526898 243161 424646 461452 533618 355555 220439 306891 250626 84137 -88246
2593h8246M7564k52436K36392J51381m3504L00103M95063r6433k82454o0308J55740
$$ -88246 -40682 -293118 -56726 94655 51151 351254 846317 749884 467430 407122 562862
2582E62862l34446M8371M65883k67099k69389K70588J98233l38066j29149j89029
$$ 562862 228416 276787 742670 475571 206182 476770 675003 336937 207788 18759
2572A8759j81454K00344J49836L36419J40051n0626M1148k98107l02521K50221
$$ 18759 -162695 37649 187485 523904 663955 613329 654477 356370 53849 304070
2562C04070l6231n0596M62479N3922l5842M95302j55208J99839J1538K40358J5857
$$ 304070 267839 217243 679722 733644 697802 1193104 1037896 1237735 1249273 1489631 1505488
2551A505488l25044m3607k57970k89448l42749M23765N98405o8596l50689r235
$$ 1505488 1180444 1136837 878867 589419 246670 670435 1268840 1200244 849555 840320
2541H40320J52168J55463K41207k17073l50641K03094K46482j64126j09149k93806
$$ 840320 992488 1147951 1389158 1172085 821444 1024538 1271020 1106894 997745 703939
2531G03939J41513K2263K66663K43386l43804J19551N3043j89132k34165j22132
$$ 703939 845452 867715 1134378 1377764 1033960 1153511 1206554 1017422 783257 661125
2521F61125R2895K04442J48193j6695k77038J24575O1358k31733l79232K64813
$$ 661125 754020 958462 1106655 1089960 812922 937497 998855 767122 387890 652703
2511F52703P4507M06490K72704o758k22713j20477k16790P6503j27860O1569L39261
$$ 652703 727210 1133700 1406404 1399646 1176933 1056456 839666 916169 788309 849878 1189139
2500A189139k06293k21899Q7839J94225K79266L12282m4688m33325P6495k7988
$$ 1189139 982846 760947 848786 1043011 1322277 1634559 1589871 1156546 1233041 1205053
2490A205053o415o8159n6851O62663M21052k17862l15141L1383m2940L8445q9667
$$ 1205053 1198638 1130479 1073628 1736291 2157343 1939481 1624340 1655723 1612783 1651228 1561561
2479A561561m07889L39559O54995R7458J2572J53782M7134l98700m5038J00746
$$ 1561561 1153672 1493231 2148226 2245684 2258256 2412038 2459172 2060472 2015434 2116180
2469B116180K55889j10796j74475n320J78053n7449L69405M6076K49612K30672
$$ 2116180 2372069 2261273 2086798 2081478 2259531 2202082 2571487 2617563 2867175 3097847
2459C097847K61379K12349L36191K46350j78783l28426J20186L37490l13352J48459
$$ 3097847 3359226 3571575 3907766 4154116 3975333 3646907 3767093 4104583 3791231 3939690
2449C939690j37567j50582O21416K66129k82351K6096K57557M38529l0333K351
$$ 3939690 3802123 3651541 4272957 4539086 4256735 4282831 4540388 4978917 4948584 4950935
2439D950935M6190N71626L05799J04508P3569j25333M30650J66942k34329K37146
$$ 4950935 4997125 5568751 5874550 5979058 6052627 5927294 6357944 6524886 6290557 6527703
2429F527703j15394N40908J84793k01290l06797N37081O66556J8573K87338j68739
$$ 6527703 6412309 6953217 7138010 6936720 6629923 7167004 7833560 7852133 8139471 7970732
2419G970732L02670K80531N65192r2874O2673M88061j47617K88738j06767M30914
$$ 7970732 8273402 8553933 9119125 9026251 9088924 9576985 9429368 9718106 9611339 10042253
2409A0042253J03822O72905K4247R04852N65401N15067N85477N23998K71468M39472
$$ 10042253 10146075 10818980 10843227 11748079 12313480 12828547 13414024 13938022 14209490 14648962
2399A4648962P75387R69022N61028M05895O09050P47210R12143N76676O24146
$$ 14648962 15424349 16393371 16954399 17360294 17969344 18716554 19628697 20205373 20829519
2390B0829519R70912P69692O03482Q72030Q15315R79687P01691O47905J78007
$$ 20829519 21800431 22570123 23173605 24045635 24860950 25840637 26542328 27190233 27368240
2381B7368240J023733J335155J659966K147508K221798L129820L495771L247439
$$ 27368240 28391973 29727128 31387094 33534602 35756400 38886220 42381991 45629430
2373D5629430J987969J449429K278467L351616M477999N970597Q317163J0853388
$$ 45629430 47617399 49066828 51345295 54696911 59174910 65145507 73462670 84316058
2365H4316058J4368878J9222238K6506088L3244422M4335220N9276607N4962035
$$ 84316058 98684936 117907174 144413262 177657684 221992904 281269511 336231546
2358C36231546j2841486n8673732n5243356m8031656l4365591k2556104j6580793
$$ 336231546 323390060 264716328 209472972 161441316 127075725 104519621 87938828
2351H7938828j2860209q737558p281744n681380m577800k810424k420249k150896
$$ 87938828 75078619 66341061 59059317 53377937 48800137 45989713 43569464 41418568
2343D1418568k728065l427762l301993k527267k102095j600005j329157j514548
$$ 41418568 38690503 35262741 31960748 29433481 27331386 25731381 24402224 22887676
2335B2887676j916301j788666j566957j376606q47277p04824m47036n42249j001035
$$ 22887676 20971375 19182709 17615752 16239146 15391869 14687045 14240009 13697760 12696725
2326A2696725m82261m44608m66969n83063m16372m71309m19542j87324l44007
$$ 12696725 12214464 11769856 11302887 10719824 10303452 9832143 9412601 9225277 8881270
2317H881270n66576m24445j04994j66806n86653j4598J66704n57808j91796j88679
$$ 8881270 8314694 7890249 7785255 7618449 7031796 7017198 7183902 6626094 6434298 6245619
2307F245619n30114O7637l28563K65993l83496p42560m36746J9663k23149j32043
$$ 6245619 5715505 5783142 5454579 5720572 5337076 4594516 4157770 4177433 3954284 3822241
2297C822241k25653j00743k74193k464K35281r6181l19938J05242J10721J98313
$$ 3822241 3596588 3495845 3221652 3219188 3454469 3358288 3038350 3143592 3254313 3452626
2287C452626m32090k40456k42816K83700m5129m54873j01419j61657o4119N7450
$$ 3452626 3020536 2780080 2537264 2820964 2775835 2320962 2219543 2057886 1993767 2051217
2277B051217j3787J85522m77781K4743l30098j23857M33294j76796N9889K00233
$$ 2051217 2037430 2222952 1745171 1769914 1439816 1315959 1749253 1572457 1632346 1832579
2267A832579j98253O3282K79684m90495n13998K42645l03109l13747M20672R4352
$$ 1832579 1634326 1697608 1977292 1486797 972799 1215444 912335 598588 1019260 1113612
2257A113612j282n06888L42258j90940N3803L50512P8981j45693K27601M65197
$$ 1113612 1112330 605442 947700 756760 810563 1161075 1240056 1094363 1321964 1787161
2247A787161j55769l27867L4112p2351j78246J62535P4689j32687j58031m2613
$$ 1787161 1631392 1303525 1337637 1265286 1087040 1249575 1324264 1191577 1033546 990933
2237I90933k43508J05786q6484j74607K23301k61777M05722m6239l24792K52451
$$ 990933 747425 853211 766727 592120 815421 553644 959366 913127 588335 840786
2227H40786N5297k44287k05300N14560M24953n52793k18258q8631n08785L22943
$$ 840786 896083 651796 446496 961056 1386009 833216 614958 526327 17542 340485
2217C40485M07044M7687o2316P2113n1082k32617j3902R5068m2561j04182M72281
$$ 340485 747529 795216 732900 805013 753931 521314 507412 602480 559919 455737 928018
2206I28018l68235l36048K84525k66767p7139m0036q9554k2299j10082j04623
$$ 928018 559783 223735 508260 241493 164354 124318 34764 12465 -97617 -202240
2196b02240J89509j75216L11530p0025p55596J54174N33044q4158N66006L41607
$$ -202240 -12731 -187947 123583 53558 -702038 -547864 -14820 -98978 467028 808635
2186H08635p91073J8741q63j24462k06971K42996J27837O509j27672M3850K80507
$$ 808635 17562 36303 35440 -89022 -295993 -52997 74840 81349 -46323 -2473 278034
2175B78034J28352k56696j33029J77172l08567l13604J41210l1475J91716J90067
$$ 278034 406386 149690 16661 193833 -114734 -428338 -287128 -318603 -126887 63180
2165F3180K72092l06471N7193L37750n17650J50894L20114l90307J4335l42963
$$ 63180 335272 28801 85994 423744 -93906 56988 377102 -13205 1130 -341833
2155c41833j1396j1366K10071n9359N2860J35436j26276j21799K84274J54665
$$ -341833 -353229 -364595 -154524 -213883 -161023 -25587 -151863 -273662 10612 165277
2145A65277k59035K46645j66163K63208j17037p2380L88366p6573l77774n0775
$$ 165277 -93758 152887 -13276 249932 132895 60515 448881 372308 -5466 -56241
2135e6241j21376J38877J41268k27888N2883j3587M69304J63672j26725l1352
$$ -56241 -177617 -38740 102528 -125360 -72477 -86064 383240 546912 420187 388835
2125C88835l05438J29717J54523m37498j58127j4570L51260N7481J38957l2186
$$ 388835 83397 213114 367637 -69861 -227988 -242558 108702 166183 305140 272954
2115B72954q4207K422M2601L39408j84852m1236m53662p0476N34520k1357j95439
$$ 272954 188747 191169 233770 573178 388326 347090 -106572 -177048 357472 336115 140676
2104A40676n9497K96269j1948k42757L43190p9049L9163J93994j42546R4286L50684
$$ 140676 81179 377448 365500 122743 465933 386884 426047 620041 477495 571781 922465
2093I22465j07663K25794J34566K45022J26636k19613k89825o68861J58070J56942
$$ 922465 814802 1040596 1175162 1420184 1546820 1327207 1037382 368521 526591 683533
2083F83533m53953k08142j08834L68816K58915l70802m08026M00403j52803M96962
$$ 683533 229580 21438 -87396 281420 540335 169533 -238493 161910 9107 506069
2073E06069l82480p8256l68392M32430O3274m67246n5646L50081j37303J53453
$$ 506069 123589 45333 -323059 109371 172645 -294601 -350247 -166 -137469 15984
2063A5984j19142p6375o4729P7773J2092k08842L1980R6999j56845K2375J76111
$$ 15984 -103158 -179533 -244262 -166489 -154397 -363239 -331259 -234260 -391105 -368730 -192619
2052a92619j38373J09386J80609j6678l26915K71859N3140L28661j02621q2210
$$ -192619 -330992 -221606 -40997 -57675 -384590 -112731 -59591 269070 166449 84239
2042H4239l07419L9912k47341K02802K61575j43911K2673K68721n64666M7720
$$ 84239 -223180 -183268 -430609 -227807 33768 -110143 -87470 181251 -383415 -335695
2032c35695L5959l6813j41870O1195q7802J02999O9856o8188j1694Q5201j47541
$$ -335695 -299736 -336549 -478419 -417224 -505026 -402027 -332171 -400359 -412053 -326852 -474393
2021d74393j74167K82691J16081k78645P4030J23811k20224q1033K53202o3998
$$ -474393 -648560 -365869 -249788 -528433 -454403 -330592 -550816 -631849 -378647 -442645
2011d42645K08740m23365J01338N4898m02507J01025J38138q8974M49403K30298
$$ -442645 -233905 -657270 -555932 -501034 -903541 -802516 -664378 -753352 -303949 -73651
2001g3651k62143K41324j60522j48529k14365N29524M22008R0882l68353J57857
$$ -73651 -335794 -94470 -254992 -403521 -617886 -88362 333646 424528 56175 214032
1991B14032J25227k35081l8352n91556M1634k7304L39918M1862m8215j14701j78877
$$ 214032 339259 104178 65826 -525730 -484096 -511400 -171482 -129620 -177835 -292536 -471413
1980d71413j84252L0804M06338p7604k2709O2813j13258K20753M9813j31381Q9973
$$ -471413 -655665 -624861 -218523 -296127 -318836 -256023 -369281 -148528 -98715 -230096 -140123
1969a40123j51093j12533k01051k00991M24126M09974m11291l4147K13297k47091
$$ -140123 -291216 -403749 -604800 -805791 -381665 28309 -382982 -417129 -203832 -450923
1959d50923p403M50217j72051l69208m7826O67446k70851O6195R1949k6814J20805
$$ -450923 -458326 -8109 -180160 -549368 -597194 70252 -200599 -134404 -42455 -69269 51536
1948E1536J4678J13321R2091l4528m66924N9504m37529k13953j57196J84354J017949
$$ 51536 66214 179535 271626 237098 -229826 -170322 -607851 -821804 -979000 -794646 223303
1937B23303p4337n29410J88104J34367m6030J53763j16757k83945m74033j82936
$$ 223303 148966 -380444 -192340 -57973 -104003 49760 -66997 -350942 -824975 -1007911
1927a007911M68764K39828J36944M320J19565o402j57106J57903p5129K11022
$$ -1007911 -539147 -299319 -162375 -158055 -38490 -44892 -201998 -44095 -119224 91798
1917I1798k9602M08970J06719n27278k46880P8357p7642n25945K98645N36750
$$ 91798 62196 471166 577885 50607 -196273 -117916 -195558 -721503 -422858 113892
1907A13892J32810R4825j58608J85m16235j37012J97679j95850k55448O386j91779
$$ 113892 246702 341527 182919 183104 -233131 -370143 -172464 -368314 -623762 -617376 -809155
1896h09155J87912N02810L4935j85863L7577J26734r6454J73528L12213n26927
$$ -809155 -621243 -118433 -83498 -269361 -231784 -105050 -201504 -27976 284237 -242690
1886b42690q6701j81210K80702L73432k81335l46796N3360J25471L7030P7985
$$ -242690 -329391 -510601 -229899 143533 -137802 -484598 -431238 -305767 -268737 -190752
1876a90752K92775J60018l7902j23336Q3224n3781k73990K4519J53957m4440l13972
$$ -190752 102023 262041 224139 100803 184027 130246 -143744 -119225 34732 -9708 -323680
1865c23680J97864J24887k10452k031N3751j43814J65651K48911P5077M5801k13411
$$ -323680 -125816 -929 -211381 -213412 -159661 -303475 -137824 111087 186164 231965 18554
1854A8554j70704M40639J30631R069l41433q4092L06485o91171j5782M32501l33286
$$ 18554 -152150 288489 419120 428189 86756 2664 309149 -382022 -397804 34697 -298589
1843b98589L7936J02827L27793l8263k9222o32160J67954O10230n07781j71774
$$ -298589 -260653 -157826 169967 131704 102482 -529678 -361724 248506 -259275 -431049
1833d31049L80984Q0415n34957l58393M68998N65113J44370K6549l74265k90261
$$ -431049 -50065 30350 -504607 -863000 -394002 171111 315481 342030 -32235 -322496
1823c22496j59686J29715O20705k14104k76155O7985K52712j42995l22254k1760
$$ -322496 -482182 -352467 268238 54134 -222021 -154036 98676 -44319 -366573 -388333
1813c88333N17520J0480J46028k87593k79033j1587R9277j68554K31289k62963
$$ -388333 129187 139667 285695 -1898 -280931 -292518 -193241 -361795 -130506 -393469
1803c93469o6341J41309K43439j53912P6258M5129K05195k2883L97958k89458
$$ -393469 -459810 -318501 -75062 -228974 -152716 -107587 97608 74725 472683 183225
1793A83225k73326J590J02502k76818j29655J36066K58149j73285j43476K77507
$$ 183225 -90101 -88511 13991 -262827 -392482 -256416 1733 -171552 -315028 -37521
1783c7521p3545j62445n3926N84386K1112L22965l86726k7108j3539k65186j0656
$$ -37521 -111066 -273511 -327437 256949 278061 601026 214300 187192 173653 -91533 -102189
1772a02189J44579j85704J19752L95291r3844m34926o9060r018J77158m67218
$$ -102189 42390 -143314 -23562 371729 277885 -157041 -226101 -235119 -57961 -525179
1762e25179k25729k76204N57009Q6157M48449k45006J97910j95483O6453K00003
$$ -525179 -750908 -1027112 -470103 -383946 64503 -180503 17407 -178076 -111623 88380
1752H8380K19598m74744j55420J53483L20972r8517l0243K52524j38249k81746
$$ 88380 307978 -166766 -322186 -168703 152269 53752 23509 276033 137784 -143962
1742a43962L34469L2101j23756K43500o6866R3632m63962P625l23627j12289O98388
$$ -143962 190507 222608 98852 342352 275486 369118 -94844 -87219 -410846 -523135 175253
1731A75253k31024m41931J61881m1716K01735N72685l9237o68355j67822K13959
$$ 175253 -55771 -497702 -335821 -377537 -175802 396883 357646 -310709 -478531 -264572
1721b64572J80515N6518l41364J37051l3666L3058N1076J19833J66967k44947
$$ -264572 -84057 -27539 -368903 -231852 -265518 -232460 -181384 -61551 105416 -139531
1711a39531P8300n7050j10566R0243j37270J61348M13072l38314n5028m1358K3259
$$ -139531 -61231 -118281 -228847 -138604 -275874 -114526 298546 -39768 -94796 -136154 -112895
1700a12895l70805P6668j82658N32215j52816J94095j05160j64046J61160p2931
$$ -112895 -483700 -407032 -589690 -57475 -210291 -16196 -121356 -285402 -124242 -197173
1690a97173j69338P7229K11812r2064L4342L44460l38669k72651M1141p0825R1636
$$ -197173 -366511 -289282 -77470 -169534 -135192 209268 -129401 -402052 -360911 -431736 -340100
1679c40100J13134R7302k07082J51540j48061L97208j48884k01375m1161j8997
$$ -340100 -226966 -129664 -336746 -185206 -333267 63941 -84943 -286318 -327479 -346476
1669c46476J34510J35440m8757j90386l51288K87334p4236N8455j41772q7866
$$ -346476 -211966 -76526 -125283 -315669 -666957 -379623 -453859 -395404 -537176 -625042
1659f25042K17930J54587P2981l52786k4935N1717R9816N531K91402O0472M6645
$$ -625042 -407112 -252525 -179544 -532330 -557265 -505548 -405732 -400201 -108799 -48327 -1682
1648a682j92958K53429l649J02699j39454m90885K6637M68377k52641J53399o1994
$$ -1682 -194640 58789 55140 157839 18385 -472500 -445863 22514 -230127 -76728 -138722
1637a38722k72496J58665j84166k08062J47714R2381K15963L31825k45515o0090
$$ -138722 -411218 -252553 -436719 -644781 -497067 -404686 -188723 143102 -102413 -162503
1627a62503K23497m96625K24377J40745J00368n3817L24574j51887J11642r1815
$$ -162503 60994 -435631 -211254 -70509 29859 -23958 300616 148729 260371 168556
1617A68556k14329J92637N318J29891l67272k76249K76168K66862o7788q0332
$$ 168556 -45773 146864 152182 282073 -85199 -361448 -85280 181582 113794 33462
1607C3462l20481J60641K36343j82667k08039n9789L50987J3726r429J72879j36252
$$ 33462 -287019 -126378 109965 -72702 -280741 -340530 10457 24183 14754 187633 51381
1596E1381n08638q4220L04119l91365q0218L45595J44333l3597j21337j07334
$$ 51381 -457257 -541477 -237358 -628723 -708941 -363346 -219013 -252610 -373947 -481281
1586d81281J00795k23724J68314j44558J4731L78166J58471j03579N8563R5183
$$ -481281 -380486 -604210 -435896 -580454 -565723 -187557 -29086 -132665 -74102 21081
1576B1081J59145k18155K74735k35688q580n64233M62432M18574j35821m87220
$$ 21081 180226 -37929 236806 1118 -7462 -571695 -109263 309311 173490 -313730
1566c13730k16793J02655J65104L27022k90476K2071K31134l74419j79089k75521
$$ -313730 -530523 -427868 -262764 64258 -226218 -204147 26987 -347432 -526521 -802042
1556h02042K25378L42928J22889L80677j90575m28035m789M10123R2925K92826
$$ -802042 -576664 -233736 -110847 269830 79255 -348780 -353569 56554 149479 442305
1546D42305M6644Q4749k09480l45088r7737J48719J06535j91863k14977L20715
$$ 442305 488949 573698 364218 19130 -78607 70112 176647 -15216 -230193 90522
1536I0522Q2058M5055l35273k01158l7301p2418j70791o0447N22022J5416J28982
$$ 90522 172580 217635 -117638 -318796 -356097 -428515 -599306 -659753 -137731 -122315 6667
1525F667l14817L07033J48634J16453n1436m22115k22670J09974L38591J14504
$$ 6667 -308150 -1117 147517 263970 212534 -209581 -432251 -322277 16314 130818
1515A30818m92558j78485P36158O52226n38070k87571J55043n09939L13483J16075
$$ 130818 -361740 -540225 195933 848159 310089 22518 177561 -332378 -18895 97180
1505I7180R6648l2002j88049j81382K59860m66988J19705K59159J43955r7823
$$ 97180 193828 161826 -26223 -207605 52255 -414733 -295028 -35869 108086 10263
1495A0263P7127O3043j69641K06553R2566m58678R3493l1501r8863K6004j21356
$$ 10263 87390 150433 -19208 187345 279911 -178767 -85274 -116775 -215638 -189634 -310990
1484c10990K34097J83463q0938J21223k73844K38400p688k86041M1597J9099K0579
$$ -310990 -76893 106570 25632 146855 -126989 111411 103723 -182318 -140721 -121622 -101043
1473a01043j11394K47729j81804J24188m85013L98918O956J49359j68040j13930
$$ -101043 -212437 35292 -146512 -22324 -507337 -108419 -101463 47896 -120144 -234074
1463b34074J63255k5712j09964l53584J48293J7786K06932K47366j97945k36463
$$ -234074 -70819 -96531 -206495 -560079 -411786 -394000 -187068 60298 -137647 -374110
1453c74110L73891j20491N137m9505n6111K45991j82945K16460L93412l03308
$$ -374110 -219 -120710 -115573 -165078 -221189 24802 -158143 58317 451729 148421
1443A48421J21204l0146j23292l97971j3627L61012M589l4843j44724J26113j43832
$$ 148421 269625 239479 116187 -281784 -295411 65601 70190 35347 -109377 16736 -127096
1432a27096k5396j63673K18993l23834P3690K87185j69668n3029K73177K44901
$$ -127096 -152492 -316165 -97172 -421006 -347316 -60131 -229799 -282828 -9651 235250
1422B35250l27373j32754J67134O4860J15807M0962J45637l61522n38857K56200
$$ 235250 -92123 -224877 -57743 7117 122924 163886 309523 -51999 -590856 -334656
1412c34656K07609J7780l23078q1455l5226K70644J91585L21198k85426Q675J13898
$$ -334656 -127047 -109267 -432345 -513800 -549026 -278382 -86797 234401 -51025 -42350 71548
1401G1548r5940N9660M6367k13857k89209k34246J66247N1375R861K76059M7659
$$ 71548 -24392 35268 81635 -132222 -421431 -655677 -489430 -438055 -428194 -152135 -104476
1390a04476J18195j25063J88230o6751q0046M32758m07107j6829j31502k12250
$$ -104476 13719 -111344 76886 10135 -69911 362847 -44260 -61089 -192591 -404841
1380d04841J81743J95298K47138k57589m8174J59667l7514k09201n11531j78280
$$ -404841 -223098 -27800 219338 -38251 -86425 73242 35728 -173473 -685004 -863284
1370h63284M20807K61672r749Q6441p9932j20403M84202m19566m10310L80901
$$ -863284 -442477 -180805 -190554 -104113 -184045 -304448 179754 -239812 -650122 -269221
1360b69221J94015O8616k97482L09867K86688j09470P4296K31464l83157m12380
$$ -269221 -75206 -6590 -304072 5795 292483 183013 257309 488773 105616 -306764
1350c06764k5074J23342L40303j91257L26024M4215J6649j37045k33128j78575
$$ -306764 -331838 -208496 131807 -59450 266574 310789 327438 190393 -42735 -221310
1340b21310q9211N25890K95383j05154k97927j63561K83678l0407n86015K13517
$$ -221310 -310521 215369 510752 405598 107671 -55890 227788 197381 -388634 -175117
1330a75117P44722k37772m95511K06436r0031j38975J42936j05638Q5567j69841
$$ -175117 569605 331833 -163678 42758 -47273 -186248 -43312 -148950 -63383 -233224
1320b33224j95883o5632P3803K791J70309K59586N3519O8553l76968l09712p7625
$$ -233224 -429107 -494739 -420936 -418145 -247836 11750 65269 133822 -243146 -552858 -630483
1309f30483J65854L78944J03151l62869k38558K71249L64381Q7601n3515r3094
$$ -630483 -464629 -85685 17466 -345403 -583961 -312712 51669 139270 85755 -7339
1299g339l77001J59783j1879M26382N7883l01977m13350Q8678j04583J86069K01459
$$ -7339 -384340 -224557 -236436 189946 247829 -54148 -467498 -378820 -483403 -297334 -95875
1288i5875K5580N6211p3845P7572k67084k27730N6454R976K63789k91683N1862
$$ -95875 -70295 -14084 -87929 -10357 -277441 -505171 -448717 -438741 -174952 -466635 -414773
1277d14773L37923j33614J98201j80349R3201N5573m02528N3358K33297o3612
$$ -414773 -76850 -210464 -12263 -192612 -99411 -43838 -446366 -393008 -159711 -223323
1267b23323O1070p8647P006N55264k63923k77682M13519J24927r4253J5585J26476
$$ -223323 -162253 -240900 -233894 321370 57447 -220235 193284 318211 223958 239543 366019
1256C66019n42515O3967J30559Q726j57571l09939R103M2789L28164p0315J41436
$$ 366019 -176496 -112529 18030 26756 -130815 -440754 -431651 -388862 -60698 -131013 10423
1245A0423j19582K68755J66194j50214l36989J14592L58255n12702K06959J21813
$$ 10423 -109159 159596 325790 175576 -161413 -46821 311434 -201268 5691 127504
1235A27504j82703P5102K36472m07919J94049L14151m48981R95j26241l9212M81892
$$ 127504 -55199 19903 256375 -151544 42505 356656 -92325 -91330 -217571 -256783 225109
1224B25109k52169J28588l91971Q3316L91985l12264J659J24769J45571K1102
$$ 225109 -27060 101528 -290443 -207127 184858 -127406 -125747 -978 144593 165695
1214A65695j84787k2060j01238N7917m57667J56945L13375L10569j30282J70949
$$ 165695 -19092 -41152 -142390 -84473 -542140 -385195 -71820 238749 108467 279416
1204B79416k47432l22366r7413J17980j65597l5293j55073Q2365N7879L8333j70452
$$ 279416 31984 -290382 -387795 -269815 -435412 -470705 -625778 -543413 -485534 -447201 -617653
1193f17653J61302K63303J61165J78584n05561L6721M03424j30868N4729j9025
$$ -617653 -456351 -193048 -31883 146701 -358860 -322139 81285 -49583 5146 -13879
1183a3879j05242K0171k86691M19914K91359M4233n35488k61332J78920K33756
$$ -13879 -119121 -98950 -385641 34273 325632 369865 -165623 -426955 -248035 -14279
1173a4279J87663k90931K88712j21511p99428M42814j90815j76172J80599N54660
$$ -14279 173384 -117547 171165 49654 -749774 -306960 -497775 -673947 -493348 61312
1163F1312j81438k56854K6113N72916p892m20698L27047M08037k50345K79396
$$ 61312 -120126 -376980 -350867 222049 214157 -206541 120506 528543 278198 557594
1153E57594j38941m86444m4812M86172j40696l22780k11745K49361L68675L3792
$$ 557594 418653 -67791 -112603 373569 232873 -89907 -301652 -52291 316384 350176
1143C50176l13097k22763j37392k17751M60083j09660J16588L15336l365J31261
$$ 350176 37079 -185684 -323076 -540827 -80744 -190404 -73816 241520 238155 369416
1133C69416Q2483j86270k54813k38476Q5415k1483M7865m1821K96714K00964l66662
$$ 369416 451899 265629 10816 -227660 -142245 -163728 -115863 -157684 139030 339994 -26668
1122b6668k40126K9795L28064J52363J9459R2910l48889P7123J86730l17483j1105
$$ -26668 -266794 -236999 91065 243428 262887 355797 6908 84031 270761 -46722 -57827
1111e7827o5017k00720K02574J52832Q0370j73039M19048j77671k09432j36216
$$ -57827 -122844 -323564 -120990 31842 112212 -60827 358221 180550 -28882 -165098
1101a65098m57083L43470M34707r5277m0143J41464j79614J63550p8615N8994
$$ -165098 -622181 -278711 155996 60719 20576 162040 -17574 145976 67361 126355
1091A26355k98476N483q17j01379L0766l75764Q1913J54463j72589K88485L60373
$$ 126355 -172121 -166638 -167455 -268834 -238068 -613832 -531919 -377456 -550045 -261560 98813
1080I8813k23990k37760N7642k40378L08195K62341k43605o8240M01639L33007
$$ 98813 -125177 -362937 -305295 -545673 -237478 24863 -218742 -286982 114657 447664
1070D47664O7927n17613r1433j35233k14986J72024P696O7378k22921K94252J13343
$$ 447664 515591 -2022 -93455 -228688 -443674 -271650 -263954 -196576 -419497 -125245 -11902
1059a1902N814L33903L7997k67963m9714k87938j25340Q6896K05700R3785p8364
$$ -11902 -6088 327815 365812 97849 48135 -239803 -365143 -278247 -72547 21238 -57126
1048e7126J21053k38097j30026O7229q7909l09911J44355L96427k55636l46261
$$ -57126 63927 -174170 -304196 -236967 -324876 -634787 -490432 -94005 -349641 -695902
1038f95902J33653O13295J28868j00102k73940K01386K23668k61434J08718n6251
$$ -695902 -562249 51046 179914 79812 -194128 7258 230926 -30508 78210 21959
1028B1959p0303Q9873n41585j13955L56730L30290j94344l606M23999k14121k00827
$$ 21959 -48344 41529 -500056 -614011 -257281 73009 -121335 -124941 299058 84937 -115890
1017a15890l43122K27783N28006K82219j28166j71992N0248n14612N835J95907
$$ -115890 -459012 -231229 296777 578996 450830 278838 329086 -185526 -179691 16216
1007A6216k20393j6200p3577k8076M64798M28333m09620j63256J08423J6789j49292
$$ 16216 -204177 -220377 -293954 -322030 142768 571101 161481 -1775 106648 123437 -25855
996b5855j90600n5068J97973J58846p0271J24401K63383K89383n96824l32658
$$ -25855 -216455 -271523 -73550 85296 15025 139426 402809 692192 95368 -237290
986b37290N227M78027n1487l36670K48612R5344J57705o72612Q7312M10654J8573
$$ -237290 -232063 245964 194477 -142193 106419 201763 359468 -313144 -225832 184822 203395
975B03395n9611L9931l44112O2200K86428j47098K04575k65626L57164l27127
$$ 203395 143784 183715 -160397 -98197 188231 41133 245708 -19918 337246 10119
965A0119j91633n0721K09509r2826J22225j00347j91493j82068K60523K70065
$$ 10119 -181514 -232235 -22726 -115552 6673 -93674 -285167 -467235 -206712 63353
955F3353o8952M3638r1594J35217M50305o55902k31468K34857R319M55455K52817
$$ 63353 -5599 38039 -53555 81662 531967 -123935 -355403 -120546 -111227 344228 597045
944E97045j95755l04568j62684j37651K87586k12222K32024l5125J75275l03245
$$ 597045 401290 96722 -65962 -203613 83973 -128249 103775 68650 243925 -59320
934e9320J50300K87000P7228k81552r1064J0003K38082l3487k30358N1393m00484
$$ -59320 90980 377980 455208 173656 82592 92595 330677 297190 66832 118225 -282259
923b82259K1603J34312J1324L70163J42003R332j98283l32289P4524K53507k59286
$$ -282259 -260656 -126344 -115020 255143 397146 406478 208195 -124094 -49570 203937 -55349
912e5349j85602M54572j57169J80869j44417K12070j14801j40947L90934r5840
$$ -55349 -240951 213621 56452 237321 92904 304974 190173 49226 440160 344320
902C44320o4729l78880j2078L11126J03308j11738J0307m24171l269m8717m29897
$$ 344320 279591 -99289 -111367 199759 303067 191329 201636 -222535 -225804 -274521 -704418
891g04418M20986M41929R7757p217l27402j40242k130k08218o3248L28170J61838
$$ -704418 -283432 158497 256254 249037 -78365 -218607 -220737 -428955 -492203 -164033 -2195
880b195K0986n6985p5878M2691k72676M55419P53383k08336k22047m73926j78136
$$ -2195 18791 -38194 -114072 -71381 -344057 111362 864745 656409 434362 -39564 -217700
869b17700l7909j97114J41636K73866n80651j21568M72920K32873J19499K38671
$$ -217700 -255609 -452723 -311087 -37221 -617872 -739440 -266520 -33647 85852 324523
859C24523k35451j34140J14099j47499j75941K84483J76421N8838j42090l87019
$$ 324523 89072 -45068 69031 -78468 -254409 30074 206495 265333 123243 -263776
849b63776j13350R3946J20374M84927Q3677o11496o8835K48174k307M15594O7604
$$ -263776 -377126 -283180 -162806 322121 405798 -205698 -274533 -26359 -28666 386928 454532
838D54532o56104k50700Q8093R4102l7897J62320k56821K1554r6216L08046J33349
$$ 454532 -201572 -452272 -364179 -270077 -307974 -145654 -402475 -380921 -477137 -169091 -35742
827c5742j2095M0140l39851J40942K1772J1494k52068J95090K09116J67840K56745
$$ -35742 -47837 -7697 -347548 -206606 -184834 -173340 -425408 -230318 -21202 146638 403383
816D03383o4128L18694k73940l45297J50201J09074k22206L019L60226l76260
$$ 403383 339255 657949 384009 38712 188913 297987 75781 78800 439026 62766
806F2766k25424k44684j28802Q08686K52098l4468l04775j62852j54392J56584
$$ 62766 -162658 -407342 -536144 272542 524640 490172 185397 22545 -131847 24737
796B4737J55293k25304K17747j3270j89569L73443o2480j89504J1731j12077j07309
$$ 24737 180030 -45274 172473 159203 -30366 343077 280597 91093 102824 -9253 -116562
785a16562M27888J37655k41281k8772k43234l0073N6962j32743M84879J33033
$$ -116562 311326 448981 207700 178928 -64306 -94379 -37417 -170160 314719 447752
775D47752k38694j3550k8415l19692q7388j13493o0821L72836J1650j30267J99383
$$ 447752 209058 195508 167093 -152599 -239987 -353480 -414301 -41465 -29815 -160082 39301
764C9301J52870Q4064o9460k10500J21941r8823R288K59131k19833q29061L02373
$$ 39301 192171 276235 206775 -3725 118216 19393 28681 287812 67979 -761082 -458709
753d58709K63360l02965L10560l13457K12996R2378J83617J17261P7650J7620
$$ -458709 -195349 -498314 -187754 -501211 -288215 -195837 -12220 105041 182691 200311
743B00311M2808k24641m79824K84918j5205J40834K34047L2537j94421K6011L74745
$$ 200311 243119 18478 -461346 -176428 -191633 -50799 183248 215785 21364 47375 422120
732D22120K0357j78628k510m51721m8573O53840l49784J36068j21067l7547M689
$$ 422120 442477 263849 261339 -190382 -238955 414885 65101 201169 80102 42555 47244
721D7244m66852m65600K96699P27898n05674K36808J4483M95907J10661j56044
$$ 47244 -419608 -885208 -588509 139389 -366285 -129477 -114994 380913 491574 335530
711C35530m52389k56856L74439L22688N3678n64680M14421j4193J47539j06534
$$ 335530 -116859 -373715 724 323412 377090 -187590 226831 212638 360177 253643
701B53643q0498R6567j51222J20392J05835n8519P1487o5046k01175K18291K48452
$$ 253643 173145 269712 118490 238882 344717 286198 357685 292639 91464 309755 558207
690E58207j44061k72687j14431k49894K26625K09826L17437k42686k43501J33046
$$ 558207 414146 141459 27028 -222866 3759 213585 531022 288336 44835 177881
680A77881J81229K00268j84292l45877L65156l44417l32201K68383M78482K48025
$$ 177881 359110 559378 375086 29209 394365 49948 -282253 -13870 464612 712637
670G12637n53859p3056M2576m30991K31418L29289j17825K537K81772J82203k96334
$$ 712637 158778 85722 128298 -302693 -71275 258014 140189 142726 424498 606701 310367
$$ [...]
##END NTUPLES=NMR SPECTRUM
##END=
