##TITLE=1H_CG-1182-1
 DMSO
 8 sc, 
 26.12.2023
##JCAMPDX= 6.0         $$ Bruker NMR JCAMP-DX V2.0
##DATA TYPE= NMR SPECTRUM
##DATA CLASS= NTUPLES
##ORIGIN= UXNMR, Bruker Analytische Messtechnik GmbH
##OWNER= root
$$ XWIN-NMR		Version 3.5
$$ Tue Dec 26 14:19:14 2023 Russian Standard Time (UT+4h)  she@DPX200
##.OBSERVE FREQUENCY= 200.1313
##.OBSERVE NUCLEUS= ^1H
##.ACQUISITION MODE= SIMULTANEOUS
##.ACQUISITION SCHEME= undefined
##.AVERAGES= 8
##.DIGITISER RES= 18
##SPECTROMETER/DATA SYSTEM= spect
##.PULSE SEQUENCE= zg30
##.SOLVENT NAME= DMSO
##.SHIFT REFERENCE= (INTERNAL, DMSO, 0, 15.499)
##AUDIT TRAIL= $$ (NUMBER, WHEN, WHO, WHERE, WHAT)
$$ ##TITLE= Audit trail, XWIN-NMR		Version 3.5
$$ ##JCAMPDX= 5.01
$$ ##ORIGIN= Bruker BioSpin GmbH
$$ ##OWNER= she
$$ F:/spectra/data/she/nmr/H-F/1/pdata/1/auditp.txt
$$ ##AUDIT TRAIL=  $$ (NUMBER, WHEN, WHO, WHERE, WHAT)
(   1,<2023-12-26 14:18:01.50 +0400>,<she>,<DPX200>,
      <created by zg, POWCHK disabled, PULCHK disabled
       configuration hash MD5:
       00 E9 B6 7A A2 85 ED C7 34 08 36 98 17 FE 4E 26
       data hash MD5: 16K
       D8 C6 BA 77 5E 6A F8 95 B8 82 C4 BC AE 72 F7 1B>)
(   2,<2023-12-26 14:18:05.10 +0400>,<she>,<DPX200>,
      <Start of raw data processing
       efp BC_mod = 2 LB = 0.24 FT_mod = 6 PKNL = 1 PHC0 = -24596.37 PHC1 = 10.05273 SI = 16K 
       data hash MD5: 16K
       82 F1 BB 8F 33 5C 3C D7 85 9D 39 BD 16 78 79 7C>)
(   3,<2023-12-26 14:18:20.57 +0400>,<she>,<DPX200>,
      <pk PHC0 = -1.220114 PHC1 = 2 
       data hash MD5: 16K
       54 00 86 A3 D8 12 AE 35 1A 32 51 57 63 EA 3A 1C>)
(   4,<2023-12-26 14:18:23.29 +0400>,<she>,<DPX200>,
      <abs ABSG = 5 
       data hash MD5: 16K
       AB A5 B2 00 FD 8F AE 4F 35 4B 66 8A EF 06 D2 7A>)
$$ ##END=
$$ 
$$ hash MD5
$$ 89 F9 F6 C3 98 85 DE 31 E0 C9 26 EF D6 7A E5 03
##$RELAX= 
##$RELAX= 
##$RELAX= 
##$RELAX= 
##$RELAX= 
##$RELAX= 
$$ Bruker specific parameters
$$ --------------------------
##$DU= <F:/spectra>
##$EXPNO= 1
##$NAME= <H-F>
##$PROCNO= 1
##$TYPE= <nmr>
##$USER= <she>
##$AMP= (0..31)
100 100 100 100 100 100 100 100 100 100 100 100 100 100 100 100 100 100 
100 100 100 100 100 100 100 100 100 100 100 100 100 100 
##$AQSEQ= 0
##$AQ_mod= 1
##$AUNM= <au_zg>
##$AUTOPOS= <>
##$BF1= 200.13
##$BF2= 200.13
##$BF3= 200.13
##$BF4= 200.13
##$BF5= 200.13
##$BF6= 200.13
##$BF7= 200.13
##$BF8= 200.13
##$BYTORDA= 1
##$CFDGTYP= 0
##$CFRGTYP= 5
##$CHEMSTR= <none>
##$CNST= (0..31)
1 1 145 1 1 1 1 1 1 1 1 1 1 1 1 1 1 1 1 1 1 1 1 1 1 1 1 1 1 1 1 1 
##$CPDPRG= <>
##$CPDPRG1= <>
##$CPDPRG2= <>
##$CPDPRG3= <>
##$CPDPRG4= <mlev>
##$CPDPRG5= <mlev>
##$CPDPRG6= <mlev>
##$CPDPRG7= <mlev>
##$CPDPRG8= <mlev>
##$CPDPRGB= <>
##$CPDPRGT= <>
##$D= (0..31)
0 1.2 0 0 0 0 0 0 0 0.06 0 0.03 0 0 0 0 0.0002 0 0 0 0 0 0 0 0 0 0 0 0 
0 0 0 
##$DATE= 1703585880
##$DBL= (0..7)
120 120 120 120 120 120 120 120 
##$DBP= (0..7)
150 150 150 150 150 150 150 150 
##$DBP07= 0
##$DBPNAM0= <>
##$DBPNAM1= <>
##$DBPNAM2= <>
##$DBPNAM3= <>
##$DBPNAM4= <>
##$DBPNAM5= <>
$$ [...]
##$SUBNAM3= <"">
##$SUBNAM4= <"">
##$SUBNAM5= <"">
##$SUBNAM6= <"">
##$SUBNAM7= <"">
##$SUBNAM8= <"">
##$SUBNAM9= <"">
##$SW= 18.0517328524113
##$SWIBOX= (0..15)
0 0 2 0 0 0 0 0 0 0 0 0 0 0 0 0 
##$SW_h= 3612.71676300578
##$TD= 16384
##$TD0= 1
##$TE= 0
##$TE2= 300
##$TE3= 300
##$TEG= 300
##$TL= (0..7)
0 120 120 120 120 120 120 120 
##$TP= (0..7)
150 150 150 150 150 150 150 150 
##$TP07= 0
##$TPNAME0= <>
##$TPNAME1= <>
##$TPNAME2= <>
##$TPNAME3= <>
##$TPNAME4= <>
##$TPNAME5= <>
##$TPNAME6= <>
##$TPNAME7= <>
##$TPOAL= (0..7)
0.5 0.5 0.5 0.5 0.5 0.5 0.5 0.5 
##$TPOFFS= (0..7)
0 0 0 0 0 0 0 0 
##$TUNHIN= 0
##$TUNHOUT= 0
##$TUNXOUT= 0
##$USERA1= <user>
##$USERA2= <user>
##$USERA3= <user>
##$USERA4= <user>
##$USERA5= <user>
##$V9= 5
##$VALIST= <valist>
##$VCLIST= <CCCCCCCCCCCCCCC>
##$VD= 0
##$VDLIST= <DDDDDDDDDDDDDDD>
##$VPLIST= <PPPPPPPPPPPPPPP>
##$VTLIST= <TTTTTTTTTTTTTTT>
##$WBST= 1024
##$WBSW= 4
##$XGAIN= (0..3)
0 0 0 0 
##$XL= 0
##$YL= 0
##$YMAX_a= 146325
##$YMIN_a= -170990
##$ZGOPTNS= <>
##$ZL1= 120
##$ZL2= 120
##$ZL3= 120
##$ZL4= 120
##$ABSF1= 15.5111
##$ABSF2= -2.54075
##$ABSG= 5
##$ABSL= 3
##$ALPHA= 0
##$AQORDER= 0
##$ASSFAC= 0
##$ASSFACI= 0
##$ASSFACX= 0
##$ASSWID= 0
##$AUNMP= <proc_1d>
##$AZFE= 0.1
##$AZFW= 0.1
##$BCFW= 0
##$BC_mod= 2
##$BYTORDP= 0
##$COROFFS= 0
##$CY= -3
##$DATMOD= 1
##$DC= 0
##$DFILT= <>
##$DTYPP= 0
##$F1P= 0
##$F2P= 0
##$FCOR= 1
##$FTSIZE= 16384
##$FT_mod= 6
##$GAMMA= 0
##$GB= 0
##$INTBC= 1
##$INTSCL= 3.70164e-10
##$ISEN= 128
##$LB= 0.24
##$LEV0= 0
##$LPBIN= 0
##$MAXI= 10000
##$MC2= 0
##$MEAN= 0
##$ME_mod= 0
##$MI= 1.114404
##$NCOEF= 0
##$NC_proc= -8
##$NLEV= 6
##$NOISF1= 3.799351
##$NOISF2= 2.8
##$NSP= 0
##$NTH_PI= 0
##$NZP= 0
##$OFFSET= 15.49899
##$PC= 1
##$PHC0= -24597.59
##$PHC1= 12.05273
##$PH_mod= 1
##$PKNL= yes
##$PPARMOD= 0
##$PSCAL= 0
##$PSIGN= 0
##$REVERSE= no
##$SF= 200.130004546157
##$SI= 16384
##$SIGF1= 3
##$SIGF2= 2
##$SINO= 5.538805
##$SIOLD= 16384
##$SREGLST= <1H.CDCl3>
##$SSB= 0
##$STSI= 16384
##$STSR= 0
##$SW_p= 3612.71676300578
##$SYMM= 0
##$S_DEV= 0
##$TDeff= 16384
##$TDoff= 0
##$TI= <>
##$TILT= no
##$TM1= 0
##$TM2= 0
##$TOPLEV= 0
##$USERP1= <user>
##$USERP2= <user>
##$USERP3= <user>
##$USERP4= <user>
##$USERP5= <user>
##$WDW= 1
##$XDIM= 16384
##$YMAX_p= 506303947
##$YMIN_p= -4853423
$$ End of Bruker specific parameters
$$ ---------------------------------
##NTUPLES= NMR SPECTRUM
##VAR_NAME=  FREQUENCY,     SPECTRUM/REAL,   SPECTRUM/IMAG
##SYMBOL=    X,             R,               I
##VAR_TYPE=  INDEPENDENT,   DEPENDENT,       DEPENDENT
##VAR_FORM=  AFFN,          ASDF,            ASDF
##VAR_DIM=   16384,         16384,           16384
##UNITS=     HZ,            ARBITRARY UNITS, ARBITRARY UNITS
##FACTOR=    0.220516191357247, 1,           1
##FIRST=     3101.81295094828, 0,            0
##LAST=      -510.903812057496, 0,           0
##MIN=       -510.903812057496, -4853423,    0
##MAX=       3101.81295094828, 506303947,    0
$$ Real data points
##PAGE= N=1
##DATA TABLE= (X++(R..R)), XYDATA
$$ [...]
6595H73867j28222n2199J52922j30215R242K01193J59132j10104j85368k7158
6585G63090J0517M30374j6739J63784M0015m73161o702m77534L8961L02334l91042
6574C83897J14817L08717j09762N34431l73110m5012K38539J59407j05790j6292
6564A089842K60041N5883m03055k03932p0134Q2674J13154j32791K71735L72993
6554A436410j20975l48290J50732k72307J04312m85457J29906L13630L88521k5802
6544A270680k18570m77010n7315L88295R7918O30243l61197j20546k27967J56986
6534A081517P8479q8911O4149L65274N2842k31083L3438J34423Q5333n31129J8626
6523A062958j07046j77089M81119Q4284l0094M1026l11848N35210j52383k21702
$$ y = [873867, 745645, 693446, 846368, 716153, 725395, 926588, 1085720, 975616, 790248, 763090, 773607, 1203981, 1187242, 1351026, 1391041, 917880, 911178, 433644, 472605, 774939, 383897, 498714, 807431, 697669, 1232100, 858990, 813978, 1052517, 1211924, 1106134, 1089842, 1349883, 1405766, 1002711, 798779, 728645, 811319, 924473, 791682, 1063417, 1436410, 1315435, 967145, 1117877, 845570, 949882, 464425, 594331, 907961, 1296482, 1270680, 1052110, 575100, 517785, 906080, 1003998, 1634241, 1273044, 1152498, 924531, 1081517, 1159996, 1071085, 1135234, 1500508, 1553350, 1322267, 1355705, 1490128, 1575461, 1044332, 1062958, 955912, 778823, 1259942, 1344226, 1314132, 1355158, 1043310, 1578520, 1426137, 1204435]
6513A204435j17844l90038N33300R1063O0412J04219k80167Q3348L73818j63198
6503A499348j74477k33794L33430M638j78791K2998K08872L7814r9482K17157
6493A637713J2266J25579k33875N023j19764k2534J31083Q8885k9022K73772L35353
6482B204479o2662l35681O9342L42314M33103j19960j96084L18135j81406M8936
6472B520516M20496N11394m28763J16103J82870k33635k59564K10496K76721j82768
6462C133866r1476m5821N57004j46844l02369j40403M2109L30789K91793Q100
6452C636748K6514k5230j58469K23065o1225n3670J75577k00742m87045j9369
6442C056154j38504N18856M28920j61999L62347K71625l23479k13591n18993P1271
$$ y = [1204435, 1086591, 696553, 1229853, 1320916, 1381328, 1485547, 1205380, 1288728, 1662546, 1499348, 1324871, 1091077, 1424507, 1429145, 1250354, 1273352, 1482224, 1520038, 1420556, 1637713, 1649979, 1775558, 1541683, 1546706, 1426942, 1404408, 1535491, 1624376, 1595354, 1869126, 2204479, 2141817, 1806136, 1875478, 2217792, 2650895, 2530935, 2334851, 2652986, 2471580, 2520516, 2941012, 3452406, 3023643, 3139746, 3322616, 3088981, 2829417, 3039913, 3316634, 3133866, 3042390, 2996569, 3553573, 3406729, 3104360, 2963957, 3006066, 3336855, 3628648, 3636748, 3663262, 3638032, 3479563, 3702628, 3641403, 3587733, 3763310, 3562568, 3075523, 3056154, 2917650, 3436506, 3865426, 3703427, 4065774, 4337399, 4013920, 3800329, 3281336, 3352607]
6432C352607j86442r2185K1277P2036k8388l96119j85564l67871P3728K93902
6422B556981k30173J01941k56736l67526J16322k65603L66211P8219J12326R56
6412B212918k0443k62346L55322o7998n25953J02824M82759J60541l0393k53077
6402B154154n02848L468J21952J22643L0834j01471N15535m55478m39176R1276
6392A540889L38687J58640m32355R9415j49565p5027k82318m6739J98210j6512
6382A333325j34565N5064j17927J27571j2287j82611L24095j42970p0263J99089
6372A378521K33933P3368M5097j25664l57522j9770J02808k4052J59125j44581
6362A321263j24745j27545J98009M28594j10904R6634m02109l9904J57250l80868
$$ y = [3352607, 3166165, 3073980, 3095257, 3167293, 3138905, 2742786, 2557222, 2189351, 2263079, 2556981, 2326808, 2428749, 2172013, 1804487, 1920809, 1655206, 2021417, 2099636, 2211962, 2212918, 2192475, 1930129, 2285451, 2217453, 1691500, 1794324, 2277083, 2437624, 2407231, 2154154, 1651306, 1654774, 1776726, 1899369, 1930203, 1828732, 2344267, 1888789, 1449613, 1540889, 1879576, 2038216, 1605861, 1705276, 1555711, 1480684, 1198366, 1151627, 1349837, 1333325, 1198760, 1253824, 1135897, 1263468, 1251181, 1068570, 1392665, 1249695, 1179432, 1378521, 1612454, 1685822, 1730919, 1605255, 1247733, 1227963, 1330771, 1306719, 1465844, 1321263, 1196518, 1068973, 1266982, 1695576, 1584672, 1681306, 1279197, 1239293, 1396543, 1015675]
6352A015675L25066K6705K32681n8888m12235L07651Q0023L23995L39554j68875
6342B011352k19432k87329J39660L67691l99771O8095L02324M3305l92760J7517
6332A650652n5807p2302Q5833O8474K51860J03143j12644q2125m59299N4961M7827
6321A480573j27324O56225N85324l95570k22390j69011l09186n5948L23532r0424
6311A675801m8843o8711L92426L46926k87442J7733j03749j39769l30286L26773
6301A780859k2509L09922j68487l26458K26059J94492l95946k1368K53886J67221
6291A997671l62929o4474M12340L1533j58011O21398r1288m24859k25750j32892
6281A602739k84254J58569K01463K06581j25064K87770K45455j36309k09764N1344
$$ y = [1015675, 1340741, 1367446, 1600127, 1541239, 1129004, 1436655, 1516678, 1840673, 2180227, 2011352, 1791920, 1504591, 1644251, 2011942, 1612171, 1680266, 1982590, 2025895, 1633135, 1650652, 1594845, 1522543, 1608376, 1676850, 1928710, 2031853, 1919209, 1837084, 1377785, 1432746, 1480573, 1353249, 2009474, 2594798, 2199228, 1976838, 1807827, 1498641, 1442693, 1766225, 1675801, 1626958, 1558247, 1950673, 2297599, 2010157, 2027890, 1924141, 1784372, 1454086, 1780859, 1758350, 2068272, 1899785, 1573327, 1799386, 1993878, 1597932, 1576564, 1830450, 1997671, 1634742, 1570268, 1982608, 2014141, 1856130, 2477528, 2386240, 1961381, 1735631, 1602739, 1318485, 1477054, 1678517, 1885098, 1760034, 2047804, 2293259, 2156950, 1947186, 1998530]
6271A998530K34308M4178j29051q2165q3799P5248r4737N25170K63713n54739
6261B196656l99956M1994N92591n91822L64856l34019k33618N01623K74653n76519
6251A836439L2654K05978K26635J86532P7024j77018O1401l46742m47037r6088
6241A559778J52256P7645l1248O1986J98536p5301j92661J83722J71089m22740
6231A683062J93859N89420o08729K74073O18196n3717m71058l4402K61204j45878
6221B306030K40509K6848m41255j49335L30047j64946m5534J07515o445J2821
6211B216255j25106O8935L33937l00485k14523K52225J02306j45379J07257J39086
6201B434508k32632o6900K36812m7990K97301j60934p24532L91113L45836K19539
$$ y = [1998530, 2232838, 2277016, 2147965, 2065800, 1982001, 2057249, 1962512, 2487682, 2751395, 2196656, 1796700, 1838694, 2431285, 1839463, 2204319, 1870300, 1636682, 2138305, 2412958, 1836439, 1869093, 2075071, 2301706, 2488238, 2565262, 2388244, 2449645, 2102903, 1655866, 1559778, 1712034, 1789679, 1758431, 1820417, 2018953, 1943652, 1750991, 1934713, 2105802, 1683062, 1876921, 2466341, 1857612, 2131685, 2749881, 2696164, 2225106, 2190704, 2451908, 2306030, 2546539, 2573387, 2132132, 1982797, 2312844, 2147898, 2102364, 2209879, 2203434, 2216255, 2091149, 2160084, 2494021, 2193536, 1979013, 2231238, 2333544, 2188165, 2295422, 2434508, 2201876, 2134976, 2371788, 2323798, 2621099, 2460165, 1735633, 2126746, 2472582, 2692121]
6191B692121J30035l26148J47137p9361m0664m17433K0632m999K8121M95440r8699
6180B546182L96665K19907l1802K51891k16895l94580M73262n96552J20362M00373
6170C168813l70787J61403J22691k88324O40438j4570o68864n158J97930j408
6160B942164K36050j39241M82027j69932J16245J67260n83918L38569l3961k73268
6150C081995J17190k82774J24257L02904k16689L99209k39012k90512K2814j92688
6140B826694N45525N68490J99029k56814n5729l08057k23767K19484K48183j75627
6130C587411k15132K97922K6617q1757j74087L07475L57272m53481K60540j47050
6120C765730J27023J0433l56438K22294J56170K36964n2470l52930J69573K82727
$$ y = [2692121, 2822156, 2496008, 2643145, 2563784, 2523120, 2105687, 2126319, 2121320, 2149441, 2644881, 2546182, 2942847, 3162754, 3130952, 3382843, 3165948, 2771368, 3244630, 2648078, 2768440, 3168813, 2798026, 2959429, 3082120, 2793796, 3434234, 3419664, 2750800, 2745642, 2943572, 2942164, 3178214, 3038973, 3521000, 3351068, 3467313, 3634573, 3050655, 3389224, 3355263, 3081995, 3199185, 2916411, 3040668, 3343572, 3126883, 3526092, 3287080, 2996568, 3019382, 2826694, 3372219, 3940709, 4139738, 3882924, 3827195, 3519138, 3295371, 3514855, 3763038, 3587411, 3372279, 3670201, 3696818, 3615061, 3440974, 3748449, 4105721, 3652240, 3912780, 3765730, 3892753, 3903186, 3546748, 3769042, 3925212, 4162176, 4109706, 3756776, 3926349, 4209076]
6110D209076J15430J68092l52540m59523L11481J55328N23108Q4271m23008J9826
6100D351541l86229Q3145j9708m1373K40355N99545k65213l82073L02696N88324
6090E071010N4957R7909p49187J01675q5858k2365j09008K4076M43177l56972
6080D469414K5K50836l53262K94512L47093K61698o60925j61907P65178n6165
6070E156497K82748n08026j25942M06183k3113K66643L55745o5341R773Q4990
6060E840157m44696K45177J08690K18544k54881m43730J77079J74871N84491L7330
6050F243032j79834N967K46697j32189j64422k71162J99439K36200K04337N8770
6040F446835K36744k96999J74422j43342p2444L17653j06945M29771K07960k039
$$ y = [4209076, 4324506, 4492598, 4140058, 3680535, 3992016, 4147344, 4670452, 4754723, 4331715, 4351541, 3965312, 4048457, 4028749, 3987376, 4227731, 4827276, 4562063, 4179990, 4482686, 5071010, 5125967, 5223876, 4474689, 4576364, 4490506, 4468141, 4359133, 4383209, 4826386, 4469414, 4469439, 4720275, 4367013, 4661525, 5008618, 5270316, 4609391, 4447484, 5212662, 5156497, 5439245, 4931219, 4805277, 5211460, 5188347, 5454990, 5810735, 5745394, 5755167, 5840157, 5395461, 5640638, 5749328, 5967872, 5712991, 5269261, 5446340, 5621211, 6205702, 6243032, 6063198, 6069165, 6315862, 6183673, 6019251, 5748089, 5947528, 6183728, 6388065, 6446835, 6683579, 6386580, 6561002, 6417660, 6345216, 6662869, 6555924, 6985695, 7193655, 7191616]
6030G191616j49696K1814J74930L93822r9348j89497L94226p6397j05732q696
6020G547042L56850l1248k67374R4386k2603J94455j90425M66993L16526n59714
6010G904888L94476K12543J02019K50395l02983l08836k27832J31512O90661N51515
6000I398358n40454k70944J3294N8817J36589M05249K63999J426Q4304Q1109J98631
5989I830378j70290M14415J55978K5359P7269K94223J2575K23999J39131n46777
5979A0456260J57101J72372J27438N17909P36780j53486k68290j18959M4141J18457
5969A1789723M24328l67107O831N49180K77051n10455K18585L79296l12585L25761
5959A2780608J64119j02985L93769L50569K35508M92676l10582J45395k6257J9749
$$ y = [7191616, 7041920, 7063734, 7238664, 7632486, 7533138, 7343641, 7737867, 7661470, 7555738, 7547042, 7903892, 7872644, 7605270, 7699656, 7677053, 7871508, 7681083, 8148076, 8464602, 7904888, 8299364, 8511907, 8613926, 8864321, 8561338, 8252502, 8024670, 8156182, 8846843, 9398358, 8857904, 8586960, 8600254, 8659071, 8795660, 9200909, 9464908, 9466334, 9550638, 9631747, 9830378, 9660088, 10074503, 10230481, 10255840, 10333109, 10627332, 10639907, 10863906, 11003037, 10456260, 10613361, 10785733, 10913171, 11431080, 12167860, 12014374, 11746084, 11627125, 11671266, 11789723, 12214051, 11846944, 11853775, 12402955, 12680006, 12169551, 12388136, 12767432, 12454847, 12780608, 12944727, 12841742, 13235511, 13586080, 13821588, 14314264, 14003682, 14149077, 14122820, 14142569]
5949A4142569R50705q0348k38180M21225R1618j83896K77156N03040K06466J79892
5939A6270247J25868J27182N62431o5252K44150R7657J95771L23304O7927M06084
5929A8355369j68706O72698M58690q3392m68938K85187P86222o3201L67592M55967
5919B0597488k10893P45406j2360N52869J73527M67360M59649J65535J31784J88139
5909B3258504K78902L39337O09857M19501n12385K36585N37868N34782L30940
5900B6033891N67245N63931K56736K30316J31454N99348Q58236N10092O2633P10916
5890C0524798J95835O70031K32679J26032K20593O16823M67831P99868O86418
5881C4540908N48265N28020L31355N29009N71970J194792P03702K30715O04736
$$ y = [14142569, 15093274, 15012926, 14774746, 15195971, 15287589, 15103693, 15380849, 15883889, 16090355, 16270247, 16396115, 16523297, 17085728, 17020476, 17264626, 17362283, 17558054, 17881358, 17949285, 18355369, 18186663, 18859361, 19318051, 19234659, 18765721, 19050908, 19837130, 19773929, 20141521, 20597488, 20386595, 21132001, 21119641, 21672510, 21846037, 22313397, 22773046, 22938581, 23070365, 23258504, 23537406, 23876743, 24486600, 24906101, 24393716, 24630301, 25168169, 25702951, 26033891, 26601136, 27165067, 27421803, 27652119, 27783573, 28382921, 29241157, 29751249, 29813882, 30524798, 30720633, 31390664, 31623343, 31749375, 31969968, 32586791, 33054622, 33854490, 34540908, 35089173, 35617193, 35948548, 36477557, 37049527, 38244319, 38948021, 39178736, 39783472]
5872C9783472L71632O21617R94029M10591M86251N97473P18191J104741N87364
5863D5675361P32466P42780Q74741J056424J173568Q22445P92938N47453O89105
5854E3107281R05189P81449J050713P68476J225911J075432R35093J329240P69341
5845F1948125J162197Q58601R74480J245200J362292J439561J575661J245220
5837G1811337J041732R12991P93071J440406J402709J024859J141151J586676
5829H1154932J542882J549622J448674P59924J541631J305148O89830J583366
5821I1576009J764117J375977J609358J418485J418462R81447J200545J244041
5813A02588441Q04532J415435J849880J701820R11650O05355P15163J162726J261837
$$ y = [39783472, 40155104, 40776721, 41770750, 42181341, 42667592, 43265065, 43983256, 45087997, 45675361, 46407827, 47150607, 48025348, 49081772, 50255340, 51077785, 51870723, 52418176, 53107281, 54012470, 54793919, 55844632, 56613108, 57839019, 58914451, 59849544, 61178784, 61948125, 63110322, 63968923, 64943403, 66188603, 67550895, 68990456, 70566117, 71811337, 72853069, 73766060, 74559131, 75999537, 77402246, 78427105, 79568256, 81154932, 82697814, 84247436, 85696110, 86456034, 87997665, 89302813, 89992643, 91576009, 93340126, 94716103, 96325461, 97743946, 99162408, 100143855, 101344400, 102588441, 103392973, 104808408, 106658288, 108360108, 109271758, 109877113, 110592276, 111755002, 113016839]
5804A13016839R84408M88246R62781P06995R09363J678254P14067L67197Q19543
5795A20647693O76896Q21090O40613O33065J113011M11436J147676N62711j15249
5786A26538942N82368P22405N06752R64574O82740M67554P9763J57673P37674
5777A31440445O83180Q65267L26279L30128M3J080827P86643L77217M19447N63716
5767A36873192L33258M86002R05134M16100M55249O59844P04167O49463M18726
5758A41901135O31315K23398K88973R40817O10301O43491Q94825N50174J008833
5749A47693262M69786P51974P18182K80750K61096R01381L76668L63549L34592
5740A52151240n3441L71396O18891M06357J70312M29338M9706P4066J64188J44661
$$ y = [113016839, 114001247, 114489493, 115452274, 116159269, 117068632, 118746886, 119460953, 119828150, 120647693, 121324589, 122145679, 122786292, 123419357, 124532368, 124943804, 126091480, 126654191, 126538942, 127121310, 127843715, 128350467, 129315041, 129997781, 130465335, 130545098, 130702771, 131440445, 132123625, 132988892, 133315171, 133645299, 133645342, 134726169, 135512812, 135890029, 136309476, 136873192, 137206450, 137692452, 138597586, 139013686, 139468935, 140128779, 140832946, 141482409, 141901135, 142532450, 142755848, 143044821, 143985638, 144595939, 145239430, 146134255, 146684429, 147693262, 148163048, 148915022, 149633204, 149913954, 150175050, 151076431, 151453099, 151816648, 152151240, 152097799, 152469195, 153088086, 153494443, 153664755, 154094093, 154143799, 154217865, 154382053, 154526714]
5730A54526714M46829K29239O05514N37593j07690J48054j54305j14378k07051
5721A55910519l49813m67713p65146p62898o20288l30741m58844n70227j70259
5712A51414590r32768n11127n76740m82280m66512r11269j050205j305628p63494
5703A44414567q82359r23092p62404j091046j336253p14113j178687j681332j345388
5694A34499893j165297j742520j474330j161684j278259j723338j822512r04570
5686A23227383j193971k107329k039266j668007j738660j562547j515883j441254
5678A09960466k113747j566935j948136r63516j892029j983816j189483j654842
5670I6647962j588555j627500j885434j609110j385746j533365j616002r27045
$$ y = [154526714, 154973543, 155202782, 155808296, 156345889, 156238199, 156386253, 156231948, 156117570, 155910519, 155560706, 155092993, 154327847, 153564949, 152944661, 152613920, 152155076, 151584849, 151414590, 150481822, 149970695, 149393955, 148911675, 148445163, 147533894, 146483689, 145178061, 144414567, 143532208, 142609116, 141846712, 140755666, 139419413, 138705300, 137526613, 135845281, 134499893, 133334596, 131592076, 130117746, 128956062, 127677803, 125954465, 124131953, 123227383, 122033412, 119926083, 117886817, 116218810, 114480150, 112917603, 111401720, 109960466, 107846719, 106279784, 104331648, 103368132, 101476103, 99492287, 98302804, 96647962, 95059407, 93431907, 91546473, 89937363, 88551617, 87018252, 85402250, 84475205]
5662H4475205j445442j820591j555693j635175j328677r80851q42054j387371
5654G3479351j524590j623162j207083j313763j347125j438101j279631j158044
5646F2587852j246354p95016r35560j111236j160641j421269q45245q99624n32971
5637E3639936p08470j190598j146124r58753j087511m43503j062945j070076p74036
5628D5197920j090577q48800n94391l87959k90647j166643p87967m30290n72740
5619C9027906p44927q41405j156183L7326q26504n48087o29243o12344K64819
5610C3971358q93119n07031o76770l72060k50864l72447q78377l66832P0275m73685
5600B9250448n72807p33344j064992k66465n95823j10725J49737l28590k42750
$$ y = [84475205, 83029763, 81209172, 79653479, 78018304, 76689627, 75708776, 74866722, 73479351, 71954761, 70331599, 69124516, 67810753, 66463628, 65025527, 63745896, 62587852, 61341498, 60546482, 59610922, 58499686, 57339045, 55917776, 55072531, 54172907, 53639936, 52931466, 51740868, 50594744, 49635991, 48548480, 48104977, 47042032, 45971956, 45197920, 44107343, 43258543, 42664152, 42276193, 41985546, 40818903, 40030936, 39600646, 39027906, 38282979, 37441574, 36285391, 36322717, 35496213, 34948126, 34318883, 33706539, 33971358, 33078239, 32571208, 31894438, 31522378, 31271514, 30899067, 30020690, 29653858, 29724133, 29250448, 28677641, 27944297, 26879305, 26612840, 26017017, 25906292, 26056029, 25727439, 25484689]
5591B5484689m19206q91726m37876k14452k88236n94647K18810m34765q13571
5582B1609020O3953l68461m03628m25423p211j78596o83393m05942o7655Q3610
5572A9216274j70403m39777j41903j89004l64291j91589r261J49339l41142q79083
5562A6639160l17797l88140o39967k67080j33391L42852j40913J86800o05584
5553A4675940k64197P2720l87414J52961J65480l70812o82413j88517J65349J31320
5543A3470417j75473m3112M97041l99993o21940n60254n83102K11825P6929l90053
5533A1482285m09464J31091J32377Q089J03261j70500m27462J2844j9553N3522
5523A0896490m4730k88738Q9575J90077j99090j67508k27413j18580k48375k24292
$$ y = [25484689, 25065483, 24173757, 23735881, 23521429, 23233193, 22638546, 22857356, 22422591, 21609020, 21672973, 21304512, 20900884, 20475461, 20468250, 20289654, 19606261, 19200319, 19132664, 19216274, 19045871, 18606094, 18464191, 18275187, 17910896, 17719307, 17710046, 17859385, 17518243, 16639160, 16321363, 15933223, 15293256, 15026176, 14892785, 15235637, 15094724, 15281524, 14675940, 14411743, 14484463, 14097049, 14250010, 14415490, 14044678, 13362265, 13173748, 13339097, 13470417, 13294944, 13251832, 13748873, 13348880, 12726940, 12166686, 11583584, 11795409, 11872338, 11482285, 11072821, 11203912, 11336289, 11344378, 11447639, 11277139, 10849677, 10862521, 10842968, 10896490, 10851760, 10563022, 10652597, 10842674, 10643584, 10476076, 10248663, 10130083, 9881708, 9657416]
5513I657416q6301Q1966m5977m69310j2723K07411l17065j85945J23427O93240
5503I646139o24338n06434q5470J79179K09482L57425m3776o64210j77402j08516
5493H182079R3405K13865q9740k15331k74331K58400k5482N6494n28891j42264
5483G528204J59039o86895o6041N13296M3432L5399j33919k85848o49965L4893
5473F491595M78180r3953R7370L3322J63856k89547k0901k70109q7370J18349
5463F620792j79253j18997M43257j46150o7583K5174L4064L54484k74326o08690
5453F082772r9730k97255j75023R2225P0673J74985L05137j0622k86765o8661
5443E787736J61593m44209K6995l77410j43103q2868M358J79814K96472M36181
$$ y = [9657416, 9571115, 9653081, 9607104, 9137794, 9125071, 9332482, 9015417, 8829472, 8952899, 9646139, 9021801, 8515367, 8429897, 8609076, 8818558, 9175983, 9132207, 8467997, 8290595, 8182079, 8275484, 8489349, 8399609, 8184278, 7909947, 8168347, 8142865, 8199359, 7670468, 7528204, 7687243, 7000348, 6934307, 7447603, 7491035, 7526434, 7392515, 7106667, 6456702, 6491595, 6969775, 6875822, 6973192, 7006514, 7170370, 6880823, 6859922, 6589813, 6502443, 6620792, 6441539, 6322542, 6765799, 6619649, 6552066, 6577240, 6611304, 6965788, 6691462, 6082772, 5983042, 5685787, 5510764, 5602989, 5673662, 5848647, 6153784, 6143162, 5856397, 5787736, 5949329, 5505120, 5532115, 5154705, 5011602, 4928734, 4933092, 5112906, 5409378, 5845559]
5433E845559l67178K78800p3469j59516L74351m39843m56193N85014J70291k69449
5423E488367L64815l59000j94608P8021j88737l34083j01026O1066l10931j05250
5413D398634J855M42561J24529J17726k74186j37933j10320J56008J78621K62465
5403E159960J57334q1126k4663m88483M02207M31096k99808J95984M5994j70688
5393E327807n03152l69206N97124J97900j64460n81537k75125J55854J53572O9840
5383D608617j18792P2481l87139l92488m7245K44591N3842N0750j47606m9090
5373C887921M93941K88664r0854j0775K52898l01781k37761L9493J52530K04681
5363D678957j94630l85076K02272N74213p719l53381j31601N6028K88871k2615
$$ y = [5845559, 5478381, 5757181, 5683712, 5524196, 5898547, 5458704, 5002511, 5587525, 5757816, 5488367, 5853182, 5494182, 5299574, 5377595, 5188858, 4854775, 4753749, 4814815, 4503884, 4398634, 4400489, 4843050, 4967579, 5085305, 4811119, 4673186, 4562866, 4718874, 4897495, 5159960, 5317294, 5236168, 5211505, 4723022, 5125229, 5556325, 5256517, 5452501, 5498495, 5327807, 4824655, 4455449, 5052573, 5250473, 5086013, 4504476, 4229351, 4385205, 4538777, 4608617, 4489825, 4562306, 4175167, 3782679, 3735434, 3980025, 4033867, 4084617, 3937011, 3887921, 4381862, 4670526, 4579672, 4568897, 4821795, 4520014, 4282253, 4321746, 4474276, 4678957, 4484327, 4099251, 4301523, 4875736, 4868017, 4514636, 4383035, 4439063, 4727934, 4705319]
5353D705319k59278j83923K14554J09270o2249k75247r6410N38208K8282l82834
5343D335692k84322K19613J43025J37395M989J05231M01113K52497K68106K53254
5333E836593P707n8065l57048m70615L54429l18652l73397J53216Q2725j71939
5323D684954k93524l40188J48863p7828M5527j53149q40415K89849J50335N6661
5313C671085P1847M90806J95037m28772j71642n9264J33302L6445j55255j78494
5303C605095L57776m60478k27487k5289j93457q2909l10877p9001j35763J25733
5293B573343L02033k66478m04477p7862j07171K81697m4579J95887j15195j43257
5283B193941K45592J24138l18658K63402o1098K62849j39753l28980K17803K9171
$$ y = [4705319, 4446041, 4262118, 4476672, 4585942, 4523693, 4248446, 4152036, 4690244, 4718526, 4335692, 4051370, 4270983, 4414008, 4551403, 4556392, 4661623, 5062736, 5315233, 5583339, 5836593, 5844300, 5786235, 5429187, 4958572, 5313001, 4994349, 4620952, 4774168, 4856893, 4684954, 4391430, 4051242, 4200105, 4122277, 4167804, 4014655, 3174240, 3464089, 3614424, 3671085, 3742932, 4233738, 4428775, 4000003, 3828361, 3769097, 3902399, 3938844, 3783589, 3605095, 3962871, 3502393, 3274906, 3249617, 3056160, 2973251, 2662374, 2583373, 2447610, 2573343, 2875376, 2608898, 2204421, 2126559, 2019388, 2301085, 2256506, 2452393, 2337198, 2193941, 2439533, 2563671, 2245013, 2508415, 2447317, 2710166, 2570413, 2241433, 2459236, 2488407]
5273B488407j49435M42788Q2714q32834N0735o6446K87076l4936p3736l12041
5263A882292p0704O61149J36401k45397j00813n1610J90826l81650k16841j67012
5253A636641L73716L10066n844K9709J08291j58894l07600M2586j84615L92783
5243B236839K37909k18974J36356J22998m42632K0461k6609K67188j01395r8908
5233B133233k13070J03559k39367P9747J83845n9583J32956J9377L732J76600
5223B321029J88715k19761J96416K26599l10824k25340P5633K33244J17833k77151
5213B326393K27929n339N3133j81772j220n8781K1228Q4823L7658M91880N21624
5202C517556k98581p730N29175O53816k0451K81285P00091O40772J228019J822239
$$ y = [2488407, 2338972, 2781760, 2864474, 2031640, 2082375, 2015929, 2303005, 2268069, 2194333, 1882292, 1811588, 2472737, 2609138, 2363741, 2262928, 2211318, 2402144, 2020494, 1803653, 1636641, 2010357, 2320423, 2314579, 2344288, 2452579, 2293685, 1986085, 2028671, 1844056, 2236839, 2474748, 2255774, 2392130, 2515128, 2072496, 2092957, 2066348, 2333536, 2232141, 2133233, 1920163, 2023722, 1784355, 1864102, 2047947, 1988364, 2121320, 2140697, 2144429, 2321029, 2509744, 2289983, 2486399, 2712998, 2402174, 2176834, 2252467, 2485711, 2603544, 2326393, 2554322, 2548983, 2602116, 2420344, 2419124, 2360343, 2381571, 2466394, 2504052, 2995932, 3517556, 3218975, 3211245, 3740420, 4394236, 4373785, 4655070, 5355161, 5995933, 7223952, 9046191]
5192I046191J115205L40467o56697j945119j132499j148665n34162n17384m58879
5183D108458n31068o82246J14554K48989k33258n13835r6756K59249Q9351n75137
5173B188301k22721Q7424L24446K29569k38490k97971j86284k68971j35761N00030
5163A979572L77245J00155m20445R9025R4161j89583N1109l35530n13242L27438
5153A569905L9878l31071l3033M03957J4514l29916l14205J90098J61580j51765
5143A219942L35162o10146M25524M18180j26321j05494J72649R0786O5726k44564
5133A641444m40135p2018j44535K98515M86700k12476K52199P6859k76230j84411
5123A425912j75508l89518N27159L77823k79741J85606k32553j17644K80252Q6786
$$ y = [9046191, 10161396, 10501863, 9845166, 7900047, 6767548, 5618883, 5084721, 4567337, 4108458, 3577390, 2895144, 3009698, 3258687, 3025429, 2511594, 2414838, 2674087, 2763438, 2188301, 1965580, 2053004, 2377450, 2607019, 2368529, 2070558, 1884274, 1615303, 1479542, 1979572, 2356817, 2456972, 2036527, 2135552, 2229713, 2040130, 2091239, 1755709, 1242467, 1569905, 1609783, 1278712, 1245679, 1649636, 1664150, 1334234, 1020029, 1210127, 1371707, 1219942, 1555104, 944958, 1370482, 1788662, 1662341, 1556847, 1729496, 1820282, 1886008, 1641444, 1201309, 1129291, 984756, 1283271, 1769971, 1557495, 1809694, 1886553, 1610323, 1425912, 1250404, 860886, 1388045, 1765868, 1486127, 1671733, 1439180, 1321536, 1601788, 1688574]
5113A688574k26494j70813j45154J64774j36936l56161K069J96281N0015P649
5103A073804K12827J25913j60449l18895K35531P08542p6774p5994j32085n39222
5093A053198L75618j35222Q4206M05963J07090k05371n84175J78559j39943j40256
5083I99667P7312Q367p2189K40159p6364J88280J17353o55081j33409M94157j90264
5072I97988M64520M34375m08792m46311j0542J77215L14430k39243l01851J3836
5062I95625M36248L32512k0895O5411k8271k85611p6498J28212K09331m7623o06435
5051A102006l26349j70464Q8596L95911K33053j05625j91775N0675M05876K53172
5041A735076j16422k15949l64794J06051K98149m920n59993P3208j05106J56414
$$ y = [1688574, 1462080, 1291267, 1146113, 1310887, 1173951, 817790, 819859, 1016140, 1066155, 1073804, 1286631, 1412544, 1252095, 933200, 1168731, 1877273, 1800499, 1724505, 1592420, 1053198, 1428816, 1293594, 1377800, 1783763, 1890853, 1685482, 1101307, 1279866, 1139923, 999667, 1076979, 1085346, 1013157, 1253316, 1176952, 1365232, 1482585, 827504, 694095, 1188252, 997988, 1462508, 1896883, 1488091, 1041780, 1031238, 1208453, 1522883, 1283640, 981789, 995625, 1431873, 1764385, 1743490, 1808901, 1780630, 1495019, 1418521, 1546733, 1756064, 1708441, 1102006, 775657, 605193, 693789, 1089700, 1322753, 1217128, 1025353, 1076028, 1481904, 1735076, 1618654, 1402705, 1037911, 1143962, 1442111, 1437191, 877198, 950406, 845300, 1001714]
5031A001714L11731J14832J52832j92131L4165k68476k97779p152K6716K08979
5021A085431L24633k63619l5104j22059J31726J33082k7766j36012J48703P35077
5011A974092l53687l74786L62142l24540j82445p8798r8283l04091j57986J41012
5001F02630J46883J95260L61557j74932J17205K20126m9823O5083O0369j70190
4991A374168L25346K13790l8337K54453l47080l97814n28190k7152K21980k58719
4981G92445M22926J70580l55767M08875K7487j26414J1388l48390L44894k04552
4971A143472q4996J69460L48297j83268m7343Q0901n1958K38155J58760K4393
4961A795873K5000n84677l21970M83927K28521k08120J34335M59587n01901n81406
$$ y = [1001714, 1313445, 1428277, 1581109, 1388978, 1423143, 1154667, 856888, 849736, 876452, 1085431, 1410064, 1146445, 1111341, 989282, 1121008, 1254090, 1226324, 1090312, 1239015, 1974092, 1620405, 1245619, 1607761, 1283221, 1100776, 1021978, 923695, 619604, 461618, 602630, 749513, 944773, 1306330, 1131398, 1248603, 1468729, 1418906, 1483989, 1544358, 1374168, 1699514, 1913304, 1874967, 2129420, 1782340, 1384526, 856336, 829184, 1051164, 792445, 1215371, 1385951, 1030184, 1439059, 1466546, 1340132, 1351520, 1003130, 1348024, 1143472, 1058476, 1227936, 1576233, 1392965, 1345622, 1426523, 1374565, 1612720, 1771480, 1795873, 1820873, 1236196, 914226, 1398153, 1626674, 1418554, 1552889, 2012476, 1510575, 929169]
4951I29169J9252L64038N622k68502L3357M13400o20944k31208P02743J43483
4941A490410l3106m91780j00740k42413N9115P25401j77399o6488L81048j81684
4931A362364J20906n48849k48117M35153P3857j07678l80324J00576r7051K49152
4921I59989P807Q270K57786K948k50053O3466M38937N2290k84734K07322q7351
4910A376677L43047l03609J49136O240N0777n210L84316J24085m12158J73418
4900A886719l98079L925O2160O53147n27950l00881q5132M16597j8493n2415j53471
4889A486127k60946M12664j42408j22458j05695J56143L02836Q0794o91124N01215
4879A617148l70511J9106k13474L62473J83982L6467k37997J08680r8975q1719
$$ y = [929169, 948421, 1312459, 1318081, 1049579, 1082936, 1496336, 875392, 644184, 1346927, 1490410, 1457304, 965524, 864784, 622371, 681486, 1406887, 1229488, 1163000, 1544048, 1362364, 1483270, 934421, 686304, 1121457, 1195314, 1087636, 707312, 807888, 710837, 959989, 967796, 976066, 1233852, 1236800, 986747, 1050213, 1489150, 1541440, 1256706, 1464028, 1376677, 1719724, 1416115, 1565251, 1571491, 1622268, 1617058, 2001374, 2125459, 1713301, 1886719, 1488640, 1492565, 1554725, 2207872, 1679922, 1379041, 1293909, 1710506, 1692013, 1639598, 1486127, 1225181, 1637845, 1495437, 1372979, 1267284, 1423427, 1726263, 1807057, 1115933, 1617148, 1246637, 1265743, 1052269, 1414742, 1598724, 1635191, 1397194, 1505874, 1406899, 1325180]
4869A325180j25765R6683m12349p4093J71867J36612L68844n5361P1773J9673
4859A523064R8089k56718o5480l47398l3237k26347L93694J14347K68302l86809
4849A081507P3425j65337K10515o5237J48974R223l82790p2484L79083l8599P4385
4838A252665k63529k74331K81879J93183j0658m38089K32277Q6881p15403P1660
4828D16535K41489M76829l8461j4366q22K21215j61289l97600q183J08256r7321
4817G46282O7260p8648J07546O8276j97422K29001L37613k00734K57893O16092
4807A953159k86972k39642k02858q9045J72949N5842k8222j62951J31076M68845
4797A772181m24580k49754K36899P43564m92187m34216L82535k2693k38582j04450
$$ y = [1325180, 1199415, 1296098, 883749, 809656, 981523, 1118135, 1486979, 1431618, 1503391, 1523064, 1621153, 1364435, 1298955, 951557, 918320, 691973, 1085667, 1200014, 1468316, 1081507, 1154932, 989595, 1200110, 1134873, 1283847, 1293070, 910280, 837796, 1216879, 1178280, 1252665, 989136, 714805, 996684, 1189867, 1179209, 741120, 973397, 1060278, 344875, 416535, 658024, 1134853, 1096392, 1082026, 1081204, 1302419, 1141130, 743530, 735347, 843603, 746282, 813542, 734894, 842440, 910716, 713294, 942295, 1279908, 1079174, 1337067, 1953159, 1666187, 1426545, 1223687, 1134642, 1307591, 1363433, 1335211, 1172260, 1303336, 1772181, 1347601, 1097847, 1334746, 2078310, 1586123, 1151907, 1534442, 1511749, 1273167, 1168717]
4787A168717M64014J83818M7823q5063k31137N3778J47191j73875o15590J44072
4777A103748M05638N32464n14861k69980K01277K22732n28097L18148K69408m1563
4767A698914K40511j3915m3591k76619J15173R3188k04651M28565p6778n5008
4757A905789K22278j02544j27911L26406j09922j08412M7618j12971K62038O156
4747B208525Q4121R7103k46555k74617N92375J1551K08372k47445k09154N76968
4737B801244o36896p6081O17999J28415N23397O0912j41524K30063L7408j70547
4727C374390m12385K67414M44995k36995k42764j09488K37665R1699p6310j17480
4717C220741k29246j32291J13885O6589L52456j56365j02351K1494k0651M38365
$$ y = [1168717, 1632731, 1816549, 1864372, 1779309, 1548172, 1601950, 1749141, 1575266, 959676, 1103748, 1509386, 2041850, 1526989, 1257009, 1458286, 1681018, 1152921, 1471069, 1740477, 1698914, 1939425, 1925510, 1881919, 1605300, 1720473, 1813661, 1609010, 2037575, 1960797, 1905789, 2128067, 2025523, 1897612, 2224018, 2114096, 2005684, 2053302, 1940331, 2202369, 2208525, 2292646, 2389749, 2143194, 1868577, 2460952, 2472503, 2680875, 2433430, 2224276, 2801244, 2164348, 2088267, 2706266, 2834681, 3358078, 3418990, 3277466, 3507529, 3544937, 3374390, 2962005, 3229419, 3674414, 3437419, 3194655, 3085167, 3322832, 3414531, 3338221, 3220741, 2991495, 2859204, 2973089, 3039678, 3392134, 3235769, 3133418, 3154912, 3134261, 3572626]
4707C572626L6765q5132Q203n49223K46662J24873O6228R4257K85472O84206l92715
4696D092222Q3322k49538n54697J39153J38868m1541m7306N0966L62883J51457
4686D125789L74342p115m69971j21689J51522L44201K75180J97797m3346J30128
4676D956838K90867Q9940j62900L94511N16562k71360M78413K13170J47131K9378
4666F682550J9418L62812k49418J55733j86044N92295J76420J99L49170K19331
4656H122466J84329l46878k12400L77294J12955J95642L43197K95782K29737K73448
4646I575572L00678j07920J97294M62323J12118L45121L96023J98414M20272N15682
4636A2415577M27983K29282O41092M96531J04709P23951N33179N62246Q33831
$$ y = [3572626, 3609391, 3524259, 3532462, 2983239, 3229901, 3354774, 3421002, 3515259, 3800731, 4484937, 4092222, 4175544, 3926006, 3371309, 3510462, 3649330, 3607789, 3560483, 3611449, 3974332, 4125789, 4500131, 4493016, 4023045, 3901356, 4052878, 4397079, 4672259, 4870056, 4826710, 4956838, 5247705, 5337645, 5174745, 5569256, 6085818, 5814458, 6292871, 6506041, 6653172, 6682550, 6701968, 7064780, 6815362, 6971095, 6785051, 7377346, 7553766, 7553965, 7903135, 8122466, 8306795, 7959917, 7747517, 8124811, 8237766, 8433408, 8776605, 9072387, 9302124, 9575572, 9876250, 9768330, 9965624, 10427947, 10540065, 10885186, 11281209, 11479623, 11899895, 12415577, 12843560, 13072842, 13713934, 14210465, 14315174, 15039125, 15572304, 16134550, 16968381]
4627A6968381P67333M94974M31111J003391J046928R37573J013607J038427J163469
4618B4865194J468586J078395K161966J903721K238656L145005L290856M194566
4610D4346945M627244N125593M495091M089811L210004L282797L787611M134991
4602G7100087N439534O795079O601651N558036L215585J733271P2225J000889
4594A07516357L324746M924439N965425M171817O51969k533628n343588n839194
4586A12838343l696771k732545n08456m42789j961873m879671o298464p092766
4578H5225008o000855m860611l530411l298047l169934l874577n002312n100369
4570E0387892m766078m909941m094074k769402l063990k067834k006764j482245
$$ y = [16968381, 17735714, 18230688, 18661799, 19665190, 20712118, 21649691, 22663298, 23701725, 24865194, 26333780, 27412175, 29574141, 31477862, 33716518, 36861523, 40152379, 44346945, 48974189, 54099782, 58594873, 62684684, 65894688, 69177485, 72965096, 77100087, 82539621, 89334700, 95936351, 101494387, 104709972, 106443243, 106515468, 107516357, 110841103, 115765542, 121730967, 125902784, 126554753, 124021125, 118677537, 112838343, 109141572, 106409027, 105900571, 105457782, 103495909, 98616238, 92317774, 85225008, 79224153, 74363542, 70833131, 67535084, 64365150, 60490573, 55488261, 50387892, 45621814, 40711873, 36617799, 33848397, 30784407, 28716573, 26709809, 25227564]
4562B5227564j046963j395793j246385j170806j044261j023629l26876r76631
4554A6996220o46079k6037p83266o73037p46779o74913q24348K20741r9569n14671
4544A2228262Q4276o07441l93861Q4883m22127P5569q47444L8420K36475m2954
4534A0434058l94702q44477K25307j15566l11989K34195k01574l4016n25698m62525
4524H003013L63161j73236J02264K13916o5316J74542N84464p8230J1293n7902
4514I077969J8494K27081j74922l48001J59836K28241P3307o9266N0277J58959
4504I401975m31692K87187k98200P9422N7777j31426O09274K67434n3198L96855
4494A0185408Q22829K95224M03595j14353N6538L86879J04080m39793L64466L58
$$ y = [25227564, 24180601, 22784808, 21538423, 20367617, 19323356, 18299727, 17972851, 16996220, 16350141, 16324104, 15540838, 14867801, 14121022, 13446109, 12621761, 12842502, 12742933, 12228262, 12312538, 11705097, 11311236, 11396119, 10973992, 11049561, 10202117, 10240537, 10477012, 10434058, 10039356, 9194879, 9420186, 9304620, 8992631, 9226826, 9025252, 8991236, 8465538, 8003013, 8366174, 8192938, 8295202, 8509118, 8443802, 8618344, 9202808, 9124578, 9135871, 9077969, 9096463, 9323544, 9148622, 8800621, 8960457, 9188698, 9262005, 9192739, 9243016, 9401975, 8970283, 9257470, 8959270, 9038692, 9096469, 8965043, 9574317, 9841751, 9788553, 10185408, 11008237, 11303461, 11707056, 11592703, 11649241, 12036120, 12140200, 11700407, 12064873, 12065231]
4484A2065231l08275K03669l31432k6114J75845J09636l7520J22193q9253M98318
4474A2382298L5737L90667j56806K16836P60663O78314M98098M10129R04411M97448
4464A6617795N35557j62769Q83526L29447P34573K7088N45470P09510J027432
4455B1247629K60441J48869Q31512O05015Q61331N65869R46687R39564J230220
4446B7637137J095736J645545J437190J771755K854145L175201L643337N228496
4438D8488542P071641R887867J3685782J9078648K4640181K8787270K1535993
4431A73175924P986745n172703q124313l468858m177313j6040034k0078050j8010359
4423A06091039j7090176j4395963j1859514p927488o786134n015608m738504k937100
$$ y = [12065231, 11756956, 11960625, 11629193, 11603079, 11778924, 11888560, 11851040, 11973233, 11883980, 12382298, 12418035, 12808702, 12651896, 12868732, 13629395, 14307709, 14805807, 15215936, 16120347, 16617795, 17153352, 16990583, 17874109, 18203556, 18938129, 18965217, 19510687, 20220197, 21247629, 21508070, 21656939, 22488451, 23093466, 23954797, 24520666, 25467353, 26406917, 27637137, 28732873, 30378418, 31815608, 33587363, 36441508, 39616709, 43260046, 48488542, 55560183, 65448050, 79133832, 98212480, 122852661, 151639931, 173175924, 181162669, 175989966, 167865653, 164396795, 160219482, 144179448, 124101398, 106091039, 89000863, 74604900, 62745386, 54817898, 48031764, 43016156, 38277652, 35340552]
4415C5340552k560267k626385k203997j949784j770971j081222j232466j397906
4407B0517554q57515n26138q02394j178196j076381n94917m20184m55896n57291
4398A4048642l85987l88726o41541q65235m16035n25966l25191J58423m31669
4389A0226715o83225l48700l06689Q3414n19462m9533l34279o37118j94072j1885
4379G225166m83659J02459L40218l51751l57123N2868j81390l90225J26398k77535
4369E805426j63995J01280L65054l40691j94840l6479J46404L8332j79238j54974
4359E386279k18051l55898p5251O5105j38494j9461P0672k25580N0014J65541
4349D704876m25071l76886m31182P1301N1259L11054J20648l89722M47138m30660
$$ y = [35340552, 32780285, 30153900, 27949903, 26000119, 24229148, 23147926, 21915460, 20517554, 19660039, 19133901, 18331507, 17153311, 16076930, 15482013, 15061829, 14605933, 14048642, 13662655, 13273929, 12632388, 11767153, 11351118, 10825152, 10499961, 10658384, 10226715, 9543490, 9194790, 8888101, 8971515, 8452053, 8402520, 8068241, 7431123, 7237051, 7225166, 6741507, 6843966, 7184184, 6832433, 6475310, 6528178, 6346788, 5956563, 6082961, 5805426, 5641431, 5742711, 6107765, 5767074, 5572234, 5535755, 5682159, 5720491, 5541253, 5386279, 5168228, 4812330, 4737079, 4802184, 4663690, 4644229, 4714901, 4489321, 4539335, 4704876, 4279805, 3902919, 3471737, 3543038, 3594297, 3905351, 4025999, 3636277, 4083415, 3652755]
4339C652755j02828K8266J74894L98503o7336Q8343m46182K24750l50587Q1054
4329C681632P9653M278k04167l19677M7276L38002o1449m935K40437l83642j08763
4318C308645j97294N94368j17584K10626J3058n58741q6928M04195K05790N75892
4308D352027P7957m30271k45607O711Q9964r2122J9351M39025j57159l92832J59755
4297C826799L31149L61411l76710K59401J24247J04167m2003m16081K54694M0336
4287D467410k07348K79730M60493K32147l23999N7059o5965P5135k61015J68459
4277D882106K37884l70346M15634K39582N0964o0921k26829j98255J82625J01801
4267E254245r9739J94371M99416K77536j43563p46716K41688M80800q5037O5135
$$ y = [3652755, 3549927, 3578193, 3753087, 4151590, 4084254, 4172597, 3726415, 3951165, 3600578, 3681632, 3761285, 3765563, 3561396, 3241719, 3288995, 3626997, 3565548, 3560613, 3801050, 3417408, 3308645, 3111351, 3705719, 3588135, 3798761, 3811819, 3253078, 3166150, 3570345, 3776135, 4352027, 4429984, 3999713, 3754106, 3760817, 3850781, 3758659, 3778010, 4217035, 4059876, 3667044, 3826799, 4157948, 4519359, 4142649, 4402050, 4526297, 4630464, 4588461, 4172380, 4427074, 4467410, 4260062, 4539792, 5000285, 5232432, 4908433, 4965492, 4899527, 4974662, 4713647, 4882106, 5119990, 4749644, 5165278, 5404860, 5455824, 5394903, 5168074, 4969819, 5152444, 5254245, 5154506, 5348877, 5848293, 6125829, 5982266, 5235550, 5477238, 5958038, 5873001, 5938136]
4257E938136n3450M4342m7150Q3806O16261O26232J45148k05723j51060L3580
4247G030122L13912O7486k10053J30970N61440J09058K04117J24773K71335J77408
4237H780568j97293M49224L47318J89415R35776L31379k80211J39330J71071j37238
4227A0729339Q04089L58620P8879M71097N08033O26355j10846M53519L34693P33899
4217A4987677N62832k9534P05236J273313j65735O65805L06728N79792P57686
4208A9643800R87596J131546P27574J109166Q37482J007118J139639R41905J328228
4199B8854054J356897K129130J121239J310541K153305J458555J763649K483729
4191D2631099K449867K188975K338651K346840K898558L132941K697804K755454
$$ y = [5938136, 5884686, 5929028, 5881878, 5965684, 6581945, 7208177, 7353325, 7147602, 6996542, 7030122, 7344034, 7411520, 7201467, 7332437, 7893877, 8002935, 8207052, 8331825, 8603160, 8780568, 8583275, 9032499, 9379817, 9569232, 10505008, 10836387, 10556176, 10695506, 10866577, 10729339, 11533428, 11892048, 11970927, 12442024, 12950057, 13576412, 13465566, 13919085, 14253778, 14987677, 15550509, 15520975, 16226211, 17499524, 17333789, 17999594, 18306322, 18886114, 19643800, 20631396, 21762942, 22490516, 23599682, 24437164, 25444282, 26583921, 27525826, 28854054, 30210951, 32340081, 33461320, 34771861, 36925166, 38383721, 40147370, 42631099, 45080966, 47269941, 49608592, 51955432, 54853990, 57986931, 60684735, 63440189]
4183F3440189K720333K787360L275267L337186L336833K918603L978061L825844
4175H9619676L627145K700408L257698L209192L645487L498776K597651K358953
4167A14514986K098705K219982K516929K510422K308889J819670J464416J978461
4159A31432460J615735N72135P22558N76394K3875k48944j159736j738742j175907
4150A30619828o30990j672441j884161j668784k295882k017157k434667k718030
4142A15297716l445239k977927k957496l595766l121788l415789l563067l142842
4134H9077802l802669l184842l133899l199444l339489l258416l075045k507068
4126F3576930k839792l645987k526484k618768k929150l060567k466905k379867
$$ y = [63440189, 66160522, 68947882, 72223149, 75560335, 78897168, 81815771, 85793832, 89619676, 93246821, 95947229, 99204927, 102414119, 106059606, 109558382, 112156033, 114514986, 116613691, 118833673, 121350602, 123861024, 126169913, 127989583, 129453999, 131432460, 133048195, 133620330, 134342888, 134919282, 134943157, 134694213, 133534477, 131795735, 130619828, 129988838, 128316397, 126432236, 124763452, 122467570, 120450413, 118015746, 115297716, 111852477, 108874550, 105917054, 102321288, 99199500, 95783711, 92220644, 89077802, 85275133, 82090291, 78956392, 75756948, 72417459, 69159043, 66083998, 63576930, 60737138, 57091151, 54564667, 51945899, 49016749, 45956182, 43489277, 41109410]
4118D1109410k208238k324974j465579j854132j458844j576477j589941j631963
4110B6999262j288959j051526j320014j183652o94682r56118j088253o76070o31066
4101A8108922m12071p54753m96185l96810r89821k46894m38450m31339j94817
4092A3747782l00407n73952q23042O2529K7402K11544n8230o61895o83K12700
4082A1843748o36588n57333L91303K89726l16680k55383n41110j56637N2455K95122
4072A0408623J99978p54569P1934q3016k63235l29843m24555J90510J2904k54671
4062H774060P101j55102K31l8048p55114L02919K14285j72847k13005m43234J88735
4051G709981L09861j09425l06656j66679k04445K17211M09482j83615j47903k35292
$$ y = [41109410, 38901172, 36576198, 35110619, 33256487, 31797643, 30221166, 28631225, 26999262, 25710303, 24658777, 23338763, 22155111, 21460429, 20504311, 19416058, 18739988, 18108922, 17696851, 16942098, 16445913, 16049103, 15059282, 14812388, 14373938, 13942599, 13747782, 13447375, 12873423, 12050381, 12112910, 12140312, 12351856, 12293626, 11631731, 11631048, 11843748, 11207160, 10649827, 11041130, 11330856, 11014176, 10758793, 10217683, 10061046, 10113501, 10408623, 10608601, 9854032, 9925966, 9842950, 9579715, 9249872, 8825317, 9015827, 9028731, 8774060, 8781161, 8626059, 8626290, 8588242, 7833128, 8136047, 8350332, 8177485, 7964480, 7521246, 7709981, 8019842, 7910417, 7603761, 7437082, 7232637, 7449848, 7859330, 7675715, 7527812, 7292520]
4041G292520K28352P8230K47319k5958k3085k80579r930j71892J70718K46976
4031G752671M22213n4343m10660K44025k5735n29419m92911N56413q0027p2091
4021G310136l89489P751L94800N25473j84719m79481j49576K07340n5467m8452
4011G138316J18060l54830l08159J13750J66346l35601k83507K99094k13083p0609
4001F269777J84729l89229k2705n14710K98897J6711O4355N2114K13723k74682
3991E898980m36336K6125j47541K50871j09005j33869j17826L54409K62077j24945
3981E722940k57827J17116N15027m30498r7442M65130j7148o88576L65414L87902
3971F082038M30217N05028k06199K76567q8463m25138j19740K54644l23250J16978
$$ y = [7292520, 7520872, 7599102, 7846421, 7820463, 7797378, 7516799, 7506869, 7334977, 7505695, 7752671, 8174884, 8120541, 7709881, 7953906, 7928171, 7398752, 6905841, 7462254, 7382227, 7310136, 6920647, 6928398, 7323198, 7848671, 7663952, 7184471, 7034895, 7242235, 7186768, 7138316, 7256376, 6901546, 6593387, 6707137, 6873483, 6537882, 6254375, 6553469, 6340386, 6269777, 6454506, 6065277, 6042572, 5527862, 5826759, 5843470, 5907825, 5959939, 6173662, 5898980, 5462644, 5488769, 5341228, 5592099, 5483094, 5349225, 5231399, 5585808, 5847885, 5722940, 5465113, 5582229, 6097256, 5666758, 5569316, 6034446, 6017298, 5328722, 5694136, 6082038, 6512255, 7017283, 6811084, 7087651, 6999188, 6574050, 6454310, 6708954, 6385704, 6502682]
3961F502682L70559K19927m40006J77004N62475K29771R39K53162m21919O4208
3951G518802R3384K61199j2106o2028M005j24541N20341K97897l1996j66523L09190
3940H607624M11198m73072O98K29131m477K03834L72071K08232k78596k14905
3930I061738j66039O50454M27022Q9634k17850O2185j9453J000040o63744k37943
3920I986044O03380J18201J77041Q4168m8805O48616K3324R9143L82614Q6465
3910A2160191L65266J55304M6650J16328K57227j29330L24624K32771K99037K10559
3900A4038627J04767L66636L89117l52783M24819K65587j65894L0527P8106O81398
3890A5860907p9486K15634P6264k50987Q28461P21639L47765L70445O34912M67034
$$ y = [6502682, 6873241, 7093168, 6653162, 6830166, 7392641, 7622412, 7623351, 7876513, 7454594, 7518802, 7612186, 7873385, 7861279, 7799251, 7803256, 7678715, 8199056, 8496953, 8464957, 8298434, 8607624, 9018822, 8545750, 8546448, 8775579, 8771102, 8974936, 9347007, 9555239, 9276643, 9061738, 8895699, 9546153, 9973175, 10062809, 9844959, 9907144, 9887691, 10887731, 10223987, 9986044, 10589424, 10707625, 10884666, 10968834, 10920029, 11568645, 11591969, 11691112, 12073726, 12160191, 12525457, 12680761, 12727411, 12843739, 13100966, 12971636, 13296260, 13529031, 13828068, 14038627, 14143394, 14510030, 14899147, 14546364, 14971183, 15236770, 15070876, 15101403, 15179509, 15860907, 15781421, 15997055, 16073319, 15822332, 16650793, 17372432, 17720197, 18090642, 18725554, 19192588]
3880A9192588N49959Q9185N24237N87537P85063J91738Q5234R90638R41276j47900
3870B3789555N24958Q18011P18975J119377P63199P29322M41084M85484R59388
3861C0349353J270242O29567J026716O49421J291826J259499J028782Q31833J023986
3852C9361225J417247R10093J510140J640460J552327J577324J565022K450464
3844E1984302K182295J596469J846052J905843K010428K632875K443210J900439
3836F8501913K169325K623375K234536K246548K561867K584240K881261K361004
3828H8164069K718032K685337K585055K548093K412142K767518K452515K329246
3820A08662007L388838K721358K805514K751063K806064L545214L138604L659434
$$ y = [19192588, 19742547, 19831732, 20355969, 20943506, 21728569, 21920307, 22005541, 22996179, 23937455, 23789555, 24314513, 25132524, 25851499, 26970876, 27734075, 28463397, 28904481, 29389965, 30349353, 31619595, 32249162, 33275878, 33925299, 35217125, 36476624, 37505406, 38337239, 39361225, 40778472, 41688565, 43198705, 44839165, 46391492, 47968816, 49533838, 51984302, 54166597, 55763066, 57609118, 59514961, 61525389, 64158264, 66601474, 68501913, 70671238, 73294613, 75529149, 77775697, 80337564, 82921804, 85803065, 88164069, 90882101, 93567438, 96152493, 98700586, 101112728, 103880246, 106332761, 108662007, 112050845, 114772203, 117577717, 120328780, 123134844, 126680058, 129818662, 133478096]
3812A33478096M395268N028647N819819O122348P110829Q023240R271114J0257413
3804A89506774J2735367J4700348J6832369J8888357K1064757K3387928K4879628
3797C21995528K5055410K4241878K2807813K0560223J7132728J3701030J0793238
3790D56287848P287583O487070N634472N185231M983895N063237N079865M887655
3782E00896856L701030J706061j200307m319140p176980j1104973j3353780j5317821
3774D53830946j6382357j6507345j7217857j6168437j5120993j4628394j3176186
3767C44629377j1698048j1760595j0168906q608529q145984p420628n775986n393623
3759B75657078m812336m354991l488945l277289l651558k903270k787118l710528
$$ y = [133478096, 137873364, 142902011, 148721830, 154844178, 161955007, 169978247, 179249361, 189506774, 202242141, 216942489, 233774858, 252663215, 273727972, 297115900, 321995528, 347050938, 371292816, 394100629, 414660852, 431793580, 445494610, 456287848, 463575431, 470062501, 475696973, 480882204, 485866099, 490929336, 496009201, 500896856, 504597886, 506303947, 505103640, 500784500, 493607520, 482502547, 469148767, 453830946, 437448589, 420941244, 403723387, 387554950, 372433957, 357805563, 344629377, 332931329, 321170734, 311001828, 302393299, 294247315, 286826687, 281050701, 275657078, 270844742, 266489751, 263000806, 259723517, 256071959, 253168689, 250381571, 246671043]
3751B46671043l896473l978782l601167l061968l237675k553381j940737j916231
3743B22484629j825292j998384k392783k610718l057366l532401m086566m440343
3735A98540776m938906m399383n091680n790015n077193n605875n953929n533356
3727A56150439m935450n253119m972006n472082n717114m976195n586104n708031
3719A13530338n059740n251179n032815m734619m619741m505220m204703l533931
3711G6588390l196173k391557k217263k537857j904564j388937r51188j098052
3703F0902799p48127l62788r82483o46386j04420K2916o28085o98983k96846l00236
3693E6157361j99654J9871o84318m9420J43063P5838k56534j35467M3377k32557
$$ y = [246671043, 242774570, 238795788, 235194621, 232132653, 228894978, 226341597, 224400860, 222484629, 220659337, 218660953, 216268170, 213657452, 210600086, 207067685, 202981119, 198540776, 193601870, 189202487, 184110807, 178320792, 173243599, 167637724, 161683795, 156150439, 151214989, 145961870, 140989864, 135517782, 129800668, 124824473, 119238369, 113530338, 108470598, 103219419, 98186604, 93451985, 88832244, 84327024, 80122321, 76588390, 73392217, 71000660, 68783397, 66245540, 64340976, 62952039, 62000851, 60902799, 60154672, 59791884, 58809401, 58163015, 58058595, 58081511, 57453426, 56754443, 56457597, 56157361, 55957707, 55977578, 55293260, 55243840, 55386903, 55462741, 55206207, 55070740, 55114117, 54881560]
3683E4881560r68391o82091q73899q17783q07085j282893j849067j655205j402182
3674D4542964j041151j504328j193654j394872j360626p39687j121305j365970
3666C4821371q57455j125141j430964j648205j110697j243504j315703j121774
3658B4967928j486051j068799q48773n82555j102754q55867m13193l01214q54320
3649A7454402o89083n68845k32245n96157l73216k25622k00393m31083j19816
3640A4017942p33368m12013m51929o23437o65226K0977m12414k80986r1978m30203
3630I937365n02830j7759K95765r9090n29532p33420m17543r6962o1506J64332
3620G938820R0658n42785k14862o08266j45036j14183l05845J24133J63406l7537
$$ y = [54881560, 53913169, 53231078, 52357179, 51539396, 50732311, 49449418, 47600351, 45945146, 44542964, 43501813, 41997485, 40803831, 39408959, 38048333, 37308646, 36187341, 34821371, 33963916, 32838775, 31407811, 29759606, 28648909, 27405405, 26089702, 24967928, 23481877, 22413078, 21564305, 20981750, 19878996, 19023129, 18609936, 18308722, 17454402, 16765319, 16196474, 15964229, 15368072, 14994856, 14769234, 14568841, 14137758, 14017942, 13284574, 12872561, 12420632, 11797195, 11131969, 11152946, 10740532, 10459546, 10367568, 9937365, 9434535, 9416776, 9712541, 9613451, 9083919, 8350499, 7932956, 7835994, 7774488, 7938820, 8029478, 7486693, 7271831, 6663565, 6518529, 6404346, 6098501, 6222634, 6386040, 6348503]
3610F348503j19383J03089n9438j51661k60618M52842p8691j43953o5763q34070
3600E190857L41494K97948n02484J19694J24449n48875o1118J2093M0825O3967
3590E078850M39805l08872m35325j48499j27017N21487K60296n30276k37312j78918
3580D334219Q3473P8259K2199L50154l56177n47896K9865J53720J48881m04122
3570C892575p0783o1114k47118K0114k3753l43953K3344L42716k2676k12941j0248
3559C286163q3725K86394k75199m96827J02858L71270Q5102l02327K20728K58610
3549C453047k88503m83560j6173J33728Q6682j73068K25090k06041O31972j75271
3539C187903k63250J01447m08443L5876k17097K87826L09566o388k5520L79638
$$ y = [6348503, 6229120, 6332209, 6272771, 6121110, 5860492, 6313334, 6234643, 6090690, 6024927, 5190857, 5532351, 5830299, 5327815, 5447509, 5571958, 5023083, 4961965, 4974058, 5014883, 5078850, 5518655, 5209783, 4774458, 4625959, 4498942, 5020429, 5280725, 4750449, 4513137, 4334219, 4417692, 4495951, 4518150, 4868304, 4512127, 3964231, 3994096, 4147816, 4296697, 3892575, 3821792, 3760678, 3513560, 3533674, 3509921, 3165968, 3189312, 3532028, 3509352, 3296411, 3286163, 3202438, 3488832, 3213633, 2716806, 2819664, 3190934, 3276036, 2973709, 3194437, 3453047, 3164544, 2680984, 2664811, 2798539, 2885221, 2712153, 2937243, 2731202, 3363174, 3187903, 2924653, 3026100, 2617657, 2653533, 2436436, 2724262, 3033828, 3027440, 3001920, 3381558]
3529C381558j37650J00695l04182l34956L42954j98600Q6239l746l91301l4174
3519B506837K01893j1861r3087L89658K96939j16006L59333K07361o11286J42640
3509C272421P43165N02778k09652q3244J98858l67464l83295k45869P52744K18306
3499D398748N2914j47753n15527k04284N85745J62048J8401n2192n842l37993
3489C954265P0868M14677k61975m88869N84407M54087m81016m54855j57251L46660
3479C980998J74275l17277l98812L27887K73500j70382n37582K04182L8368m91768
3469C083389j74089M17213K83569J13481l84692q7143M914N01694R0612l93299
3459C455649k65284K94459N13214k76371k98593k71811J08683J76534J37744M11254
$$ y = [3381558, 3243908, 3344603, 3040421, 2705465, 3048419, 2849819, 2936058, 2932312, 2541011, 2506837, 2708730, 2696869, 2603782, 2993440, 3290379, 3174373, 3533706, 3741067, 3129781, 3272421, 4015586, 4518364, 4308712, 4225468, 4424326, 4056862, 3673567, 3427698, 4180442, 4398748, 4451662, 4303909, 3788382, 3584098, 4169843, 4331891, 4350292, 4298100, 4292258, 3954265, 4025133, 4439810, 4177835, 3688966, 4273373, 4727460, 4246444, 3791589, 3634338, 3980998, 4155273, 3837996, 3439184, 3767071, 4040571, 3870189, 3332607, 3536789, 3575157, 3083389, 2909300, 3326513, 3610082, 3723563, 3338871, 3251728, 3256642, 3758336, 3848948, 3455649, 3190365, 3484824, 3998038, 3721667, 3423074, 3151263, 3259946, 3436480, 3574224, 3985478]
3449C985478k33809n53504j16569j17375J92012N85757M02602J47628J96928l40017
3439D149131o9346J69975J62827o0349K42278m91315k19992J17016p8571J24474
3429D046128K17777K6018j42818P3861m5290k98045J6180J54399J10057O62108
3419D820375K09731J86697n5567K96500N00137O45916L40357J08371N06167J18506
3409G677190L41256N68484q376J7749L01448j42068O414p119l80774J69935j37186
3398H406953J22740K84068K5417R2957k13569n80713j73971l27921p20970o41254
3388F273737J5711J02538o21106p07624L9706m32656o59440K91006l02662m9346
3378C949864K91903m57933k08679l14352k32065K48074l12159J63361r1368k30333
$$ y = [3985478, 3751669, 3198165, 3081596, 2964221, 3156233, 3741990, 4144592, 4292220, 4489148, 4149131, 4079785, 4249760, 4412587, 4352238, 4594516, 4103201, 3883209, 4000225, 3921654, 4046128, 4263905, 4289923, 4147105, 4220966, 4175676, 3877631, 3893811, 4048210, 4158267, 4820375, 5030106, 5216803, 5161236, 5457736, 5957873, 6603789, 6944146, 7052517, 7558684, 7677190, 8018446, 8586930, 8578554, 8596303, 8897751, 8755683, 8762097, 8754978, 8374204, 8544139, 8406953, 8529693, 8813761, 8839178, 8932135, 8718566, 8137853, 7963882, 7635961, 6914991, 6273737, 6289448, 6391986, 5770880, 5063256, 5102962, 4670306, 4010866, 4301872, 3999210, 3949864, 4241767, 3783834, 3575155, 3260803, 3028738, 3276812, 2964653, 3128014, 3036646, 2806313]
3368B806313n3055m12114K15984L09357O5801k76864p8275J12185J14909j96488
3358B607753K2548J61680K21671L22661n07195l62215J30440j61334r7066l41188
3348A997755Q0954o7294k94740K3731J76945p5125m44028k95609K85576L0750
3338A418915K80866l20488j39303L23108j50529M26938m7008o38971j58389L49622
3328A344761J0229K65911m69565q7284J34102K21546R9342O8360n84330m05151
3318E97921K25986K60395k58448J13595K15915m13081J20739L35639J56233K06803
3308A561697J34570k04418j98105l22607j27086M60757p7122K03307n0206k38456
3298A142331M9223l58892J55259N96034l55487o1592O4455k6330N102l94740M66818
$$ y = [2806313, 2753258, 2341144, 2557128, 2866485, 2932286, 2655422, 2577147, 2689332, 2804241, 2607753, 2630301, 2791981, 3013652, 3336313, 2829118, 2466903, 2597343, 2436009, 2338943, 1997755, 2078709, 2011415, 1716675, 1740406, 1917351, 1842226, 1398198, 1102589, 1388165, 1418915, 1699781, 1379293, 1239990, 1563098, 1412569, 1839507, 1792499, 1153528, 995139, 1344761, 1354990, 1620901, 1151336, 1064052, 1198154, 1419700, 1519042, 1587402, 1003072, 597921, 823907, 1084302, 825854, 939449, 1155364, 742283, 863022, 1198661, 1354894, 1561697, 1696267, 1491849, 1293744, 971137, 844051, 1304808, 1227686, 1430993, 1380787, 1142331, 1191554, 832662, 987921, 1583955, 1228468, 1166876, 1231331, 1205001, 1210103, 815363, 1282181]
3287A282181k2617l90021N35766O6813k93567N45357P1230p52594L23028O96285
3277B061861m53572P32281O27758L31483P68196M04717k74359k48772M5272o02997
3267C391868j81344m42303m60827n86194l48893J28509j09605K3217P9933K17656
3257A712017j57448P3240l79091J83695L21746l1941L06789L81285k55303M16361
3247B571350M21396j13522M89363L99137r3422r7511J25538J39929K79796n69315
3237C552739K59506Q7816l10571p30001l24082J0910m75494j56005j95849j68089
3227A550880l90655K0201O739K32082O25726l71355k41122j73998j7567J68025
3217A408956L1156n72765L32537M25788J20418k29474m70139P7210L42633J82839
$$ y = [1282181, 1259564, 869543, 1405309, 1472122, 1178555, 1723912, 1795142, 1042548, 1365576, 2061861, 1608289, 2340570, 2968328, 3299811, 4068007, 4472724, 4198365, 3949593, 3994865, 3391868, 3210524, 2768221, 2307394, 1721200, 1372307, 1500816, 1391211, 1414428, 1494361, 1712017, 1554569, 1627809, 1248718, 1432413, 1754159, 1722218, 2029007, 2410292, 2154989, 2571350, 2992746, 2879224, 3368587, 3767724, 3674302, 3576791, 3702329, 3842258, 4122054, 3552739, 3812245, 3900061, 3589490, 2859489, 2535407, 2546317, 2070823, 1914818, 1718969, 1550880, 1160225, 1180426, 1187165, 1419247, 2044973, 1673618, 1432496, 1258498, 1240931, 1408956, 1440112, 867347, 1199884, 1625672, 1746090, 1516616, 1046477, 1123687, 1466320, 1649159]
3207A649159n58689K56851J44396K02321o1957L750l70888m98212K19785J44615
3197A131131j65308l3302j26015n91085m164N29786j63482k0859J46568j56716
3187E46554K38621M40591j81232p7863l09482j28447k73399J68357l4597K28694
3177F17797L10088Q4231j75028k47309j20687L5225J65746l31256K78260J1793
3167F28860k94157k6701J37736J36051N0824O4993l02778L622j27234K31716r5440
3156D07492j83100p0602M3866q4709P4074M27587l7782K94859l76137k56640M78203
3145G17111k02978j16909L45565k99509J16258K06459J68483J49551l45804l19421
3135D18806J1988j02800L33258j32953o4046J14326Q20364k25631n37730K69965
$$ y = [1649159, 1090470, 1347321, 1491717, 1694038, 1632081, 1635831, 1264943, 766731, 986516, 1131131, 965823, 932521, 806506, 215421, 211257, 741043, 577561, 556702, 703270, 546554, 785175, 1225766, 1044534, 966671, 657189, 528742, 255343, 423700, 389103, 617797, 927885, 1012116, 837088, 589779, 469092, 504317, 670063, 338807, 617067, 628860, 334703, 308002, 445738, 581789, 632613, 697606, 394828, 398450, 271216, 502932, 407492, 224392, 153790, 197656, 112947, 187021, 614608, 576826, 871685, 495548, 238908, 717111, 514133, 397224, 742789, 443280, 559538, 765997, 934480, 1084031, 738227, 418806, 430794, 327994, 661252, 528299, 464253, 578579, 1398943, 1173312, 635582, 905547]
3125I05547R5399n18388P1586K44714m85781J29486J92360L81459l370m76585
3115E36427M45327J29585l30869J12335j046j64914k78303P97894j97170j74091
3105H75175j31301k05883K30818O7065k22195j24271L32908k03579l10912J26913
3095D34738K73685l6415k21143J23254K4108P5706J43649k32447J60644O6877
3085H12656N69783o33198l42786K0162K24038j44630k62618r7755N135K4414j22186
3074E3015L66133N7222l5526k49797k19727K45387L09790k59266J44104r6625
3064C14710N0572k84216k10668M57833k71276N80578J22792j69331J21279k43657
3054D68616K7894k62700j10105M06356k10951R3820o7848n24026K51139K34213
$$ y = [905547, 1000946, 482558, 554144, 798858, 313077, 442563, 634923, 1016382, 1013012, 536427, 981754, 1111339, 780470, 892805, 891759, 726845, 448542, 1246436, 1049266, 875175, 743874, 537991, 768809, 835874, 613679, 489408, 822316, 618737, 307825, 434738, 708423, 672008, 450865, 574119, 598227, 673933, 817582, 585135, 745779, 812656, 1382439, 749241, 406455, 426617, 650655, 506025, 243407, 145652, 150787, 175201, 53015, 419148, 476370, 440844, 191047, -28680, 216707, 526497, 267231, 411335, 314710, 365282, 81066, -129602, 328231, 56955, 637533, 760325, 590994, 712273, 468616, 496510, 233810, 123705, 530061, 319110, 412930, 345082, -178944, 72195, 306408]
3044C06408J20814n10421J55713J19618r6282L28211J56320K95231l48380o6094
3034D61138m3052n46486j42642N0069Q4946L90395j42822q0227K80860k51478
3024F0701K98931j578L4570p9336m03095K8517M5147M8159M58130j28296j20102
3013B41748m23933j69574L89009L21671l22568J12983M95281m61431j83959N314
3003D541j12514J88554L41650M0107J06471k89314j01331l15254q1109n82599
2993h00798M56245O09596K27299L15929k07115k59239J63467n73798l58478M78906
2983E2014o0018l9544j13064N39851r4191Q0054J5964M2345j27148Q9105l15759
2972F9609j37769m6656J48893J56457K42644j4906j3707k04032q9213K06924j53166
$$ y = [306408, 427222, -83199, 72514, 192132, 95850, 424061, 580381, 875612, 527232, 461138, 418086, -128400, -271042, -220973, -136027, 254368, 111546, 31319, 312179, 60701, 359632, 358054, 392624, 313288, -89807, -61290, -16143, 32016, 490146, 361850, 241748, -182185, -351759, 37250, 358921, 36353, 149336, 644617, 183186, -773, 4541, -107973, 80581, 422231, 462338, 568809, 279495, 178164, -137090, -218199, -800798, -344553, 265043, 492342, 808271, 601156, 341917, 505384, -68414, -426892, 52014, -8004, -47548, -160612, 379239, 285048, 365102, 381066, 423411, 296263, 385368, 69609, -68160, -114816, 34077, 190534, 433178, 418272, 404565, 200533, 111320, 318244, 165078]
2961A65078j25162O1213m42942K17326J98923L70469N6365K211k4451k04390k27549
2950D7091J32063r5707n19362J96732L67052N19755J25246l85391J9623K46835
2940F53937n57274q8736J87687J89252q5874P0628m95568k28946O65164o42713
2930c32443j21601M77474l07416j9452M533K4967k05461L11120K4894M71388k38469
2919H9534l74100M34585j26858n01593J41713Q5888k11395J72213k19854q6996
2909e96863M27111L1425J4655j67674M64013M0222l70640L11028l04647O1086
2899i0284O7333m03109O99985p3103n1536M7075J19059L8595J25415j63260m14477
2888i8307j87752R0437l26866Q0189P8811k30773k119J16371J56339K08239p4068
$$ y = [165078, 39916, 101129, -341813, -124487, 74436, 444905, 501270, 503481, 479030, 274640, 47091, 179154, 83447, -435915, -239183, 127869, 647624, 772870, 387479, 407102, 653937, 96663, 7927, 195614, 384866, 298992, 369620, -125948, -354894, 310270, -332443, -454044, 23430, -283986, -303438, -298905, -273938, -479399, -168279, -143385, 328003, 89534, -284566, 150019, 23161, -478432, -336719, -250831, -462226, -290013, -509867, -596863, -169752, -138327, -123672, -291346, 172667, 212889, -157751, 153277, -151370, -90284, -22951, -426060, 273925, 200822, 149286, 196361, 315420, 354015, 479430, 316170, -98307, -286059, -195622, -522488, -442299, -363488, -594261, -596380, -480009, -323670, -115431, -189499]
2877a89499N2472l88573Q3336J93341j3914j39562K69896M02921k47723l56810
2867c34115j4111J84418j03837M56174K16373P912m21576j45613j41358j19714
2857d15447L89354m9280m25545L82084Q8607j52808j54641O5637j88801k22428
2847f83268j55949J23073M02321K89164M1684n31790K2534L54055m05489J75777
2837c67888J83986p841q007J44451j85535j14505K14781J793K24853K39006m27702
2826a02608k23111j86362K79822M00570L07737J42445k72649l26773K04112k43141
2816a9958L50080k77479K43275j25065n00330j45114J75837M88126Q7029J09507
2806C85908j57043J17788O9018O3251M27394l49826j43516j04585k82784L8928
$$ y = [-189499, -137027, -525600, -442264, -248923, -262837, -402399, -132503, 270418, 22695, -334115, -348226, -163808, -267645, 188529, 404902, 412814, -8762, -154375, -295733, -415447, -26093, -75373, -500918, -118834, -30227, -183035, -337676, -272039, -460840, -683268, -839217, -716144, -313823, -24659, 17025, -514765, -492231, -138176, -543665, -367888, -183902, -191743, -199750, -55299, -240834, -355339, -140558, -138765, 86088, 325094, -102608, -325719, -512081, -232259, 168311, 476048, 618493, 345844, 19071, 223183, -19958, 330122, 52643, 295918, 170853, -329477, -474591, -298754, 189372, 276401, 385908, 228865, 346653, 415671, 478922, 906316, 556490, 412974, 308389, 25605, 64533]
2796F4533j87663l37011L36518K0060j47607n1712k06992J82677r4874J79784
2786b42287k06522J76704L17820R4627j85499J70877j02130J36417J45681q4116
2776B21572L09889k41577m63142J6690M22719j43281n35484N89507l01522m59952
2766e84581L33976J88766j48076p6187J68607J68569l22336K67735j79659l4932
2756b18118M04090j32814N4741l03583J27466m8437j70342J97135K67218k59505
2746h2149k22757J96341l73424l5135M1435O52935l02783k19352L60043m38809
2736d23655O9988M04491m90833j66058M01307j17764n14813K49686M11849l5413
2726b11215r4015m59663O6387K75994K13489N0297k13979K32110k4977q990j33919
$$ y = [64533, -123130, -460141, -123623, -103563, -251170, -302882, -509874, -327197, -422071, -242287, -448809, -272105, 45715, 140342, -45157, 125720, 23590, 160007, 305688, 221572, 531461, 289884, -173258, -156568, 266151, 122870, -412614, 176893, -124629, -584581, -250605, -61839, -209915, -286102, -117495, 51074, -271262, -3527, -183186, -218118, 185972, 53158, 107899, -195684, -68218, -116655, -286997, -89862, 177356, -82149, -304906, -108565, -481989, -517124, -475689, 177246, -125537, -344889, 15154, -423655, -353667, 50824, -440009, -606067, -204760, -322524, -837337, -587651, -175802, -211215, -305230, -764893, -698506, -422512, -209023, -158726, -372705, -140595, -165572, -174562, -308481]
2715c08481O6881J56709l77518J13945L47288n41384J58848L02049K05961j42182
2705a7884m72267J35222L46182l8229l03504M18350J50774l02226J17685P8356
2695A12459k63871m08027o3305J48748J23028L50726l8211K49638m8908l11135
2685a48858K25129j09105k49833n5065l20130K0909K51020K65826j81536K47275
2675e4368K29981K18749k23543n26333M21325j5453o140J72937n4923J81262j14980
2664B28514k20903M23100K4312k49771j62931m4702J65928p6575K65710r6264
2654B56418k54190K6599j25445J57832O06671j09077k71808k34637M07077j54784
2644C04656p2760l37905R2189P5110j42539L6228L4030k5618l54670P6067L17333
$$ y = [-308481, -241600, -84891, -462409, -348464, -1176, -542560, -383712, -81663, 124298, -17884, -490151, -354929, -8747, -46976, -350480, 67870, 218644, -83582, 34103, 112459, -151412, -559439, -622744, -473996, -350968, -242, -38453, 211185, 162277, -148858, 76271, -32834, -282667, -337732, -657862, -636953, -385933, -120107, -301643, -54368, 175613, 394362, 170819, -355514, 65811, 50358, 44218, 217155, 162232, 343494, 228514, 7611, 430711, 455023, 205252, 42321, -2381, 163547, 86972, 352682, 256418, 2228, 28827, -96618, 61214, 667885, 558808, 287000, 52363, 459440, 304656, 231896, -106009, -13820, 61290, -81249, -45021, -10991, -36609, -391279, -315212, 2121]
2633B121j77626K43010K86501l5655k02519k24131j6844Q0192l08134k96174J36673
2622e12586o2630K76201L43979J22613K83355j69622q4252M7738J55585q7265
2612C13116m52135J15078M95891j60811P3745o1523J31382j33810n37331q6021
2602c02419j81966k91211L40652J12192K05179L28684m20719j8487k83072K57887
2592b53280k39743l6151n6999M35858K07515O57349J05581l73586k49965p5258
2582A21321Q1665K06049j1090l26100O4140j08195l30531K5422q6629O19673J23918
2571C79643q7270j26966k94571n9382N51170r4316j2436J32235j99505k5675r6943
2560F5984m17555L01299K9706N1213J47332J15676Q6475m02553M1079m7780k45414
$$ y = [2121, -175505, 67505, 354006, 318351, 115832, -108299, -125143, -44951, -353085, -649259, -512586, -575216, -299015, 44964, 167577, 450932, 281310, 197058, 244796, 400381, 313116, -139019, -23941, 471950, 311139, 384884, 323361, 454743, 320933, -216398, -302419, -484385, -775596, -434944, -322752, -117573, 211111, -209608, -228095, -511167, -253280, -493023, -529174, -586173, -150315, 57200, 714549, 820130, 446544, 196579, 121321, 202986, 409035, 397945, 71845, 135985, 27790, -302741, -277319, -363948, 255725, 379643, 292373, 165407, -129164, -188546, 362624, 268308, 255872, 388107, 188602, 162927, 65984, -351571, -50272, -20566, 30647, 177979, 293655, 380130, -22423, 18656, -29124, -274538]
2549b74538j91137L22229K03129J71583j38761J1060j072j41599j66399J75760
2539b9745p2939J26642K51891p6708j35264k69547K6888K75095k12865J26596
2529A0044j57710k48276L66150l70989j8444J57099n30276Q5808M2509L64478
2519b99607m81924j08022P63204j01810L19111J33261m53207k07097k31665O34743
2509c3013O1597q9024l67706R205J83727m5905J57613m2054m1026j63074L91663
2498B2003J33796k5877K16248J34239l25244k62724L0662J43568O3267J24966
2488B54904m7226j93394O4060j94349J43491M43538m17003j24249m06395L28893
2478a47730R5912K31651L30344r5107o3608j19111j62030k69147P59377L12516
$$ y = [-274538, -465675, -143446, 59683, 231266, 92505, 103565, 102493, -39106, -205505, -29745, -102684, 23958, 275849, 199141, 63877, -205670, -178782, 96313, -116552, 10044, -147666, -395942, -29792, -400781, -419225, -262126, -792402, -706594, -664085, -299607, -781531, -889553, -126349, -228159, 90952, 224213, -228994, -436091, -667756, -33013, 28584, -60440, -428146, -418941, -235214, -281119, -123506, -165560, -206586, -369660, 22003, 155799, 129922, 346170, 480409, 155165, -107559, -76897, 66671, 129938, 254904, 207678, 14284, 78344, -116005, 27486, 471024, 54021, -70228, -476623, -147730, -51818, 179833, 510177, 415070, 351462, 232351, 70321, -198826, 560551, 873067]
2468H73067K62721l53244j65326j61450R952j81057o29851q6996M30304o6861
2458f8741K00544R2824K58562m27076l1529N74868o41403M73967N8872l93229
2448I7659L01325J10418j787n27384Q290l56466O6361M43174k86815K65873j02806
2437A7842m15639J55657K64446r9671K02873M12778q5617J69155L83512J84306
2427A189642j92959l35995l64003j25191L48885J00408n516j40634m2482k59109
2417A73046R4755j3144J61499Q4188n2484J18677J7543m28285j19906O83042j87598
2406E31333L6872j23494r9910J09182J07679L82969l3066O2438j6834m34630k36371
2395B86168M28408M21945J9342r0880j52389n12906Q7146L43259K24388k55992
$$ y = [873067, 1135788, 782544, 617218, 455768, 465720, 284663, -345188, -432184, -1880, -68741, 131803, 224627, 483189, 56113, 24584, 599452, -41951, 432016, 490888, 97659, 398984, 509402, 507615, -19769, -11479, -367945, -301584, 141590, -145225, 120648, 17842, -397797, -242140, 22306, -77365, 125508, 538286, 452669, 621824, 1005336, 1189642, 996683, 660688, 296685, 171494, 520379, 620787, 615271, 474637, 432155, 173046, 267801, 254657, 416156, 500344, 447860, 566537, 584080, 155795, 35889, 718931, 531333, 568205, 444711, 344801, 453983, 561662, 944631, 911565, 974003, 957169, 522539, 286168, 714576, 1136521, 1155863, 1064983, 912594, 399688, 486834, 830093, 1054481, 798489]
2385G98489J58429p582L87026j65342p8636p6213k9341K89205k38748P7018O47281
2374A761586j31102j3471J01869l0076j60686K28066j79888O1016O4832L5046
2364A737192L28534K47941J98482k4426R0690k60705L65543j02958j2173l48206
2354B219914L28934J81468J97042M03860n3437M8221N33592J09451j26288J97513
2344D040270j22857J66245L48220M61346l56646J33493O08593J92537O56245M29092
2334F556538J36606M35244J079675N28442K83830L99026O29112Q80533J482831
2325A2411837J281242K082298K494001L415885M344959N708546P656709R540470
2317D8935947P326837J301974n610160j0082033q341572o296375m661942k968203
$$ y = [798489, 956918, 949336, 1336362, 1171020, 1092384, 1016171, 986830, 1276035, 1037287, 1114305, 1761586, 1630484, 1617013, 1718882, 1688806, 1528120, 1756186, 1576298, 1637314, 1702146, 1737192, 2065726, 2313667, 2512149, 2487723, 2578413, 2317708, 2683251, 2580293, 2568120, 2219914, 2548848, 2730316, 2927358, 3331218, 3277781, 3326002, 3859594, 3969045, 3842757, 4040270, 3917413, 4083658, 4431878, 4893224, 4536578, 4670071, 5278664, 5471201, 6127446, 6556538, 6693144, 7128388, 8208063, 8736505, 9020335, 9419361, 10048473, 10929006, 12411837, 13693079, 15775377, 18269378, 21685263, 26030222, 31738768, 39395477, 48935947, 56262784, 57564758, 51954598, 41872565, 33530993, 27234618, 22572676, 19604473]
2309A9604473j571756k076431k008064j683325j194038q21391p47158j88420n49522
2300H764368p35891p29232q22764k03157m23023j040290j26520k86667l10496
2291D086328j42641j37077l95067l95060J25342k12935K67729o65725K16680k20447
2281B527127m38912K88268J46701J1514k85676L70370m13514l19807J81152K4079
2271B091302k11398n46375K6435r4769K94723l7663j44371K18582l99775J29973
2261A326664m13181N11729k96089m68669q5283K18143p7001m5008L20149o95669
2251B95785K75329j60817o8798K61381J95647j54930p7461P8525J26595n5794
2241G15462k31454r0045M219K49974j64182k72712J34712o8076l49501K85258
$$ y = [19604473, 18032717, 15956286, 13948222, 12264897, 11070859, 10249468, 9502310, 9313890, 8764368, 8028477, 7299245, 6476481, 6273324, 5850301, 4810011, 4683491, 4396824, 4086328, 3943687, 3806610, 3411543, 3016483, 3141825, 2928890, 3196619, 2530894, 2747574, 2527127, 2088215, 2376483, 2523184, 2534698, 2249022, 2619392, 2205878, 1886071, 2067223, 2091302, 1879904, 1333529, 1359964, 1265195, 1559918, 1522255, 1377884, 1596466, 1196691, 1326664, 913483, 1425212, 1129123, 660454, 575171, 793314, 716313, 671305, 991454, 295785, 571114, 410297, 341499, 602880, 798527, 643597, 566136, 644661, 771256, 715462, 484008, 393963, 398182, 648156, 483974, 211262, 345974, 277898, -71603, 213655]
2231B13655K80530J12520p48421L46628N55753l11277o2356R1533K59857M05536
2221A143958o82165J00238K17854l45610J80841J20635l26287J67538K49163r7090
2211G29075k23856r6290k72281j0713K0205Q2560O6781j44123K95395l69557J84183
2200B61379j05352j86025j59958L89785N638k27537n16164m35589K83556L78922
2190c11345O67585Q1322m22045n21708J42145M58347j15904N7607k19717L50391
2180A66678J16102J41573j76640n0487k68772l88593K96572L08382j65894j4397
2170c5476J59400K49899k11039K8831R8171p10691k10374L70140O24239L00288
2160F63388m64665n78582P3874o3859K05306q3143K65907P8690m7297l1385r5364
$$ y = [213655, 494185, 606705, -141716, 204912, 760665, 449388, 387032, 478565, 738422, 1143958, 461793, 562031, 779885, 434275, 615116, 735751, 409464, 577002, 826165, 729075, 505219, 408929, 136648, 125935, 146140, 228700, 295481, 151358, 446753, 77196, 261379, 156027, -29998, -189956, 199829, 205467, -22070, -538234, -973823, -690267, -311345, 356240, 437562, 15517, -506191, -364046, 94301, -21603, 36004, -183713, 166678, 282780, 424353, 247713, 197226, -71546, -460139, -163567, 144815, -21079, -35476, 123924, 373823, 162784, 191615, 289786, -420905, -631279, -261139, 363100, 663388, 198723, -379859, -305985, -369844, -164538, -247681, 18226, 96916, 49619, 18234, -77130]
2149g7130J24091K0409K32702k18907j88785J69986J51550J10381j59606Q7245
2139B51936J07618m84739J85526j5413N8709l34640o73953N16866J30772p5948
2129c33266J26188P7319J52291m16231L019J59298J62672J73210L09731M3339
2119D57570m56885j71058K58273K390j57544K22520R7617k76686r4899j99953
2109c18655R9340M13297J40868l44747K21849k61709n98338M81269J98043K54583
2099B85800J78211k72118o96038P58338l41242l4802K52602k1247J92379l79732
2089g7849M04546P7817j56934P31318q37102N4283L91211o2330m1350k52856j6710
2078B14044o07649J64445J33339L2620p0704j24615K97116J56095K16061n96002
$$ y = [-77130, 46961, 67370, 300072, 81165, -107620, 62366, 213916, 324297, 164691, 251936, 359554, -125185, 60341, 44928, 103637, -231003, -904956, -388090, -257318, -333266, -207078, -129759, 22532, -393699, -390680, -231382, -68710, 104500, 414231, 457570, 685, -170373, 87900, 90290, -67254, 155266, 252883, -23803, -118702, -318655, -219315, 193982, 334850, -9897, 211952, -49757, -648095, -166826, 31217, 285800, 464011, 191893, -504145, 254193, -87049, -121851, 130751, 109504, 301883, -77849, 326697, 404514, 247580, 978898, 141796, 196079, 587290, 524960, 483610, 230754, 214044, -393605, -229160, -95821, -63201, -133905, -258520, 38596, 194691, 410752, -185250]
2068a85250N2778J67572j63074L10341O22745k50939q54493K17307J00045J86218
2058B03250m54676k76105Q92069K95738k7543j65064l14149j03202L3859r8657
2048a4480J69355J07597M9697K47131p05762l04856O82832J43573k58075M8791
2038A65803m66475L64753m1506l24076j51830J28429O54304L10819l25191J9130
2028C34160M4212J00434l25224j87310l80905j96936K96522J47246J03260k55209
2018c19750K80650R4340j13968M12178l92010n36169l4353L25097n1028j80191
2008e15204K70058M07621N3176q7767O4892M01156k02900N2995l35824J54720
1998B62923J14345n70341k13567K61433J85816L91917J14848k62158j50520m48654
$$ y = [-185250, -132472, 35100, -127974, 182367, 805112, 554173, -300320, -83013, 17032, 203250, -251426, -527531, 364538, 660276, 632733, 467669, 153520, 50318, 84177, -14480, 154875, 262472, 312169, 559300, -146462, -451318, 231514, 375087, 117012, 165803, -300672, 64081, 22575, -301501, -453331, -324902, 329402, 640221, 315030, 334160, 378372, 478806, 153582, -33728, -414633, -611569, -315047, -167801, -64541, -319750, -39100, 55240, -58728, 353450, -38560, -574729, -609082, -283985, -335013, -515204, -245146, 162475, 215651, 127884, 192776, 593932, 391032, 444027, 108203, 262923, 377268, -193073, -406640, -145207, 40609, 432526, 547374, 285216, 134696, -313958]
1988c13958L14011J88369M872p7807N8723M3831K47717m17946o38449M11314N73151
1977C93828j88853L1586m38611n9020J0737R323J6304j65722j96044M09891m1445
1966b18026M27664k1817l4830K95878l53786m80602J16739J40471R739R291Q501
1955a00778Q1323M9137Q0245j05142k2246K17874L04297J48335k97254J24323
1945D80114l50582k00286k16036k23638J05422L67421P12799j04410j67134P6042
1935D79712n82319J86916j27911O9191K8876j31976L51813o0734K24215n73177
1925a35394k48334k61726L31060K47319q8890Q6251K77185l02751l41479K29088
1915b07671k5549l33499K53838m3642m80771K61482J85059J49368P6576p9142
$$ y = [-313958, 53, 188422, 193294, 115487, 174210, 218041, 465758, 47812, -590637, -179323, 393828, 204975, 236561, -202050, -261070, -250333, -241010, -224706, -390428, -586472, -176581, -218026, 209638, 187821, 152991, 448869, 95083, -385519, -268780, -128309, -118570, -109279, -100778, -19455, 29682, 109927, 4785, -17461, 200413, 504710, 653045, 355791, 480114, 129532, -70754, -286790, -510428, -405006, -37585, 675214, 570804, 403670, 479712, -102607, 84309, -43602, 25589, 54465, -77511, 274302, 213568, 437783, -135394, -383728, -645454, -314394, -67075, -155965, -69714, 207471, -95280, -436759, -207671, -233220, -566719, -312881, -356523, -837294, -575812, -390753, -241385, -164809, -243951]
1905b43951K07662O6644K42912l32629l11317j91297j29115M57229o9299k42558
1895e45719M80076k0529J48652q0010J29641l00116L02923J65450j19175j57539
1885C654j16497K91295J5335J25495m47298R872M50030j52560m72164l63116L81515
1874b74439Q1678n8763j25334M7779L75070J03865J21660k4683N596K00341k04214
1863B48556l61469j05690J00917L41864j83802j51695o4515j41747l9760k94419
1853f51760P2115L03614M89912L698n3476o53067k68430M14771n3592P6116K61606
1842e8493N49709k54172K8476K34408R6030l72577r0640J36148j58172K2534r1889
1831D1362k89759m6009M8311L75049j04922n41772K47524L40814J32775J3177
$$ y = [-243951, -36289, 30355, 273267, -59362, -370679, -561976, -691091, -233862, -303161, -545719, -65643, -86172, 62480, -17530, 112111, -188005, 114918, 280368, 161193, 3654, -112843, 178452, 193787, 319282, -128016, -118144, 331886, 179326, -292838, -655954, -274439, -192761, -251524, -376858, -329079, 45991, 149856, 271516, 246833, 252429, 452770, 248556, -112913, -218603, -117686, 224178, 40376, -111319, -175834, -317581, -357341, -651760, -579645, -276031, 213881, 217579, 164103, -488964, -757394, -342623, -396215, -320099, -58493, 491216, 237044, 265520, 499928, 595958, 223381, 132741, 268889, 110717, 133251, 41362, -248397, -294406, -246095, 128954, 24032, -517740, -270216, 70598, 203373, 216550]
1821B16550m13151J18431m4215m4200J03115Q0367j51411J28522J01210K98944
1811C94162J49084m79843n48952j16229J58934J98336q3596L01263K60177j79259
1801E4077p1080j64058L709L1738j92601k5495L98587k00392J29170o6683M7921
1790e5107K04194k74565J19130J31719k91486k45888M10248k6527J69378J07003
1780B48099j37431L00040j44670n48825J08396n4312j03482L0147l22965J63349
1770d61654L59641J90435q1173k73089J80136k1476L86173q6131k06865k34796
1760b48799j83569K48922L5330l60325K25208K64798n86824K19692L81347j80971
1750a85191j63723r7437j317P2860M95646j11680l34993K00190j4152k32925J16552
$$ y = [216550, -196601, -78170, -122385, -166585, -63470, 16897, -134514, -5992, 95218, 394162, 543246, 63403, -485549, -601778, -442844, -244508, -328104, -26841, 233336, 54077, -17003, -181061, -177352, -145614, -338215, -363710, 34877, -165515, -36345, -103028, -55107, 149087, -125478, -6348, 125371, -166115, -412003, -1755, -28282, 141096, 248099, 110668, 410708, 266038, -282787, -174391, -228703, -332185, -302038, -625003, -461654, -102013, 88422, 7249, -265840, -85704, -107180, 278993, 192862, -14003, -248799, -432368, -183446, -148116, -508441, -283233, -18435, -605259, -385567, -4220, -185191, -348914, -446351, -447668, -374808, 120838, 9158, -325835, -125645, -139797, -372722, -256170]
1739b56170O96531k05434j27590k32982j56568J89379K6684k25826J43997N90739
1729D42760j68759o78220L76104j58836k49540j22238O40K85154L14210n5822
1719a4547M5835M83905o96378k03662N35612r770K79432k05087l08423Q9859k75606
1708b78830j17136J45513K3721n59808J8792K95321j449M3488k65705J65428O71897
1697A41232J6238n35588j57583M864O23918O2514p6960k16461n68209N41994K9932
1686a34109j03286J17490j35963N04194o08101J32726J77506J52757j29116j46504
1676a72406J51215J88330J98301k11407O68929k71190l17153j03005K36927k96469
1666G2072K2366j91032m225J59772j26087K72386k49458j01521K36379n1987l54413
$$ y = [-256170, 440361, 234927, 107337, -125645, -282213, -92834, -66150, -291976, -147979, 442760, 274001, -404219, -28115, -186951, -436491, -558729, -558089, -272935, 41275, -14547, 31288, 515193, -181185, -384847, 150765, 140995, 420427, 215340, -93083, -3224, -278830, -395966, -250453, -226732, -786540, -767748, -472427, -473876, -430388, -696093, -530665, 141232, 157470, -378118, -535701, -530837, 93081, 155595, 78635, -137826, -706035, -164041, -134109, -237395, -119905, -255868, 248326, -359775, -227049, -49543, 103214, -25902, -172406, -21191, 167139, 365440, 154033, 822962, 551772, 234619, 131614, 368541, 72072, 94438, -96594, -100819, 58953, -67134, 205252, -44206, -145727, 90652, 38665, -315748]
1655c15748P5005j7704J70957m4418q8477k09361q6401j33219R94293L79986l40939
1644C83974j0861p6798k95453K10219k76481O4770L24271l20534l4051J49500
1634A18556J5661Q6564l50485p6960O15292k99076k614k33232n24685K51862J52105
1623b47012J22083L30741j73046l12009Q6681N54968m13151j86759J33424k54202
1613c58282n61918N341J60916N24087K58250l05557j44943L29907Q1436J10446
1603I9683K35153k79016M589j56386r0556q9685n29190K75477L70287M4041j79990
1592b95593K64930j02719J80717k39375J22523M28019m4757M5991m5420n87293
1582b72977j15224o2828J34999K68250k72610M14829p4557O0363K78237l37193
$$ y = [-315748, -240743, -258447, -87490, -131908, -220385, -429746, -516147, -649366, 344927, 724913, 383974, 373113, 296315, 862, 211081, -65400, -630, 323641, 3107, -30944, 118556, 134217, 220781, -129704, -206664, 408628, 109552, 106938, -126294, -650979, -399117, -247012, -124929, 205812, 32766, -279243, -192562, 362406, -50745, -237504, -104080, -358282, -920200, -914859, -753943, -229856, 28394, -277163, -422106, -92199, -10763, 99683, 334836, 55820, 60409, -95977, -186533, -276218, -805408, -529931, -159644, -115603, -295593, -30663, -133382, 47335, -192040, -69517, 358502, 313745, 359736, 314316, -272977, -388201, -451029, -316030, -47780, -320390, 94439, 19882, 80245, 358482, 21289]
1572B1289k7631J68399o3984j83656N76448K44091l37997j21341R7908j23790
1562B49736K90984k48835p63616K1064o6875N38929L1004k02682K27672o5297
1552A2084l43312L32974n1447l00315M88842O1522j90998j65607J86379J04750
1542A34872K70724K28712k07987j22081k29163J73886k36263M6865N7524O1459
1532A78548l35947k41088P9409J63279Q2106k1942M18392K6392m66474k64903
1522c82228K09875M03899J37627m31001Q4398j92337J69720L62795k05316l9077
1512A18355l54900l24406L1900k26881L49828M82418L7094L15429O4665o60511
1502a67009n0472K28963R1131J10756m67879j92554K06269K8754k6448J02436
$$ y = [21289, -6342, 162057, 98073, -85583, 490865, 734956, 396959, 275618, 373526, 249736, 540720, 291885, -471731, -450667, -517542, 21387, 52391, -150291, 77381, 12084, -331228, 1746, -49701, -350016, 138826, 200348, 9350, -156257, 30122, 134872, 405596, 634308, 426321, 304240, 75077, 248963, 12700, 59565, 117089, 178548, -157399, -398487, -319078, -155799, -73693, -95635, 322757, 349149, -117325, -382228, -172353, 231546, 369173, -61828, 22570, -169767, -47, 362748, 157432, 118355, -236545, -560951, -529051, -755932, -406104, 76314, 113408, 428837, 493502, -167009, -217481, 11482, 102613, 213369, -254510, -447064, -240795, -212041, -238489, -136053]
1492a36053L63524M06551m38874j67606J47172l1562j81440N7733o28314K48710
1482c60159N92424L42088J40799k87487m00224K64240l98158N4084J73383k42498
1472a21508M46636l74326K5498L52043m10760J67342L97798p0278m57636k8646
1462g3837N1530R8586k21965M5850K6725K50926P515n0391k75385J88188K80271
1451C28013j14297Q3409K4648J8485K2313j97993k49521K79642j71510k13898
1441a90709j58132M8520J52449Q8222m99680J44581L42453J8957m7339j62052
1431b62730K4917L04488n28569L28429r278j80886r6366J85540O7642k16128L27104
1420e5837n61564k41972R8469M21079J87738L8930o05205L65894Q39993Q454l62903
$$ y = [-136053, 227471, 634022, 195148, 27542, 174714, 143152, -38288, 19445, -608869, -360159, 232265, 574353, 715152, 427665, 27441, 291681, -106477, -52393, 120990, -121508, 325128, -49198, -23700, 328343, -82417, 84925, 482723, 412445, -45191, -73837, -22307, 76279, -145686, -99836, -73111, 177815, 185330, 134939, -140446, 47742, 328013, 213716, 297125, 321773, 340258, 362571, 164578, -84943, 194699, 23189, -190709, -348841, -300321, -147872, -59650, -559330, -414749, -72296, -53339, -100678, -262730, -237813, 66675, -461894, -133465, -142743, -323629, -419995, -234455, -166813, -382941, -55837, -617401, -859373, -760904, -339825, -152087, -113157, -718362, -352468, 487525, 495979, 133076]
1409A33076j40271l76320Q402R5350O5792M30013n5932k40773p4857M9746p7169
1398a82943L05068J95074j06740j53696L58058k97396l40527J42456L57132j92453
1388H4033K25861m74307L23182K85783j38250L7341j90752N8064k25322j87819
1378b02186k37373n860O15451Q1340J8526n7670M50104m38819J7676k18970j64679
1367a42460j30265j92535L93677N8334K48649l62736k53367J75228K58860M78398
1357E31783J88942m70808m12273j77007j90404J87495M5115J3252P0510J50206
1347f3189k53768L57467M66823k29762m79876J13957j69437m62961L12603l17053
1337g25196K95466L10205M7455K43169L70277J5703j36837k78510n36477J09593
$$ y = [133076, -7195, -383515, -375113, -279763, -213971, 216042, 160110, -80663, -155520, -105774, -182943, 122125, 317199, 210459, 56763, 414821, 117425, -223102, -80646, 276486, 84033, 309894, -164413, 158769, 444552, 306302, 343643, 152891, 210955, -14367, -202186, -439559, -445419, 170032, 251372, 269898, 212228, 662332, 223513, 241189, 22219, -142460, -272725, -465260, -71583, -13249, 235400, -127336, -380703, -205475, 53385, 531783, 720725, 249917, -162356, -339363, -529767, -342272, -297157, -283905, -213395, -63189, -316957, 40510, 507333, 277571, -202305, -88348, -257785, -720746, -408143, -725196, -429730, -119525, -72070, 171099, 541376, 557079, 420242, 141732, -394745, -285152]
1327b85152N23632r7034O7125m36953K04916J92582k73099l54068K0964J08815
1317c28272K91662r9076r1018N13636j8955K7855l9582r1189j40052l36487R1206
1306b20272K34083r614L47821j90029P4144N5749k50399P9477m92872l87595M37147
1295c22360J37018K3416L75268L3164j89154k05505J74624k98472M6196L4264
1285a91541J07667m0672J35818l26771r5551L22122L78602k22519L29155l65661
1275C0649m23690K09056l54045Q7061K33590M72621K51277l26522j13191l35314
1265b68508n10945N70535M51402O2294J42983l97644K48821l04613L49892K36342
1255E80559j66865L4358j40591l96025J64509n2494p00523P77360M39425l14618
$$ y = [-285152, 238480, 141446, 208571, -228382, -23466, 169116, -103983, -458051, -437087, -328272, -36610, -135686, -226704, 286932, 267977, 295832, 256250, 165061, 25009, -311478, -220272, 13811, 4197, 352018, 161989, 236133, 291882, 41483, 120960, -371912, -759507, -322360, -185342, -161926, 213342, 246506, 57352, -148153, 26471, -272001, -225805, -191541, -83874, -124546, 11272, -315499, -411050, -88928, 289674, 67155, 396310, 30649, -393041, -183985, -538030, -450969, -217379, 255242, 506519, 179997, 66806, -268508, -779453, -208918, 242484, 304778, 447761, 50117, 298938, -5675, 344217, 580559, 413694, 448052, 307461, -88564, 75945, 23451, -677072, 100288, 539713, 225095]
1245B25095Q7473k58537J50299j54000N3170m07477j64043M98780J39452j21174
1235D9038k49030Q916J9258N2869o7608K54608J40873K49858n47427l08868j05186
1224e02699L2735M2123K8334k10313P33800J36113k47172n6091m01089J74044
1214b70215M26991k0027j92027J4170J05394j6413L03734J69990K99174o41923
1204A78848n2272M2082j61324j92509L05070J90209k12895l5894J78514j57037
1194H2792o5354Q2972j77086o4995j62983J12171j7139j84528J90882J80214J02404
1183G9350j58290k21952L90397L55496j67107n7897l08776K55875J6341j06345
1173G7092k23537J0680J65575R9813k5665J30912l98186k32613J49049R3356j53951
$$ y = [225095, 312568, 54031, 204330, 50330, 103500, -303977, -468020, 30760, 170212, 49038, -199992, -191076, -171818, -118949, -186557, 68051, 208924, 458782, -88645, -397513, -502699, -469964, -427841, -399507, -609820, 123980, 260093, 12921, -43170, -444259, -270215, 156776, 136749, -55278, -41108, 64286, 47873, 351607, 521597, 820771, 178848, 126576, 168658, 7334, -185175, 119895, 310104, 97209, 61315, 239829, 82792, 17438, 100410, -76676, -141671, -304654, -192483, -209622, -394150, -203268, -23054, 79350, -78940, -300892, 89505, 445001, 277894, 219997, -88779, 167096, 183437, 77092, -146445, -135765, 29810, 129623, 103958, 234870, -163316, -395929, -246880, -153524, -307475]
1162c07475J99547O44113k57801k79579p050j42829o8815K03480l45179j89365
1152e50953N08175L05827J29270L17934l82752r6149m97592J70074j775J17242
1142A9301J25377j62917j9953M52967l77806j21753n7334j899P7676l17916J58033
1131b26224m0098p4065J16586L33079K12208n93708K0421L77015r5017O5098n5124
1120D0171l4286K0226k81295j28681L84344J11754j71804j66490L02124m41561
1110c65498L07488j76817j93784j35408N97115L23811J081K10783n91566j08642
1100a31437K57551n1677k38093P1968m95452K55643J54468j19139j5354J52829
1090a58693K79409L57616j62489j72168q621J51946J26334r7648l26571O3608
$$ y = [-307475, -107928, 536185, 278384, -1195, -8245, -151074, -219889, -16409, -361588, -550953, -42778, 263049, 392319, 710253, 327501, 231352, -266240, -96166, -97941, 19301, 144678, -18239, -38192, 414775, 36969, -84784, -142118, -144017, -66341, -384257, -226224, -266322, -340387, -223801, 109278, 321486, -272222, -251801, 125214, 30197, 95295, 40171, 5885, 26111, -255184, -383865, 479, 112233, -59571, -226061, 76063, -365498, -58010, -234827, -428611, -564019, 33096, 356907, 357988, 568771, -22795, -131437, 126114, 74437, -163656, -91688, -587140, -331497, -177029, -296168, -311522, -158693, 120716, 478332, 315843, 143675, 135054, 287000, 413334, 315686, -10885, 52723]
1080E2723j11452L33546k25231j6866j69533J35759o266L55259q1688m11495R9110
1069d6134k81420J74223J57301K90090n9114k52574n5698k45857R6927L79898
1059A57642K85932K39034o48652k46879O08804j97038K67099j22248k2339k47208
1049G4147J04014Q3571m63101M41779k00849N9719p535L02879k15001L13006j17235
1038C75394J4335l42951j06545L94527m66533l78916J70883L40442k40721j16263
1028c56348j40639o1828N10612M0241J50552k73212J11811Q891k68826q0175J49794
1017b09127K64901j7800K95293k19814m68493k19150O20472k2931r156R6782K24494
1006C35471l30750n71447o3745M34336L56334k01249J10016j34398J2246J33715
$$ y = [52723, -58729, 274817, 49586, 32720, -136813, -1054, -7320, 347939, 266251, -145244, -46134, -327554, -153331, 3970, 294060, 234946, -17628, -73326, -319183, -222256, 157642, 443574, 682608, 33956, -212923, 395881, 198843, 465942, 343694, 321355, 74147, 178161, 261732, -201369, 240410, 39561, 99280, 91745, 394624, 179623, 492629, 375394, 389729, 46778, -59767, 334760, -131773, -510689, -339806, 636, -240085, -356348, -496987, -558815, -48203, -7962, 142590, -130622, -18811, -9920, -278746, -358921, -209127, 55774, 37974, 333267, 113453, -355040, -574190, 46282, 23351, 14195, 110977, 335471, 4721, -566726, -630471, -196135, 160199, -41050, 68966, -65432, -53186, 80529]
996H0529J75581J16246l95365J48742m6411l4499j03429l02307K2671L80556k6271
985A6043l0367J96732k48843L65925m62437k41557J92008m7592j26072K82510
975a03650N12316J79339m91287l9905j45020K50455j32164M957J65939n953p5202
964A19825k78108N16812J71475l15803k96004l44324M18874P63440m04123r8723
954B53341j50434K01637K44939l20296N0448L3106j78076l38213J74837N6647
944B7936l21535J32321R8354K50471J91317k34766O3807J29414K69399k25113
934C81605j33444o24245n3032K54533o2542Q7865Q8693j84379j29890L64760J59888
923A49812N8705k69990R6621L97603p085r5312j05194n44325j73263N33330J94476
$$ y = [80529, 256110, 372356, -23009, 125733, 79322, 44823, -58606, -360913, -338242, 42314, 16043, -14324, 182408, -66435, 299490, -162947, -404504, -212496, -260088, -386160, -103650, 408666, 588005, 96718, 56813, -88207, 162248, 30084, 35041, 200980, 195027, 119825, -158283, 358529, 530004, 214201, -81803, -426127, -7253, 756187, 352064, 253341, 102907, 304544, 549483, 229187, 279635, 312741, 134665, -203548, -28711, 27936, -293599, -161278, -62924, 187547, 378864, 144098, 207905, 337319, 606718, 381605, 248161, -376084, -429116, -174583, -237125, -149260, -60567, -244946, -374836, -10076, 149812, 208517, -61473, 35148, 432751, 425666, 330354, 225160, -319165, -492428, 40902, 235378]
912B35378j43382J29552j25339K62888r4464o15307J97195k50302j31748j32196
902f67725J74647M07759j53970m5934J71462q3688l84658L02319R988j40695J06858
891c03637r8704L42518M33119l56116k46609K3058l47805j60196K27139l1766
881e18999J71099L76005k53839j49649k98038k65698O15671L26923L31369l39066
871d222k32260J1988Q4236J14567k24164L51169M99165k38301L82639k76045K56707
860G25479k83432k65468p4767J37045l3352K93449k46209p5580k23971m39625
850d86431j12804J64835L11886J40916L02027l88398j05163k20570L7068J41562
840b15072J86482J98242J0207k39877L2028k75089K28743r5890K69873j3599r5662
$$ y = [235378, 91996, 221548, 96209, 359097, 264633, -350674, -153479, -403781, -535529, -667725, -493078, -85319, -239289, -285223, -113761, -197449, -582107, -279788, -269800, -410495, -303637, -402341, -59823, 373296, 17180, -229429, -206371, -554176, -714372, -487233, -518999, -347900, 28105, -225734, -375383, -673421, -939119, -323448, 3475, 334844, -4222, -236482, -224494, -140258, -25691, -249855, 101314, 600479, 362178, 744817, 468772, 725479, 442047, 176579, 101812, 238857, 205505, 498954, 252745, 177165, -46806, -486431, -599235, -434400, -122514, 18402, 320429, -67969, -173132, -393702, -356634, -215072, -28590, 169652, 179859, -60018, -27990, -303079, -74336, -170226, 99647, 86048, -9614]
829i614K23837P7241r3643J01108l59820O4694K71320n09030j85266j47149j93147
$$ y = [-9614, 214223, 291464, 197821, 298929, -60891, 3803, 275123, -233907, -419173, -566322, -759469]
$$ [...]
##END NTUPLES=NMR SPECTRUM
##END=
