##TITLE=1H_CG-1181-b3
 CDCl3
 8 sc, 
 12.4.2024
##JCAMPDX= 6.0         $$ Bruker NMR JCAMP-DX V2.0
##DATA TYPE= NMR SPECTRUM
##DATA CLASS= NTUPLES
##ORIGIN= UXNMR, Bruker Analytische Messtechnik GmbH
##OWNER= root
$$ XWIN-NMR		Version 3.5
$$ Fri Apr 12 14:04:13 2024 Russian Standard Time (UT+4h)  she@DPX200
##.OBSERVE FREQUENCY= 200.1309
##.OBSERVE NUCLEUS= ^1H
##.ACQUISITION MODE= SIMULTANEOUS
##.ACQUISITION SCHEME= undefined
##.AVERAGES= 8
##.DIGITISER RES= 18
##SPECTROMETER/DATA SYSTEM= spect
##.PULSE SEQUENCE= zg30
##.SOLVENT NAME= CDCl3
##.SHIFT REFERENCE= (INTERNAL, CDCl3, 0, 15.5398)
##AUDIT TRAIL= $$ (NUMBER, WHEN, WHO, WHERE, WHAT)
$$ ##TITLE= Audit trail, XWIN-NMR		Version 3.5
$$ ##JCAMPDX= 5.01
$$ ##ORIGIN= Bruker BioSpin GmbH
$$ ##OWNER= she
$$ F:/spectra/data/she/nmr/H-F/1/pdata/1/auditp.txt
$$ ##AUDIT TRAIL=  $$ (NUMBER, WHEN, WHO, WHERE, WHAT)
(   1,<2024-04-12 14:02:07.35 +0400>,<she>,<DPX200>,
      <created by zg, POWCHK disabled, PULCHK disabled
       configuration hash MD5:
       00 E9 B6 7A A2 85 ED C7 34 08 36 98 17 FE 4E 26
       data hash MD5: 16K
       53 EB 75 15 38 BF 79 F0 5A 1C 85 52 79 A3 C2 AA>)
(   2,<2024-04-12 14:03:02.29 +0400>,<she>,<DPX200>,
      <Start of raw data processing
       efp BC_mod = 2 LB = 0.24 FT_mod = 6 PKNL = 1 PHC0 = -25458.56 PHC1 = 10.58731 SI = 16K 
       data hash MD5: 16K
       35 D8 DF 4E F2 69 FA 3D 1F 75 0B 37 DA 8B 04 17>)
(   3,<2024-04-12 14:03:16.54 +0400>,<she>,<DPX200>,
      <pk PHC0 = 1.459525 PHC1 = -2.2 
       data hash MD5: 16K
       81 7D 33 08 67 DB FE 99 9A BD 3B 20 C2 8C 5F D4>)
(   4,<2024-04-12 14:03:20.18 +0400>,<she>,<DPX200>,
      <abs ABSG = 5 
       data hash MD5: 16K
       26 DC 9B CA 37 6D E9 C1 7C 98 2A 65 60 29 50 08>)
$$ ##END=
$$ 
$$ hash MD5
$$ AA 77 33 4F FA 00 5A 0C EF 83 FC ED D1 EA 21 86
##$RELAX= 
##$RELAX= 
##$RELAX= 
##$RELAX= 
##$RELAX= 
##$RELAX= 
$$ Bruker specific parameters
$$ --------------------------
##$DU= <F:/spectra>
##$EXPNO= 1
##$NAME= <H-F>
##$PROCNO= 1
##$TYPE= <nmr>
##$USER= <she>
##$AMP= (0..31)
100 100 100 100 100 100 100 100 100 100 100 100 100 100 100 100 100 100 
100 100 100 100 100 100 100 100 100 100 100 100 100 100 
##$AQSEQ= 0
##$AQ_mod= 1
##$AUNM= <au_zg>
##$AUTOPOS= <>
##$BF1= 200.13
##$BF2= 200.13
##$BF3= 200.13
##$BF4= 200.13
##$BF5= 200.13
##$BF6= 200.13
##$BF7= 200.13
##$BF8= 200.13
##$BYTORDA= 1
##$CFDGTYP= 0
##$CFRGTYP= 5
##$CHEMSTR= <none>
##$CNST= (0..31)
1 1 145 1 1 1 1 1 1 1 1 1 1 1 1 1 1 1 1 1 1 1 1 1 1 1 1 1 1 1 1 1 
##$CPDPRG= <>
##$CPDPRG1= <>
##$CPDPRG2= <>
##$CPDPRG3= <>
##$CPDPRG4= <mlev>
##$CPDPRG5= <mlev>
##$CPDPRG6= <mlev>
##$CPDPRG7= <mlev>
##$CPDPRG8= <mlev>
##$CPDPRGB= <>
##$CPDPRGT= <>
##$D= (0..31)
0 1.2 0 0 0 0 0 0 0 0.06 0 0.03 0 0 0 0 0.0002 0 0 0 0 0 0 0 0 0 0 0 0 
0 0 0 
##$DATE= 1712916126
##$DBL= (0..7)
120 120 120 120 120 120 120 120 
##$DBP= (0..7)
150 150 150 150 150 150 150 150 
##$DBP07= 0
##$DBPNAM0= <>
##$DBPNAM1= <>
##$DBPNAM2= <>
##$DBPNAM3= <>
##$DBPNAM4= <>
$$ [...]
##$SUBNAM3= <"">
##$SUBNAM4= <"">
##$SUBNAM5= <"">
##$SUBNAM6= <"">
##$SUBNAM7= <"">
##$SUBNAM8= <"">
##$SUBNAM9= <"">
##$SW= 18.0517689322627
##$SWIBOX= (0..15)
0 0 2 0 0 0 0 0 0 0 0 0 0 0 0 0 
##$SW_h= 3612.71676300578
##$TD= 16384
##$TD0= 1
##$TE= 0
##$TE2= 300
##$TE3= 300
##$TEG= 300
##$TL= (0..7)
0 120 120 120 120 120 120 120 
##$TP= (0..7)
150 150 150 150 150 150 150 150 
##$TP07= 0
##$TPNAME0= <>
##$TPNAME1= <>
##$TPNAME2= <>
##$TPNAME3= <>
##$TPNAME4= <>
##$TPNAME5= <>
##$TPNAME6= <>
##$TPNAME7= <>
##$TPOAL= (0..7)
0.5 0.5 0.5 0.5 0.5 0.5 0.5 0.5 
##$TPOFFS= (0..7)
0 0 0 0 0 0 0 0 
##$TUNHIN= 0
##$TUNHOUT= 0
##$TUNXOUT= 0
##$USERA1= <user>
##$USERA2= <user>
##$USERA3= <user>
##$USERA4= <user>
##$USERA5= <user>
##$V9= 5
##$VALIST= <valist>
##$VCLIST= <CCCCCCCCCCCCCCC>
##$VD= 0
##$VDLIST= <DDDDDDDDDDDDDDD>
##$VPLIST= <PPPPPPPPPPPPPPP>
##$VTLIST= <TTTTTTTTTTTTTTT>
##$WBST= 1024
##$WBSW= 4
##$XGAIN= (0..3)
0 0 0 0 
##$XL= 0
##$YL= 0
##$YMAX_a= 297997
##$YMIN_a= -210305
##$ZGOPTNS= <>
##$ZL1= 120
##$ZL2= 120
##$ZL3= 120
##$ZL4= 120
##$ABSF1= 15.52546
##$ABSF2= -2.526425
##$ABSG= 5
##$ABSL= 3
##$ALPHA= 0
##$AQORDER= 0
##$ASSFAC= 0
##$ASSFACI= 0
##$ASSFACX= 0
##$ASSWID= 0
##$AUNMP= <proc_1d>
##$AZFE= 0.1
##$AZFW= 0.1
##$BCFW= 0
##$BC_mod= 2
##$BYTORDP= 0
##$COROFFS= 0
##$CY= -3
##$DATMOD= 1
##$DC= 0
##$DFILT= <>
##$DTYPP= 0
##$F1P= 0
##$F2P= 0
##$FCOR= 1
##$FTSIZE= 16384
##$FT_mod= 6
##$GAMMA= 0
##$GB= 0
##$INTBC= 1
##$INTSCL= 3.70164e-10
##$ISEN= 128
##$LB= 0.24
##$LEV0= 0
##$LPBIN= 0
##$MAXI= 10000
##$MC2= 0
##$MEAN= 0
##$ME_mod= 0
##$MI= 1.114404
##$NCOEF= 0
##$NC_proc= -7
##$NLEV= 6
##$NOISF1= 3.799351
##$NOISF2= 2.8
##$NSP= 0
##$NTH_PI= 0
##$NZP= 0
##$OFFSET= 15.53978
##$PC= 1
##$PHC0= -25457.1
##$PHC1= 8.38731
##$PH_mod= 1
##$PKNL= yes
##$PPARMOD= 0
##$PSCAL= 0
##$PSIGN= 0
##$REVERSE= no
##$SF= 200.129596387257
##$SI= 16384
##$SIGF1= 3
##$SIGF2= 2
##$SINO= 5.538805
##$SIOLD= 16384
##$SREGLST= <1H.CDCl3>
##$SSB= 0
##$STSI= 16384
##$STSR= 0
##$SW_p= 3612.71676300577
##$SYMM= 0
##$S_DEV= 0
##$TDeff= 16384
##$TDoff= 0
##$TI= <>
##$TILT= no
##$TM1= 0
##$TM2= 0
##$TOPLEV= 0
##$USERP1= <user>
##$USERP2= <user>
##$USERP3= <user>
##$USERP4= <user>
##$USERP5= <user>
##$WDW= 1
##$XDIM= 16384
##$YMAX_p= 360316134
##$YMIN_p= -403946
$$ End of Bruker specific parameters
$$ ---------------------------------
##NTUPLES= NMR SPECTRUM
##VAR_NAME=  FREQUENCY,     SPECTRUM/REAL,   SPECTRUM/IMAG
##SYMBOL=    X,             R,               I
##VAR_TYPE=  INDEPENDENT,   DEPENDENT,       DEPENDENT
##VAR_FORM=  AFFN,          ASDF,            ASDF
##VAR_DIM=   16384,         16384,           16384
##UNITS=     HZ,            ARBITRARY UNITS, ARBITRARY UNITS
##FACTOR=    0.220516191357247, 1,           1
##FIRST=     3109.96983192029, 0,            0
##LAST=      -502.746931085477, 0,           0
##MIN=       -502.746931085477, -403946,     0
##MAX=       3109.96983192029, 360316134,    0
$$ Real data points
##PAGE= N=1
##DATA TABLE= (X++(R..R)), XYDATA
$$ [...]
12186A26611k1344P962p0192J00624j28634r2339Q885O269M5510O107n508P2300
$$ 126611 105267 113229 43037 143661 15027 -77312 -68427 -62158 -16648 -10541 -16049 56251
12174E6251o0924l8107k5173p0649P0518K9815l7535R7525o3927M2991N971j1525
$$ 56251 -4673 -42780 -67953 -138602 -68084 -38269 -75804 21721 -42206 785 6756 -4769
12162d769J04511J07449j04218j77263J8157P4240J07587o2174j00671N7632m289
$$ -4769 99742 207191 102973 -74290 -56133 18107 125694 63520 -37151 20481 16192
12151A6192O9624P5247j14778j01667N5160L3077m5530K322J17767j40583n6296
$$ 16192 85816 161063 46285 -55382 -222 32855 -12675 -10353 107414 -33169 -89465
12140h9465N869M6903r9430p2028J12025J39017J5286J7159m7397m9993K0476
$$ -89465 -83596 -36693 -136123 -208151 -96126 42891 58177 75336 27939 -22054 -1578
12129a578R6197m8675k11347R1316n3448N4681k0543J81640R000q1567K7074q0451
$$ -1578 94619 45944 -165403 -74087 -127535 -72854 -93397 88243 97243 15676 42750 -37701
12117c7701O062J2546J09035o3609j4320j96253r1608J63285N3381n5974J2555
$$ -37701 -31639 -19093 89942 26333 12013 -184240 -275848 -112563 -59182 -115156 -102601
12106a02601M7352M8500R5238n1702l9179n8429k0033n9150o4584J02543J15627
$$ -102601 -55249 -6749 88489 36787 -2392 -60821 -80854 -140004 -204588 -102045 13582
12095A3582n6136J2602N554l3520N4066n415R494J08632O9747l5521n5587j16346
$$ 13582 -42554 -29952 -24398 -57918 -3852 -9267 227 108859 178606 143085 87498 -28848
12083b8848M9864J887P5587L7994N0376n1007n8135n7464p1256J93837q3248j92803
$$ -28848 21016 22903 98490 136484 186860 135853 77718 20254 -51002 142835 59587 -133216
12071a33216m6441M5244K6158O9124m4520J8859r183l8537q3103M8489m2577O0665
$$ -133216 -179657 -134413 -108255 -39131 -83651 -64792 -73975 -112512 -195615 -147126 -189703 -129038
12059a29038n894J80153J38395k34889j4074O7849J8162k0043j65952l112K10405
$$ -129038 -134932 45221 183616 -51273 -65347 2502 20664 621 -165331 -168443 41962
12048D1962l7924J5266L669p9011n1345Q8093L7965J8183q7956Q0985N6287m3826
$$ 41962 4038 19304 22973 -56038 -107383 -19290 18675 36858 -51098 29887 86174 42348
12036D2348J0981o4650r211N015l264Q8955j59426p8433K6496Q6664p6960L3810
$$ 42348 53329 -11321 -20532 -15517 -18781 70174 -89252 -167685 -141189 -54525 -131485 -97675
12024i7675Q329O8107J26356j24829q3776N3643o6581k7505N4125R3317m9981
$$ -97675 -89346 -21239 105117 -19712 -103488 -49845 -116426 -143931 -89806 3511 -46470
12013d6470l2678m2355n1916J54574j49369O0517J07693J08812J60j28050O4440
$$ -46470 -79148 -121503 -173419 -18845 -168214 -107697 -4 108808 108968 -19082 45358
12002D5358N7574k26811m7910J04472J4299J5308N8551J4129J4053R323p4547
$$ 45358 102932 -123879 -171789 -67317 -53018 -37710 20841 34970 49023 58346 -16201
11991a6201j86814m747J8303Q7768j259M4837R4097n623p0565J2900J4798O857
$$ -16201 -203015 -207762 -189459 -101691 -102950 -58113 35984 30361 -40204 -27304 -12506 -5649
11979e649j5774m2984M9669Q1615m5558j09841n4127O8256K299M4578M36P9855
$$ -5649 -21423 -64407 -14738 66877 21319 -88522 -142649 -74393 -72094 -27516 -27080 52775
11967E2775J9212M1128k08252R5344N1692n5391m7006j35556J80367j4128O3437
$$ 52775 71987 113115 -95137 207 51899 -3492 -50498 -186054 -5687 -19815 43622
11956D3622l7344o0902M3651j18272k1568J42885n7021J6203J21313J57013k33229
$$ 43622 6278 -54624 -10973 -129245 -150813 -7928 -64949 -48746 72567 229580 -3649
11945c649L2222m0576L2671q7965O470k8664j25689J13875k0541j1534p9348Q9416
$$ -3649 28573 -12003 20668 -67297 -60827 -89491 -215180 -101305 -121846 -133380 -212728 -123312
11933a23312L6262m9044Q5682J60532n0848j55941o6689J71758L2147k3691o8682
$$ -123312 -87050 -136094 -50412 110120 59272 -96669 -163358 8400 40547 16856 -51826
11922e1826q5881K7013M2954J09146n9870m3048Q0459l7343L2009l883O2468j31136
$$ -51826 -137707 -110694 -67740 41406 -18464 -61512 18947 -18396 13613 9730 72198 -58938
11910e8938k6939R6057j45745L44J12593n0680p5300J24574R734Q5605k9926l8759
$$ -58938 -85877 10180 -135565 -135221 -22628 -73308 -148608 -24034 -14300 71305 41379 2620
11898B620j76435L6942J17709n1923N1795K3042n2872P9804j16234r2317O8027
$$ 2620 -173815 -136873 -19164 -71087 -19292 3750 -49122 30682 -85552 -177869 -109842
11887a09842J05231j6762R312O5035J8899K3370Q437M1879l2748j40736p3497
$$ -109842 -4611 -21373 -12061 52974 71873 95243 103680 145559 112811 -27925 -101422
11876a01422m5831p2074J15594R1881k206K0459k4759l4057O865j8091p6383k7256
$$ -101422 -147253 -219327 -103733 -11852 -14058 6401 -18358 -52415 -45550 -63641 -140024 -167280
11864a67280J7300J91801l3836O9598J16058j54761p4664N5699l7597J55271n9651
$$ -167280 -149980 41821 7985 77583 193641 38880 -35784 19915 -17682 137589 77938
11853G7938k04070J6110n795P5876J14921q1169O1267J0175m9422n1139j92022
$$ 77938 -126132 -110022 -115817 -39941 74980 -6189 55078 65253 15831 -35308 -227330
11842b27330J31623J04074J592j912J05368p7406L1000K8349Q249j1089j09253
$$ -227330 -95707 8367 9959 8047 113415 36009 67009 95358 103607 92518 -16735
11831a6735j35954J19942N5032j09972M0291k7613j39638J53645p6228o699J10341
$$ -16735 -152689 -32747 22285 -87687 -47396 -75009 -214647 -61002 -137230 -143929 -33588
11820c3588J04183J9283P1263p4499q1341K6472j7005r8314j4933L7041O7570
$$ -33588 70595 89878 161141 86642 5301 31773 14768 -83546 -98479 -61438 6132
11809F132l2506j23357P355K4034J3392K3485n4840J2059P6392J66528q9116k60731
$$ 6132 -26374 -149731 -142376 -118342 -104950 -81465 -136305 -124246 -47854 118674 29558 -231173
11797b31173N8354K78562j74173m7442O6761k1903J36769k7898j47632p262N0039
$$ -231173 -172819 105743 -68430 -115872 -49111 -71014 65755 37857 -109775 -117037 -66998
11786f6998j49386K0909J14602K0692q4062K5986J6772m3163P722K03212o2665
$$ -66998 -216384 -195475 -80873 -60181 -144243 -118257 -101485 -144648 -136926 66286 3621
11775C621J6222m190p8156L5016K970J3659L9703k9281L8380n6845p3412K4478
$$ 3621 19843 15653 -62503 -27487 -24517 -10858 28845 -436 37944 -18901 -92313 -67835
11763f7835K40426o2308j96616N7543J27800r7099p1815O6643j6594j07633k61
$$ -67835 172591 110283 -86333 -28790 99010 1911 -69904 -3261 -19855 -127488 -127749
11752a27749N1047J18324p1754J1521J36889M963j53276J5238m285Q019m3274
$$ -127749 -76702 41622 -30132 -18611 118278 123241 -30035 -14797 -19082 -11063 -54337
11741e4337O9087N5773k6944Q6169p4421o0541j6951M4450j03046l5313J7776
$$ -54337 14750 70523 43579 129748 55327 -5214 -22165 22285 -80761 -116074 -98298
11730i8298M7992L73L4908j13499M0119J27684n4212R0205O3088j63777M672m488
$$ -98298 -50306 -49933 -15025 -128524 -88405 39279 -14933 75272 138360 -25417 -20745 -25233
11718b5233k2835L9599p8415O3142j18689R7787M6009m2219k4339j22347K9993
$$ -25233 -48068 -8469 -86884 -23742 -142431 -44644 1365 -40854 -65193 -187540 -157547
11707a57547j7512J9361J2558K57720L3155j45484q4729N3790K9637N5794q5708
$$ -157547 -175059 -155698 -143140 114580 147735 2251 -82478 -28688 949 56743 -28965
11696b8965m5823r1789J35433K1157n8893P188L0873Q5936j06799j5228P4285
$$ -28965 -74788 -166577 -31144 -9987 -68880 -61692 -30819 55117 -51682 -66910 7375
11685G375M1471k6846O8809j62229j4095o0704Q0520O3230J1426J37062M590k00308
$$ 7375 48846 22000 90809 -71420 -85515 -146219 -65699 -2469 8957 146019 150609 -49699
11673d9699O5716K8274J0569k7847j10831l1894O3827J31035j7688O7753m0096
$$ -49699 16017 44291 54860 27013 -83818 -115712 -51885 79150 61462 129215 89119
11662H9119j06238j5904J01137j02030j6057L3658N6427q6024K9532M7639J04725
$$ 89119 -17119 -33023 68114 -33916 -49973 -16315 40112 -45912 -16380 31259 135984
11651A35984j11568o9734l2786M9217N8320l2122M246O135l9046J8670l0491q0196
$$ 135984 24416 -45318 -78104 -28887 29433 -2689 1557 7692 -31354 -12684 -43175 -123371
11639a23371n1563M2369J25308P7027j31226Q29L4092K3768N0415l8100K9412
$$ -123371 -174934 -132565 -7257 69770 -61456 -60627 -26535 -2767 47648 9548 38960
11628C8960r5366j25318J69638J16023o8162k982R492P0458j24661k3228j83677
$$ 38960 -56406 -181724 -12086 103937 35775 32793 42285 112743 -11918 -35146 -218823
11617b18823J70505R3525J60012j32061n9278k1118n489l2778P9924J47360j3681
$$ -218823 -48318 45207 205219 73158 13880 -7238 -12727 -45505 34419 181779 168098
11606A68098Q7543j42369j43649K4788r0246P8987j05713n0075J50353J0448M4567
$$ 168098 255641 113272 -30377 -5589 -95835 -16848 -122561 -172636 -22283 -11835 32732
11595C2732n8941q9648L3363Q3763j04742j29388N2424Q2484K5424J31920M5080
$$ 32732 -26209 -115857 -82494 1269 -103473 -232861 -180437 -97953 -72529 59391 104471
11584A04471j57469J57452K746r4026k1170j56205J49468o9611k7073K9233P2509
$$ 104471 -52998 104454 107200 13174 -7996 -164201 -14733 -84344 -111417 -82184 -9675
11573i675O122l9665r348J952P8328J2848q8215p8346J01907K3363q452L9814
$$ -9675 -3553 -43218 -52566 -50614 27714 40562 -47653 -125999 -24092 -729 -9181 30633
11561C0633k7963N1691Q1124M8289j33975r7118J01233K21094l1004k8403o5527
$$ 30633 2670 54361 135485 183774 49799 -47319 53914 275008 244004 215601 150074
11550A50074l7003j32955k3408K8715p24J9455n351Q2369M9035j05722r7051J26536
$$ 150074 113071 -19884 -43292 -14577 -15301 4154 -1197 81172 130207 24485 -72566 53970
11538E3970L7390r5052k7373Q5663L8637M8593k8706j09998j2131j527j4309P5089
$$ 53970 91360 -3692 -31065 54598 93235 141828 113122 3124 -9007 -10534 -24843 50246
11526E0246q2644J7004J08165j18711k3807m7224J04485j4793L726j9267j19881
$$ 50246 -32398 -15394 92771 -25940 -49747 -96971 7514 -7279 -3553 -22820 -142701
11515a42701J05739P4108K146j1810N0927j26464l7138k0310P1327N5694j7497
$$ -142701 -36962 37146 39292 27482 78409 -48055 -85193 -105503 -34176 21518 4021
11504D021O848k9465m6205r292M9608K66k8475K5218o3229K579O8315K6664R0573
$$ 4021 10869 -18596 -64801 -74093 -24485 -24219 -52694 -27476 -90705 -88126 -19811 6853 97426
11491I7426j2054k7345p3792k2076P7556J3362n2223k6791R4761j01101j4389
$$ 97426 85372 58027 -15765 -37841 39715 53077 854 -25937 68824 -32277 -46666
11480d6666P2496Q4786R4818p1192o3966j6756n6117j1778m202M3800m4712K9665
$$ -46666 25830 110616 205434 134242 70276 53520 -2597 -14375 -18577 25223 -19489 10176
11468A0176l089k16603Q0843P7474Q9907M0153L9235j14696k5513M2916n5559
$$ 10176 7087 -209516 -128673 -51199 38708 78861 118096 3400 -22113 20803 -34756
11457c4756k3219J5723K7521k3945R3561J5586r6244n5612m553j0600M0835j9152
$$ -34756 -57975 -42252 -14731 -38676 54885 70471 -25773 -81385 -85938 -96538 -55703 -74855
11445g4855o3348J2561J28611N067m483q4157N8426J45180l7618n370k0026m9203
$$ -74855 -138203 -125642 2969 8036 3553 -80604 -22178 123002 85384 80014 59988 10785
11433A0785p664m4845R2705O9897j49554k677j1517N0381J1096l1248k6139J18266
$$ 10785 3121 -41724 50981 120878 -28676 -31353 -42870 7511 18607 -12641 -38780 79486
11421G9486J16011n0118k06552J9362J2661r1823M4857J04238P1936n0673n4639
$$ 79486 195497 145379 -61173 -41811 -29150 -120973 -76116 28122 100058 49385 -5254
11410e254k6572m7026j11095m683P2172j7256K6908Q6076j34569N1374J78779
$$ -5254 -31826 -78852 -189947 -194630 -122458 -139714 -112806 -26730 -161299 -109925 68854
11399F8854n6674P7706n649L1410j04672j16406Q8394k2627J4060k4305R0595
$$ 68854 12180 89886 84237 115647 10975 -105431 -17037 -39664 -25604 -49909 40686
11388D0686O7320j26821M1108N8233o3633L0339j23031J0599j3569o238O6324
$$ 40686 108006 -18815 22293 80526 16893 47232 -75799 -65200 -78769 -85007 -18683
11377a8683J5998l2491k0021n1304R3323j6742l5403L6920N0867O310m4500j17902
$$ -18683 -2685 -35176 -55197 -106501 -13178 -29920 -65323 -28403 22464 28774 -15726 -133628
11365a33628Q8067N2139J6465J05476k7255m0325k8046j10994P5084K6419r3710
$$ -133628 -45561 6578 23043 128519 101264 60939 32893 -78101 -3017 23402 -70308
11354g0308k2354k816J688P6086m4461n3628J06161O6325N2460l6792j03262N7573
$$ -70308 -92662 -95478 -93790 -17704 -62165 -115793 -9632 56693 109153 72361 -30901 26672
11342B6672O4046j38756R467M5898Q455m9575J2313l1874P957o8078O6499m2591
$$ 26672 90718 -48038 -38571 7327 15782 -33793 -21480 -53354 -45397 -113475 -46976 -89567
11330h9567L0701R2407P6998r3644n519L162j51112p8970L4973J17695q5830R2179
$$ -89567 -58866 33541 110539 16895 11376 14538 -136574 -215544 -180571 -62876 -148706 -56527
11318e6527K960j05993J03528J45981O0049n1861n7540j47860O0260J31354r716
$$ -56527 -53567 -159560 -56032 89949 149998 98137 40597 -107263 -47003 84351 74635
11307G4635P966O4114k4581p2992q6682M5434N5373Q64O1168p9498k55M805l3702
$$ 74635 82601 146715 122134 49142 -37540 7894 63267 64131 125299 45801 45546 50351 16649
11294A6649J7355j16315j03118L8796L674J367l861n5794j8935J49227J25008
$$ 16649 34004 -82311 -185429 -146633 -142959 -141592 -145453 -201247 -220182 -70955 54053
11283E4053j07714n4779J77447q6890L270J1262k8907m5485O0533M9464j40462
$$ 54053 -53661 -108440 69007 -17883 -14613 -3351 -32258 -77743 -17210 32254 -108208
11272a08208O8092K3732N328P5035K0711j22345j22284L1004k748M5335r743o5388
$$ -108208 -40116 -16384 -11056 63979 84690 -37655 -159939 -128935 -131683 -86348 -96091 -161479
11260a61479M8083J18521J37956n7615N896o8946J7607P5767j0097j3384M7185
$$ -161479 -113396 5125 143081 85466 91362 22416 40023 115790 105693 92309 139494
11249A39494j45711k4474p3345J09749O6240j50220O0539J7290J3096n0846j12631
$$ 139494 -6217 -30691 -104036 5713 71953 -78267 -17728 -438 12658 -38188 -150819
11238a50819L8682k9162Q2230Q6514k5319N1226n9140j37354J43818o9120m0447
$$ -150819 -112137 -141299 -59069 27445 2126 53352 -5788 -143142 676 -68444 -108891
11227a08891O4624L7209O3222k4061o4719N6647o6644j52240J36772J00499m0836
$$ -108891 -44267 -7058 56164 32103 -32616 24031 -42613 -194853 -58081 42418 1582
11216A582q0706P0107q8581J49574l6023l74k1377q256j8784l6775J47414J68433
$$ 1582 -79124 -9017 -97598 51976 15953 15579 -5798 -14054 -32838 -69613 77801 246234
11204B46234p9207j60082R284N4273j35359N7290O8434j10678q4935J1190K8794
$$ 246234 167027 6945 16229 70502 -64857 -7567 60867 -49811 -134746 -123556 -94762
11193i4762l7293o2454N5841P0907O7585P6068j01238p730K11112r2501j11025
$$ -94762 -132055 -194509 -138668 -67761 -176 75892 -25346 -33076 178036 85535 -25490
11182b5490m6486R8330r822n5322Q213K6654j25773j0570J43907m0408J18984
$$ -25490 -71976 26354 16532 -38790 -30577 -3923 -129696 -140266 3641 -36767 82217
11171H2217M9563j36084P1336p3502j60827O1414O020m076J71750J7290j14045
$$ 82217 131780 -4304 67032 -6470 -167297 -105883 -99863 -103939 67811 85101 -28944
11160b8944J08544N4788r4467K5899m2910o6119J57434m0922L6743O9829K943
$$ -28944 79600 134388 39921 65820 22910 -43209 114225 73303 110046 179875 182818
11149A82818j04528p3482K2046K8424K3107p6573j77743k6612J30808O9884o9019
$$ 182818 78290 4808 26854 55278 78385 1812 -175931 -202543 -71735 -1851 -70870
11138g0870k0544J2884Q9587L1339O4471m8734p3893n3856j224L0094R8473j6544
$$ -70870 -91414 -78530 11057 42396 106867 58133 -15760 -69616 -70840 -40746 57727 41183
11126D1183L4135K8126j4493k8038l0552q8214M7138m6923k0364R5463n628R489
$$ 41183 75318 103444 88951 60913 30361 -57853 -10715 -57638 -78002 17461 11833 21322
11114B1322j40046R823M2176o2684N1526R812R2809Q7069n1053m3365K5553M1075
$$ 21322 -118724 -108901 -66725 -129409 -77883 -68071 24738 111807 60754 17389 42942 84017
11102H4017l5843o2229K1542L1830o2201P0816K8293j71893L8400k6748j79845
$$ 84017 48174 -14055 7487 39317 -22884 47932 76225 -95668 -57268 -84016 -263861
11091b63861J68277j191J64887P6795j06203j0400o1988J02863o6843k668m2230
$$ -263861 -95584 -96775 68112 144907 38704 28304 -33684 69179 2336 -332 -42562
11080d2562n106N0247k1154L0263n2294L6840J14115O482j02275l792j1092n5308
$$ -42562 -47668 2579 -18575 11688 -40606 -3766 110349 116831 14556 10764 -328 -55636
11068e5636q254J20894o4156l4291k2853k6677J26158l6783L6114q3758O6304
$$ -55636 -63890 57004 -7152 -41443 -64296 -90973 35185 -1598 34516 -49242 17062
11057A7062K3811Q6325L3854Q8308j8579k31844J25224o0617K5071K605m4543
$$ 17062 40873 127198 161052 249360 230781 -1063 124161 63544 88615 91220 46677
11046D6677m4474n5154P1440J00810j17816j22383k2860J34449j4742J2097N1736
$$ 46677 2203 -52951 18489 119299 1483 -120900 -143760 -9311 -24053 -11956 39780
11035C9780m6095J7035q4697L2469M6911o539Q8110N4557j71094j8185N9051r042
$$ 39780 -6315 10720 -73977 -41508 5403 -1136 86974 141531 -29563 -47748 11303 2261
11023B261K1418J6420J13795l1509r4527m4286J3485L2750J9566R5829r4238K0504
$$ 2261 23679 40099 153894 122385 27858 -16428 -2943 29807 49373 145202 50964 71468
11011G1468k5864j53867j0446J22391p2139N3081J10041j94356N4403P1904k1242
$$ 71468 45604 -108263 -118709 3682 -68457 -15376 94665 -99691 -45288 26616 5374
11000E374J14002O052L5352l1762j51988q4170J428L6147J84009J86898j51797
$$ 5374 119376 125428 160780 129018 -22970 -107140 -105712 -69565 114444 301342 149545
10989A49545l3866n4889k4935m1059r9788N9216J45505j0284j5502K783j04667
$$ 149545 115679 60790 35855 -5204 -104992 -45776 99729 89445 73943 76726 -27941
10978b7941k387J48484k7587m9371Q7801P0840j05573J7842j03270j00266O0503
$$ -27941 -30328 118156 90569 41198 128999 199839 94266 112108 8838 -91428 -30925
10967c0925R5735j14817m096L0652L9903J2553L0439l3881j87381J4762M7234
$$ -30925 64810 -50007 -54103 -23451 16452 29005 59444 25563 -161818 -147056 -99822
10956i9822J09468Q0801q47o2772M7986j55218j20787M1967J304J06629J79714
$$ -99822 9646 90447 89600 26828 74814 -80404 -201191 -159224 -157920 -51291 128423
10945A28423j51126J06242O117r6439J05575n9037l9622o4588P7455J12095k9383
$$ 128423 -22703 83539 89656 -6783 98792 39755 133 -64455 13000 125095 95712
10934I5712j30083m648L9370j59338J26333N7149N3373o1146P147P6737q4800
$$ 95712 -34371 -39019 351 -158987 -32654 24495 77868 16722 23869 100606 15806
10923A5806K1993N0202J8477k22814J43679m1355k48609l1582j6100K61057J05978
$$ 15806 37799 88001 106478 -116336 27343 -14012 -262621 -294203 -310303 -49246 56732
10912E6732m6265R056L7846o7916m6579O6502q5653j6910M2589P2013L9753o8410
$$ 56732 10467 19523 57369 -10547 -57126 9376 -76277 -93187 -50598 21415 61168 -7242
10900g242l6678P6894L6198j03886j12282J01922J23521j34934l3503K6411K02503
$$ -7242 -43920 32974 69172 -34714 -146996 -45074 78447 -56487 -89990 -63579 138924
10889A38924P6344q3919p4061k8639j45424l426L9383R0611l058L6614j18239
$$ 138924 215268 131349 57288 28649 -116775 -120201 -80818 9793 6735 43349 -74890
10878g4890l5201O1917q6998J02699K3299m9656O4922K21400m2867K9704r9227
$$ -74890 -110091 -48174 -135172 -32473 -9174 -58830 6092 227492 184625 214329 115102
10867A15102m091j90164L862J05288k5702J20497M7226j767j43781O681m6270
$$ 115102 111011 -79153 -75291 29997 4295 124792 172018 170251 26470 33151 -13119
10856a3119L0939J25477J5417m5184n5456M5889q8094J07640J02203j38875p6427
$$ -13119 17820 143297 158714 113530 58074 103963 15869 123509 225712 86837 10410
10845A0410j1942j19655J17221J54565p475Q295r6277r1923Q8513k2351k4763
$$ 10410 -1532 -121187 -3966 150599 143124 151419 55142 -36781 51732 29381 4618
10834D618p8088o2690M8074p7667M5727j22J31355M2418M3879j01458j93734k7184
$$ 4618 -73470 -136160 -88086 -165753 -120026 -120148 11207 53625 97504 -3954 -197688 -224872
10822b24872J17204k7483P5271J53712l8976m3565l649P5503l1892o454J7210
$$ -224872 -107668 -135151 -59880 93832 54856 11291 7642 83145 51253 44799 62009
10811F2009K0570r2568N6757J36202p3606J15598p2113q7134J7376q7467O9513
$$ 62009 82579 -9989 46768 182970 109364 224962 152849 65715 83091 -4376 65137
10800F5137j0267J1813k3249o2047J03159r812N4895N861k1181r8623p8912J05025
$$ 65137 54870 66683 43434 -18613 84546 74734 129629 135490 114309 15686 -63226 41799
10788D1799o473k9061o6335o6896N2611j8268o1046L8684J44614l4330o8438L8877
$$ 41799 35326 6265 -60070 -126966 -74355 -92623 -153669 -114985 29629 -4701 -73139 -34262
10776c4262p925L0128M8802j4039N3801R062j05755J20031j3089l6833p1998k023
$$ -34262 -42187 -12059 36743 22704 76505 85567 -20188 99843 86754 49921 -22077 -24100
10764b4100L4954P6672m5413p840P2923j89752m0226Q6471J1004K6246r1191P2019
$$ -24100 10854 87526 42113 34273 107196 -82556 -122782 -36311 -25307 939 -90252 -18233
10752a8233r3691M1065R3080r3784K9616L925J05675K2276L4904q4691m0270Q9641
$$ -18233 -111924 -70859 22221 -71563 -41947 -38022 67653 89929 124833 40142 -128 89513
10740H9513N5201m8058p8882n8953k0831Q8943l3112k686j56959l6491J05280
$$ 89513 144714 96656 17774 -41179 -62010 26933 -6179 -8865 -165824 -202315 -97035
10729i7035P8138J2924l964p7561N2322P297q5973O6299m0843k3815J00116O3061
$$ -97035 -18897 -5973 -9937 -87498 -35176 -27879 -113852 -47553 -88396 -112211 -12095 50966
10717E0966Q5492J9956m8967o9632O1610k767J8958O9613n8171k30215m0548K25281
$$ 50966 136458 156414 107447 37815 99425 96658 115616 185229 127058 -103157 -143705 81576
10705H1576O7565P2819o6766j65615J1126L1526j10517l7390N8473K3039L919
$$ 81576 149141 221960 155194 -10421 705 32231 -78286 -115676 -57203 -34164 -30245
10694c0245R0716j22679k286o3431L1623J35520j2m1363l1814m9723j8233p8132
$$ -30245 60471 -62208 -64494 -127925 -96302 39218 39206 -2157 -33971 -83694 -101927 -180059
10682a80059P6737L3576l6982M1754j6881p6514J48665l9422o7586O9832O7576
$$ -180059 -103322 -69746 -106728 -64974 -81855 -158369 -9704 -49126 -116712 -46880 20696
10671B0696O0294J8528m3843L3148O2281j05908k0709j13158L2687L9991P277
$$ 20696 80990 99518 55675 88823 151104 45196 24487 -88671 -55984 -15993 -8716
10660h716J13599l0686m2228L3326L0663j22992n6878O1042M2433N0579j8153
$$ -8716 104883 74197 31969 65295 95958 -27034 -83912 -22870 19563 70142 51989
10649E1989O74P2369N852j27130k645Q9885k4595K2979L38m505R5899k3250j05949
$$ 51989 52663 125032 130884 3754 1109 90994 66399 89378 89716 85211 181110 157860 51911
10636E1911J1377J9740o0443R3548l9844k0408J1400j48069J70383k4554j15338
$$ 51911 63288 83028 22585 116133 76289 55881 67281 -80788 89595 65041 -50297
10625e0297K456N1171o3939J4904k2416k0688N7670j0378L1848l2636J41336O4503
$$ -50297 -47841 3330 -60609 -45705 -68121 -88809 -31139 -41517 -9669 -42305 99031 163534
10613A63534J6261k24856n4184L7092P7233L0693N575r1728N9088J40496l5061
$$ 163534 179795 -45061 -99245 -62153 15080 45773 51348 -40380 18708 159204 124143
10602A24143k12052l6461K67484j553q1248k36603J1281J31333j497R5515P9354
$$ 124143 -87909 -124370 143114 141561 60313 -176290 -165009 -33676 -35173 60342 139696
10591A39696l8667j7517j08631j7788N5478N751M1365p8169K6762M1633q468p0261
$$ 139696 101029 83512 -25119 -42907 12571 18322 59687 -18482 8280 49913 41445 -28816
10579b8816J09573J4254r2350j03719J43175J04129j76627l9205o5795J87995
$$ -28816 80757 95011 2661 -101058 42117 146246 -30381 -69586 -135381 52614
10569E2614r1901p8419J56458j6960n2066J9351j58417L106n196M7963R0951q5399
$$ 52614 -39287 -117706 38752 21792 -30274 -10923 -169340 -166234 -171430 -123467 -32516 -117915
10557a17915K3599R2738J40465j34291m5030j17728M0992J02324R7524K798k3156
$$ -117915 -94316 -1578 138887 4596 -40434 -158162 -117170 -14846 82678 85476 62320
10546F2320K4539j36232l9252Q0563J09583q0622n6670k1363Q3256P9697K9022
$$ 62320 86859 -49373 -88625 -8062 101521 20899 -35771 -57134 26122 105819 134841
10535A34841m3033R271J63393j13174j96495L1194J40091N4490q5019p4871M8548
$$ 134841 91808 101079 264472 151298 -45197 -14003 126088 180578 95559 20688 69236
10524F9236m7884J85904L5625o1612j94262q1657P1860O8924N2274n7319n2513
$$ 69236 21352 207256 242881 181269 -12993 -94650 -22790 46134 98408 41089 -11424
10513a1424R526K0726N3522K1354l8811k3881l6088l7304K7721m3446M7887l9868
$$ -11424 -1898 18828 72350 93704 54893 31012 -5076 -42380 -14659 -58105 -10218 -50086
10501e0086R6240o2489k5355n4784M6653L5003J9649L5499r4131K1655n8276K47585
$$ -50086 46154 -16335 -41690 -96474 -49821 -14818 4831 40330 -53801 -32146 -90422 157163
10489A57163J21679p2967m6931n723j160j8632j47212q369M6621J92672p5730
$$ 157163 278842 205875 158944 153221 152061 133429 -13783 -22152 24469 217141 141411
10478A41411q1254m7349O8105n9426l3838p4992Q1353J0135J09685K6218o4600
$$ 141411 60157 12808 80913 21487 -12351 -87343 -5990 4145 113830 140048 75448
10467G5448O526q863R8672o7513q2614j883J58048j8438j48384N8861N302K7884
$$ 75448 81974 73111 171783 104270 21656 19773 177821 159383 10999 69860 75162 103046
10455A03046r4392J42696J09011j60199m8216M9536N850o9763N0375J00308j15068
$$ 103046 8654 151350 260361 100162 51946 101482 107332 37569 87944 188252 73184
10444G3184m7053k2589K7093J00415j20402m5660K7109j05579N5539R8199m2029
$$ 73184 26131 3542 30635 131050 10648 -35012 -7903 -113482 -57943 40256 -1773
10433a773M6027L1419j7083j49263k6420J03176Q8250P1089q6388K9005Q8153
$$ -1773 44254 75673 58590 -90673 -117093 -13917 74333 145422 59034 88039 176192
10422A76192n9146l7399m068J890n6315o4642K848J2560J50116L6115p2244k9846
$$ 176192 117046 79647 75579 77469 21154 -43488 -40640 -28080 122036 158151 85907 56061
10410E6061R9879l144j15284q693l2872j3806M2262Q5693N030p465j45696m151
$$ 56061 155940 152796 37512 28819 -4053 -17859 24403 110096 115126 107661 -38035 -42186
10398d2186k8085l4874J9789J54734O9126n7036P236J00655j33261L060J3338
$$ -42186 -70271 -105145 -85356 69378 138504 81468 88704 189359 56098 59158 72496
10387G2496N3503m8867m1411O5995j72160O6361P1002j05010j0629Q3800O8110
$$ 72496 125999 77132 35721 101716 -70444 -4083 66919 -38091 -48720 35080 103190
10376A03190o7433n7057n3117J0345k176J63872L2075m2264m3174o3233J22788
$$ 103190 35757 -21300 -74417 -64072 -66248 97624 129699 87435 44261 -18972 103816
10365A03816j1471j7272n499j10249O5692O3748o441J48863L066q8368R9693j06091
$$ 103816 92345 75073 69574 -40675 25017 88765 82324 231187 234253 145885 245578 139487
10353A39487r4671Q7751o6943j05535R7948J87381k3701j54167r507J88j6741
$$ 139487 44816 132567 65624 -39911 58037 245418 221717 67550 58043 58231 41490
10342D1490P3311l0778q0821k3957O6875j8328O2665l5023J45270R372o8882m2288
$$ 41490 114801 84023 3202 -20755 46120 27792 90457 55434 200704 210076 141194 98906
10330I8906j3110P5723K4036O5661n2556j1882p3198q3123J9072k6591L1401l6558
$$ 98906 85796 161519 185555 251216 198660 186778 113580 30457 49529 22938 54339 17781
10318A7781L8761J08300o8046j07721K910k1323K9023j0118J2813J78275p1409
$$ 17781 56542 164842 96796 -10925 -8015 -29338 -315 -10433 2380 180655 109246
10307A09246K5049n2765R4881L7323j16229j14202J39276p4261p5011J51134j16232
$$ 109246 134295 81530 176411 213734 97505 -16697 122579 48318 -26693 124441 8209
10296H209j9807J86951k6069j06341k6865L0785M340Q5723j3578O1175j6844j634
$$ 8209 -11598 175353 149284 42943 16078 46863 51203 136926 123348 184523 167679 166045
10284A66045l1298M8079O6575j03381N7148r9453o4445J02015P6888j01180j00309
$$ 166045 134747 182826 249401 146020 203168 103715 39270 141285 218173 116993 16684
10273A6684l1927J1698M9285K1601r5429M9067n7465M4107K1069J0645q756P9796
$$ 16684 -15243 -3545 45740 67341 -28088 20979 -36486 7621 28690 39335 30579 110375
10261A10375j12552n3615L9348K7168r4777O4910J05490l6386j04750O9843J20510
$$ 110375 -2177 -55792 -16444 10724 -84053 -19143 86347 49961 -54789 15054 135564
10250A35564N843m3526k1049j1724j0684L8491p4833K7231P7251J07588M9238
$$ 135564 141407 97881 76832 65108 54424 92915 18082 45313 122564 230152 279390
10239B79390k1785q1251k26268Q1460J16747L1616l887J78897r5584j35855o5248
$$ 279390 257605 176354 -49914 31546 148293 179909 176022 354919 259335 123480 58232
10228E8232M8892Q7377m0697q5441J6640k0106l0550O0685J7023j45318J5681
$$ 58232 107124 194501 153804 68363 85003 64897 34347 95032 112055 -33263 -17582
10217a7582J14819J18406q4395n6488O5706K8902j5480m7685J45291j1370K9796
$$ -17582 97237 215643 131248 74760 140466 169368 153888 106203 251494 240124 269920
10206B69920p5496k3076Q7820j12051r7958L24M0331L4403j7554K5108j73461
$$ 269920 194424 171348 259168 147117 49159 49483 89814 124217 106663 131771 -41690
10195d1690J6136P3438O2317o7667m1955J52409j6542l4231p70M7444N1170j19426
$$ -41690 -25554 47884 110201 42534 579 152988 136446 102215 101445 148889 200059 80633
10183H0633J17913k4378P2985p7088j1234l3704k3172J25279J50330n6260j43883
$$ 80633 198546 174168 247153 170065 158831 125127 101955 227234 377564 321304 177421
10172A77421n307j05507m2812J80560N6115k9524M8346o0818p0906P4862r9952
$$ 177421 172114 66607 23795 204355 260470 230946 279292 218474 147568 222430 122478
10161A22478M5935M9708p845k7517P157o4117N9902p5467j6648l0619J76497L5520
$$ 122478 168413 218121 210276 182759 189916 125799 185701 110234 93586 62967 239464 274984
10149B74984o2519J30284n6034J84744l728R381j13632m7542L5266p283N3908
$$ 274984 212465 342749 286715 471459 467731 477112 363480 315938 351204 343921 397829
10138C97829n1526l9612k5013P1142j4961r652r4354J04368j02773p5859J18005
$$ 397829 346303 306691 281678 352820 337859 328207 233853 338221 235448 159589 277594
10127B77594n1296l0270L437J48959r7520k4460M5725o16M9554m4307q8045N1194
$$ 277594 226298 196028 199465 348424 250904 226444 272169 271553 321107 276800 188755 239949
10115B39949J59115m8475l3515L3216m234K8160r2319j15152m2899m2872R8111
$$ 239949 399064 350589 317074 350290 346056 374216 281897 166745 123846 80974 179085
10104A79085J14356M6347O9042j5878j9791p8738M0334l7250J03287j00487j17888
$$ 179085 293441 339788 408830 392952 373161 294423 334757 297507 400794 300307 182419
10093A82419r868n012J38645J01938j28939m1194N7944j33076j70506J28748O3437
$$ 182419 172551 167539 306184 408122 279183 237989 295933 162857 -7649 121099 184536
10082A84536j9714j24087J23479O1853J31548J14643o5894l4556K7036o1471j26102
$$ 184536 164822 40735 164214 226067 357615 472258 406364 371808 398844 337373 211271
10071B11271p1614M9245K5392l9381P4063Q039n1412j8420l9261J55103q0670
$$ 211271 139657 188902 214294 174913 248976 257015 205603 187183 147922 303025 222355
10060B22355K1764J010j7004j08583m1160J9135k9524J09151j9775J22815o4970
$$ 222355 244119 245129 228125 119542 78382 97517 67993 177144 157369 280184 215214
10049B15214J232l2458J1100l5503l2709R4212Q6290r0503j4036r2790Q153O1435
$$ 215214 216446 183988 195088 159585 126876 221088 307378 216875 202839 110049 118202 179637
10037A79637J6345K5810j080Q8904L2056J20505L1892m5638o418o4171K3165o1638
$$ 179637 195982 221792 220712 309616 341672 462177 494069 448431 442013 377842 401007 339369
10025C39369j11244p6162k7239J25058N5235o548o2309O7442J66208j23345j660
$$ 339369 228125 151963 124724 249782 305017 298469 236160 303602 469810 346465 344805
10014C44805Q8460J6443j59507N3561j52k0771J46341m4420n7769l621Q7029k4309
$$ 344805 433265 449708 290201 343762 343610 322839 469180 424760 366991 363370 450399 426090
10002D26090M5980k7416p8323J6722K07665J2826j72191L606P4732p7864J1263
$$ 426090 472070 444654 366331 383053 590718 603544 431353 434959 509691 431827 443090
9991D43090J9977o2681J27804P8406M2327M950j58616q036L2907k6065J44089
$$ 443090 463067 400386 528190 606596 648923 653873 495257 487221 520128 494063 638152
9980F38152J58217m2251l4766P2668j1090O8103j45402J29235O2373l9847R5746
$$ 638152 796369 754118 719352 792020 780930 849033 703631 832866 895239 855392 951138
9969I51138P6122O6547J2450J73051p1221l3054J28039Q5312j16201o0964j9857
$$ 951138 1027260 1093807 1106257 1279308 1208087 1175033 1303072 1388384 1272183 1211219 1191362
9958A191362j8995j16869q3080O2985K2117K3248j378K9601j00553N369j69093
$$ 1191362 1172367 1055498 972418 1035403 1057520 1080768 1079390 1108991 1008438 1013807 844714
9947H44714j3053Q4482M2125l3757n1092P907L3481j9599J57730L3837r8089M8095
$$ 844714 831661 916143 958268 924511 873419 881326 914807 895208 1052938 1086775 988686 1036781
9935A036781J96816p713R603M4309J82840M9133k1661m4841O4644j3330m406j3906
$$ 1036781 1233597 1225884 1235487 1279796 1462636 1511769 1490108 1445267 1509911 1496581 1492175 1478269
9923A478269p5681J43723p3460j36939j47879L281p6630L1451p9457O7927J1861
$$ 1478269 1402588 1546311 1472851 1335912 1188033 1191314 1114684 1146135 1066678 1134605 1146466
9912A146466j66794N8711q0506r9474P5060K5092J38656j11929N6249j54667p2292
$$ 1146466 979672 1038383 957877 858403 933463 958555 1097211 985282 1041531 886864 814572
9901H14572J47572k2013N9532J3392J22253j54245L690J75069r362n3902p274
$$ 814572 962144 940131 999663 1013055 1135308 981063 984753 1159822 1150460 1096558 1089284
9890A089284n0003o0566L8158R5047j76266N9767J10489Q0167Q2216J52687m5575
$$ 1089284 1039281 978715 1016873 1111920 935654 995421 1105910 1186077 1268293 1420980 1375405
9879A375405m0382J3463L0650N3316J00726R4232k68390m4807l6489L4561l7484
$$ 1375405 1335023 1348486 1379136 1432452 1533178 1627410 1359020 1314213 1277724 1312285 1274801
9868A274801m0852k5780r7103L109j7991O1810M6181j24713J6010j22058K5154
$$ 1274801 1233949 1208169 1111066 1114175 1096184 1157994 1204175 1079462 1095472 973414 998568
9857I98568m2686Q5783P8312N9870k1443n5318j60681J20994Q4785p7708L2836
$$ 998568 955882 1041665 1119977 1179847 1158404 1103086 942405 1063399 1148184 1070476 1103312
9846A103312J3046j4211k069M4564Q3447J6928Q8632k78776k7239L8981O4973
$$ 1103312 1116358 1102147 1100078 1144642 1228089 1245017 1333649 1054873 1027634 1066615 1131588
9835A131588J77483n7269k83M9864M2818k0348k4040J4237J02796K0281o2002
$$ 1131588 1309071 1251802 1251519 1301383 1344201 1323853 1299813 1314050 1416846 1437127 1375125
9824A375125Q544K16180j62882j40043O2201K03803k04823N2713J55307n4571
$$ 1375125 1383669 1599849 1436967 1296924 1359125 1562928 1358105 1410818 1566125 1511554
9814A511554m3074J9404M2631l2214J19047L976k3838k4257J70116p398o1064
$$ 1511554 1468480 1487884 1530515 1498301 1617348 1621324 1597486 1573229 1743345 1735947 1674883
9803A674883M1269J7014j2222l0166j61p170l5623O5716N4272L6479l0157J05247
$$ 1674883 1716152 1733166 1720944 1690778 1690617 1683447 1647824 1713540 1767812 1804291 1774134 1879381
9791A879381J09748j36641k7256O0570O5045J00249L5729J789O592n0582M9894
$$ 1879381 1989129 1852488 1825232 1885802 1950847 2051096 2086825 2088614 2095206 2044624 2094518
9780B094518m0866o5301J24260K1230M8421R6591j19369Q4713r9506L7231R0610
$$ 2094518 2053652 1988351 2112611 2133841 2182262 2278853 2159484 2244197 2144691 2181922 2272532
9769B272532l6094K9390N5211m858J3062l6630N4112J02140J67644q7375l1717
$$ 2272532 2236438 2265828 2321039 2316181 2329243 2292613 2346725 2448865 2616509 2529134 2497417
9758B497417M4951j19067P3716K09513O4427j02833J3683n7777O9338J63943M5413
$$ 2497417 2542368 2423301 2497017 2706530 2770957 2668124 2681807 2624030 2693368 2857311 2902724
9747B902724j6625l338n5198j5442K08546J04448O3649q4988j35904O0572J8313
$$ 2902724 2886099 2882761 2827563 2812121 3020667 3125115 3188764 3103776 2967872 3028444 3046757
9736C046757J30895J56686N7763J02409j3190j05180o8276J62770Q7869N4309
$$ 3046757 3177652 3334338 3392101 3494510 3481320 3376140 3307864 3470634 3558503 3612812
9726C612812O5138l6085Q5069J48557N3067N3884R2871J54454m6920M2459J07668
$$ 3612812 3677950 3641865 3726934 3875491 3928558 3982442 4075313 4229767 4182847 4225306 4332974
9715D332974O6724P7336J76371P3973l0035Q1943Q6457L93R9724K16983R9455
$$ 4332974 4399698 4477034 4653405 4727378 4697343 4779286 4865743 4866136 4965860 5182843 5282298
9704E282298K5718J62034Q1457k4524J91881R4594P6976J75230J99159P8846K3636
$$ 5282298 5308016 5470050 5551507 5526983 5718864 5813458 5890434 6065664 6264823 6343669 6367305
9693F367305P983K12363K51204J50582K60799L2378J76744K74440K02854K15112
$$ 6367305 6375288 6587651 6838855 6989437 7250236 7282614 7459358 7733798 7936652 8151764
9683H151764P8425J32328L4732K46857J84507J49696K67630J18313K34117J66768
$$ 8151764 8230189 8362517 8397249 8644106 8828613 8978309 9245939 9364252 9598369 9765137
9673I765137K12493K75814J19552J35288L29036K58865K34698L75269K68945K95481
$$ 9765137 9977630 10253444 10372996 10508284 10837320 11096185 11330883 11706152 11975097 12270578
9663A2270578K78545L88439L70857K76540L70630N75326L61406M56288M21378
$$ 12270578 12549123 12937562 13308419 13584959 13955589 14530915 14892321 15348609 15769987
9654A5769987L20067M51898N01477N41707N69877M16598N45953N26871N33396
$$ 15769987 16090054 16541952 17043429 17585136 18155013 18571611 19117564 19644435 20177831
9645B0177831N98585M97787N25913O02646P70701P66414N94982O54409O06499
$$ 20177831 20776416 21274203 21800116 22402762 23173463 23939877 24534859 25189268 25795767
9636B5795767R76403R41481R09437R21807R58045J182171J318127J188922J316966
$$ 25795767 26772170 27713651 28623088 29544895 30502940 31685111 33003238 34192160 35509126
9627C5509126J615212J645829J602571J945336K028353K244515K832624L148874
$$ 35509126 37124338 38770167 40372738 42318074 44346427 46590942 49423566 52572440
9619E2572440L270313L817051M567306N341214O311450P405437Q378040R173848
$$ 52572440 55842753 59659804 64227110 69568324 75879774 83285211 91663251 100837099
9611A00837099R669731R860135J0432924J0119639P987067N554052L744876K049280
$$ 100837099 110506830 120366965 130799889 140919528 148906595 154460647 158205523 160254803
9603A60254803j55710l521481o471268p654559p524110q297592r043192q761643
$$ 160254803 160099093 156577612 150106344 142451785 134927675 126630083 117586891 108825248
9595A08825248p411813n931298m950052m010845k924155j871940j584011j185501
$$ 108825248 101413435 95482137 90532085 86521240 83597085 81725145 80141134 78955633
9587G8955633o59126L4321O80573Q80772J680933K664787L588772M672786N916650
$$ 78955633 78296507 78330828 79011401 79892173 81573106 84237893 87826665 92499451 98416101
9578I8416101P314144P969988Q362447Q874383R420528R153764P408318N009787
$$ 98416101 105730245 113700233 122062680 130937063 140357591 149511355 156919673 161929460
9570A61929460L170909J845860n99178m711780q488660r739445r715787j0091524
$$ 161929460 165100369 166946229 166347051 161635271 153146611 143407166 133691379 123599855
9562A23599855j1298778j0737706r520300q310673p207763o096505n147279m473550
$$ 123599855 112301077 101563371 92043071 83732398 76524635 70428130 65280851 60807301
9554F0807301l965503l498989l259167l093082k719293k831188k588732k301505
$$ 60807301 56841798 53342809 50083642 46990560 44271267 41440079 38851347 36549842
9546C6549842k236801k011093k079994j823377j675101j675318j384473j180211
$$ 36549842 34313041 32301948 30221954 28398577 26723476 25048158 23663685 22483474
9538B2483474j195421r27762q93259r31267p71738p65904o82049l94851n86833
$$ 22483474 21288053 20360291 19467032 18535765 17764027 16998123 16316074 15921223 15334390
9529A5334390n97956n15173l32160l85129n12568k74803k61154l73573l86465
$$ 15334390 14736434 14221261 13889101 13503972 12991404 12716601 12455447 12081874 11695409
9520A1695409l41590k98443k54722l52675j82885m36235l58155p3639j74446k36216
$$ 11695409 11353819 11055376 10800654 10447979 10265094 9828859 9470704 9397065 9222619 8986403
9510H986403l09117l26079k57702k07709j37675j95623q9664j47750j34079k09048
$$ 8986403 8677286 8351207 8093505 7885796 7748121 7552498 7462834 7315084 7181005 6971957
9500F971957j89459j66686j03665j36105j49487j09132j83716j63733q1585j65930
$$ 6971957 6782498 6615812 6512147 6376042 6226555 6117423 5933707 5769974 5688389 5522459
9490E522459q0362j95633l5198l1489j06387j15343p8188m240K5339n0692j62879
$$ 5522459 5442097 5246464 5211266 5179777 5073390 4958047 4879859 4875619 4900958 4850266 4687387
9479D687387n7248j64394j75617j65422O0183m6496j60483l2683n6082j30785
$$ 4687387 4630139 4465745 4290128 4124706 4184889 4138393 3977910 3945227 3889145 3758360
9469C758360m9469k8241r5581L2113n7717j54570j16117L8134j7453m2804j6660
$$ 3758360 3708891 3680650 3585069 3617182 3559465 3404895 3288778 3326912 3309459 3266655 3249995
9458C249995P2247J7100k31944j85195N7561O4781q5656m8379j7331R2424n8461
$$ 3249995 3322242 3339342 3107398 2922203 2979764 3044545 2958889 2910510 2893179 2985603 2927142
9447B927142j95918k0070k6670O3954J6844p7471j67804j05007R3307J2998q7136
$$ 2927142 2731224 2711154 2684484 2748438 2765282 2687811 2520007 2415000 2508307 2521305 2434169
9436B434169o1846j54829J36170J06189J16577q6411k9338J3069j63755M5867
$$ 2434169 2372323 2217494 2353664 2459853 2576430 2490019 2460681 2473750 2309995 2355862
9426B355862n6233J4074K29328k1613j82995q0634P0139J64896K6183j6220j80897
$$ 2355862 2299629 2313703 2543031 2521418 2338423 2257789 2327928 2492824 2519007 2502787 2321890
9415B321890m6332L0564q2228O2284p201r7230k9994n1332m784m8908m4742N6987
$$ 2321890 2275558 2306122 2223894 2286178 2278977 2181747 2151753 2100421 2095637 2046729 2001987 2058974
9403B058974J35433J01784j9456j10305K8334l9123p5242J01114K8825Q5856J32429
$$ 2058974 2194407 2296191 2276735 2166430 2194764 2155641 2080399 2181513 2210338 2296194 2428623
9392B428623M742r294M4628o2596Q1330L0069l1453m0548L8307r0346j03743J46619
$$ 2428623 2433365 2424071 2468699 2406103 2487433 2517502 2486049 2445501 2483808 2393462 2289719 2436338
9380B436338P9912L8388R308j00592q7212K8469r3162j412j9579J49310q1042
$$ 2436338 2516250 2554638 2563946 2463354 2376142 2404611 2311449 2310037 2290458 2439768 2358726
9369B358726r1996P562M5888j6802Q2290r389m3896P9403L2796k9907k6440j14412
$$ 2358726 2266730 2274292 2320180 2303378 2385668 2376279 2332383 2411786 2444582 2414675 2388235 2273823
9357B273823O5351l0713R200M9045J9957J66561j61414n3320O3335J4202j06299
$$ 2273823 2339174 2308461 2317661 2366706 2386663 2553224 2391810 2338490 2401825 2416027 2309728
9346B309728k6443k0505N9575J29717j15595P6401q7842j00115p8278Q2169l1598
$$ 2309728 2283285 2262780 2322355 2452072 2336477 2412878 2325036 2224921 2146643 2228812 2197214
9335B197214M1187J11630J90367M9477j53166P2344o1598o8219r7521M1746J927
$$ 2197214 2238401 2350031 2540398 2589875 2436709 2509053 2447455 2379236 2281715 2323461 2325388
9324B325388n3783M9400P8587j37409o1545J2946r4127J10968J3861J1041p3326
$$ 2325388 2271605 2321005 2399592 2262183 2200638 2213584 2119457 2230425 2244286 2255327 2182001
9313B182001j65611k7002K4971K26959P1543r4562k2306k6322j57492J14842N1253
$$ 2182001 2016390 1989388 2014359 2241318 2312861 2218299 2195993 2169671 2012179 2127021 2178274
9302B178274o5072J4549j06255j8590J26775K7864J4283j92750J49976K11392
$$ 2178274 2113202 2127751 2021496 2002906 2129681 2157545 2171828 1979078 2129054 2340446
9292B340446J53082o9290j20110L2951J32517l4879J82P4224M2593J6530j73870
$$ 2340446 2493528 2424238 2304128 2337079 2469596 2434717 2434899 2509123 2551716 2568246 2394376
9281B394376J58880O7108m9170J11132O2451k1454k1670J23292m7898j13991q2116
$$ 2394376 2553256 2620364 2571194 2682326 2744777 2723323 2701653 2824945 2777047 2663056 2580940
9270B580940N5385J58766P9861P0530o5833P0436m271m4771o1954L9475K0022
$$ 2580940 2636325 2795091 2874952 2945482 2879649 2950085 2945814 2901043 2839089 2878564 2898586
9259B898586J04020R0781k3304l4391J43272J03514l7894J1829m8910K21519J53196
$$ 2898586 3002606 3093387 3070083 3035692 3178964 3282478 3244584 3256413 3207503 3429022 3582218
9248C582218J02284Q9907O4331J80329j7842l3724j10426l7338O486K8630n1425
$$ 3582218 3684502 3774409 3838740 4019069 4001227 3967503 3857077 3819739 3826225 3854855 3803430
9237C803430q8266K6243L3792N4914j37509K3782q5855L4417J32836M3555J05544
$$ 3803430 3715164 3741407 3775199 3830113 3692604 3716386 3630531 3664948 3797784 3841339 3946883
9226C946883J2034L9503Q7445O8444J40181R6954J4419J22997l7455M6510J61986
$$ 3946883 3958917 3998420 4085865 4154309 4294490 4391444 4405863 4528860 4491405 4537915 4699901
9215D699901R7608K68669L8272N3509M6723R3898P5356o5793J42446L5013k1058
$$ 4699901 4797509 5066178 5104450 5157959 5204682 5298580 5373936 5308143 5450589 5485602 5464544
9204E464544j23761r5854n7341o1893k5804N6364r7803j25773k5719J8708j17418
$$ 5464544 5340783 5244929 5187588 5125695 5099891 5156255 5058452 4932679 4906960 4925668 4808250
9193D808250J28223L3269p5707J05294J14445J0461M5026M6322o756J73787K9881
$$ 4808250 4936473 4969742 4894035 4999329 5113774 5124235 5169261 5215583 5208827 5382614 5412495
9182E412495m310k216j06036K5448Q8386p096j20434M9582K09650n9025R6634
$$ 5412495 5408185 5405969 5299933 5325381 5413767 5406671 5286237 5335819 5545469 5486444 5583078
9171E583078M2692k13531O5991Q9865R7284R8466J53368J09891j92192O6740J6926
$$ 5583078 5625770 5412239 5478230 5568095 5665379 5763845 5917213 6027104 5834912 5901652 5918578
9160E918578M6106L30676q3184J12728R7204p215J47112R1831J79868Q0526J36270
$$ 5918578 5964684 6295360 6212176 6324904 6422108 6414893 6562005 6653836 6833704 6914230 7050500
9149G050500J34715M9863k8098n3152J50844n0231J02203P3205O0532j2569Q4089
$$ 7050500 7185215 7235078 7206980 7153828 7304672 7254441 7356644 7429849 7490381 7477812 7561901
9138G561901K47279J11802J04882O2118J03462N3696K04301Q5541J37113J23522
$$ 7561901 7809180 7920982 8025864 8087982 8191444 8245140 8449441 8534982 8672095 8795617
9128H795617K70501P6155K03664N4232J6401J46913K19916K88037J22708J12261
$$ 8795617 9066118 9142273 9345937 9400169 9416570 9563483 9783399 10071436 10194144 10306405
9118A0306405L36272K90924K26358K49422J13529K5185K36738J89809K01104J01068
$$ 10306405 10642677 10933601 11159959 11409381 11522910 11548095 11784833 11974642 12175746 12276814
9108A2276814K53560L94383K06409J98911J70853J74143L28823L60259L83025
$$ 12276814 12530374 12924757 13131166 13330077 13500930 13675073 14003896 14364155 14747180
9099A4747180L93352L24736K56868L17885L80910N37605M28381L97618K89832
$$ 14747180 15140532 15465268 15722136 16040021 16420931 16958536 17386917 17784535 18074367
9090A8074367M94122N86767N05164O52320M43440O82038O53196N29617O58466
$$ 18074367 18568489 19155256 19660420 20312740 20756180 21438218 22091414 22621031 23279497
9081B3279497O83747P53479P35082Q19175R63981R47854J095499J249507J530253
$$ 23279497 23963244 24716723 25451805 26270980 27234961 28182815 29278314 30527821 32058074
9072C2058074J512660J775298J942843K345336J957672J391718P66446Q30489
$$ 32058074 33570734 35346032 37288875 39634211 41591883 42983601 43750047 44580536
9064D4580536Q82020P39919L66911j41848m71302n22111j28216q365Q8269M93235
$$ 44580536 45462556 46202475 46569386 46427538 45956236 45434125 45305909 45297544 45385813 45879048
9054D5879048P28172J001702J176151J205684J452144J704894J962293K196272
$$ 45879048 46607220 47608922 48785073 49990757 51442901 53147795 55110088 57306360
9046E7306360K530710K843443L402607L993583M406757N071797N218013M750148
$$ 57306360 59837070 62680513 66083120 70076703 74483460 79555257 84773270 89523418
9038H9523418M056596L872051M575068N197979N731809N922227N682543M782561
$$ 89523418 93580014 97452065 102027133 107225112 112956921 118879148 124561691 129344252
9030A29344252K698791N39408j92851L79986R34113k40574k691041m362749m385110
$$ 129344252 132043043 132582451 132389600 132769586 133703699 133463125 130772084 126409335 122024225
9021A22024225l554956k831332j859004k41567Q91935K035229L347293M331723
$$ 122024225 118469269 115637937 113778933 113537366 114429301 116464530 119811823 124143546
9013A24143546N450682P002918Q654026J0570680J2871148J5048186J6895359
$$ 124143546 129594228 136597146 145251172 155821852 168693000 183741186 200636545
9006B00636545J8542079K0132155K0845722J9204914J4317269P948371K354463
$$ 200636545 219178624 239310779 260156501 279361415 293678684 301627055 303981518
8999C03981518k25396o99752j905465m965105r491270j2879442j4550988j5238039
$$ 303981518 303756122 303056370 301150905 296185800 286694530 273815088 259264100 244026061
8991B44026061j6484258j8214341j8261908j6751255j4480153j2326701j0222801
$$ 244026061 227541803 209327462 191065554 174314299 159834146 147507445 137284644
8984A37284644q306240o565893m995171m147249l594012l089012k273942j515464
$$ 137284644 128978404 122412511 117417340 113270091 109676079 106587067 104313125 102797661
8976A02797661j121046o43724L8374J407202K721898L518845L821484K530938
$$ 102797661 101676615 101032891 101071265 102478467 105200365 108719210 112540694 115071632
8968A15071632J252224P25475O05709L1613j070612l412858n920809o895185o624494
$$ 115071632 116323856 117049331 117655040 117686653 116616041 113203183 107282374 100387189 93762695
8959I3762695n788996n174867m601485m098317l856757l539801l183485k780658
$$ 93762695 87973699 82798832 78197347 74099030 70242273 66702472 63518987 60738329
8951F0738329k640356j938486j457257j255320j000050r06155q34497q24055p01517
$$ 60738329 58097973 56159487 54702230 53446910 52446860 51540705 50706208 49882153 49180636
8942D9180636o79071q19782q02664r95061r68154j184766j502269j492379j232188
$$ 49180636 48501565 47681783 46879119 45884058 44915904 43731138 42228869 40736490 39504302
8933C9504302j301464j080694q64872o57897o78584n76773m25670l79172j04893
$$ 39504302 38202838 37122144 36257272 35599375 34920791 34344018 33918348 33539176 33434283
8924C3434283k35264j02219n863N267L5596O3380R3789K96504L42176M42498M01536
$$ 33434283 33199019 33096800 33090937 33096204 33131800 33195180 33288969 33585473 33927649 34370147 34771683
8913C4771683O48178M98681O42634Q08995N13401O02147O91587N57236N76495
$$ 34771683 35419861 35918542 36561176 37370171 37883572 38485719 39177306 39734542 40311037
8904D0311037N33825P46061Q36692Q43396P78533R61293J117745J218260J491547
$$ 40311037 40844862 41590923 42427615 43271011 44049544 45010837 46128582 47346842 48838389
8895D8838389J850802J824619K127449K250155K485791L067402L719378M515921
$$ 48838389 50689191 52513810 54641259 56891414 59377205 62444607 66163985 70679906
8887G0679906N503751O093516O332412O390301O360760O055477N414120L660433
$$ 70679906 76183657 82277173 88609585 94999886 101360646 107416123 112830243 116490676
8879A16490676J300708r35979k268074l603608m868140n667582n505906m649227
$$ 116490676 117791384 116855405 114587331 110983723 106115583 100448001 94942095 90292868
8871I0292868l852816k693964j846880o61543R3955R72741J798210K668826L782640
$$ 90292868 86440052 83746088 81899208 81237665 81331620 82304361 84102571 86771397 90554037
8862I0554037N196693O416381P512558Q349087P427206N400757L565828K294497
$$ 90554037 95750730 102167111 109679669 118028756 125455962 130856719 134422547 136717044
8854A36717044Q91588N20525J283106K604972K985576J314016j178928k914131
$$ 136717044 137608632 138129157 139412263 142017235 145002811 146316827 145137899 142223768
8846A42223768l429019l305365k756531k583304k479780k779089k671340k346038
$$ 142223768 138794749 135489384 132732853 130149549 127669769 124890680 122219340 119873302
8838A19873302k400375k473641k076691j339768J51888J723446L290125M305518
$$ 119873302 117472927 114999286 112922595 111582827 111734715 113458161 116748286 121053804
8830A21053804L631180K588225K371944L360369N471784P406460Q720624Q000886
$$ 121053804 124684984 127273209 129645153 133005522 138477306 145883766 154604390 162605276
8822A62605276N513584K337094q18096l442471n281568n455473m712450m357774
$$ 162605276 168118860 170455954 169637858 166195387 160913819 155458346 150745896 146388122
8814A46388122m958739o274365o905296o297682m632766l031238j868461l273111
$$ 146388122 141429383 135155018 128249722 121952040 117319274 114288036 112419575 109146464
8806A09146464n430489n925864n142850m141665l413519k476703j511718m43038
$$ 109146464 103715975 97790111 92647261 88505596 85092077 82615374 81103656 80660618
8798H0660618N45244J338954J741604P96364r91913j984712j567533n37429M28477
$$ 80660618 81205862 82544816 84286420 85082784 84090871 82106159 80538626 80001197 80429674
8789H0429674J165363J203978P58189m06086j923192l652029m701329n600446
$$ 80429674 81595037 82799015 83557204 83151118 81227926 77575897 72874568 67274122
8781F7274122n986701n537655m742709l999775l320678k758909k269490k000429
$$ 67274122 61287421 55749766 51007057 47007282 43686604 40927695 38658205 36657776
8773C6657776j786912j672813j557385j501600j380917j186592j058486q47440
$$ 36657776 34870864 33198051 31640666 30139066 28758149 27571557 26513071 25665631
8765B5665631r59639j063374j010512q40517q04326q56457p25731o36884q22442
$$ 25665631 24705992 23642618 22632106 21791589 20987263 20130806 19405075 18768191 17945749
8756A7945749p98292p62341o24711n11668m80977k47519m74874o65440n10065
$$ 17945749 17147457 16385116 15760405 15248737 14767760 14520241 14045367 13379927 12869862
8747A2869862m71559m27615k34653m74786k73372m26142k78852k36462k18184
$$ 12869862 12398303 11970688 11736035 11261249 10987877 10561735 10282883 10046421 9828237
8738I828237k20149l05937k56416j64987l21684k57544r7426j51393j28228l515
$$ 9828237 9608088 9302151 9045735 8880748 8559064 8301520 8204094 8052701 7924473 7920958
8728G920958l52337k92300j83701j76632l1546j80191j96771j42615K3939K0508
$$ 7920958 7568621 7276321 7092620 6915988 6884442 6704251 6507480 6364865 6388804 6409312
8718F409312k38248J753R480l30910p4404o9599j27223k32748j04423j4345N3313
$$ 6409312 6171064 6172817 6182297 5851387 5776983 5707384 5580161 5347413 5242990 5228645 5281958
8707E281958j18622j81100j57022q1903l0832o3712o8309p8396M3282J2451p3250
$$ 5281958 5163336 4982236 4825214 4743311 4712479 4648767 4580458 4502062 4545344 4557795 4484545
8696D484545j12916J34883m6471n4170R569k32894N7786Q6510j11696m7155j9325
$$ 4484545 4371629 4506512 4460041 4405871 4415440 4182546 4240332 4326842 4215146 4167991 4148666
8685D148666k16615q7512j80434Q7419j04939j70672n8188l0149l7208J40462
$$ 4148666 3932051 3844539 3664105 3751524 3646585 3475913 3417725 3387576 3350368 3490830
8675C490830K138k04960M8623m39l3007P5034N1665K9512j90359r5658M8228J68425
$$ 3490830 3492968 3288008 3336631 3336192 3303185 3378219 3429884 3459396 3269037 3173379 3221607 3390032
8663C390032r1629R7843O2431q0016q5234o3567J3097r8301o7848o409o3202P0416
$$ 3390032 3298403 3396246 3458677 3378661 3293427 3229860 3242957 3144656 3076808 3070399 3007197 3077613
8651C077613K758l563m8039j09069l3946j46954O4801M8279N1791J25309n4075
$$ 3077613 3080371 3076808 3028769 2919700 2885754 2738800 2803601 2851880 2903671 3028980 2974905
8640B974905n6054p4252k2961n0170r3715q5272k2234p5762L4863L4285J9103
$$ 2974905 2918851 2844599 2821638 2771468 2677753 2592481 2570247 2494485 2529348 2563633 2582736
8629B582736p2915j60610l958o0629n0978o9124m1883o9068l3573L1750j4200
$$ 2582736 2509821 2349211 2345253 2284624 2233646 2164522 2122639 2053571 2019998 2051748 2037548
8618B037548N1693o8930l2836p2154j4666R4013k28759k0884l1775N5270J14010
$$ 2037548 2089241 2020311 1987475 1915321 1900655 1994668 1765909 1745025 1713250 1768520 1882530
8607A882530J17855j05301n8910J6610m7262l1654m1359l5403P8057j7003j45713
$$ 1882530 2000385 1895084 1836174 1852784 1805522 1773868 1732509 1697106 1775163 1758160 1612447
8596A612447j27522R9304j15423N9707j08326j13920k305N6329r8247O7094l750
$$ 1612447 1484925 1584229 1468806 1528513 1420187 1306267 1303962 1360291 1262044 1329138 1325388
8585A325388m2824q444k5055j00692J2642j40171K0997J2881M6707L3049K66282
$$ 1325388 1282564 1274120 1249065 1148373 1161015 1020844 1041841 1054722 1101429 1134478 1400760
8574A400760J091j87791n8590m406o5113p4891L4115k01640r8813J84740J0811
$$ 1400760 1401851 1214060 1155470 1151064 1085951 1011060 1045175 843535 744722 929462 940273
8563I40273m9887O8003P0306o6064P709N6304j23596J6913N6837o9773l0627J64847
$$ 940273 890386 958389 1028695 962631 970340 1026644 903048 919961 976798 907025 876398 1041245
8551A041245o3002J5708r6657K4519M6681j9762l4282k5059K5810K3125q63K01083
$$ 1041245 978243 993951 897294 921813 968494 948732 914450 889391 915201 938326 937463 1138546
8539A138546j00812m4604J2832P3754r2260l2472K141P6680j46413l4432P9449
$$ 1138546 1037734 993130 1005962 1079716 987456 954984 957125 1033805 887392 852960 932409
8528I32409Q0934L587j07352j6757J97245l2662J965l1027k9358J09360J53224
$$ 932409 1013343 1016930 909578 892821 1090066 1057404 1059369 1028342 998984 1108344 1261568
8517A261568k2230r7414j09446L9298J1751m2580P94K5886j01097j4125J4962
$$ 1261568 1239338 1141924 1032478 1071776 1083527 1040947 1041741 1067627 966530 952405 967367
8506I67367M312p8476O3395N5467l9144N1624r0180K6848J9220J06040K0064O0387
$$ 967367 971679 893203 956598 1012065 972921 1024545 934365 961213 980433 1086473 1106537 1166924
8494A166924J9586K6162J4740J8990N2563k0197l9172r8232J01070j4047n5940
$$ 1166924 1186510 1212672 1227412 1246402 1298965 1278768 1239596 1141364 1242434 1228387 1172447
8483A172447L8685q7994J6588o3209L7515j0273p1049L7036j08268O6750o5225
$$ 1172447 1211132 1123138 1139726 1076517 1114032 1103759 1032710 1069746 961478 1028228 963003
8472I63003r3682J2170l7190K52627p5836m3638M646O0676j096m2428M8553J04756
$$ 963003 869321 881491 844301 1096928 1021092 977454 982100 1042776 1041680 999252 1047805 1152561
8460A152561r4593r825J59075J7048r3786J2519J23067j28542o8887K2585m2502
$$ 1152561 1057968 1048143 1207218 1224266 1130480 1142999 1266066 1137524 1068637 1091222 1048720
8449A048720j34903o8805p8413O114N68j31540k5939k2472r860m5320N4984J3364
$$ 1048720 913817 845012 766599 772713 773281 641741 615802 593330 583470 538150 593134 606498
8437F06498j4062k1410K4522J02928K3847l929o0361k0892O2589L9047J3771L860
$$ 606498 592436 571026 595548 698476 722323 718394 658033 637141 699730 738777 752548 756408
8425G56408m1384Q6938j7573p9244M1779j01183l0789o5570N0557J0257j61193
$$ 756408 715024 801962 784389 705145 746924 645741 614952 549382 599939 610196 449003
8414D49003p473J28428L3033m3911m6289l7732n6351j8935j13806L4914R8444
$$ 449003 441530 569958 602991 559080 512791 475059 418708 399773 285967 320881 419325
8403D19325K2476Q148j07818N5342j7339p6901P9155K9248l6009r3469l5874q436
$$ 419325 441801 449949 342131 397473 380134 303233 382388 411636 375627 282158 246284 237848
8391B37848K6711J28093n8378j6174j5227m5931m832l5378J35810r9475R853r5525
$$ 237848 264559 392652 334274 318100 302873 256942 252110 216732 352542 253067 262920 167395
8379A67395j89562L2058Q4633K3867K9638o3805L2558j8123Q4631P6140k2166
$$ 167395 -22167 9891 94524 118391 148029 84224 116782 98659 183290 259430 237264
8368B37264q8596m8329J7829o1169N868m5593M3283K2457J16355r5375j00859
$$ 237264 148668 100339 118168 56999 62867 17274 60557 83014 199369 103994 3135
8357C135J8204k1350Q7574n5968J0011J49378P4796j56699j2L2235j9576N5390
$$ 3135 21339 -11 87563 31595 41606 190984 265780 109081 109069 141304 121728 177118
8345A77118j88355j4264J15569P5460J5360J13122n3175q2309p5817j0081K0366
$$ 177118 -11237 -25501 90068 165528 180888 294010 240835 158526 82709 72628 92994
8334I2994M6858R9509N10R8082o1487j39234o97p4853O661M833K13454n0050q5181
$$ 92994 139852 239361 239871 337953 276466 137232 136535 61682 68343 73176 286630 236580 151399
8321A51399O1698K0441N878j14556j17405k9573J08628J5084j193p4388J0693
$$ 151399 213097 233538 239416 124860 7455 -22118 86510 101594 100401 26013 36706
8310C6706M9153J1225J8131j0205n1319j04486N6147K641L5761K3183K2596r649
$$ 36706 85859 97084 115215 105010 53691 -50795 5352 7993 43754 66937 89533 79884
8298G9884J7130k0951r5288o6721l4022M7224J91270p408j24721o480K4580K7289
$$ 79884 97014 76063 -19225 -85946 -119968 -72744 118526 111118 -13603 -20083 4497 31786
8286C1786r1455M9137J30358L5106k7577j21673n9495J65006j3928l5373L8627
$$ 31786 -59669 -10532 119826 154932 127355 5682 -53813 111193 97265 61892 100519
8275A00519r6769l1314L5923N6969M3217M6789j20528j10234J2689J50692m3628
$$ 100519 3750 -27564 8359 65328 108545 155334 34806 -75428 -62739 87953 44325
8264D4325j21885o5914M5221J09088l2003o5972m262M1369m9462N4901m752M6090
$$ 44325 -77560 -143474 -98253 10835 -21168 -87140 -91402 -50033 -99495 -44594 -49346 -3256
8252c256J22489m5599q102o1065l4486R8702J58216j81608M6876k213k61315L6154
$$ -3256 119233 73634 65532 4467 -30019 68683 226899 45291 92167 89954 -171361 -135207
8240a35207J26006J30803j03755m1680l0044M8793j8903j6997K9260O7245j7104
$$ -135207 -9201 121602 17847 -23833 -53877 -5084 -23987 -40984 -11724 55521 38417
8229C8417J30192j03315j8712J00597j00525j27928j3108O3735p109o5282j7247
$$ 38417 168609 65294 46582 147179 46654 -81274 -94382 -30647 -37756 -103038 -120285
8218a20285k3249J1800N5919L3576J04604Q5421p5802r6371r1041K5518P1906
$$ -120285 -143534 -131734 -75815 -42239 62365 147786 71984 -24387 -115428 -89910 -18004
8207a8004Q7102p1654L8049j9813k3058J4671j11536L3700r0239R5250P5282N876
$$ -18004 69098 -2556 35493 15680 -7378 7293 -104243 -70543 -160782 -65532 9750 15626
8195A5626J50173k51917L6361J078557j74556m69224j0106j13761j15780m1105
$$ 15626 165799 -86118 -49757 1028800 854244 385020 374914 261153 145373 104268
8185A04268m2641j07845J03020O5139l2770j00046l9913n1500J2556K17748m0022
$$ 104268 61627 -46218 56802 121941 89171 -10875 -50788 -102288 -89732 128016 87994
8174H7994j69580m5570P0533n3739p6939R1896J20791J24901J5365M2785j37948
$$ 87994 -81586 -127156 -56623 -110362 -187301 -95405 25386 150287 165652 208437 70489
8163G0489j36021K4966M0616k6640J19931L6425q2737p4952Q689J528j83713Q7237
$$ 70489 -65532 -40566 50 -26590 93341 129766 47029 -27923 -19234 -17706 -201419 -114182
8151a14182J06433j4338P7014j53149K259j4901J09777j34862R2577k3777j01662
$$ -114182 -7749 -22087 54927 -98222 -95963 -110864 -1087 -135949 -43372 -67149 -168811
8140a68811M0373l317K09242k1427j8012O712O5348J6591k2066P1706p8382n9524
$$ -168811 -128438 -131755 77487 56060 38048 44760 110108 126699 104633 176339 97957 38433
8128C8433q7565O1361j28694m8303j2170N3472M3505o9174K1635M9843j9923l9728
$$ 38433 -49132 12229 -116465 -164768 -176938 -123466 -79961 -149135 -127500 -77657 -97580 -137308
8116a37308J55362N9024j11984o9982M1645N5155M6068O7986R0761j70500m4696
$$ -137308 18054 77078 -34906 -104888 -63243 -8088 37980 105966 196727 26227 -18469
8105a8469J7714Q3871m0255j42591l0246M0076J18610J4018m3615j684k330J62607
$$ -18469 -755 83116 42861 -99730 -129976 -89900 28710 42728 -887 -2571 -4901 157706
8093A57706M0548j47862J4531R0758p9717j06882O3183p7100j13233L7169j9628
$$ 157706 198254 50392 64923 155681 75964 -30918 32265 -44835 -158068 -120899 -140527
8082a40527O692M8836L7183N8793J16543j03037N6864R2246q4228K0970P8950
$$ -140527 -133835 -84999 -47816 10977 127520 24483 81347 173593 89365 110335 189285
8071A89285k72978o2915Q2229l1819J7174N8298J0788j15633j6006J45429N9805
$$ 189285 -83693 -146608 -64379 -96198 -79024 -20726 -9938 -125571 -141577 3852 63657
8060F3657j42779j08863J07992L1254M611p1117l3390J54566j13381k9969N9399
$$ 63657 -79122 -187985 -79993 -48739 -44128 -115245 -148635 5931 -107450 -137419 -78020
8049g8020K6930M9965Q518m835k2006J21715o6568o2320j5553O7681P3111j3441
$$ -78020 -51090 -1125 7393 2558 -19448 102267 35699 -26621 -42174 25507 98618 85177
8037H5177p131j36673j29834O8481o8844n5259L3825J34071O0240j32083o1320
$$ 85177 78046 -58627 -188461 -119980 -188824 -244083 -210258 -76187 -15947 -148030 -209350
8026b09350J46188O1723J90L2536q0786L8622N468l1822M3402n7015J3857j28755
$$ -209350 -63162 -1439 -1249 31287 -49499 -10877 -5409 -37231 6171 -50844 -36987 -165742
8014a65742Q7575J51180M8291j77378r0092L1026L0912m1576M477P1958o9353
$$ -165742 -78167 73013 121304 -56074 -146166 -115140 -84228 -125804 -121327 -49369 -118722
8003a18722R9417o2313L8433J7527J1104j4644n8036j2866p5615N1560J5654J1723
$$ -118722 -19305 -81618 -43185 -25658 -14554 -29198 -87234 -100100 -175715 -124155 -108501 -96778
7991i6778j2600J3295P6183Q0918R627q7737K2367j35095P1707p4496O7711N6295
$$ -96778 -109378 -96083 -19900 61018 70645 -17092 5275 -129820 -58113 -132609 -64898 -8603
7979h603j15255j39190J14882M5269O1238n3210j01070l6144J19936L5548n5174
$$ -8603 -123858 -263048 -148166 -102897 -41659 -94869 -195939 -232083 -112147 -76599 -131773
7968a31773j3764K10353o0290m635j68072J23319J07632j40904L2491k0524M0625
$$ -131773 -145537 64816 4526 -109 -168181 -44862 62770 -78134 -45643 -66167 -25542
7957b5542q7969o3743l6324R6881J01936L9571j12350k18616N5051R7674J16676
$$ -25542 -113511 -177254 -213578 -116697 -14761 24810 -87540 -306156 -251105 -153431 -36755
7946c6755k7979J4339L2943P595M0216k0594Q869k13839P8213o9226J29987j17721
$$ -36755 -64734 -50395 -17452 -9857 30359 9765 18634 -195205 -116992 -186218 -56231 -173952
7934a73952O316K04568j8888p450j5832o3875K1489q8838p2585J67525p7873o5285
$$ -173952 -167636 36932 18044 10594 -5238 -69113 -47624 -136462 -209047 -41522 -119395 -184680
7922a84680N9718J33056q6765L1529M6123j19240m4485J25674J5555p4402l1912
$$ -184680 -124962 8094 -78671 -47142 -1019 -120259 -164744 -39070 -23515 -97917 -129829
7911a29829l388P7418j19290l4098J36739r700P1035N7852j77668j09409M4693
$$ -129829 -133217 -55799 -175089 -209187 -72448 -82148 -11113 46739 -130929 -240338 -195645
7900a95645J09735l3165q503o9114J25922k8189r2892o479J8510O3095p3520m7740
$$ -195645 -85910 -119075 -127578 -196692 -70770 -98959 -191851 -198330 -179820 -116725 -190245 -237985
7888b37985J9805J15053q261r0914Q987p656N8483p6722J37454r7622O1998J91343
$$ -237985 -218180 -103127 -111388 -202302 -193315 -200971 -142488 -219210 -81756 -179378 -117380 73963
7876G3963o3382l1117O2735k2300p6609o0936M8318R8160r9366r5051J8674J64511
$$ 73963 10581 -20536 42199 19899 -56710 -117646 -69328 28832 -70534 -165585 -146911 17600
7864A7600K3345k8800p475j15364m432q746j0681K4680J00614K1988Q3844P61
$$ 17600 40945 12145 4670 -110694 -115126 -123872 -134553 -109873 -9259 12729 96573 97334
7852I7334j84428l0669R0553q8229O49K216q8515p700j5171n4830O4085J36780
$$ 97334 -87094 -117763 -27210 -115439 -114790 -112574 -201089 -208789 -223960 -278790 -214705 -77925
7840g7925L1476k5816j3169q9756R25R3912Q7335q7393j16483K31255R960j25263
$$ -77925 -46449 -72265 -85434 -175190 -174265 -80353 6982 -80411 -196894 34361 44321 -80942
7828h0942j50027M8801O2110p1361N3855R3109m6188n7860O964R8048J895j45299
$$ -80942 -230969 -182168 -120058 -191419 -137564 -44455 -90643 -148503 -141539 -43491 -41596 -186895
7816a86895p6164M6374n6733j8560j8292j1454K90101P98572k79853l61746J847
$$ -186895 -263059 -216685 -273418 -291978 -310270 -321724 -31623 766949 487096 125350 127197
7805A27197p8882L3408o917n4348n1943Q2496l2159L1117p1730q6346k9810N9773
$$ 127197 48315 81723 74806 20458 -31485 51011 18852 49969 -21761 -108107 -137917 -78144
7793g8144n7146n7530Q3732K1068L902K8442m919J13157m8641j06930L1109k2994
$$ -78144 -135290 -192820 -109088 -88020 -84118 -55676 -60595 52562 3921 -103009 -71900 -94894
7781i4894m4623P6122m8114J23265M1423r1813n4410j42441J47080P1831p6952
$$ -94894 -139517 -63395 -111509 11756 53179 -38634 -93044 -235485 -88405 -16574 -93526
7770i3526r179l881j11569n7721K03859N2346K4695o9284q4990P0634P4146M5078
$$ -93526 -102705 -106586 -218155 -275876 -72017 -19671 5024 -64260 -149250 -78616 -4470 40608
7758D0608L36q7095O4976O5910j51328J74644j61648J3409N9169j25639j0644
$$ 40608 40944 -46151 18825 84735 -66593 108051 -53597 -40188 18981 -106658 -117302
7747a17302R905K7186Q5019k3293j25386O1130J602j4076J65232M8834p8511J11101
$$ -117302 -107397 -80211 4808 -18485 -143871 -82741 -81139 -95215 70017 118851 40340 151441
7735A51441j16769o0029j7109k068L6439l8826Q7978N1791n6055n9731L1083l5925
$$ 151441 34672 -25357 -42466 -44534 -8095 -46921 41057 92848 36793 -22938 8145 -27780
7723b7780O800m2155p3151J1987p8390P4177K3225p3474P1525R5875j2396l0212
$$ -27780 -20980 -63135 -136286 -124299 -202689 -128512 -105287 -178761 -107236 -11361 -23757 -53969
7711e3969o0837K5941n4081K929L7786K1634O2510K0582Q202o2102K2822l1621
$$ -53969 -114806 -88865 -142946 -140017 -102231 -80597 -18087 2495 10697 -51405 -28583 -60204
7699f0204j01193O1336j2832N5552L9565j16537N8455O1516K5356R70j52270K3410
$$ -60204 -161397 -100061 -112893 -57341 -17776 -134313 -75858 -14342 11014 11984 -140286 -116876
7687a16876j9765Q9643k3317J59275r457p0857k2341p3248O5717J754K7033o3877
$$ -116876 -136641 -46998 -70315 88960 79503 8646 -13695 -86943 -21226 -19472 7561 -56316
7675e6316P4054J00262l1649J15000N453r3839l5920k04007J3231L774L5420j15050
$$ -56316 17738 118000 86351 201351 206804 112965 77045 -126962 -113731 -109957 -74537 -189587
7663a89587J42429k6246o0074j2288l4454J07571k7921J33921K6225q2888M98
$$ -189587 -47158 -73404 -133478 -145766 -180220 -72649 -100570 33351 59576 -23312 -22814
7652b2814n6229K4575O4207o90K2665M3378r0063N4250m7561l3640O3477J5494
$$ -22814 -79043 -54468 9739 9049 31714 75092 -14971 39279 -8282 -41922 21555 37049
7640C7049j09358m109K9372N6169r8908j4108J83964n4325m1517P3039K5039j68471
$$ 37049 -72309 -76418 -47046 9123 -89785 -103893 80071 25746 -15771 57268 82307 -86164
7628h6164K5382N1692N505j17139k6695K87449J5680j64783p4941r187L1793j18532
$$ -86164 -60782 -9090 -3585 -120724 -147419 140030 155710 -9073 -84014 -93201 -61408 -179940
7616a79940O5958K4733j3199N0057O8653R7297K0077j95211J6744P1864K4055
$$ -179940 -113982 -89249 -102448 -52391 16262 113559 133636 -61575 -44831 27033 51088
7605E1088m0547k4073L5874p273p723m1181n2801o0749J14956L005j18514j00770
$$ 51088 10541 -13532 22342 15069 7346 -33835 -86636 -147385 -32429 -29424 -147938 -248708
7593b48708P1158J89973l8161r6330Q0033J41738l2335j58559m5696O3211N2341
$$ -248708 -177550 12423 -25738 -122068 -42035 99703 67368 -91191 -136887 -73676 -21335
7582b1335P6489M8704n4290r4220n6915L8263K7945K7669K2998j15237l3369k1576
$$ -21335 55154 103858 49568 -44652 -101567 -63304 -35359 -7690 15308 -99929 -133298 -154874
7570a54874R1202N5524r340n0490m3128l1344N5613J46824r4370j8894J1157l8264
$$ -154874 -63672 -8148 -17488 -67978 -111106 -142450 -86837 59987 -34383 -53277 -42120 -80384
7558h0384P9251J22362K7382k6994j27540o36J13786k18727n3452L9053J88049
$$ -80384 -1133 121229 148611 121617 -5923 -6559 107227 -111500 -164952 -125899 62150
7547F2150n5181j70141K3926N3370L3002m3241J32188l3221L6760R738r3993m4778
$$ 62150 6969 -163172 -139246 -85876 -52874 -96115 36073 2852 39612 49350 -44643 -89421
7535h9421L6228K0914L7182m5694j6616J0583r789j14350O3653M6311J3128J35955
$$ -89421 -53193 -32279 4903 -40791 -57407 -46824 -56613 -170963 -107310 -60999 -47871 88084
7523H8084o9175n7128n4508r9509L4714o443O6835P0254K2112M523n0907k2825
$$ 88084 18909 -38219 -92727 -192236 -157522 -163965 -97130 -26876 -4764 -241 -51148 -73973
7511g3973r5600l790j8133J09194P0156r831J7671j06601O1248Q7552L8409k2944
$$ -73973 -169573 -173363 -191496 -82302 -12146 -21977 -4306 -110907 -49659 37893 76302 53358
7499E3358n3813Q5809p5488m6291o5436K20117J05412j18670j07137j31861Q1149
$$ 53358 -455 85354 9866 -36425 -101861 118256 223668 104998 -2139 -134000 -52851
7488e2851R914k7394j07234L3928j2642K6997m897J65781O3175p722j30310j03619
$$ -52851 -42937 -70331 -177565 -143637 -156279 -129282 -134179 31602 94777 87055 -43255 -146874
7476a46874J19291P1356k4912j16207Q5273n7687O2114L492o5373Q3953l7715
$$ -146874 -27583 43773 18861 -97346 -12073 -69760 -7646 -4154 -69527 14426 -23289
7465b3289J1319O6021M6045j4206l6109K1824n0415m1827j2229l6728J05112K8357
$$ -23289 -11970 54051 100096 85890 49781 71605 21190 -20637 -32866 -69594 35518 63875
7453F3875N194o3644p8600R6947N574o3601n6970Q4008L45m7061m1513m5828J00148
$$ 63875 69069 5425 -73175 23772 29346 -34255 -91225 -7217 -6872 -53933 -95446 -141274 -41126
7440d1126J04198o1866r3714j1156n2707J60315K5579r8357M2220J7745N4234
$$ -41126 63072 1206 -92508 -103664 -156371 3944 29523 -68834 -26614 -8869 45365
7429D5365k4169l5227Q0225j3143k7320L0453j24144l2079j5109r170P7564j13859
$$ 45365 21196 -14031 66194 53051 25731 56184 -67960 -100039 -115148 -124318 -46754 -160613
7417a60613L9497M1017j42765J21980O3755j57214P3207R3118Q4063p8958l7208
$$ -160613 -121116 -80099 -222864 -100884 -37129 -194343 -121136 -28018 56045 -22913 -60121
7406f0121M3462l6525j24462p079J83273j53936J0706O9883Q0878J4707q0444
$$ -60121 -16659 -53184 -177646 -184725 -1452 -155388 -144682 -74799 6079 20786 -59658
7395e9658K4219Q7105q8593J20443o281L870p5393j27749J65883p3401R0608m7797
$$ -59658 -35439 51666 -36927 83516 77235 81105 5712 -122037 43846 -29555 61053 13256
7383A3256k453R0828j23946j0983N2586n9268K4609K8609l8995k2501p394r7994
$$ 13256 10803 101631 -22315 -33298 19288 -39980 -15371 13238 -25757 -48258 -55652 -153646
7371a53646J13953M9097r992L489O0138n4146j42301J07749j02422N0663J03806
$$ -153646 -39693 9404 -588 2901 63039 8893 -133408 -25659 -128081 -77418 26388
7360B6388P2481j8359l5084j13617l1458N5831J20205O8321r8263j67257j12953
$$ 26388 98869 80510 45426 -68191 -99649 -43818 76387 144708 46445 -120812 -233765
7349b33765M3776J97221q1365q154q112N0893R6387j58015L015O0165j3282j4571
$$ -233765 -189989 7232 -74133 -82287 -90399 -39506 56881 -101134 -98119 -37954 -51236 -65807
7337f5807j5137m4807J46422K9539o4709j13574J19700m9243j49642J2950L0033
$$ -65807 -80944 -125751 20671 50210 -14499 -128073 -8373 -57616 -207258 -194308 -164275
7326a64275l3408J5047P7241P1827O1973j19898J2135J3291O668l196K4645n2308
$$ -164275 -197683 -182636 -105395 -33568 28405 -91493 -79358 -66067 -59399 -62595 -37950 -90258
7314i0258j9724K8715J00533P3238M4586q9141o2066p2944O6261q4179r4449J13179
$$ -90258 -109982 -81267 19266 92504 137090 47949 -14117 -87061 -20800 -104979 -199428 -86249
7302h6249R6707R1727n3640n8687m4883L7127o9537J26763j51896N5329J767Q0154
$$ -86249 10458 102185 48545 -10142 -55025 -17898 -87435 39328 -112568 -57239 -55472 24682
7290B4682j12404K9587K51869o2952L667o1819j11779J7640L5168N3149N3268
$$ 24682 -87722 -58135 193734 130782 134449 72630 -39149 -21509 13659 66808 120076
7279A20076l7872r0791l137P1564K0032j37054k4685J4345K4158q816M110M2124
$$ 120076 82204 -8587 -11724 59840 79872 -57182 -81867 -67522 -43364 -52180 -48070 -5946
7267e946n8549K14245j44264o6994j0981Q5829N9662j32734J60263k9909p4368
$$ -5946 -64495 149750 5486 -61508 -72489 13340 73002 -59732 100531 70622 -3746
7256c746j11541M3404J05650J7974j05632L7595P7939n6448k8288k1378N1969
$$ -3746 -115287 -71883 33767 51741 -53891 -16296 61643 5195 -23093 -44471 7498
7245G498o867P1316j67850Q5240J73525M3141q0707j44922P0697m77r560L3545
$$ 7498 631 71947 -95903 -10663 162862 206003 125296 -19626 51071 50594 41034 74579
7233G4579m5575J6732l9274M8111l1577p98L0634K6641j43961r526k1071o615
$$ 74579 29004 45736 6462 54573 22996 22198 52832 79473 -64488 -74014 -95085 -101700
7221a01700M9981J8688O1674k0826M3343j8783j2355l7996N2565r830j5395m3155
$$ -101700 -51719 -33031 28643 7817 51160 32377 20022 -17974 34591 24761 9366 -33789
7209c3789N1172K2748j9983L00L3230L7695j78259p0876J7989r7691J82677L168
$$ -33789 17383 40131 20148 20448 53678 91373 -86886 -157762 -139773 -237464 -54787 -51619
7197e1619r669M4453N9365j2170q1896O2356P0198J42685j60007j00184n359P5761
$$ -51619 -61288 -16835 42530 30360 -51536 10820 81018 223703 63696 -36488 -41847 33914
7185C3914k7646j37384K9328O0807J00771N7092O9400r6424j76042n2278N64n2381
$$ 33914 6268 -131116 -101788 -40981 59790 116882 186282 89858 -86184 -138462 -137898 -190279
7173a90279J05801J37461o7381J6169q843O7390R8878j83962J9289N2714n6449
$$ -190279 -84478 52983 -14398 1771 -7072 60318 159196 -24766 -5477 47237 -9212
7162i212k5729P2583K5401k7342q7263K9506k9800Q6904o1659j02329P5434M8998
$$ -9212 -34941 37642 63043 35701 -51562 -22056 -51856 35048 -26611 -128940 -53506 -4508
7150d508L1891j47414J70454L7243K775o8778j1073J24792m8862k0021J24593
$$ -4508 27383 -120031 50423 87666 90441 21663 10590 135382 86520 66499 191092
7139A91092j13174j67010J08558N9832o4882R3381N4426p6924j0793l8982l8053
$$ 191092 77918 -89092 19466 79298 14416 107797 162223 85299 74506 35524 -2529
7128b529J8563J1219l4723M2955P6686j3649K090n6858O5175j1623L8849j29608
$$ -2529 16034 27253 -7470 35485 112171 98522 100612 43754 108929 97306 136155 6547
7116F547j0898j4706j22127R9890N0231j46902J1918R6135K0891m5062k2436J963
$$ 6547 -4351 -19057 -141184 -41294 8937 -137965 -126047 -29912 -9021 -54083 -76519 -74556
7104g4556J05832M578n9098O4402k878K2890j83547N8985J42818M8345K2486m9970
$$ -74556 31276 35854 -23244 41158 38280 61170 -122377 -63392 79426 127771 150257 100287
7092A00287j4885L5784q2004J5552j4265L8677j17245o9236p455L8522L4714J43850
$$ 100287 85402 121186 39182 54734 40469 79146 -38099 -107335 -114790 -76268 -41554 102296
7080A02296J138O601q9582j23019J22308q2P4120P764j14915l0300P1960m3125
$$ 102296 103434 110035 20453 -102566 19742 19660 93780 101544 -13371 -43671 28289 -14836
7068a4836l774J11668q291r0472J03180R5102O347O681r2680J2099l5899r0811
$$ -14836 -18610 93058 84767 -5705 97475 192577 198924 205605 112925 125024 89125 -1686
7056a686j9588j6985J06460N4705k7966r605q0094L0132r1260j08588J19501O3868
$$ -1686 -21274 -38259 68201 122906 94940 85335 5241 35373 -55887 -164475 -44974 18894
7044A8894J25990j03096k30k6247k6680r4075J6760K9361O9458M3377J5945n2181
$$ 18894 144884 41788 41558 15311 -11369 -105444 -88684 -59323 10135 53512 69457 17276
7032A7276o5696N5477k3266R9551R410p2077j8572P5147M0347j43973k6745K7537
$$ 17276 -48420 7057 -16209 83342 92752 20675 2103 77250 117597 -26376 -53121 -25584
7020b5584j387l2096l1128J1995N7086j3774k205j6282L6810R8037k8247N6138
$$ -25584 -26971 -59067 -90195 -78200 -21114 -34888 -37093 -53375 -16565 81472 53225 109363
7008A09363Q1550r0188n0375m1814m4741O9265j12427J65669O0845K8387J1381
$$ 109363 190913 100725 50350 8536 -36205 33060 -79367 86302 147147 175534 186915
6997A86915n1309n4213o898J5573O1072j8050q6775J17850r1645K4423p1467n1214
$$ 186915 135606 81393 74495 90068 151140 133090 46315 164165 72520 96943 25476 -25738
6985b5738N6097P1649K494k8095j1157P967L9711j12997q1077J00J09121L5005
$$ -25738 30359 102008 104502 76407 65250 73217 112928 -69 -81146 -81046 28075 63080
6973F3080J32941o0230M1580l1126o8731K3661n9855l0666J04684q5078L1375
$$ 63080 196021 135791 177371 146245 77514 101175 41320 10654 115338 30260 61635
6962F1635K2357O0051K546m8123p5474M2419N8188n8576l7171Q5148O8202q2796
$$ 61635 83992 144043 146589 98466 22992 65411 123599 65023 27852 113000 181202 98406
6950I8406q9573Q3326j270o079l4721p2665J12246p9966P5475N5493k9222m0630
$$ 98406 8833 92159 90889 84810 50089 -22576 89670 9704 85179 140672 111450 70820
6938G0820p7728J02820L876o3451m128N1813J32260M2944j9146q9824j04847k3898
$$ 70820 -6908 95912 99788 36337 32209 84022 216282 259226 240080 150256 45409 21511
6926B1511O7368L6743o9674O9279P4361r1470L7748N3823J06865j22449J6497
$$ 21511 88879 125622 55948 125227 199588 108118 145866 199689 306554 184105 200602
6915B00602J8039m9397j41842m5134J36242J21634j57938K8770k5437L0653K44608
$$ 200602 218641 169244 27402 -17732 118510 240144 82206 110976 85539 116192 360800
6904C60800O8578J8936o7944r1469N4353N6907K4751j21393m0709l2487p5560
$$ 360800 429378 448314 380370 288901 343254 400161 424912 303519 262810 230323 154763
6893A54763o7265K4756R0277j9160j50191J3812J25090R8588m6707m7135J2731
$$ 154763 87498 112254 202531 183371 33180 46992 172082 270670 223963 176828 189559
6882A89559j00641N5881r8205l1512o391L9858J69689r9821n1030j4438m3859
$$ 189559 88918 144799 46594 15082 8691 48549 218238 118417 67387 52949 9090
6871I090k8235L6752J49944K1136N0587j8690j0268l3365p7730K5714L6391q3904
$$ 9090 -19145 17607 167551 188687 239274 220584 210316 176951 99221 124935 161326 77422
6859G7422K2160J6972r7395P4583j36627J4664R4855L7048p9617j0805l3639r6871
$$ 77422 99582 116554 19159 93742 -42885 -28221 66634 103682 24065 13260 -20379 -117250
6847a17250M4274J67567m4570k2310J48111L8351p0998P659M9875q5015L4102
$$ -117250 -72976 94591 50021 27711 175822 214173 143175 150834 200709 115694 149796
6836A49796K0316k3908j17795l4554N7460J68857k5840m0831n1833k2159N4526
$$ 149796 170112 146204 28409 -6145 51315 220172 194332 153501 101668 79509 134035
6825A34035L1837r8928j40856P7020L9095P7899N4080O6559o6663q0898K19072
$$ 134035 165872 66944 -73912 3108 42203 120102 174182 240741 174078 93180 312252
6814C12252j6153j16004j3737K6725r7964p6611O8366J13322p4539q1295L5596
$$ 312252 296099 180095 166358 193083 95119 18508 86874 200196 125657 44362 79958
6803G9958J07663l7173O4053K3021o9638m4969Q5423q4292q732j3440N1671K0320
$$ 79958 187621 150448 214501 237522 167884 122915 208338 124046 115314 101874 153545 173865
6791A73865n4667M8445J33146j14619j132Q7757j2686o1636o4462j75595J8789
$$ 173865 119198 167643 300789 186170 185038 272795 260109 198473 134011 -41584 -22795
6780b2795Q1930K8409J60437j0806l9824J6217m3840j19099J21803m9143J36180
$$ -22795 59135 87544 247981 237175 197351 213568 169728 50629 172432 123289 259469
6769B59469P059j54213K8478L6694l5934O5599L587R0108j23904Q2841q1104q6957
$$ 259469 266528 112315 140793 177487 141553 207152 210739 300847 176943 259784 178680 91723
6757I1723K26059M358m1577j39391p3418r850J17051K0515p280N0171Q3181r0459
$$ 91723 317782 322140 280563 141172 67754 57904 174955 195470 188190 238361 321542 231083
6745B31083k3674J2030j0946r3768J08347O350j06788J9053J4883M4852l0831
$$ 231083 207409 219439 208493 114725 223072 229422 122634 141687 156570 201422 170591
6734A70591n2424O4167J502p3333k1067p706j2196J61680N5233j70537J5801R6755
$$ 170591 118167 182334 183836 110503 89436 81730 69534 231214 286447 115910 131711 228466
6722B28466q7340O0272l3849q9524P0092O4756L1692K3994o4767m5676L6969K2249
$$ 228466 141126 201398 167549 78025 148117 212873 244565 268559 203792 158116 195085 217334
6710B17334M6164j04728J0029m1322N0168N6386J50186n2803m0402j03439M565
$$ 217334 263498 158770 168799 127477 177645 234031 384217 331414 291012 187573 192138
6699A92138M3465J6791N14n2569o4203J68292K9899K163j14289J26819m6964J5383
$$ 192138 235603 252394 252908 200339 136136 304428 334327 336490 222201 349020 302056 317439
6687C17439O3192J55998p0954k8592J3275q2162O9074R259l5722p6768m6029K6844
$$ 317439 380631 536629 465675 437083 450358 368196 437270 446529 410807 334039 288010 314854
6675C14854l6337K0617l8999N6996J88054k09775o7509m4185Q5194J96181n5762
$$ 314854 278517 299134 260135 317131 505185 295410 227901 183716 268910 465091 409329
6664D09329r692J0441q8356P5514P0273j1993j6208J169k02549J85215K4363m7140
$$ 409329 399637 410078 321722 397236 467509 455516 439308 440477 237928 423143 447506 400366
6652D00366o0427Q3667j0982j04883K5919m8881O6674r913n1920O3437K0970Q9785
$$ 400366 339939 423606 412624 307741 333660 284779 351453 341540 289620 353057 374027 463812
6640D63812N3599l4944n4642m1221J07951J58919p1879j51826O1724j0791P3513
$$ 463812 517411 482467 427825 386604 494555 653474 581595 429769 491493 480702 554215
6629E54215K59003Q842p3305j8464O2137j56361O7672K8244o3786p9431N2319
$$ 554215 813218 822060 748755 730291 792428 636067 703739 731983 668197 588766 641085
6618F41085P6519k0988M9698l9206n9487O8075o8587k7258M9131J24478M3690
$$ 641085 717604 696616 746314 707108 647621 715696 647109 619851 668982 793460 837150
6607H37150j40354q2161J69656J58622R2132J1313L1634n0433o9936O3776L4525
$$ 837150 696796 614635 784291 942913 1035045 1046358 1077992 1027559 957623 1021399 1055924
6596A055924r061K4571n619j56430J08602k1617j27074N9599j8965j11136Q477
$$ 1055924 1046863 1071434 1065815 909385 1017987 996370 869296 928895 909930 798794 807271
6585H07271m9652j6590o8345J43554k2748N3726Q6871O9043k9230o9547m9053
$$ 807271 757619 741029 672684 816238 793490 847216 934087 1003130 973900 904353 855300
6574H55300J48080m4779n9482J32192o9798m7967N2048J6695j4711o8601M1537
$$ 855300 1003380 958601 899119 1031311 961513 913546 965594 982289 967578 898977 940514
6563I40514J54286j86450l030J3093n9023p7325r9575L8994K35698M4491j34174
$$ 940514 1094800 908350 905320 918413 859390 782065 682490 721484 957182 1001673 867499
6552H67499k2775L7646Q8163j54874l5290N0850q3351J25690K9252K8457o3080
$$ 867499 844724 882370 970533 815659 780369 831219 747868 873558 902810 931267 868187
6541H68187P9660J81925l8670L6726l8204J8099o788Q275j11109n3159P2626P7297
$$ 868187 947847 1129772 1091102 1127828 1089624 1107723 1100935 1109210 998101 944942 1017568 1094865
6529A094865M4614l5441r3067p5045K6285K2872J11296N0921K55n0883M7217L0748
$$ 1094865 1139479 1104038 1010971 935926 962211 985083 1096379 1147300 1147555 1096672 1143889 1174637
6517A174637O8154K4905L655q9279O202P4907J3499j19521m8105m0436J43016
$$ 1174637 1242791 1267696 1271351 1182072 1188274 1263181 1276680 1157159 1109054 1068618 1211634
6506A211634P5599j24138P0302q464j2573L7966O0990p2526J33767Q1677r6543
$$ 1211634 1287233 1163095 1233397 1224933 1212360 1250326 1311316 1238790 1372557 1454234 1357691
6495A357691j2315J19717m9743l769Q6326O9306N1958j17532M8036L1391k7648
$$ 1357691 1345376 1465093 1415350 1411581 1497907 1567213 1619171 1501639 1549675 1581066 1553418
6484A553418L0026O5512l596J6313o4841J06223L8120p0416n7959k0382R8408
$$ 1553418 1583444 1648956 1645360 1661673 1596832 1703055 1741175 1670759 1612800 1592418 1690826
6473A690826J76178N6606j24641J57669K8550p5057M1066J11248M8086Q0790N7398
$$ 1690826 1867004 1923610 1798969 1956638 1985188 1910131 1951197 2062445 2110531 2191321 2248719
6462B248719j5439j08853q9193M6766O8175R9094J64430J00074l6806J27451J1461
$$ 2248719 2233280 2124427 2035234 2082000 2150175 2249269 2413699 2513773 2476967 2604418 2615879
6451B615879j17500n2852l3197J70406m0939J22422J52623J64638q4838j35332
$$ 2615879 2498379 2445527 2412330 2582736 2541797 2664219 2816842 2981480 2896642 2761310
6441B761310O1121M430J40279K19274N7963j24849q017Q3474N8383q3507n7873
$$ 2761310 2822431 2826861 2967140 3186414 3244377 3119528 3111511 3194985 3253368 3169861 3111988
6430C111988J9688m2897P0629J8883k8577o3464J10957j16718R1304J77020P5942
$$ 3111988 3131676 3088779 3159408 3178291 3149714 3086250 3197207 3080489 3171793 3348813 3424755
6419C424755J41919R4132p340L6971P8352q6723J20995J38583J03974J16828J0564
$$ 3424755 3566674 3660806 3653466 3690437 3768789 3682066 3803061 3941644 4045618 4162446 4173010
6408D173010o9846Q0631J18611N3242J23965O5225j0482P3138J09968J12780P2922
$$ 4173010 4103164 4183795 4302406 4355648 4479613 4544838 4534356 4607494 4717462 4830242 4903164
6397D903164J24939m34n3421J81216k9532p18J90277N5272J64343J23407J25415
$$ 4903164 5028103 5027669 4974248 5155464 5125932 5125214 5315491 5370763 5535106 5658513 5783928
6386E783928J63514J8290M9405L15222K29536N7254J21661J78721K16114K44961
$$ 5783928 5947442 5965732 6015137 6330359 6559895 6617149 6738810 6917531 7133645 7378606
6376G378606K4859K05256K22991J28190J61893K48045J08896J12659K90902J62045
$$ 7378606 7403465 7608721 7831712 7959902 8121795 8369840 8478736 8591395 8882297 9044342
6366I044342K38455L05193K18667K94230J31739J99574K31132K66617K27326L66263
$$ 9044342 9282797 9587990 9806657 10100887 10232626 10432200 10663332 10929949 11157275 11523538
6356A1523538J39541K40333M29276K65869L36974N70914L48341L58877M68464
$$ 11523538 11663079 11903412 12332688 12598557 12935531 13506445 13854786 14213663 14682127
6347A4682127N95577M45193M95197N19052M42372N28475M47543O68746O22859
$$ 14682127 15277704 15722897 16218094 16737146 17179518 17707993 18155536 18824282 19447141
6338A9447141P88593O45067P63089P64335P24490R16683J003830J093864J240160
$$ 19447141 20235734 20880801 21643890 22408225 23132715 24049398 25053228 26147092 27387252
6329B7387252J400695J514279J749135K127990K560000K765053L172511L760393
$$ 27387252 28787947 30302226 32051361 34179351 36739351 39504404 42676915 46437308
6321D6437308M261481M618477M632179L914802K658970O99693j239083k455113
$$ 46437308 50698789 55317266 59949445 63864247 66523217 67222910 65983827 63528714
6313F3528714k795832k731792k488829j930261j371839q97438m40106O3756N54137
$$ 63528714 60732882 58001090 55512261 53582000 52210161 51312723 50872617 50936373 51490510
6304E1490510J145235J542056K076689K879409L589989M545024N497222O570617
$$ 51490510 52635745 54177801 56254490 59133899 62723888 67268912 72766134 79336751
6296G9336751P931251Q619363R042476P711861M636025K82679m175562p258750
$$ 79336751 87268002 95887365 104929841 112641702 117277727 117560406 113384844 106126094
6288A06126094q620631q670782p980906o884259n707608m753721l791140l121099
$$ 106126094 97505463 88834681 80853775 73969516 68261908 63508187 59717047 56595948
6280E6595948k560707j834327j222806n80158J61733N70127J196521K069575K662205
$$ 56595948 54035241 52200914 50978108 50397950 50559683 51129810 52326331 54395906 57058111
6271E7058111L244879M031778M012380L434330J837744n48032k661515m020985
$$ 57058111 60302990 64334768 68347148 71781478 73619222 73071190 70409675 66388690
6263F6388690m791376m720953m337998m241042l870735l657600l421743k875238
$$ 66388690 61597314 56876361 52538363 48297321 44426586 40768986 37347243 34472005
6255C4472005k713041k341259j956332j765544j506498j147155r84314j020454
$$ 34472005 31758964 29417705 27461373 25695829 24189331 23042176 22057862 21037408
6247B1037408q65675p45041n73042n21496m37500m68285l55257j36667k32936
$$ 21037408 20171733 19426692 18853650 18332154 17894654 17426369 17071112 16934445 16701509
6238A6701509j22869J40965j06454O2976j19280p8226k97615k17473m06674n63646
$$ 16701509 16578640 16719605 16613151 16676127 16556847 16478621 16181006 15963533 15556859 14993213
6228A4993213n45621m35967k90416m51666k28714k22936j93936k21633l43917
$$ 14993213 14447592 14011625 13721209 13269543 13040829 12817893 12623957 12402324 12058407
6219A2058407p6435l4061q7890O7565K8166L3293p1646P481J08455N9835P7225
$$ 12058407 11981972 11947911 11860021 11927586 11955752 11989045 11917399 11924880 12033335 12093170 12170395
6208A2170395O1258Q1960J05250r36J08424M8800J16447J59397K7561J46053J70869
$$ 12170395 12231653 12313613 12418863 12417927 12526351 12575151 12691598 12850995 12878556 13024609 13195478
6197A3195478J38407J67722K03659K51297K33402L24500K73535L61515M82358
$$ 13195478 13333885 13501607 13705266 13956563 14189965 14514465 14788000 15149515 15631873
6188A5631873O72829M88440N22514N91222N34575M44538L97186L05683J95505
$$ 15631873 16304702 16793142 17315656 17906878 18441453 18885991 19283177 19588860 19784365
6179A9784365J87994K45896K14156K72715M26368L12595M53910N92610N89426
$$ 19784365 19972359 20218255 20432411 20705126 21131494 21444089 21897999 22490609 23080035
6170B3080035O93441Q94691J072926J140804J493782J661355J951890K242860
$$ 23080035 23773476 24668167 25741093 26881897 28375679 30037034 31988924 34231784
6162C4231784K436117L052771L217971L455796L241324K644380J458806j1287
$$ 34231784 36667901 39720672 42938643 46394439 49635763 52280143 53738949 53727662
6154E3727662j177291j925000k354082k424341k160261j700746j337931r33631
$$ 53727662 52550371 50625371 48271289 45846948 43686687 41985941 40648010 39714379
6146C9714379n94837l43140J35060M87085P56955J269021J580837K098181K560839
$$ 39714379 39119542 38776402 38911462 39398547 40155502 41424523 43005360 45103541 47664380
6137D7664380L145178L786458M459583N101943N536632N499012M590344K630779
$$ 47664380 50809558 54596016 59055599 64157542 69694174 75193186 79783530 82414309
6129H2414309j84272k833346m737519n870349n880443n462772m831431l966205
$$ 82414309 82230037 79396691 74659172 68788823 62908380 57445608 52614177 48647972
6121D8647972l311489k713416k241955k016676j374172q67521n94883l58943k0459
$$ 48647972 45336483 42623067 40381112 38364436 36990264 36122743 35527860 35168917 35148458
6112C5148458M07850Q40539J201424J515990J832545K034120K007422J549713
$$ 35148458 35556308 36396847 37598271 39114261 40946806 42980926 44988348 46538061
6104D6538061N92803n41143j668480k572035l040736l248084k903206k649219
$$ 46538061 47130864 46589721 44921241 42349206 39308470 36060386 33157180 30507961
6096C0507961k385944j986002j826741j595470j346980j301560j076642r08182
$$ 30507961 28122017 26136015 24309274 22713804 21366824 20065264 18988622 18080440
6088A8080440p16280p80123n88911n77550m06049l39736m20810l95213j71017
$$ 18080440 17364160 16584037 15995126 15417576 15011527 14671791 14250981 13855768 13684751
6079A3684751l27924l62851k47652j57567k02325k74635j26543k2189j62388k0040
$$ 13684751 13356827 12993976 12746324 12588757 12386432 12111797 11985254 11963065 11800677 11780637
6069A1780637J4821m1983O7250K4643l1483L0401Q8340L6731P7341N7396K15675
$$ 11780637 11795458 11753475 11820725 11845368 11813885 11844286 11932626 11969357 12046698 12104094 12319769
6058A2319769M7621o58N6127J16937Q6526J30759K15469L933P5056R0024L28606
$$ 12319769 12367390 12366732 12422859 12539796 12626322 12757081 12972550 12976483 13051539 13141563 13470169
6047A3470169R9057J39273K18546Q7006L76352L38576L27579K49109J23076L27413
$$ 13470169 13569226 13708499 13927045 14014051 14390403 14728979 15056558 15305667 15428743 15756156
6037A5756156L99952L00335N91787L85412L70401L64783L92476L85111L03546
$$ 15756156 16156108 16456443 17048230 17433642 17804043 18168826 18561302 18946413 19249959
6028A9249959M10117N94627O17686N78273P69249P42975P96930J004944R98289
$$ 19249959 19660076 20254703 20872389 21450662 22219911 22962886 23759816 24764760 25763049
6019B5763049R73788J375169J337738J418364J745223K107376K411765K839897
$$ 25763049 26736837 28112006 29449744 30868108 32613331 34720707 37132472 39972369
6011C9972369L401956L766685M790148N539005O138495O157442M810297K048364
$$ 39972369 43374325 47141010 51931158 57470163 63608658 69766100 74576397 76624761
6003G6624761q23034k605339k826579k355351j662299o19225N15975J852414K745552
$$ 76624761 75801727 73196388 70369809 68014458 66352159 65732934 66248909 68101323 70846875
5994G0846875L383785L049469J719026M65177M62493J471380K185668K961945
$$ 70846875 74230660 77280129 78999155 79464332 79926825 81398205 83583873 86545818
5986H6545818K888279J448417p14662k705262l515216l412231k553327j340104
$$ 86545818 89434097 90882514 90167852 87462590 83947374 80535143 77981816 76641712
5978G6641712o7568M85552N5869j539647k852485k864419k310580j195150J42062
$$ 76641712 76574144 77059696 77115565 75575918 72723433 69859014 67548434 66353284 66495346
5969F6495346J352844K661872L489841L424325J651630j861093n031824o690419
$$ 66495346 67848190 70510062 73999903 77424228 79075858 77214765 72182941 65492522
5961F5492522o813819o324933n815612m900468m221188l620140k810558k581473
$$ 65492522 58678703 52353770 46538158 41637690 37416502 33796362 30985804 28404331
5953B8404331k209704j935723j681229j572850j303504j039233r58093q56205
$$ 28404331 26194627 24258904 22577675 21004825 19701321 18662088 17703995 16847790
5945A6847790o96955p96323o66630o69721o01808n58434m99782l75889m65373
$$ 16847790 16150835 15354512 14687882 14018161 13416353 12857919 12358137 11982248 11516875
5936A1516875m12405l30478j85209k68017l06718l05292k05295l08121k65825
$$ 11516875 11104470 10773992 10588783 10320766 10014048 9708756 9503461 9195340 8929515
5927H929515j88403j44377j23203j61090j71850j72825k38939r3801n9691j09147
$$ 8929515 8741112 8596735 8473532 8312442 8140592 7967767 7728828 7635027 7575336 7466189
5917G466189k38603j97965p3278q808j11392j67855j32946r2228K549j5714j03038
$$ 7466189 7227586 7029621 6956343 6947535 6836143 6668288 6535342 6443114 6445663 6429949 6326911
5906F326911q8526o3201k8545o4727j04485o0691o5327j47571J6304n753j26207
$$ 6326911 6238385 6175184 6146639 6081912 5977427 5916736 5851409 5703838 5720142 5714389 5588182
5895E588182m094o7240n9004L3220Q6095M648k5044j29361J1932Q6925k2188j01700
$$ 5588182 5584088 5516848 5457844 5491064 5577159 5581807 5556763 5427402 5439334 5526259 5504071 5402371
$$ [...]
##END NTUPLES=NMR SPECTRUM
##END=
