##TITLE=1H_CG-1181-b2
 CDCl3
 8 sc, 
 12.4.2024
##JCAMPDX= 6.0         $$ Bruker NMR JCAMP-DX V2.0
##DATA TYPE= NMR SPECTRUM
##DATA CLASS= NTUPLES
##ORIGIN= UXNMR, Bruker Analytische Messtechnik GmbH
##OWNER= root
$$ XWIN-NMR		Version 3.5
$$ Fri Apr 12 14:19:05 2024 Russian Standard Time (UT+4h)  she@DPX200
##.OBSERVE FREQUENCY= 200.1309
##.OBSERVE NUCLEUS= ^1H
##.ACQUISITION MODE= SIMULTANEOUS
##.ACQUISITION SCHEME= undefined
##.AVERAGES= 8
##.DIGITISER RES= 18
##SPECTROMETER/DATA SYSTEM= spect
##.PULSE SEQUENCE= zg30
##.SOLVENT NAME= CDCl3
##.SHIFT REFERENCE= (INTERNAL, CDCl3, 0, 15.5772)
##AUDIT TRAIL= $$ (NUMBER, WHEN, WHO, WHERE, WHAT)
$$ ##TITLE= Audit trail, XWIN-NMR		Version 3.5
$$ ##JCAMPDX= 5.01
$$ ##ORIGIN= Bruker BioSpin GmbH
$$ ##OWNER= she
$$ F:/spectra/data/she/nmr/H-F/1/pdata/1/auditp.txt
$$ ##AUDIT TRAIL=  $$ (NUMBER, WHEN, WHO, WHERE, WHAT)
(   1,<2024-04-12 14:15:53.81 +0400>,<she>,<DPX200>,
      <created by zg, POWCHK disabled, PULCHK disabled
       configuration hash MD5:
       00 E9 B6 7A A2 85 ED C7 34 08 36 98 17 FE 4E 26
       data hash MD5: 16K
       56 24 72 5F CF 7E 48 EA FD 7E FB EB E1 50 B9 EE>)
(   2,<2024-04-12 14:17:30.53 +0400>,<she>,<DPX200>,
      <Start of raw data processing
       efp BC_mod = 2 LB = 0.24 FT_mod = 6 PKNL = 1 PHC0 = -25457.1 PHC1 = 8.38731 SI = 16K 
       data hash MD5: 16K
       9F 86 FF C9 9B F7 F5 91 DA AB A2 26 AD 30 21 7B>)
(   3,<2024-04-12 14:18:04.50 +0400>,<she>,<DPX200>,
      <pk PHC0 = -0.3840234 PHC1 = 0.5999999 
       data hash MD5: 16K
       8E 00 28 F2 B9 41 1B 1C E9 2C 13 3B 55 12 62 21>)
(   4,<2024-04-12 14:18:07.84 +0400>,<she>,<DPX200>,
      <abs ABSG = 5 
       data hash MD5: 16K
       EA 90 F9 D8 1C 38 57 E4 5D 46 FC 23 B8 58 95 3A>)
$$ ##END=
$$ 
$$ hash MD5
$$ 22 EC 63 53 45 08 FF 33 51 67 4B 07 DA B9 1F A5
##$RELAX= 
##$RELAX= 
##$RELAX= 
##$RELAX= 
##$RELAX= 
##$RELAX= 
$$ Bruker specific parameters
$$ --------------------------
##$DU= <F:/spectra>
##$EXPNO= 1
##$NAME= <H-F>
##$PROCNO= 1
##$TYPE= <nmr>
##$USER= <she>
##$AMP= (0..31)
100 100 100 100 100 100 100 100 100 100 100 100 100 100 100 100 100 100 
100 100 100 100 100 100 100 100 100 100 100 100 100 100 
##$AQSEQ= 0
##$AQ_mod= 1
##$AUNM= <au_zg>
##$AUTOPOS= <>
##$BF1= 200.13
##$BF2= 200.13
##$BF3= 200.13
##$BF4= 200.13
##$BF5= 200.13
##$BF6= 200.13
##$BF7= 200.13
##$BF8= 200.13
##$BYTORDA= 1
##$CFDGTYP= 0
##$CFRGTYP= 5
##$CHEMSTR= <none>
##$CNST= (0..31)
1 1 145 1 1 1 1 1 1 1 1 1 1 1 1 1 1 1 1 1 1 1 1 1 1 1 1 1 1 1 1 1 
##$CPDPRG= <>
##$CPDPRG1= <>
##$CPDPRG2= <>
##$CPDPRG3= <>
##$CPDPRG4= <mlev>
##$CPDPRG5= <mlev>
##$CPDPRG6= <mlev>
##$CPDPRG7= <mlev>
##$CPDPRG8= <mlev>
##$CPDPRGB= <>
##$CPDPRGT= <>
##$D= (0..31)
0 1.2 0 0 0 0 0 0 0 0.06 0 0.03 0 0 0 0 0.0002 0 0 0 0 0 0 0 0 0 0 0 0 
0 0 0 
##$DATE= 1712916953
##$DBL= (0..7)
120 120 120 120 120 120 120 120 
##$DBP= (0..7)
150 150 150 150 150 150 150 150 
##$DBP07= 0
##$DBPNAM0= <>
##$DBPNAM1= <>
##$DBPNAM2= <>
##$DBPNAM3= <>
##$DBPNAM4= <>
$$ [...]
##$SUBNAM3= <"">
##$SUBNAM4= <"">
##$SUBNAM5= <"">
##$SUBNAM6= <"">
##$SUBNAM7= <"">
##$SUBNAM8= <"">
##$SUBNAM9= <"">
##$SW= 18.0517689322627
##$SWIBOX= (0..15)
0 0 2 0 0 0 0 0 0 0 0 0 0 0 0 0 
##$SW_h= 3612.71676300578
##$TD= 16384
##$TD0= 1
##$TE= 0
##$TE2= 300
##$TE3= 300
##$TEG= 300
##$TL= (0..7)
0 120 120 120 120 120 120 120 
##$TP= (0..7)
150 150 150 150 150 150 150 150 
##$TP07= 0
##$TPNAME0= <>
##$TPNAME1= <>
##$TPNAME2= <>
##$TPNAME3= <>
##$TPNAME4= <>
##$TPNAME5= <>
##$TPNAME6= <>
##$TPNAME7= <>
##$TPOAL= (0..7)
0.5 0.5 0.5 0.5 0.5 0.5 0.5 0.5 
##$TPOFFS= (0..7)
0 0 0 0 0 0 0 0 
##$TUNHIN= 0
##$TUNHOUT= 0
##$TUNXOUT= 0
##$USERA1= <user>
##$USERA2= <user>
##$USERA3= <user>
##$USERA4= <user>
##$USERA5= <user>
##$V9= 5
##$VALIST= <valist>
##$VCLIST= <CCCCCCCCCCCCCCC>
##$VD= 0
##$VDLIST= <DDDDDDDDDDDDDDD>
##$VPLIST= <PPPPPPPPPPPPPPP>
##$VTLIST= <TTTTTTTTTTTTTTT>
##$WBST= 1024
##$WBSW= 4
##$XGAIN= (0..3)
0 0 0 0 
##$XL= 0
##$YL= 0
##$YMAX_a= 548462
##$YMIN_a= -375400
##$ZGOPTNS= <>
##$ZL1= 120
##$ZL2= 120
##$ZL3= 120
##$ZL4= 120
##$ABSF1= 15.53979
##$ABSF2= -2.512095
##$ABSG= 5
##$ABSL= 3
##$ALPHA= 0
##$AQORDER= 0
##$ASSFAC= 0
##$ASSFACI= 0
##$ASSFACX= 0
##$ASSWID= 0
##$AUNMP= <proc_1d>
##$AZFE= 0.1
##$AZFW= 0.1
##$BCFW= 0
##$BC_mod= 2
##$BYTORDP= 0
##$COROFFS= 0
##$CY= -3
##$DATMOD= 1
##$DC= 0
##$DFILT= <>
##$DTYPP= 0
##$F1P= 0
##$F2P= 0
##$FCOR= 1
##$FTSIZE= 16384
##$FT_mod= 6
##$GAMMA= 0
##$GB= 0
##$INTBC= 1
##$INTSCL= 3.70164e-10
##$ISEN= 128
##$LB= 0.24
##$LEV0= 0
##$LPBIN= 0
##$MAXI= 10000
##$MC2= 0
##$MEAN= 0
##$ME_mod= 0
##$MI= 1.114404
##$NCOEF= 0
##$NC_proc= -6
##$NLEV= 6
##$NOISF1= 3.799351
##$NOISF2= 2.8
##$NSP= 0
##$NTH_PI= 0
##$NZP= 0
##$OFFSET= 15.57724
##$PC= 1
##$PHC0= -25457.48
##$PHC1= 8.98731
##$PH_mod= 1
##$PKNL= yes
##$PPARMOD= 0
##$PSCAL= 0
##$PSIGN= 0
##$REVERSE= no
##$SF= 200.129588891562
##$SI= 16384
##$SIGF1= 3
##$SIGF2= 2
##$SINO= 5.538805
##$SIOLD= 16384
##$SREGLST= <1H.CDCl3>
##$SSB= 0
##$STSI= 16384
##$STSR= 0
##$SW_p= 3612.71676300577
##$SYMM= 0
##$S_DEV= 0
##$TDeff= 16384
##$TDoff= 0
##$TI= <>
##$TILT= no
##$TM1= 0
##$TM2= 0
##$TOPLEV= 0
##$USERP1= <user>
##$USERP2= <user>
##$USERP3= <user>
##$USERP4= <user>
##$USERP5= <user>
##$WDW= 1
##$XDIM= 16384
##$YMAX_p= 381622916
##$YMIN_p= -261497
$$ End of Bruker specific parameters
$$ ---------------------------------
##NTUPLES= NMR SPECTRUM
##VAR_NAME=  FREQUENCY,     SPECTRUM/REAL,   SPECTRUM/IMAG
##SYMBOL=    X,             R,               I
##VAR_TYPE=  INDEPENDENT,   DEPENDENT,       DEPENDENT
##VAR_FORM=  AFFN,          ASDF,            ASDF
##VAR_DIM=   16384,         16384,           16384
##UNITS=     HZ,            ARBITRARY UNITS, ARBITRARY UNITS
##FACTOR=    0.220516191357247, 1,           1
##FIRST=     3117.46663531081, 0,            0
##LAST=      -495.250127694965, 0,           0
##MIN=       -495.250127694965, -261497,     0
##MAX=       3117.46663531081, 381622916,    0
$$ Real data points
##PAGE= N=1
##DATA TABLE= (X++(R..R)), XYDATA
$$ [...]
7529g1115K8632q254L0617j3931n947J8826m6867k7754k1975J2927j0392m1718
7517a56951J4314J13494j0098l6668N9500o9978P945J3757L415m82o987j1221
7505g9960l7044k8494o919N6513l6905K006M763K1245N6917k6703k1408j7298
7493a13287N9415N0283n7668k4377J9994j379J6701L746m5p6570K6658N7341n6505
7480i5693L054N8612n94l4292P342m613l3719K4872L630l9957M2052r227k6378
7467a04911k0416m946M7900L8685o9507L0518P5185q2825Q891l7956L4754r366
7455i3994j05441Q0321K4582j6667N0444l6264j4726J6468o3186N2273Q2732k5136
7443d8594l565j7555k8443q873k5257J21302N0872r7135L1613q905r8213J1844
$$ y = [-71115, -42483, -50737, -20120, -34051, -39998, -21172, -68039, -95793, -117768, -104841, -115233, -156951, -142637, -29143, -39241, -75909, -16409, -86387, -78442, -64685, -61270, -61752, -68739, -79960, -117004, -145498, -152417, -95904, -132809, -130803, -126040, -104795, -47878, -74581, -95989, -113287, -53872, -3589, -61257, -85634, -65640, -67019, -50318, -46572, -46617, -123187, -96529, -39188, -95693, -92639, -34027, -34621, -68913, -61571, -66184, -99903, -75031, -71401, -111358, -69306, -78533, -104911, -125327, -130273, -82373, -43688, -113195, -82677, -7492, -90317, -81426, -119382, -84628, -93994, -199435, -119114, -94532, -111199, -60755, -97019, -111745, -95277, -158463, -106190, -23458, -48594, -52159, -69714, -98157, -107030, -132287, -10985, 39887, -57248, -25635, -34540, -132753, -120909]
7431a20909l273J4465M7947O3846K4228j13665l0209M5897Q152O4577m5897K8362
7419a6479K4666l5534o405M933j2549J3627m2092o50K0045O150k751n0199J718
7406i5520M8071n6297O6532m2577n4599L6763N5126P0486K2299p1686k4476l389
7394d9267m475J8261L6468m5678l033M6240m0213J7914q378k4755k5093J2551
7382f9458N8130m219l2640K6442m9619J61l3474J8323J8603o533j4220L0910m0950
7369i8544M5643m9307K2108P4966P485j5314K3892l594p7506m4865m5673j4088
7357a74797N6921O8950K8450j9381K3955l7319p2261M4525j2092j661o0532N9689
7345i5553M9930k5561K1637l3806M1907j9321l8391J0298L4004n0490M0415N7132
$$ y = [-120909, -124182, -109717, -61770, 2076, 26304, -87361, -117570, -71673, -63521, 1056, -44841, -16479, 8187, -27347, -33752, -28819, -41368, -27741, -69833, -70483, -50438, -44288, -47039, -97238, -95520, -47449, -103746, -37214, -79791, -134390, -97627, -42501, 27985, 50284, -21402, -45878, -49267, -53742, -35481, 987, -44691, -47724, -1484, -41697, -23783, -32161, -56916, -82009, -69458, -11328, -15547, -48187, -21745, -71364, -71203, -104677, -86354, -67751, -74284, -88504, -57594, -98544, -52901, -102208, -80100, -5134, 2351, -12963, 10929, 7335, -70171, -115036, -160709, -174797, -117876, -48926, -20476, -39857, -15902, -53221, -125482, -80957, -93049, -94710, -155242, -95553, -45623, -71184, -49547, -83353, -41446, -60767, -99158, -88860, -54856, -105346, -64931, -7799]
7333g799m5822l2866O1384j9950j8921L3140Q6808n7105n1347k5074k5571K9734
7321g3389M2480k0486P231L508M4706L0564q0278m3197j6078R4277m7921n8863
7309a17446q028K2836R946M2757m7307q005J18237j2623m7401O0426k7319q739
7297b2666q501J5109R6611n6067p5511L2200m0661K018N4040K3099K8178q281
7285C9568l9726K1744j0756m4720l5940Q15k9003L6346j9262j9785P2182j812
7273c0349M3633M028j0799l911m62k6991k0854K8981m2303P266N8042l047j8809
7260a5575r875J04319m4515j7477l7152m1352l1168O072L879M1604N7010m2282
7248b6512L8056l8603L756p7230P7174K7696n11l9645p56K3359P409m4481k4689
$$ y = [-7799, -53621, -86487, -25103, -45053, -63974, -30834, 55974, -1131, -52478, -77552, -103123, -73389, -30909, -51395, -44164, -40656, 4050, 34614, -45664, -88861, -104939, -10662, -58583, -117446, -125474, -102638, -92692, -49935, -97242, -105247, 12990, 367, -47034, 13392, -13927, -22666, -31167, -16058, 80553, 24486, -51025, -18825, -59486, -57468, -3428, 19671, 47849, 39568, -158, 21586, 10830, -33890, -69830, -69015, -98018, -61672, -80934, -100719, -28537, -30349, 13284, 17312, 6513, 2602, 2140, -24851, -45705, -16724, -59027, -51761, 6281, 3234, -15575, -25450, 78869, 34354, 16877, -20275, -61627, -92795, -86723, -82844, -41240, 15770, -26512, 11544, -27059, -23303, -100533, -23359, 4337, 3826, -35819, -36575, -13216, -5807, -50288, -74977]
7235g4977P5498P948r8016K5553j0883J0833r974N8273N1476p2570k1327m3071
7223a01237L6243j4503L2428O7725j3768p01j9384q2115K0519L8233K1350K6562
7211A1352k9069j7636J6284k0124Q179L3387J8460q7601m3874n420K8637K3519
7199f3906K226K0322j1375O3932m993r6604m2230M3717N6223k6292J1843M4655
7187b482k6530j2472j7678j7436j2736k4399R49P1487j3908o4206j06K5744N2267
7174d1506j3602M1956M98m0987j1820M5852k1080m4390R2924j0743q006M01N4877
7161D4374M951j01282k2776j5617K416L878P5589J8458l6234m9002L7081O53l7901
7148g5412M1029j847n6250p672K3702O1927j6810k2573k8267L7364M8145K0524
$$ y = [-74977, 521, 8469, -89547, -63994, -74877, -64044, -74018, -15745, 35731, -36839, -58166, -101237, -64994, -79497, -47069, 20656, 6888, 6187, -13197, -95312, -74793, -36560, -15210, 11352, -17717, -35353, -19069, -39193, -31014, 2373, 20833, -66768, -110642, -116062, -87425, -63906, -61680, -41358, -52733, 11199, 6206, -90398, -132628, -88911, -32688, -58980, -47137, -2482, -29012, -41484, -59162, -76598, -89334, -113733, -112784, -41297, -55205, -119411, -119517, -93773, -41506, -55108, -13152, -12654, -53641, -65461, -19609, -40689, -85079, 7845, -2898, -10904, -10503, 44374, 49325, -51957, -74733, -90350, -87934, -84056, -8467, 9991, -26243, -75245, -38164, -37511, -75412, -34383, -36230, -92480, -100152, -76450, -14523, -31333, -53906, -82173, -44809, 3336, 23860]
7136B3860O4387j9970r1135k1574l9847N9153p644k9584j3692L805J9345J1960
7124d0936J6369K5797K7372N23l9731j2830L2389L1197k2157o1989J9870L8336
7112A4210M625j6072O1301q2751L474r700j05317M0985N3783K8219k5059l3671
7100f5973M0173m9256J0226k8225K0403L8759j9375K2274n784J6698J061k2229
7088d1248J7575N887n5375J1843o1294k1068P7162j76j305j5057J6197l032L2294
7075c7597M3436M3461q023q2493K0072k6223L573j3105j3968K086N1330j0512
7063b7963l9497k2227l891j6939o8332N7649L4629M0601M8971p4889J6959N6461
7051A532k365m448j07679n231P3551M7944o7656L8755Q03J5243K279j1635J1843
$$ y = [23860, 88247, 68277, -22858, -44432, -84279, -25126, -32770, -62354, -76046, -72241, -52896, -40936, -24567, 1230, 28602, 29125, -10606, -23436, 8953, 40150, 17993, -43996, -24126, 14210, 18835, 2763, 64064, -18687, -15213, -24913, -130230, -89245, -35462, -7243, -32302, -65973, -25800, -75056, -64830, -93055, -72652, -33893, -53268, -30994, -36778, -20080, -19019, -41248, -23673, -17786, -73161, -61318, -122612, -143680, -66518, -66694, -67999, -83056, -66859, -69891, -37597, 5839, 49300, 41277, -41216, -21144, -47367, -43794, -56899, -70867, -68781, -17451, -27963, -67460, -89687, -93578, -110517, -178849, -121200, -86571, -45970, 3001, -71888, -54929, 1532, -833, -5281, -112960, -118191, -44640, 3304, -64352, -25597, -24794, -9551, -7272, -18907, -7064]
7038g064L066R941j9755l2436L7214J0856j2897k3740N0105m8545j8519J0749
7026d1025L119R620m7849K0580j3515j985L6709l1573K3907n012o0221L7953M2531
7013b6761J09m5948J9391P4027p558m8420L9031k9750N694K908J3519j2837Q149
7000h446N4453k6107p6040M15N6388n907m0372M7502J3419L4501n206m2835r059
6987g294J274M546n0254j6337L2605Q044k8598M0619J3939R21m0920j8920L8641
6974b1734j9387M4173l6447N3719K7772q6771k377K6557j215m7588K9984K367
6962c0947k7130j7641l728p8732J589J08673M1848n3271j4948O1694L9253j4026
6950A2634j31225O145Q9005P834N861Q3889N0p8818J6040P9406n9221m8437K5011
$$ y = [-7064, -3998, 5943, -13812, -46248, -9034, 1822, -11075, -34815, 15290, -33255, -51774, -41025, -37906, -28286, -76135, -55555, -69070, -71055, -34346, -65919, -42012, -47024, -107245, -69292, -26761, -26652, -72600, -53209, 20818, 13260, -35160, 3871, -25879, -20185, -17277, -3758, -16595, -8446, 46007, 19900, -56140, -55725, 663, -5244, -45616, 1886, 15305, 49806, 44600, 1765, -7294, -6020, -1474, -51728, -68065, -35460, -27416, -56014, -15395, -1456, -535, -41455, -60375, -21734, -41121, 3052, -33395, 20324, 48096, -38675, -41052, -14495, -15710, -63298, -33314, -30947, -58077, -75718, -79446, -158178, -156589, -47916, -6068, -59339, -74287, -12593, 26660, 12634, -118591, -112446, -23441, -15607, -9746, 74143, 74193, -4625, 11415, 90821, 31600, -16837, 8174]
6937H174Q100M054l8120L1023l0057k6046L5358K2032L5409k6728o3650L0539
6925i912J10211o9873n887L299J2942n7283j8059k3658j0034M5405K280J7150
6913c419M6397m3981p0954J27614k3085m1128Q919l8737O7293k5770J358L0895
6901C5402n150l5622q1973Q7451J11252r921J1059j9205p2320N050l1936K5649
6889A9736k1293J4794M3449p001n8291J802L60P4026n368q4968N283m6256Q130
6876e5597O0867j9929j8031O8640M6360r0364k8191M7973M5830m1518J0133q2802
6864e6629j0145M5673o3236N4415J03022m8745o8962N284N2690Q4730l6413l1637
6852C0047L0359J2855k1978J783l0009M0660K3982j2853k941K5975l2579p313
$$ y = [8174, 16274, 20328, -17792, 13231, -16826, -42872, -7514, 14518, 49927, 23199, -40451, -9912, 100299, 30426, 24539, 27838, 40780, -16503, -34562, -58220, -68254, -22849, -20569, -3419, 42978, -1003, -71957, 55657, 32572, -8556, 363, -38374, 28919, 3149, 4507, 35402, 30252, -5370, -87343, 108, 111360, 101439, 112498, 93293, 20973, 26023, -5913, 19736, -1557, 13237, 56686, 49685, -8606, -6804, -6444, 67582, 62214, -22754, -17471, -63727, -55597, 5270, -14659, -32690, 35950, 82310, -8054, -36245, 11728, 57558, 16040, 26173, -56629, -66774, -21101, -84337, -29922, 73100, 24355, -44607, -39323, 13367, 98097, 61684, 30047, 60406, 73261, 51283, 53066, 23057, 63717, 87699, 74846, 71905, 97880, 65301, 57988]
6840E7988r203P4882N314k2732k8451p3560N3105M8041K1218L0408j6767n6727
6828H3516K1861k454j4156P9670M5692l3366r1758m1911R121J4426o025J7162
6816H1778j0481l8573J6046L115R622k8384o468O46j9660J4981j9541N5618m746
6803E3953j1370K0684j8734n954L3668m1176J4811M8139n6255Q20k4120K6530
6791D0996O2018r416k5628n831l9323M4344K8021K3175k9010k5319k5406j2724
6779B5897L2335L4481j8593j3454L0732Q366m5029m9325k8720O1178M8803n4327
6767C2344M809K6790q019M6479k8887l1304L7703j1158o6350L8931J1821N2468
6755A05627N3938m5609j8870q416j0002P7451j4249q960p898j05661K1220M0105
$$ y = [57988, 48785, 123667, 128981, 106249, 77798, 4238, 57343, 105384, 126602, 157010, 140243, 83516, 105377, 102923, 88767, 168437, 214129, 180763, 89005, 47094, 56215, 70641, 64616, 81778, 71297, 32724, 48770, 51885, 61507, 33123, 26655, 27301, 7641, 22622, 3081, 58699, 53953, 42583, 63267, 44533, 38579, 72247, 31071, 45882, 94021, 37766, 38586, 14466, 40996, 103014, 93598, 67970, 62139, 22816, 67160, 95181, 118356, 89346, 64027, 38621, 25897, 58232, 92713, 74120, 60666, 91398, 99764, 54735, 5410, -23310, 37868, 86671, 32344, 37153, 63943, 55924, 102403, 73516, 42212, 79915, 68757, 2407, 41338, 53159, 105627, 159565, 113956, 95086, 86670, 76668, 154119, 139870, 130910, 123012, 17351, 38571, 78676]
6743G8676l7105N9597j6491j02174q026p869K6493q522k80L7511K6903k0597M267
6730C2383m2864M9522M1726l8750N842J9629p569O8763K3113k3749q1152j2598
6718C4296R20M0303j7209m2379P249M343k8396L3432K5522L5927K1065l7029m6079
6705C1965P054K9265r534K5198J5628L5719j4537L9722l5725j26131n2393M968
6693d8801R6079K5740Q170K1131q3205K6368J6422l4408O6328J1300l6031N5911
6681A25004k5377q233r837q601L7126m604j37414K758N9985k431L6745K7896j9458
6668G3559N1233p832l8078R3707L9467l1236k8126j00947p66J10593n2988j1426
6656I7160m0371P536n091M4226j7028J3375l0851J249J8631m4814N6728L8653
$$ y = [78676, 41571, 101168, 84677, -17497, -25523, -33392, -6899, -15421, -15701, 21810, 48713, 28116, 32383, -10481, 39041, 80767, 42017, 47859, 67488, 59919, 128682, 151795, 128046, 46894, 34296, 35216, 75519, 58310, 15931, 23180, 27523, -873, 32559, 58081, 94008, 115073, 78044, 31965, 39019, 68284, 58750, 83948, 99576, 135295, 120758, 160480, 124755, -1376, -53769, -48801, 47278, 73018, 81188, 102319, 19114, 45482, 61904, 27496, 93824, 105124, 69093, 125004, 99627, 91394, 81557, 72956, 110082, 105478, -31936, -29178, 30807, 28376, 65121, 93017, 73559, 124792, 116960, 78882, 172589, 212056, 180820, 152694, 51747, 50981, 161574, 108586, 97160, 56789, 64325, 59234, 103460, 86432, 99807, 68956, 70205, 88836, 44022, 100750, 139403]
6644A39403M284m2556J3536o294m0510J1042N1565J2218J4374K647l466M3914
6632B00157q6610m8861r364J0651q4272K7197K0807N3063L1817M4068M3500l9600
6620A62553N5217n1230L529n2409R753l6996L6512Q5186n885n0488K209l6662
6608A21289l5010K6993P2368o4568j3459J26L9741N7313m7864J1200L5234m3699
6596A59664j9155M4943N3450o571o7501o727J5593M5198l981P915P5943k7407
6584B71364j6678k9967R049k7669r9041O7275O1523k0460M0579l1065l3698L5095
6572B26307K6089n1769p750K1229k964L9721N6224n8892j6921K5648l2269N9512
6560B84165L7189k0777k5482J6254N398J6141J9585P0035J0670K3816j5403L1198
$$ y = [139403, 143687, 101131, 114667, 108373, 67863, 78905, 130470, 142688, 157062, 159709, 156243, 200157, 113547, 64686, 55322, 65973, -18299, 8898, 29705, 82768, 114585, 158653, 202153, 162553, 217770, 166540, 170069, 117660, 127413, 90417, 126929, 212115, 206230, 155742, 157951, 121289, 86279, 113272, 185640, 121072, 107613, 107739, 147480, 204793, 156929, 168129, 203363, 159664, 140509, 185452, 238902, 232331, 164830, 158103, 173696, 218894, 214913, 222828, 298771, 271364, 254686, 224719, 233768, 206099, 107058, 174333, 235856, 215396, 255975, 224910, 191212, 226307, 252396, 200627, 192877, 214106, 211142, 250863, 307087, 248195, 231274, 256922, 224653, 284165, 321354, 300577, 275095, 291349, 296747, 312888, 332473, 402508, 413178, 436994, 421591, 452789]
6548D52789k0966k3143j1879m1528L0179O1283j2497L265M1994J2512L2643m3982
6536D80670n3970O6379L7011P4272Q8374J205k1347k5165N303l5065J4202o472
6524F25397m5167K024J3147o042m4321R384P4087m684L3909O4377l2213o037J4366
6511F98227Q649J6854P8072J29973O0880m8652J7835l6384l4474l4667p8582k3372
6499G54359K8924m6162M133J195m3639n1069j6452L3898M594n235l823m351M2921
6486F99293M3809k2371l5020m2819J05358j3989k861K7309K1157k1226m5781j7305
6474F95554k7092J9714M6606J7366k7951o9868J6324L538K3101k4885k8366k1306
6462F22735k6292M0519L5655M4104j9271p9445j4542P4442j341j06666Q5325J7424
$$ y = [452789, 431823, 408680, 396801, 355273, 385452, 446735, 434238, 437503, 479497, 492009, 524652, 480670, 426700, 493079, 530090, 604362, 692736, 693941, 672594, 647429, 652732, 617667, 631869, 625397, 580230, 582254, 595401, 589359, 545038, 554422, 628509, 623825, 657734, 722111, 689898, 683861, 698227, 706876, 723730, 801802, 931775, 992655, 944003, 961838, 925454, 890980, 856313, 777731, 754359, 783283, 737121, 741254, 742449, 698810, 647741, 631289, 665187, 669781, 664546, 660723, 656372, 699293, 743102, 720731, 685711, 642892, 748250, 734261, 731400, 758709, 779866, 758640, 712859, 695554, 668462, 688176, 734782, 752148, 724197, 654329, 670653, 674191, 697292, 672407, 644041, 622735, 596443, 636962, 672617, 716721, 697450, 618005, 603463, 677905, 676564, 569898, 655223, 672647]
6450F72647l1107M1858J316k8270k4993K0068O1228M5138p1141L420k7371P105
6438F69898l1230j0981Q7179Q202M458J6883k9894L885j056K7094J1321N6009
6426H11768l0526M1493K1816M6571k9464p5999N2237L1971Q704P7001j9348j8164
6414I18060N4620M3997m8470l266l2591j9828J09116J2825J7774J005j5230n1430
6402I86582J3968N622O7189J4j6321J0685O9676m0129J2343K683n4245N1148J21868
6389A231083P1983l7030L5210j4786K6514j4740M5456Q0748J9942k1763l297J5716
6377A435036m906M3152O143P642j8461J6758O6360M1783N0096M895k4842K1642
6365A645298M6136N268l6051O1285O3366M2053o315L7163Q646Q9000k007l3400
$$ y = [672647, 641540, 683398, 684714, 656444, 631451, 651519, 712747, 757885, 686744, 690164, 662793, 669898, 638668, 627687, 714866, 723068, 727526, 744409, 714515, 718400, 717344, 744438, 755759, 811768, 781242, 822735, 844551, 891122, 861658, 785659, 837896, 869867, 878571, 955572, 936224, 918060, 972680, 1016677, 968207, 964941, 932350, 912522, 1021638, 1034463, 1052237, 1053242, 1038012, 986582, 1000550, 1006172, 1073361, 1073375, 1057054, 1067739, 1137415, 1097286, 1109629, 1112312, 1058067, 1109215, 1231083, 1303066, 1266036, 1301246, 1286460, 1312974, 1298234, 1343690, 1424438, 1444380, 1422617, 1419320, 1435036, 1430130, 1473282, 1479425, 1487067, 1468606, 1485364, 1551724, 1593507, 1643603, 1648498, 1623656, 1645298, 1691434, 1696702, 1660651, 1721936, 1785302, 1827355, 1821040, 1858203, 1866849, 1955849, 1953842, 1920442]
6353A920442O9656J7599O5832k7784k7703R9506O7859J3649O4623O3719M6954
6342B374352k4884j1912L4345L6168J581l9214P0620J39463L9608J9000k0477
6331B618650R2024o198L6549R5933Q0484N4556j0018J33243R703j7251Q5805O3081
6319C236561R5352J24768R4509Q0710L9295N8197J43092J26883Q3730N0724P6115
6308D209936J41805Q9804Q8098Q8940J30045Q0776J25209J38268O9033J44812
6298E306726J49856J04701J45468J99569J18856J94424K82748J72454K51803K38896
6288G165501J65653J88296J84476J43700K01566K46935K25174K34959K89892K59145
6278I305297K20855K47275L89097K46812K69885L59880L97645M50136L11525L86170
$$ y = [1920442, 1990098, 2007697, 2073529, 2045745, 2018042, 2117548, 2185407, 2199056, 2263679, 2327398, 2374352, 2349468, 2337556, 2371901, 2408069, 2409650, 2370436, 2441056, 2580519, 2620127, 2639127, 2618650, 2710674, 2704476, 2741025, 2836958, 2917442, 2971998, 2961980, 3095223, 3104926, 3087675, 3173480, 3236561, 3331913, 3456681, 3551190, 3631900, 3671195, 3729392, 3872484, 3999367, 4083097, 4133821, 4209936, 4351741, 4441545, 4529643, 4618583, 4748628, 4829404, 4954613, 5092881, 5161914, 5306726, 5456582, 5561283, 5706751, 5906320, 6025176, 6219600, 6502348, 6674802, 6926605, 7165501, 7331154, 7519450, 7703926, 7847626, 8049192, 8296127, 8521301, 8756260, 9046152, 9305297, 9526152, 9773427, 10162524, 10409336, 10679221, 11039101, 11436746, 11886882, 12198407, 12584577]
6268A2584577L79581L30905L81469M40749M55946M44204M50813M04827M53120
6259A6326191M56545N23431N60566N20963N83994O37724O59684O92594P19504
6250B1681196P66432P09033P00364P84540Q38784Q20209Q59356R23906Q39593
6241B8923413R25751J067892J048598J069385J244609J363773J470939J518483
6233C8632843J625367J749247J930088K276451K708799L074548L679475M135033
6225E9811851M716103M701193M085211K505291L09377j592033k737268k981126
6217F8818599k683338k161578j588377r38194n31142q8976L30829O58795J000451
6208F2817069J289391J664829K203280K810199L482651M575770N797228P071443
$$ y = [12584577, 12964158, 13295063, 13676532, 14117281, 14573227, 15017431, 15468244, 15873071, 16326191, 16782736, 17306167, 17866733, 18387696, 18971690, 19609414, 20269098, 20961692, 21681196, 22447628, 23156661, 23857025, 24641565, 25480349, 26300558, 27159914, 28083820, 28923413, 29849164, 30917056, 31965654, 33035039, 34279648, 35643421, 37114360, 38632843, 40258210, 42007457, 43937545, 46213996, 48922795, 51997343, 55676818, 59811851, 64527954, 69229147, 73314358, 75819649, 76129026, 74536993, 71799725, 68818599, 66135261, 63973683, 62385306, 61447112, 60915970, 60826994, 61157823, 61816618, 62817069, 64106460, 65771289, 67974569, 70784768, 74267419, 78843189, 84640417, 91711860]
6200I1711860Q199253Q418493P200088L796784j132500n849440q833468r491364
6192I4019706q729421p427944o088347m775090l764670k943536k344541j925176
6184E6020981j640624j311142q89194m26703Q4940P61253J360361K091131K725016
6175E8776019L318315L444452K564214P94233j848775m030528n363359n592397
6167E2062174n218735m550362l938040l304852k815539k319731k005569j732110
6159B6177236j532213j452902j351392j123499j119546r74489q60099o99941p94292
6150A6268863o48501o41601n99473m95787m07180l02047l74423l25484l36023
6141A2138344k21662k45318k31696k36156j77098k35551j40157q2896j03397j17349
$$ y = [91711860, 99911113, 108329606, 115529694, 119326478, 118193978, 112344538, 103511070, 94019706, 85290285, 77862341, 71773994, 66998904, 63234234, 60290698, 57946157, 56020981, 54380357, 53069215, 52180021, 51753318, 51838258, 52599511, 53959872, 56051003, 58776019, 62094334, 65538786, 68103000, 68897233, 67048458, 63017930, 57654571, 52062174, 46843439, 42293077, 38355037, 35050185, 32234646, 29914915, 27909346, 26177236, 24645023, 23192121, 21840729, 20717230, 19597684, 18623195, 17763096, 17063155, 16268863, 15620362, 14978761, 14379288, 13883501, 13476321, 13174274, 12799851, 12474367, 12138344, 11916682, 11671364, 11439668, 11203512, 11026414, 10790863, 10650706, 10567810, 10464413, 10347064]
6131A0347064j40338j8995N0953k2406k3068K8398k4971j05448p8042k9604O1549
6120A0045092q9172p7490r5590K4254J6011q9766j5966M8891P538O5641J84853
6109A0024296J77313J75309J72656K48404J76378K45632J95512J66798K25684
6100A1807982J12801N8452O4085L382K4951J0629J71547Q4818J58147J10292O3561
6089A2670647J93183J48410J50131K08035L86063L71301L67930M36185M89193
6080A5421078O64465O04901M38694N42715L75121L03947K72212J60581J07834
6071A8891548K28104L15733L85897O37360P46677Q53554J088746J239597J333633
6062B5720849J262511J032314N90487J07740l80198o36393p28943o80332n24353
$$ y = [10347064, 10206726, 10187731, 10238684, 10216278, 10193210, 10221608, 10196637, 10091189, 10013147, 9983543, 10045092, 9955920, 9878430, 9782840, 9807094, 9823105, 9733339, 9717373, 9766264, 9773802, 9839443, 10024296, 10201609, 10376918, 10549574, 10797978, 10974356, 11219988, 11415500, 11582298, 11807982, 11920783, 11979235, 12043320, 12046702, 12071653, 12082282, 12253829, 12338647, 12496794, 12607086, 12670647, 12863830, 13012240, 13162371, 13370406, 13756469, 14127770, 14495700, 14931885, 15421078, 16085543, 16690444, 17129138, 17671853, 18046974, 18350921, 18623133, 18783714, 18891548, 19119652, 19435385, 19821282, 20458642, 21205319, 22058873, 23147619, 24387216, 25720849, 26983360, 28015674, 28606161, 28713901, 28333703, 27697310, 26968367, 26288035, 25763682]
6053B5763682m42542k48386j09769m2992N2719J21137K28841L12394M71713N69304
6043B6676101O83365R39614J171434J489626J807897K168041K453154K425497
6035C9814729J961258R01277m68228j799773k690542l003827k845219k427219
6027B9442456k046864j664402j370987j055268q75402p05049n39799l92327k29712
6018B0562646j47135k8103J91216M02808M94490O82848Q42137R01561R48102O37770
6008B5488340J07516n74107j149394j499343j511905j486701j445343j178049
6000A6751014j001148q63848p62016n91411n63308n38583m24455k79261l08409
5991A1418575k62294k05279j12856j21826m5116j5282P610k5446n9493m9560k0081
$$ y = [25763682, 25321140, 25072754, 24962985, 24919993, 24972712, 25093849, 25322690, 25635084, 26106797, 26676101, 27359466, 28299080, 29470514, 30960140, 32768037, 34936078, 37389232, 39814729, 41775987, 42677264, 42209036, 40409263, 37718721, 34714894, 31869675, 29442456, 27395592, 25731190, 24360203, 23304935, 22429533, 21724484, 21184685, 20792358, 20562646, 20415511, 20387408, 20578624, 20981432, 21475922, 22158770, 23000907, 23902468, 24850570, 25488340, 25595856, 25021749, 23872355, 22373012, 20861107, 19374406, 17929063, 16751014, 15749866, 14886018, 14124002, 13532591, 12969283, 12430700, 12006245, 11726984, 11418575, 11156281, 10951002, 10838146, 10716320, 10671204, 10655922, 10663532, 10638086, 10578593, 10529033, 10508952]
5980A0508952J1591M5769J36692J7230R3597J19570R7375J11552P7466K30828
5970A1450622J68071J97257K40763J83584K09797K88237K85245K72897L45891
5961A3642364K72586L04811L15738K60431L28198L07712K03926L26744K87723
5952A6250233L46051M42703L93960M27597N23815M88190N20035N36564M85773
5943B0414921N29503N97068P72632P55819P01212P11087O72878P36408Q32497
5934B6724025P91026Q69756R89274R67820R82490J124571J128725J078500J230693
5925C5886880J429371J446432J587634J730085J836162K080757K209775K517877
5917E0724973K980144L746260M580687N570756O393466O665469N191792J959470
$$ y = [10508952, 10520543, 10566312, 10703004, 10720234, 10813831, 10933401, 11030776, 11142328, 11219794, 11450622, 11618693, 11815950, 12056713, 12240297, 12450094, 12738331, 13023576, 13296473, 13642364, 13914950, 14219761, 14535499, 14795930, 15124128, 15431840, 15635766, 15962510, 16250233, 16596284, 17038987, 17432947, 17860544, 18384359, 18872549, 19392584, 19929148, 20414921, 20944424, 21541492, 22314124, 23069943, 23771155, 24482242, 25155120, 25891528, 26724025, 27515051, 28384807, 29374081, 30341901, 31324391, 32448962, 33577687, 34656187, 35886880, 37316251, 38762683, 40350317, 42080402, 43916564, 45997321, 48207096, 50724973, 53705117, 57451377, 62032064, 67602820, 73996286, 80661755, 85853547, 87813017]
5909H7813017j738655l658120l685276k813180j770664n68627P96041J999963
5901G6374499L103526L653205L090651Q74322p94034n50457O69147K163575L181799
5892I1766233L086877J327320j389176l691674m635081m109713k724718j134402
5884G8495666K13653J119677M20047k002844l837511m058283l145994j823232
5876F5381179k63566J304732K728317L779366L927889J837714k607032o418475
5868F9670124p915636p584846o597298n468995m426938l574641l045539k491237
5860B8564994k220751j965298j785629j558975j359542j083619q98154q21957
5852A6871069p78806p32517p44716p34414o36365n15046m11928l77768l29747
$$ y = [87813017, 86074362, 82416242, 78730966, 75917786, 74147122, 73578495, 74374536, 76374499, 79478025, 83131230, 86221881, 87096203, 86302169, 85751712, 86420859, 88584434, 91766233, 94853110, 96180430, 94791254, 91099580, 86464499, 82354786, 79630068, 78495666, 78709319, 79828996, 80249043, 78246199, 74408688, 70350405, 67204411, 65381179, 65117613, 66422345, 69150662, 72930028, 76857917, 78695631, 76088599, 69670124, 61754488, 54169642, 47572344, 42103349, 37676411, 34101770, 31056231, 28564994, 26344243, 24378945, 22593316, 21034341, 19674799, 18591180, 17693026, 16871069, 16092263, 15359746, 14615030, 13880616, 13244251, 12729205, 12317277, 11939509, 11609762]
5843A1609762l35162m23000l33914l54657l83733k96597k85558j87423j95442
5834H814276k28267k17520j43335k63171k43382j76261j54931j09357q8059j49855
5824G040138j07253j17326j39921j33111j43898J7007j6802j03523n5834j47470
5814F092007j91952j93496j19529k0642p8896l1813k4542m1309m9435m4515r8952
5803E196926m2226l4931j36392k1930P6842K7450k4868k610p1993j07243l4323
5792D824702K8334J1556k9784n7330o2840M5001Q3635m6974m9738m5156l7993
5781D663413N2079N0524k5883K2418P420j641k2592L2995K1044o01J12916K5930
5769D938022k0327k9455l698J8512L0723J00143J51834J27945O0685J5411R5825
$$ y = [11609762, 11274600, 10851600, 10517686, 10163029, 9779296, 9482699, 9197141, 9009718, 8814276, 8586009, 8368489, 8225154, 7961983, 7718601, 7542340, 7387409, 7278052, 7189993, 7040138, 6932885, 6815559, 6675638, 6542527, 6398629, 6415636, 6398834, 6295311, 6239477, 6092007, 5900055, 5706559, 5587030, 5566388, 5487492, 5455679, 5431137, 5389828, 5340393, 5295878, 5196926, 5154700, 5119769, 4983377, 4961447, 5038289, 5065739, 5040871, 5038261, 4966268, 4859025, 4824702, 4853036, 4864592, 4834808, 4777478, 4714638, 4759639, 4843274, 4796300, 4746562, 4701406, 4663413, 4715492, 4766016, 4740133, 4762551, 4769971, 4768330, 4745738, 4778733, 4799777, 4799176, 4912092, 4938022, 4917695, 4888240, 4884542, 4903054, 4933777, 5033920, 5185754, 5313699, 5374384, 5389795, 5485620]
5758E485620L0427J7007J19548R6362O0840J0606J09470L0049J6486Q9960O6160
5747F132535J31638M6618J39213J54342J45657J23012Q7381J36750Q6133J09154
5737G292433K34317J80070J99136K14518J20333K29940K11899J17324J99915K99979
5727I299864J87264J32388K33780K83289K83338K04359K71812L15863L50550L11550
5717A1874057L75460M10054L20321L33757L19769L60262M14386M67948L82253
5708A5258267M50538M58766M42456M51813M42008M97841M97559M94034O33759
5699A9627041O47681O10887O09098N95177P19027P28304P62216Q18934R14286
5690B6032651R88370R15251R21465J071200R89992R43786J087204J158382J254325
$$ y = [5485620, 5516047, 5533054, 5652602, 5748964, 5809804, 5820410, 5929880, 5959929, 5976415, 6066375, 6132535, 6264173, 6310791, 6450004, 6604346, 6750003, 6873015, 6960396, 7097146, 7183279, 7292433, 7526750, 7706820, 7905956, 8120474, 8240807, 8470747, 8682646, 8799970, 8999885, 9299864, 9487128, 9619516, 9853296, 10136585, 10419923, 10624282, 10896094, 11211957, 11562507, 11874057, 12249517, 12659571, 12979892, 13313649, 13633418, 13993680, 14408066, 14876014, 15258267, 15708805, 16167571, 16610027, 17061840, 17503848, 18001689, 18499248, 18993282, 19627041, 20274722, 20885609, 21494707, 22089884, 22808911, 23537215, 24299431, 25118365, 26032651, 27021021, 27936272, 28857737, 29928937, 30918929, 31862715, 32949919, 34108301, 35362626]
5681C5362626J342545J460571J466233J658085J766602J936040K258439K570402
5673D9821543K916065L506789M063620M796108N396346N697041N093749L042143
5665H4333404R9957k476380l841115m038672l609044l010481k407699j720008
5657F3329962j041691n16711l7207M03143P07799J074235J520690K079402K793587
5648G0313209L560989M751455O155115P623981Q869629R275955P558129L252674
5640A21361136k829177p796650r997820r979534q802012p528922o220779n020778
5632F3185464m032815l212681k595490k056311j617892j170376p68081k40638
5624D7491180J88979O62458J099372J756246K251603K685005K799487K161501
$$ y = [35362626, 36705171, 38165742, 39631975, 41290060, 43056662, 44992702, 47251141, 49821543, 52737608, 56244397, 60308017, 65104125, 70500471, 76197512, 81291261, 84333404, 84433361, 81956981, 78115866, 74077194, 70468150, 67457669, 65049970, 63329962, 62288271, 61771560, 61734353, 62137496, 62845295, 63919530, 65440220, 67519622, 70313209, 73874198, 78625653, 84780768, 92404749, 101274378, 110550333, 118108462, 121361136, 118531959, 110735309, 100737489, 90757955, 81955943, 74427021, 68206242, 63185464, 59152649, 55939968, 53344478, 51288167, 49670275, 48499899, 47731818, 47491180, 47680159, 48342617, 49441989, 51198235, 53449838, 56134843, 58934330, 61095831]
5616F1095831O10107j775756l994008n106222n007325m571730m004903l487197
5608C3758797k943476k391660j969837j728271j473336j194512j105981q69892
5600B0081832p54864n55550l85597l66652m11513n53815n32346p31765p73401
5591A5016329o81639n77439n27442l88365l98574l86699k58512l31749k77091
5582A1188819k95396k21066j74301j87984m4811q3725k4812o9674n7724J7240
5572A0046566m8662n145M0679L5685m5390q4787j59095j91818k34387j55095j75162
5561I023389m9862j07114j08747K8211M3714M1669J2906P3107R5491J63863Q9773
5550I306400N7737N3832J432r0322k7763q7646O407L0449K9786K36K7605N0438
$$ y = [61095831, 61705938, 59930182, 55936174, 50829952, 45822627, 41250897, 37245994, 33758797, 30815321, 28423661, 26453824, 24725553, 23252217, 22057705, 20951724, 20081832, 19326968, 18771418, 18385821, 18019169, 17607656, 17053841, 16521495, 15789730, 15016329, 14334690, 13757251, 13229809, 12841444, 12442870, 12056171, 11797659, 11465910, 11188819, 10893423, 10672357, 10498056, 10310072, 10265261, 10181536, 10156724, 10087050, 10029326, 10046566, 9997904, 9992759, 10033438, 10069123, 10023733, 9938946, 9779851, 9588033, 9353646, 9198551, 9023389, 8973527, 8866413, 8757666, 8785877, 8829591, 8871260, 8884166, 8957273, 9052764, 9216627, 9306400, 9364137, 9417969, 9419401, 9329079, 9301316, 9213670, 9220077, 9250526, 9280312, 9280548, 9308153, 9358591]
5538I358591O1468N2734j7195M5280Q8985J46143J11146K20539K15604J40736
5528A0424031J13817K03834J57018J63520K03654J75924J73847J20946P0346K4913
5518A1831850R7004J49842J10462K09810K04281K14925L44256L09093L53119L30307
5508A4154949L28478L42312M70891N25938L89871M88616M05558K97482M19388
5499A7823483K75964L21205M16340M59807M82861O04876P78483Q43921J012292
5490B3019232J139841J290697J590102J789139J721356J444015R35701K20041
5482C3150124m91139p94668q24870p20779n62217m01950m30499m11421k84847
5473B8227734k90291q9465k0347M1911K47367M69656O33422Q94204J176081J498628
$$ y = [9358591, 9420059, 9472793, 9455598, 9500878, 9589863, 9736006, 9847152, 10067691, 10283295, 10424031, 10537848, 10741682, 10898700, 11062220, 11265874, 11441798, 11615645, 11736591, 11806937, 11831850, 11928854, 12078696, 12189158, 12398968, 12603249, 12818174, 13162430, 13471523, 13824642, 14154949, 14483427, 14825739, 15296630, 15822568, 16212439, 16701055, 17106613, 17404095, 17823483, 18099447, 18420652, 18836992, 19296799, 19779660, 20384536, 21163019, 22006940, 23019232, 24159073, 25449770, 27039872, 28829011, 30550367, 31994382, 32930083, 33150124, 32658985, 31864317, 31039447, 30318668, 29756451, 29354501, 28924002, 28512581, 28227734, 27937443, 27847978, 27827631, 27869542, 28116909, 28586565, 29219987, 30114191, 31290272, 32788900]
5463C2788900J931689K419801K780378K886865K293256Q25920r70361k371771
5455D2584677k935252l011912k728766k273177j932319j598198j393003j166948
5447B5545102r19573q27160o33926o01692m01442k23130o4751N2965K65981M05116
5437B2597490M79969O57728Q17256Q08146N28228Q7016l93570r73881j300455
5428B3307927j386842j303639j165066j019893q01106o92373n17348l68468m07777
5419A5645415l21575j37146j85605k01661k8826J7728l734q13N7413J10151J19246
5408A5070593J74737J80260J41938J64763K20834K63230K44639L17392L12596
5399A7090982K22441L91075L21792L86430M24477M35543L79949N03590N40877
$$ y = [32788900, 34720589, 37140390, 39920768, 42807633, 45100889, 45926809, 44956448, 42584677, 39649425, 36637513, 33908747, 31635570, 29703251, 28105053, 26712050, 25545102, 24625529, 23798369, 23164443, 22562751, 22161309, 21938179, 21873428, 21926393, 22192374, 22597490, 23077459, 23735187, 24552443, 25360589, 25888817, 25975833, 25582263, 24608382, 23307927, 21921085, 20617446, 19452380, 18432487, 17631381, 16939008, 16421660, 16053192, 15645415, 15323840, 15186694, 15001089, 14799428, 14770602, 14788330, 14784596, 14783783, 14841196, 14951347, 15070593, 15245330, 15425590, 15567528, 15732291, 15953125, 16216355, 16460994, 16778386, 17090982, 17313423, 17704498, 18026290, 18412720, 18837197, 19272740, 19652689, 20156279, 20697156]
5390B0697156N09226M98878N42288O38574O08202O65833P55323P78764O56270
5381B6350514O91180P25858P03336P56323P99548Q81628R25763R97009R80626
5372C3811785J078227J202628J268556J386071J373513J531454J807818J949194
5364D5409246K085104K259821K413059K668123K988540L513103M386301N359354
5356G1082651O426483P063899O767238M333039L2324l408093m729254m210896
5348H3357391k953680j518237j28803J275630K487724L121985K283847N6598j819670
5339H6162785j903724o14600R98548K523111L656398L685363K051331q30902l448357
5330I2279953m479934l860412k446422r86912l6555n47129k545604m258949m359850
$$ y = [20697156, 21206382, 21705260, 22247548, 22886122, 23494324, 24160157, 24915480, 25694244, 26350514, 27041694, 27767552, 28470888, 29227211, 30026759, 30908387, 31834150, 32831159, 33811785, 34890012, 36092640, 37361196, 38747267, 40120780, 41652234, 43460052, 45409246, 47494350, 49754171, 52167230, 54835353, 57823893, 61336996, 65723297, 71082651, 77509134, 84573033, 91340271, 95673310, 95705634, 92297541, 87568287, 83357391, 80403711, 78885474, 78756671, 80032301, 82520025, 85642010, 87925857, 87982455, 86162785, 84259061, 83644461, 84643009, 87166120, 90822518, 94507881, 96559212, 95728310, 92279953, 87800019, 83939607, 81493185, 80506273, 80469718, 79922589, 77376985, 73118036, 68758186]
5321F8758186l504548k493553j361874M4235J467972K496058L146356K545172
5313G1098004k2831l875289o430282o808367o244252n282523m302889l497986
5305C4633585k889401k434963k135709j871938j793319j592915j408010j135965
5297A9371365r51765q82606p86138p87345p33922o42905o35956n70589n41665
5288A2838474l88207l69020l94607m13792l91707m32430l80976k27838j72388
5279I667509j56462k37570k13862k18275k69366l61314j49467j60218q6599p7604
5269G736772o0519j13551j87702j38461j37848j54022j31793l7472l3745m4144
5259F697515k7939l8715j18613j21906n0607j4114l9564q097K5309k3193n4529
$$ y = [68758186, 65253638, 62760085, 61398211, 61442446, 62910418, 65406476, 68552832, 71098004, 71075173, 67199884, 60769602, 53961235, 47716983, 42434460, 38131571, 34633585, 31744184, 29309221, 27173512, 25301574, 23508255, 21915340, 20507330, 19371365, 18419600, 17536994, 16750856, 15963511, 15229589, 14586684, 13950728, 13380139, 12838474, 12450267, 12081247, 11686640, 11272848, 10881141, 10448711, 10067735, 9839897, 9667509, 9511047, 9273477, 9059615, 8841340, 8571974, 8210660, 8061193, 7900975, 7814376, 7736772, 7676253, 7562702, 7375000, 7236539, 7098691, 6944669, 6812876, 6775404, 6741659, 6697515, 6669576, 6630861, 6512248, 6390342, 6339735, 6325621, 6286057, 6277960, 6303269, 6280076, 6225547]
5248F225547r7340n6467J2354J2436L3441M9920N1253q0295j4369O5408l8367
5237F163521J1903J27021J09135J06106J14385N620m1025J9796J315Q2551J53772
5226F854100K35022J13582J89751J46094J31061J96538J44682J72232K61424K57819
5216H702305J67926K77780K26599O7043j6896q3184j06669r1599k6005L5826P775
5205I160901N9204K5556o2949k28443k10688k35553j30271r4127p0785p7670j98853
5194G936322j44449j26831j04127j44468m8977J1561K1593J05791O1822Q3600
5184G651837K03038J86445K41288K98709K79859K70156K75027L87452M26392N51201
5174A0771404N26164M27056Q3934n65405q72318q55719q28192p51961n20424m50985
$$ y = [6225547, 6128207, 6071740, 6084094, 6096530, 6129971, 6179891, 6231144, 6150849, 6136480, 6201888, 6163521, 6175424, 6302445, 6411580, 6517686, 6632071, 6637691, 6596666, 6616462, 6617777, 6700328, 6854100, 7089122, 7202704, 7392455, 7538549, 7669610, 7866148, 8010830, 8183062, 8444486, 8702305, 8870231, 9148011, 9374610, 9441653, 9424757, 9341573, 9234904, 9143305, 9117300, 9153126, 9160901, 9220105, 9245661, 9182712, 8954269, 8743581, 8508028, 8377757, 8283630, 8212845, 8135175, 7936322, 7791873, 7665042, 7560915, 7416447, 7367470, 7379031, 7400624, 7506415, 7568237, 7651837, 7854875, 8041320, 8282608, 8581317, 8861176, 9131332, 9406359, 9793811, 10220203, 10771404, 11297568, 11724624, 11808558, 11243153, 10370835, 9515116, 8686924, 7934963, 7414539, 6963554]
5164F963554l63045k80048r2153j27901j23473j25989j45231j18585p2904M3379
5154E557604J12960J34659J71689K60332L54232L68635K66513J89320j03627m37779
5144F874538n66825m33443m81693l55066l48051k88962q9467j52988j88402o2115
5134C907526l4031p1191o2029j00924l9970J8535P263L1375Q5672L4775R3958
5123C870959J20286O5472J56137J90003L04157M77656M85503M13906K73041L6972
5113F394092l66677n24038n66951n34206l83687l03931k89948j75650k15847j78368
5103B854789j57899j44299r0312O7580L3892q8924j38831m1208L8544q4484j4997
5092B233851m021K7770O3148J02037J40335J17007O8759M4534P9241K24231Q7617
$$ y = [6963554, 6600509, 6320461, 6228308, 6100407, 5976934, 5850945, 5705714, 5587129, 5514225, 5557604, 5670564, 5805223, 5976912, 6237244, 6591476, 6960111, 7226624, 7415944, 7312317, 6874538, 6307713, 5874270, 5392577, 5037511, 4689460, 4400498, 4311031, 4158043, 3969641, 3907526, 3873495, 3802304, 3740275, 3639351, 3599381, 3617916, 3625179, 3656554, 3742226, 3777001, 3870959, 3991245, 4056717, 4212854, 4402857, 4707014, 5184670, 5670173, 6084079, 6357120, 6394092, 6027415, 5503377, 4936426, 4402220, 4018533, 3714602, 3424654, 3249004, 3033157, 2854789, 2696890, 2552591, 2462279, 2529859, 2563751, 2474827, 2335996, 2294788, 2333332, 2248848, 2233851, 2229830, 2257600, 2320748, 2422785, 2563120, 2680127, 2748886, 2793420, 2872661, 3096892, 3184509]
5081C184509j6633o1358j50575j96552k61905j96211j13812j35334o2651j6846
5071A972632q5837r1660q3517r6635l2014k6452l2106M5014M0101l1734r763k1771
5059A546258K119l6471j2585O0679m8325L2758Q3422O7117J1794J9634J8734M4578
5047A789712N0508J9308L3662k647m7166n4996j76447j19252L6758K5607J03970
5036A659017p9958L1624k0657m5911p3491L4325j8633n6260P6934J22329j8961
5025A610358l4937k9162o6742P18M2648M7265L6549L6100P8761J4398n2144M0632
5013A724444k0946o8919J7286O7823J6026n720K7519k7732j75358j19232j35120
5002A300071j0249l2145L5286K4984m0653l4578m3634l5924l4601k7713J2949
$$ y = [3184509, 3167876, 3106518, 2955943, 2759391, 2497486, 2301275, 2187463, 2052129, 1989478, 1972632, 1886795, 1795135, 1711618, 1614983, 1582969, 1556517, 1524411, 1569425, 1609526, 1577792, 1568029, 1546258, 1548377, 1511906, 1499321, 1560000, 1511675, 1544433, 1627855, 1694972, 1706766, 1726400, 1745134, 1789712, 1840220, 1859528, 1893190, 1890543, 1843377, 1788381, 1611934, 1492682, 1529440, 1555047, 1659017, 1579059, 1610683, 1590026, 1544115, 1470624, 1504949, 1486316, 1430056, 1506990, 1629319, 1610358, 1575421, 1546259, 1479517, 1480235, 1522883, 1570148, 1606697, 1642797, 1721558, 1735956, 1683812, 1724444, 1703498, 1634579, 1651865, 1719688, 1735714, 1729994, 1757513, 1729781, 1554423, 1435191, 1300071, 1289822, 1257677, 1292963, 1317947, 1277294, 1242716, 1199082, 1163158, 1128557, 1100844, 1113793]
4991A113793O5981L5185o624l1378n7068o0900m0987k1799k65j6487M2478K9965
4979A051894r6312m9735k2667k122P5497K1618L0253J03814q9053j6523j26656
4968H80008m6176K3702O7041Q4532k8217j3823L903o2498j2655P100O5079j7493
4956I50503k0331J19591M1453j2889q0695j7248k5799O290N9769K5472O8603O3773
4944A178492Q6457j6983q4956L5944O5490N5188L3903O7264P4854o426Q8253R7898
4932A675378M948K5889J35684J66849K18475K54277K88294L82357M81385M48752
4922D082288K9865l94801m96960l92422k31320k80710j92217j29624j14922m4040
4912A835137o4935l8604j64045r4880j25890j1219q6518o2857k5153J5661K9789
$$ y = [1113793, 1179774, 1214959, 1208335, 1176957, 1119889, 1058989, 1018002, 996203, 995938, 979451, 1021929, 1051894, 955582, 905847, 883180, 881058, 956555, 978173, 1008426, 1112240, 1023187, 1006664, 880008, 833832, 857534, 924575, 1009107, 980890, 967067, 970970, 908472, 895817, 902917, 967996, 950503, 930172, 1049763, 1091216, 1078327, 997632, 980384, 954585, 960875, 1020644, 1046116, 1114719, 1178492, 1264949, 1247966, 1163010, 1198954, 1264444, 1319632, 1353535, 1420799, 1495653, 1489227, 1577480, 1675378, 1680326, 1706215, 1841899, 2008748, 2227223, 2481500, 2769794, 3152151, 3633536, 4082288, 4112153, 3717352, 3220392, 2827970, 2596650, 2315940, 2123723, 1994099, 1879177, 1835137, 1770202, 1731598, 1567553, 1472673, 1346783, 1335564, 1249046, 1186189, 1161036, 1176697, 1206486]
4901A206486P0077K4596O2361O7517l5573p7097o6268j34606m6656m1806o260
4890A022771N5102o8174o1154k2392m4196L6955m0216J267O8116K7889o3630n8128
4878H54210L5889m2908N5253N0092M9406k4322j3840l3844K5891L4672N8114K1480
4866A070093M0590K2910K3148K3962l4292M3501M3705n2030j9122M0260K9419
4855A232144N3195N9786L5457J6136K9809n118O3313j740l8972m9279M7844P6763
4843A519338j6814p2163k3451N5567J27945J42974K21335K38740J81251J76944
4833B551666J66629m697k52537k33296k06208j53881k29339j53537r7529j24454
4823A262817l8537J083O3907r2478L1199K0578p7737j7358j4055l6606p0893Q1359
$$ y = [1206486, 1276563, 1301159, 1363520, 1431037, 1395464, 1318367, 1252099, 1117493, 1070837, 1029031, 1022771, 1077873, 1009699, 948545, 926153, 881957, 918912, 878696, 879963, 948079, 975968, 912338, 854210, 890099, 847191, 902444, 952536, 1001942, 977620, 963780, 929936, 955827, 990499, 1048613, 1070093, 1110683, 1133593, 1156741, 1180703, 1146411, 1189912, 1233617, 1181587, 1162465, 1202725, 1232144, 1285339, 1345125, 1380582, 1396718, 1426527, 1421409, 1484722, 1482982, 1444010, 1394731, 1442575, 1519338, 1502524, 1430361, 1406910, 1462477, 1590422, 1733396, 1954731, 2193471, 2374722, 2551666, 2718295, 2713598, 2461061, 2227765, 2021557, 1867676, 1638337, 1484800, 1387271, 1262817, 1224280, 1225363, 1289270, 1196792, 1227991, 1248569, 1170832, 1153474, 1139419, 1102813, 1031920, 1113279]
4811A113279K5251L654k7306l7941j371l3019M4300J25429l0424l6255M2468O6738
4799A254803j7043k2410k6301l5996M6787J4951L3442J8068J587j0108o0096l6376
4787A161308j5729J9219N5478N3799P9593N6195N8353P908J0526L6491J332O4938
4775A589411J12657J7707j2576o041p4239L606j1968j4784P3032J33573N2879
4764A863257k945K9630N641o728P2850P7171M3823J12002Q8212j9654J5612j229
4752B277642j7485M5027L717R0430J79118R0259N0679P1170J7548Q8271K4829
4741B921205J49372J49898J11722J22903N1522o602m3081O1986J14122K15753
4731C848800J78192K30080J95983Q9425L4716K7181k3878P7098J11774J53084
$$ y = [1113279, 1138530, 1142184, 1114878, 1076937, 1075566, 1042547, 1086847, 1212276, 1181852, 1145597, 1188065, 1254803, 1237760, 1215350, 1189049, 1153053, 1199840, 1214791, 1248233, 1266301, 1267888, 1257780, 1197684, 1161308, 1145579, 1164798, 1220276, 1274075, 1353668, 1409863, 1468216, 1476124, 1486650, 1523141, 1524473, 1589411, 1702068, 1719775, 1707199, 1701158, 1626919, 1630525, 1618557, 1603773, 1676805, 1810378, 1863257, 1860312, 1889942, 1895583, 1888855, 1961705, 2038876, 2082699, 2194701, 2282913, 2263259, 2278871, 2277642, 2260157, 2305184, 2308901, 2399331, 2578449, 2668708, 2719387, 2790557, 2808105, 2896376, 2921205, 3070577, 3220475, 3332197, 3455100, 3506622, 3500020, 3456939, 3518925, 3633047, 3848800, 4026992, 4257072, 4453055, 4542480, 4577196, 4604377, 4580499, 4657597, 4769371, 4922455]
4721D922455J88757L21274K19294K44391K83690M60618O46169P93649J128356
4712I208653J280426J054571Q32870O68624l70032j451840j672919j366486j007126
4703G176741p89084n95169n12934m58042l36126l48500l45127j63052j36639n6034
4693C436034o061j13055j23560j18289q2209j17805l4564l2801M4393L3557p2259
4682B813381M029o4327q5989k990J0280N4577j0207m010j8210P9524O1552l4307
4670B803303n0182j3983O063M1149Q7107n5169l3176n6689r8832m429p3538P6593
4658B628217J14426J25562R9752J11336N2264P3661L0834M3776M7472M6307J2844
4647C386451l0922p9464o2081j12517O612P0248J31041J96745O9624P4265Q6757
$$ y = [4922455, 5111212, 5432486, 5651780, 5896171, 6179861, 6640479, 7286648, 8080297, 9208653, 10489079, 11543650, 12376520, 13045144, 12675112, 11223272, 9550353, 8183867, 7176741, 6387657, 5792488, 5279554, 4821512, 4485386, 4136886, 3791759, 3628707, 3492068, 3436034, 3429973, 3316918, 3193358, 3075069, 2992860, 2875055, 2840491, 2807690, 2852083, 2885640, 2813381, 2817410, 2753083, 2667094, 2664104, 2674384, 2728961, 2718754, 2714744, 2696534, 2776058, 2837610, 2803303, 2753121, 2739138, 2745201, 2786350, 2873457, 2818288, 2785112, 2728423, 2629591, 2625162, 2551624, 2628217, 2742643, 2868205, 2967957, 3079293, 3131557, 3205218, 3236052, 3279828, 3327300, 3373607, 3386451, 3355529, 3276065, 3213984, 3101467, 3108079, 3178327, 3309368, 3506113, 3575737, 3650002, 3736759]
4636C736759p378k6558J53227J48314J90104J49936J99623J59765N0700p125R3961
4625D841328J35637J11131J34333J68044K25704J57985J39631O3566J28994J40148
4615F246501K00384L13803L96894L65043K88855K42749J28588O5088K15234K77856
4605H740995K88877L49384K76544K95481K19067K74703K93939L55027M17492O43080
4595A2154589O29311M36129L98514K92178L50694L67341L44626M39217N54399
4586A5966998N79653N35538N15903L98038L59463L79914M81091O03584O36366
4577B0456548Q02767P44162O81476N79334N65237O02745Q17255R61177J082494
4568B7293195J209462J248856R73224R05343Q63393R15805R82719J171796J420538
$$ y = [3736759, 3729381, 3702823, 3856050, 4004364, 4194468, 4344404, 4544027, 4703792, 4754492, 4747367, 4841328, 4976965, 5088096, 5222429, 5390473, 5616177, 5774162, 5913793, 5977359, 6106353, 6246501, 6446885, 6760688, 7157582, 7522625, 7811480, 8054229, 8182817, 8247905, 8463139, 8740995, 9029872, 9379256, 9655800, 9951281, 10170348, 10445051, 10738990, 11094017, 11511509, 12154589, 12783900, 13220029, 13618543, 13910721, 14261415, 14628756, 14973382, 15412599, 15966998, 16546651, 17082189, 17598092, 17996130, 18355593, 18735507, 19216598, 19820182, 20456548, 21259315, 22003477, 22684953, 23264287, 23829524, 24432269, 25249524, 26210701, 27293195, 28502657, 29751513, 30724737, 31630080, 32493473, 33409278, 34391997, 35563793, 36984331]
4559C6984331J297564J310819J331375J322629J156254J272501J373649J627511
4551D7676633J826709K031647J995111J929274J818085J956805K005608K230531
4543F3470403K531431K806326L026313L068712K924289K984025L061104L417785
4535H7290388L934427M508411N158412N437220N611179N963235O345227P431911
4527A31680410R043432J1145006J4465827K0529523K8941012L7646873M4901096
4520B98353179N1526906L1742831j9730569n2735724n3489612m3980714l4672874
4513A77013423k7272628k1488390j6804487j2791979j0157341q862942q021743
4506G1613913p284786o278291n218121m178584l203932k534582k365194k313911
$$ y = [36984331, 38281895, 39592714, 40924089, 42246718, 43402972, 44675473, 46049122, 47676633, 49503342, 51534989, 53530100, 55459374, 57277459, 59234264, 61239872, 63470403, 66001834, 68808160, 71834473, 74903185, 77827474, 80811499, 83872603, 87290388, 91224815, 95733226, 100891638, 106328858, 111940037, 117903272, 124248499, 131680410, 140723842, 151868848, 166334675, 186864198, 215805210, 253452083, 298353179, 349880085, 381622916, 361892347, 309156623, 255667011, 211686297, 177013423, 149740795, 128252405, 111447918, 98655939, 88498598, 79635656, 71613913, 64329127, 58050836, 52832715, 48654131, 45450199, 42915617, 40550423, 38236512]
4498C8236512k506874k534149k347323j994176j660932j294782j003642r63456
4490B3931178q16566j017428j207694j214643j102724q69593o51252l81922l85280
4481A6284076m54750n91450o60887o82167n75337n20270l05360j96904j82736
4472A2114215k91912m00675m42455m46536m73756l33212k00927j23369j16010
4463I285363j44638l26700k59986m23237l72899k43664j41339j39353p9821j27196
4453G026530j86925j96731l70753k45757l8602q0117m2307j9376j19470j83330
4443E543162j82839k89089k97696q6495j28299j06670j14919p7628j35072j90685
4433C933770j60171j48461j32363J0783l9595J4764k120q0683j29491r1656j13204
$$ y = [38236512, 35729638, 33195489, 30848166, 28853990, 27193058, 25898276, 24894634, 23931178, 23114612, 22097184, 20889490, 19674847, 18572123, 17702530, 17051278, 16669356, 16284076, 15829326, 15237876, 14576989, 13894822, 13319485, 12799215, 12493855, 12296951, 12114215, 11822303, 11421628, 10979173, 10532637, 10058881, 9725669, 9524742, 9401373, 9285363, 9140725, 8814025, 8554039, 8130802, 7757903, 7514239, 7372900, 7233547, 7153726, 7026530, 6839605, 6642874, 6272121, 6026364, 5987762, 5907645, 5865338, 5845962, 5726492, 5543162, 5360323, 5071234, 4773538, 4687043, 4558744, 4452074, 4337155, 4259527, 4124455, 3933770, 3773599, 3625138, 3492775, 3503558, 3463963, 3478727, 3476607, 3395924, 3266433, 3174777, 3061573]
4422C061573r5025j11299M7679M461J4136p5549j56279j59489j38490m8238L019
4411B346499P5403Q6837l5184l7529p2712l1538J8870p033J80158M0204l244p003
4399B553728j04242r4692p7040j16270j29740K6179n5795L8547P997l9984p9005
4388A929683j30978l5382L5992P5842L7631J07384P6903j6753r2821j35015n1034
4377A801452n5720q8861j9217K486o0981r7419n1909j82428L3301R3443l2933
4366A341214K9930J5557M3833K7748m7384n9051j00674k7944K9635O4193n422
4355A311635o0192o849l7169J4204r504j29867M7195N6163L2261l0497o5535m3501
4343A078344o7018L5936m8923p0708n1075J21739L6389m7421j2601m7534n6939
$$ y = [3061573, 2966548, 2855249, 2902928, 2907389, 2921525, 2845976, 2689697, 2530208, 2391718, 2343480, 2346499, 2421902, 2508739, 2473555, 2436026, 2363314, 2331776, 2350646, 2343613, 2523771, 2563975, 2560731, 2553728, 2449486, 2354794, 2277754, 2161484, 2031744, 2057923, 2002128, 2040675, 2048672, 2008688, 1929683, 1798705, 1763323, 1799315, 1875157, 1912788, 2020172, 2097075, 2080322, 1987501, 1852486, 1801452, 1745732, 1656871, 1637654, 1640140, 1579159, 1481740, 1429831, 1247403, 1280704, 1374147, 1341214, 1371144, 1386701, 1430534, 1458282, 1410898, 1351847, 1251173, 1223229, 1252864, 1317057, 1311635, 1251443, 1244594, 1207425, 1221629, 1212125, 1082258, 1129453, 1185616, 1217877, 1187380, 1121845, 1078344, 1011326, 1047262, 998339, 927631, 876556, 998295, 1034684, 987263, 974662, 927128, 870189]
4332H70189l2710R80J5978O8078N9343j8886p5301p0298p9262J829Q6077P2237
4320H98254P3929l1950p7159q9383M89o5477m2728K6888O791O9220J4343k6389
4308G56828o1716j36637R621J7554M6343Q4285p202L1391L842Q378K9571j19014
4296F63244p162P8323P2985K8936k6050r490o6083p6848n2208J2163M1156R9882
4284G58848J2798J5207j00933l7696K3573L54J52K4215R6321P2074M662n2558
4272H17017m6193k950l616q019J1688J33728R1266l9833J3462m9440k5434o8140
4260H23536m1988K9690L6562K207j258K7778n7368Q169n0417r9188O041Q7537
4248G71301N4670K4705l0840n8325q5304j3044K4177P3202j166M6292j625l1806
$$ y = [870189, 837479, 838459, 854437, 922515, 981858, 962972, 887671, 817373, 738111, 739940, 826017, 898254, 972183, 940233, 863074, 773691, 774180, 708703, 665975, 692863, 699654, 768874, 783217, 756828, 695112, 558475, 568096, 585650, 631993, 716278, 709076, 740467, 744309, 752687, 782258, 663244, 656082, 734405, 807390, 836326, 810276, 800786, 734703, 657855, 605647, 617810, 658966, 758848, 771646, 786853, 685920, 648224, 671797, 672151, 672303, 696518, 792839, 864913, 869575, 817017, 770824, 767874, 764258, 756239, 767927, 901655, 992921, 953088, 966550, 917110, 891676, 823536, 781548, 811238, 847800, 850007, 848749, 876527, 819159, 827328, 776911, 677723, 683764, 771301, 825971, 850676, 819836, 761511, 676207, 663163, 687340, 760542, 759376, 805668, 804043, 772237]
4236G72237L5158Q605O5798O5833k8211L1459n6448M0766L4305m3666m202J5927
4224I37561k8313N2942Q4995O4339O9992J2475N2503n0187P3738P9378K4204L2782
4212A406409J31495R0491N6983l2033L4532N0588J35716J80702J96759K86398
4202B538040L48797J2939l20958l01492l04973j73497j96374o7747N5796n9112
4192A531419l3314n0514n8144o1626l0722M4210j1386M7072L0073L1259J116J3779
4180A453222j0955M4865n0697N3231M9624m292Q5128K1541P9238L9263P6191L3638
4168A869997J1623J0727J46281J26788J0254O3955O7358J09174J65820R6963J65708
4157B844648J11667P076J01037J10535J19698J66829K72438L63121N63352Q25760
$$ y = [772237, 807395, 816000, 881798, 947631, 919420, 950879, 894431, 935197, 969502, 925836, 921634, 937561, 909248, 962190, 1047185, 1111524, 1181516, 1193991, 1246494, 1196307, 1270045, 1349423, 1373627, 1406409, 1537904, 1628395, 1685378, 1653345, 1687877, 1738465, 1874181, 2054883, 2251642, 2538040, 2886837, 2899776, 2578818, 2277326, 1972353, 1798856, 1602482, 1534735, 1590531, 1531419, 1498105, 1447591, 1389447, 1327821, 1297099, 1341309, 1329923, 1376995, 1407068, 1438327, 1439443, 1453222, 1442267, 1487132, 1436435, 1489666, 1539290, 1534998, 1620126, 1641667, 1720905, 1760168, 1836359, 1869997, 1881620, 1892347, 2038628, 2165416, 2175670, 2239625, 2306983, 2416157, 2581977, 2678940, 2844648, 2956315, 2963391, 3064428, 3174963, 3294661, 3461490, 3733928, 4097049, 4660401, 5486161]
4147E486161R82794J212674J407141M47515j156342j493425j275301r51995p57415
4138C901807n80401m82742l97009j46303k00514k12876j48355j34574k2666k02041
4128A374326j00437m8407j49027m9099j9501o9381M091p3292m4142N693l8549
4117G92275q0802m6609k9023K431j2012J052k3954k9836m8489r2918J9164k3993
4105D27286O707l7882M4059J2027K058o542n0513k7472M5611M410n211j1522l390
4092C99626n7846N77m3459o330N3706R333q051K3915j3264J9570R75j022p2639
4079C05091r554Q199L7900l1377j9663L5392j01711N6612L8409m6964K9335P74
4067C02443l2091L242q865K4725q382P378j1542k6294M8534l3524J0059M5978
$$ y = [5486161, 6468955, 7681629, 9088770, 9536285, 8379943, 6886518, 5611217, 4659222, 3901807, 3321406, 2838664, 2441655, 2295352, 2094838, 1881962, 1733607, 1599033, 1576367, 1374326, 1273889, 1225482, 1076455, 1027356, 1007855, 938474, 942565, 869273, 825131, 830824, 792275, 711473, 664864, 635841, 638272, 626260, 627312, 603358, 573522, 525033, 432115, 451279, 427286, 433993, 396111, 440170, 452197, 454255, 447713, 397200, 369728, 415339, 419749, 414538, 403016, 399626, 341780, 342357, 298898, 292568, 346274, 355607, 347556, 371471, 358207, 377777, 378752, 377730, 305091, 295537, 303736, 341636, 310259, 290596, 325988, 224277, 280889, 319298, 272334, 301669, 302443, 270352, 273594, 264729, 289454, 281072, 288450, 276908, 250614, 299148, 265624, 275683, 321661]
4055C21661m7354m6735j8250J8958L732O7067l8145k4286M4508p7456K6416O341
4043B36457K7063L5212n046m7223M038M2166r3296L0857j240j4224P1213M251
4031B90228n4325J7010K4717r094k3948k140P0217J4778m7825k5212P9256j5680
4019C17982n1025k0126o6773K7380M1330k531m9659M6829L2410J6110n3261k1645
4007B17021k0600L6181N0705j3998n7157n4j4407K1740L5291r767Q4292k2871
3995C06376k9790P881p831j572m3125m8010J0059N4296O1654j3529K5329l6906
3983B84832m6313M2985N1943J0955L9621k9157m1907N2482q1962j01004J2172
3972A94647K2786L1507M2588K9133R308k7944k1639q345L2782j3601K59q980L5486
$$ y = [321661, 274307, 227572, 209322, 228280, 232012, 299079, 260934, 236648, 281156, 203700, 230116, 236457, 263520, 298732, 293686, 246463, 250501, 292667, 199371, 230228, 228988, 214764, 285977, 290228, 235903, 252913, 277630, 268536, 244588, 242448, 312665, 327443, 279618, 254406, 333662, 317982, 266957, 246831, 180058, 207438, 248768, 246237, 196578, 243407, 275817, 291927, 238666, 217021, 196421, 232602, 283307, 269309, 212152, 212098, 197691, 219431, 254722, 244955, 329247, 306376, 276586, 284467, 276636, 275064, 231939, 183929, 193988, 248284, 309938, 296409, 321738, 284832, 238519, 281504, 333447, 344402, 384023, 354866, 312959, 365441, 283479, 182475, 194647, 217433, 248940, 291528, 320661, 329969, 302025, 280386, 272041, 304823, 291222, 291481, 282501, 317987]
3959C17987R222m3319K3559O9375r17j470n3666k9344M2926l061k0637N3508l3623
3946C30540n1009M6686R540L8155j1544j8565M8274l811k9361N2838l4748n4912
3934C22083k429K620J4662M8538l9423k7605j5834N7061m280N4023q1597l4093
3922B93726M8259J441J3810N43L283Q537K0946j9568q349M0037m1319J9052N9757
3909D40155q9592l4152K9560R1386P0414m4977p0488j7012O5724K6912M2216m6614
3897D63532j8643M5582j605o0789L6382K9274K1664N8894r572m4089l4520j9955
3885D66155K6187J1546J8086J2574o4722P1057N6297K0727j7379q956m2501O9353
3873F18424o4342K6422K6011N6933m9712o8289m7497L5868J1696R134K5299J8101
$$ y = [317987, 327209, 283890, 307449, 376824, 375907, 374437, 320771, 291427, 334353, 331292, 310655, 364163, 330540, 279531, 326217, 335757, 373912, 362368, 343803, 392077, 388266, 358905, 411743, 376995, 322083, 319654, 322274, 336936, 385474, 346051, 318446, 302612, 359673, 355393, 409416, 327819, 293726, 341985, 343426, 357236, 357779, 361062, 369599, 390545, 370977, 362628, 402665, 361346, 380398, 440155, 350563, 316411, 345971, 437357, 507771, 462794, 392306, 375294, 441018, 467930, 510146, 463532, 444889, 490471, 488866, 428077, 464459, 493733, 515397, 574291, 564719, 520630, 486110, 466155, 492342, 503888, 521974, 534548, 469826, 540883, 597180, 617907, 600528, 591572, 549071, 618424, 554082, 580504, 606515, 663448, 613736, 545447, 497950, 533818, 545514, 554648, 579947, 598048]
3861E98048O3559J515L2842J0014k0182K637R848k0671k1892J430l7791O5283
3849F84640O845p1857m9237J13243N8199n6236N7846l2494J4977l3024Q335m2578
3837F58659J7319N8494o635O2208L7800j7320j4517j2203o8120P140K5925K4736
3825G73486O5205q725K5426l9033M8961m2891m9507K5201J2594K8050J0505n63
3813H48709L921j236L6380K3057q4783M0001M2275l113j3484j0797j7022J3682
3801H77590m136k1175P8535n3460M2521k4224n8620N6712j9167L7923K1196M9789
3789I83484L1256J0084m965n0279K9000Q597l9085J6879L7933q929k4056j1440
3777I78479L6620N456m7543n2970O2520j6204L3065M5106m5003m113j0569L4760
$$ y = [598048, 661607, 663122, 695964, 705978, 685796, 688433, 698281, 677610, 655718, 657148, 619357, 684640, 691485, 619628, 570391, 683634, 741833, 685597, 743443, 710949, 725926, 692902, 701237, 658659, 675978, 734472, 727837, 790045, 827845, 810525, 796008, 783805, 715685, 722825, 748750, 773486, 838691, 829966, 855392, 816359, 865320, 822429, 772922, 798123, 810717, 838767, 849272, 848709, 852630, 851394, 887774, 910831, 826048, 866049, 908324, 905211, 891727, 880930, 863908, 877590, 873454, 852279, 930814, 877354, 919875, 895651, 837031, 893743, 874576, 912499, 933695, 983484, 1014740, 1024824, 1019859, 969580, 998580, 1007177, 968092, 984971, 1022904, 1013975, 989919, 978479, 1015099, 1020555, 973012, 920042, 982562, 966358, 999423, 1044529, 999526, 995413, 984844, 1019604]
3765A019604N1373m7848l9053P174L2076J17258j1258J403M2966k5668j0201l7553
3753A100273P2099J1135M132K7964j7584l6159p89Q2461N5214l5787J18082q379
3741A372662j05300M3254l5656O1889k1246m050J9261j61j8055L6411Q2011n34
3729A430486O0812L9598j7705K4884o042j56R98J17285l1827R3044N3790j8908
3717A746259R2636L1300L9262k0794j1031O2327Q2727K7510K9023K5626O2482
3706B167327k3412P3037N0413K7271J20924P5021O299m3832M1821P0378J2005
3695B577252M6455M3282J51598M5002J8120J16605J24938J72422J7074L4038P6638
3684C423424M5066J32307P0992J07787K28225J40935Q9546R9567J98285J93535
$$ y = [1019604, 1070977, 1023129, 984076, 991250, 1023326, 1140584, 1129326, 1130729, 1173695, 1148027, 1137826, 1100273, 1172372, 1183507, 1187639, 1215603, 1198019, 1161860, 1161071, 1243532, 1298746, 1262959, 1381041, 1372662, 1267362, 1310616, 1274960, 1336849, 1315603, 1311553, 1330814, 1330653, 1312598, 1349009, 1431020, 1430486, 1491298, 1530896, 1513191, 1538075, 1532033, 1531877, 1532875, 1650160, 1618333, 1711377, 1765167, 1746259, 1838895, 1870195, 1909457, 1888663, 1877632, 1939959, 2022686, 2050196, 2079219, 2104845, 2167327, 2143915, 2216952, 2267365, 2294636, 2415560, 2490581, 2496880, 2453048, 2494869, 2565247, 2577252, 2623707, 2666989, 2818587, 2863589, 2881709, 2998314, 3123252, 3295674, 3312748, 3346786, 3423424, 3468490, 3600797, 3671789, 3779576, 4007801, 4148736, 4238282, 4337849, 4536134, 4729669]
3674D729669J77241K16609K70978K49398K61439K64209K95552L74119M10121L57565
3664G606900K98849J20549P7590j26553l88719m49597m60346m17063m20759l75598
3654E465253l53447k82712k92729j52142j70206k44281k08653j69075j47295j01598
3644C343115j21678j55211l0564j28995n1321l4238j1240q8083o6852N1432k0936
3633B685429j09331k6001k5817k1967K0735K1964m8518m2353N675p7020m3097
3622B339699m5418N0382k4838o503k8945k9398K2017j3097o8606J0659o5439m0606
3610B099907m3594K2053k2801M3270J602l9960M9534K4653q584p3215j9989k0230
3598B012646Q954r674J9981o445L3917M108o99K7880l621j7746k5345O3638o7547
$$ y = [4729669, 4906910, 5123519, 5394497, 5643895, 5905334, 6169543, 6465095, 6839214, 7249335, 7606900, 7905749, 8026298, 8103888, 7977335, 7588616, 7139019, 6678673, 6261610, 5840851, 5465253, 5111806, 4829094, 4536365, 4384223, 4214017, 3969736, 3761083, 3592008, 3444713, 3343115, 3221437, 3066226, 3035662, 2906667, 2855346, 2821108, 2809868, 2721785, 2654933, 2706365, 2685429, 2576098, 2550097, 2524280, 2502313, 2523048, 2545012, 2496494, 2454141, 2459816, 2382796, 2339699, 2294281, 2344663, 2319825, 2313322, 2284377, 2254979, 2276996, 2263899, 2195293, 2205952, 2140513, 2099907, 2056313, 2078366, 2055565, 2098835, 2100437, 2060477, 2110011, 2134664, 2126080, 2052865, 2032876, 2012646, 2021600, 2011926, 2031907, 2025462, 2059379, 2063487, 2062788, 2090668, 2087047, 2069301, 2043956, 2107594, 2040047]
3585B040047J5593J5124q6571M8559k5795l0680n273K4343K8741R159K1334P366
3573B061947m2155r3331m1076L1488K4794N3741k991P739O515O1033K7826N687
3561B101217N2010k5420m5589N623N5998m122K5910O2799j7915l338m6173P8607
3549B239607k0188o5436N7317L8893n777j6281O497L9607m113J82R9187L1123
3537B400618P257j7319j2423R253N3958O7502L1178O324M898L7907Q2957K6309
3525B698419P055p928K6912J4296Q0767P9798M8622Q6801N411L7307N6325q371
3513C125414O5460L7032J17584J46055L6159R0391J6616M5423P5062O5422Q7312
3502C907930J21868J39126J00914J39279J49686K3819J04230R2284p1877l3506
$$ y = [2040047, 2055640, 2070764, 1984193, 2032752, 2006957, 1976277, 1971004, 1995347, 2024088, 2033247, 2054581, 2061947, 2019792, 1926461, 1885385, 1916873, 1941667, 1995408, 1992417, 2000156, 2006671, 2067704, 2095530, 2101217, 2153227, 2127807, 2082218, 2087841, 2143839, 2139717, 2165627, 2228426, 2210511, 2207173, 2161000, 2239607, 2219419, 2153983, 2211300, 2250193, 2244416, 2228135, 2234632, 2274239, 2270126, 2270308, 2369495, 2400618, 2407875, 2390556, 2378133, 2387386, 2441344, 2508846, 2540024, 2546348, 2551246, 2589153, 2672110, 2698419, 2705474, 2697546, 2724458, 2738754, 2819521, 2899319, 2947941, 3034742, 3040153, 3077460, 3133785, 3125414, 3190874, 3227906, 3345490, 3491545, 3527704, 3618095, 3634711, 3680134, 3755196, 3820618, 3907930, 4029798, 4168924, 4269838, 4409117, 4558803, 4582622, 4686852, 4779136, 4707259, 4673753]
3492D673753K5433J14436M5855P2787J4890P1324O4092J2230J39400J57433J15904
3481E507537Q0635O3716J43504J46786J25633J47800J66192K32677J33834J00044
3471F848358J85689J72693J87350K97950K87193K25141L35736K42381P3021J6500
3461H872012p2598L7694k0586j3591J55135O2586J36866J58891J52266K16885
3451I685560J44608K09367J51146J70312J66995J90211K03930K50663K67846K35626
3441A1676264L20098K53821K48060L23599K96185L74714L67146K84912K73892
3432A4418691L68812K92088L07637J97182K27541K49384K20836K30957K51616
3423A6764744K57606K54512L52391K00885M22498L58058L65278M41957L67575
$$ y = [4673753, 4699186, 4813622, 4859477, 4932264, 4947154, 5018478, 5082570, 5094800, 5234200, 5391633, 5507537, 5588172, 5651888, 5795392, 5942178, 6067811, 6215611, 6381803, 6614480, 6748314, 6848358, 7034047, 7206740, 7394090, 7692040, 7979233, 8204374, 8540110, 8782491, 8855512, 8872012, 8799414, 8837108, 8816522, 8802931, 8958066, 9020652, 9157518, 9316409, 9468675, 9685560, 9830168, 10039535, 10190681, 10360993, 10527988, 10718199, 10922129, 11172792, 11440638, 11676264, 11996362, 12250183, 12498243, 12821842, 13118027, 13492741, 13859887, 14144799, 14418691, 14787503, 15079591, 15387228, 15584410, 15811951, 16061335, 16282171, 16513128, 16764744, 17022350, 17276862, 17629253, 17830138, 18252636, 18610694, 18975972, 19417929, 19785504]
3414A9785504M15630M57393M83969M69707N37375N35083N17144M87000M41919
3405B4130724N49477N90747N68767O14287O25359O99620P60874Q37900Q54425
3396C0232180R42824J040573J220604J242382J213055J214400J043681J014631
3388C9164330R71671O75669M70975K70934K9493k58737n25024p80881j056334
3379C8962096j194586j320670j393320j492123j530082j471622j372297j219053
3371B7968343j146134j065725j004064j010869q81713r12021q19778p43045o00417
3362A9784577o73741o00057n24991n40811n07330n36156n59600m72714l70458
3353A4998719m19059l89104l50900l16044k73941k33857l37502l94118k30820
$$ y = [19785504, 20201134, 20658527, 21142496, 21612203, 22149578, 22684661, 23201805, 23688805, 24130724, 24680201, 25270948, 25839715, 26454002, 27079361, 27778981, 28539855, 29377755, 30232180, 31175004, 32215577, 33436181, 34678563, 35891618, 37106018, 38149699, 39164330, 40136001, 40811670, 41282645, 41553579, 41583072, 41324335, 40799311, 40018430, 38962096, 37767510, 36446840, 35053520, 33561397, 32031315, 30559693, 29187396, 27968343, 26822209, 25756484, 24752420, 23741551, 22859838, 21947817, 21128039, 20384994, 19784577, 19110836, 18510779, 17985788, 17444977, 16937647, 16401491, 15841891, 15369177, 14998719, 14579660, 14190556, 13839656, 13523612, 13249671, 13015814, 12678312, 12284194, 12053374]
3344A2053374j91102j83755j93049k19859k39923k20392k57980j55478j71672
3335A0220164j81443q9364j59929p6059p0059r3183j04500k9589Q040o0690j55412
3324I207976q6724n8595r5633L029l753q5140M1521j2520L8308N0051J89558J65098
3312I353176K17742L04375L30611M39263M79151M01925K74461l7392l50690m81910
3302A0930712o06367l86119l83747l63195k76299k78223r3475j19697j30100j31270
3292H162220j03933p679k5189n3932Q7246J21618Q7015J67346J26251Q2870J93907
3281H837740K71272L77454N16798O13484P95592J007108J008741Q49451J93342
3272A4470982p83664j157833j129216j000533q95944o96531n91392n47551m05229
$$ y = [12053374, 11862272, 11678517, 11485468, 11265609, 11025686, 10805294, 10547314, 10391836, 10220164, 10038721, 9949357, 9789428, 9713369, 9643310, 9550127, 9445627, 9416038, 9424078, 9363388, 9207976, 9121252, 9062657, 8967024, 8970053, 8966300, 8881160, 8922681, 8910161, 8948469, 8998520, 9188078, 9353176, 9570918, 9875293, 10205904, 10645167, 11124318, 11526243, 11800704, 11763312, 11412622, 10930712, 10324345, 9938226, 9554479, 9191284, 8914985, 8636762, 8543287, 8423590, 8293490, 8162220, 8058287, 8050608, 8025419, 7971487, 8058733, 8180351, 8267366, 8434712, 8560963, 8643833, 8837740, 9109012, 9486466, 10003264, 10616748, 11412340, 12419448, 13428189, 14277640, 14470982, 13687318, 12529485, 11400269, 10399736, 9503792, 8807261, 8215869, 7668318, 7263089]
3263G263089l13480k99629j68849j95985j18718j27539j16635m7284j0786j6003
3253E848181M192j7075O1122K5004P7156J10948J20128K36638K61026K72201M78729
3242G478250L93330J34362k44243n35206o36675n33058m43658l13913l42592k90671
3232D665926j57040k19822j31924j28816p5860j47839n9051n7481q6260j13869
3222C487964q5757k6498Q819p3966k000r8648l0704o4891o2923j7158l0526m5663
3210B958049o2126r774l5467p6259K3463K9712o8828j05690j4823L5745l1693
3199B642309P334j8204j4222P005m541r7489K3556n6959O8l8826j16391Q9551
3187B423191L3166l2356P353l822k8178m4788m6453L3854K2916o295n4604J6334
$$ y = [7263089, 6949609, 6649980, 6481131, 6285146, 6166428, 6038889, 5922254, 5874970, 5864184, 5848181, 5852373, 5835298, 5896420, 5921424, 5998580, 6109528, 6229656, 6466294, 6727320, 6999521, 7478250, 7871580, 8005942, 7761699, 7226493, 6589818, 6056760, 5613102, 5299189, 4956597, 4665926, 4508886, 4289064, 4157140, 4028324, 3952464, 3804625, 3745574, 3688093, 3601833, 3487964, 3402207, 3375709, 3384528, 3310562, 3308562, 3209914, 3179210, 3114319, 3051396, 3034238, 3003712, 2958049, 2895923, 2886149, 2850682, 2774423, 2797886, 2827598, 2758770, 2653080, 2638257, 2674002, 2642309, 2649643, 2631439, 2617217, 2624222, 2619681, 2522192, 2545748, 2488789, 2488857, 2450031, 2333640, 2423191, 2456357, 2424001, 2431354, 2427532, 2399354, 2354566, 2308113, 2341967, 2364883, 2358588, 2303984, 2320318]
3175B320318o3635P1153l2354l8690Q183L1570M194n4022O9939j4667K4129k677
3163B323441K0365O4688j1957j7291R3655L4289J8295p2469j783J74089p918K7904
3151B645308j2753n0456J8364J391M4550Q2203M2916P1738O7982l9192K2239J54026
3139C048316M9604j1723N8388Q999P2321N8523Q5189J13639O2805k9260N1460
3128C568261J36425J6197O4567N2607R064P1337O7725J68002J09550R1804Q7814
3117D443353J32326Q2502Q4512J43330O9913J34984J43967J25990J32016P1511
3107E564404P7994J78027K05446J93373J76608K01796K07445K04043K02892R5898
3097G307926K09392J25957J52976J43412J7611J66775J22202K37667J63631K61878
$$ y = [2320318, 2256683, 2327836, 2295482, 2256792, 2264975, 2296545, 2300739, 2246717, 2316656, 2301989, 2326118, 2323441, 2343806, 2408494, 2396537, 2379246, 2472901, 2507190, 2525485, 2453016, 2451233, 2625322, 2617404, 2645308, 2632555, 2582099, 2600463, 2601854, 2646404, 2728607, 2771523, 2843261, 2911243, 2872051, 2894290, 3048316, 3097920, 3086197, 3144585, 3153584, 3225905, 3284428, 3369617, 3483256, 3546061, 3516801, 3568261, 3704686, 3720883, 3785450, 3838057, 3847121, 3918458, 3986183, 4154185, 4263735, 4355539, 4443353, 4575679, 4658181, 4742693, 4886023, 4955936, 5090920, 5234887, 5360877, 5492893, 5564404, 5642398, 5820425, 6025871, 6219244, 6395852, 6597648, 6805093, 7009136, 7212028, 7307926, 7517318, 7643275, 7796251, 7939663, 7957274, 8124049, 8246251, 8483918, 8647549, 8909427]
3087H909427L22747K27266K81236L50387L65850K72259K82629M24861N07468L98563
3077A2342693L68600M72467M87562M03086M53719M67819M19233M03107M08284
3068A6226570J90414K54280J57542M5258K3126N8934j8360N2259P3856Q5441J17510
3057A7266830N8241P2383J60406K36343K95559K64155K23576M14111K97298L24383
3047A9613285N37972O17270O95696R29187J162872J143942R11265J23624r51890
3038B4783223j356116j478556j187770j009501r41776p93041o14466m21496l92807
3029A6587694l13327k97477l47217k22991j96668o0023m2975l8644j6863k2537
3019A5028972N9303N6960j3818j15214k1035l2395l7633j18170j30369j69004
$$ y = [8909427, 9232174, 9459440, 9740676, 10091063, 10456913, 10729172, 11011801, 11436662, 11944130, 12342693, 12711293, 13183760, 13671322, 14074408, 14528127, 14995946, 15415179, 15818286, 16226570, 16416984, 16671264, 16828806, 16874064, 16897190, 16956124, 16937764, 16990023, 17063879, 17149320, 17266830, 17325071, 17397454, 17557860, 17794203, 18089762, 18353917, 18577493, 18991604, 19288902, 19613285, 20151257, 20768527, 21464223, 22393410, 23556282, 24700224, 25611489, 25735113, 24783223, 23427107, 21948551, 20760781, 19751280, 18809504, 18016463, 17401997, 16980501, 16587694, 16274367, 15976890, 15629673, 15406682, 15210014, 15149991, 15107016, 15068372, 15051509, 15028972, 15088275, 15145235, 15131417, 15016203, 14995168, 14962773, 14925140, 14806970, 14676601, 14507597]
3009A4507597m00480n36680n74801o19132o20986m55882n28434m49271l26167
3000I995764l79186k75916k41499j82371k70855k20185k09804k52973j83448k91864
2990G487663j84963k58649k86923k80965k53570k77991k89961j96268k05873k36932
2980E015568j78600j78145j57460k21384j73117p5447j19587j57883r8478l9667
2970C615800j55887q3157q4348j23072p8766j37160q8573Q613l4828o9299j32866
2959B636457j49263m2089k2996p0110k6986j06513m9412k4579m6566J0073l4214
2948B073802o9441o4870r5075P110k3419j44755p3101K7894k0478m8733q0123
2937A488811M755O1619k495m1617l6549l2627n222K5706o6964m455l8868p8822
$$ y = [14507597, 14107117, 13570437, 12995636, 12376504, 11755518, 11299636, 10771202, 10321931, 9995764, 9616578, 9340662, 9099163, 8916792, 8645937, 8425752, 8215948, 7962975, 7779527, 7487663, 7302700, 7044051, 6757128, 6476163, 6222593, 5944602, 5654641, 5458373, 5252500, 5015568, 4836968, 4658823, 4501363, 4279979, 4106862, 4031415, 3911828, 3753945, 3655467, 3615800, 3459913, 3376756, 3292408, 3169336, 3090570, 2953410, 2864837, 2873450, 2838622, 2769323, 2636457, 2487194, 2445105, 2422109, 2351999, 2325013, 2218500, 2169088, 2144509, 2097943, 2108016, 2073802, 2004361, 1939491, 1844416, 1851526, 1828107, 1683352, 1610251, 1638145, 1617667, 1568934, 1488811, 1493566, 1555185, 1552690, 1511073, 1474524, 1441897, 1436675, 1462381, 1395417, 1390962, 1352094, 1273272]
2925A273272l6229n4756K6079J3668p4683k2375j01880n6077Q2354Q396l1562
2914A026207m7052r89k812k0810p07r2689M5967j14010k9525L4758J248N5413
2902H54999O104p5062n9731M2935j2611N704o2477K1176k3881j8898p3497J07929
2890G12690j3519j0935r8238L236j5359k7328j1532l49O8293m1125j636m4736
2878E19462l0973p531l6787j7362K5791j0245j7558k083L1350J7363J2372n7311
2866D26488n2954l6676l317P8467J4836o2047O5556j8148k120o3713j8376l9296
2854B88700J8870N0213J0861J3143q364j8491j0930j7477O7074P853k0825k2583
2842C58044l1546K0737Q747k751L2430l4634p5616K9048J4294K8932K3291l0365
$$ y = [1273272, 1237043, 1182287, 1208366, 1222034, 1147351, 1124976, 1023096, 967019, 1049373, 1057769, 1026207, 979155, 978166, 975354, 954544, 953837, 861148, 907115, 793105, 763580, 798338, 799586, 854999, 861103, 786041, 726310, 769245, 756634, 762338, 699861, 721037, 697156, 678258, 604761, 712690, 699171, 688236, 589998, 593234, 577875, 550547, 539015, 538666, 606959, 565834, 564198, 519462, 488489, 480958, 444171, 426809, 452600, 442355, 424797, 422714, 454064, 471427, 483799, 426488, 373534, 336858, 333541, 412008, 426844, 364797, 430353, 412205, 410085, 346372, 327996, 288700, 307570, 357783, 368644, 381787, 373423, 354932, 344002, 326525, 393599, 401452, 380627, 358044, 326498, 347235, 355982, 353231, 385661, 351027, 275411, 304459, 318753, 347685, 370976, 340611]
2830C40611j10753K1346K1230O4073K3172j8709j4895K339k3076p7110K143k8840
2818B01531J6464j3024L8130M7787J6922n7374n7568K8150l3179N116R3528m4428
2806B42055j3808L2543l6950J754K0188J0462p7667L4779J3048n5043N4961j873
2794B24449m5504J5178M6352K9559j0339j2100O38j7027K6344K4556m1806j6421
2782B23879N3245M1736J9633j4882n8103L0564M9396j14934l6108Q2271l1924
2771B44773n5765K0708O0598p3033K4945L7958k1764m8593O3303O9768o6022q8687
2759A68189O6209q358k0571J05712m4050k0188k2181J3565l9910k8752o7708M9954
2747A51911L7572J5986L4195q9904K4321L3616j0837l647m7914q325Q2508m781
$$ y = [340611, 229858, 251204, 272434, 336507, 359679, 340970, 326075, 328414, 305338, 228228, 230371, 201531, 217995, 204971, 243101, 290888, 307810, 250436, 192868, 221018, 187839, 192955, 286483, 242055, 228247, 260790, 223840, 225594, 245782, 256244, 178577, 213356, 226404, 171361, 226322, 224449, 178945, 194123, 240475, 270034, 259695, 247595, 248233, 231206, 257550, 282106, 240300, 223879, 277124, 318860, 338493, 323611, 265508, 296072, 345468, 230534, 194426, 276697, 244773, 189008, 209716, 270314, 197281, 222226, 260184, 238420, 189827, 253130, 322898, 256876, 168189, 234398, 226040, 205469, 311181, 267131, 246943, 224762, 238327, 198417, 169665, 101957, 151911, 189483, 205469, 239664, 149760, 174081, 207697, 196860, 193213, 145299, 136974, 219482, 214701]
2735B14701K7138Q301n7258P629j6278o910R9058n9718p2873j7482l1559K5952
2723A20701P003L2512J5664k6560l5978N682M2327r7095m8699L157P5208O0145
2711A54067r5083M3300j8779k9342L3389J4065r399k1717K8292O231l9316K5930
2699I1638P785m1671O794j8310L002Q5008l7869n2226j119K9052j2142K5168l0541
2686E4569o550N9402n7701L5054L6056P274Q662r3633l066K99k968K4142o438
2673E5102k4497L3126L6470k3525m5253M718n202O3041L5295j10475p12N95J7736
2660C6419k9093L8026m6021j3253L5146M3712K1201j06970M1436m091M196N6832
2648G7540L3952k5585m7598n7410K4385L9349m4193L3905k0507L8571j4374J7523
$$ y = [214701, 241839, 250140, 192882, 200511, 184233, 177323, 276381, 216663, 143790, 126308, 94749, 120701, 127704, 160216, 175880, 149320, 113342, 119024, 161351, 64256, 15557, 18714, 93922, 154067, 58984, 102284, 83505, 54163, 87552, 101617, 92218, 70501, 98793, 105024, 65708, 91638, 99423, 57752, 64546, 46236, 49238, 134246, 96377, 44151, 43032, 72084, 59942, 85110, 54569, 48019, 107421, 49720, 84774, 120830, 128104, 136766, 43133, 40067, 40366, 37398, 61540, 55102, 30605, 63731, 100201, 76676, 31423, 36141, 30939, 93980, 129275, 18800, 18088, 18683, 36419, 7326, 45352, -669, -13922, 21224, 64936, 86137, -20833, 20603, 16512, 20708, 77540, 111492, 85907, 38309, -19101, 5284, 44633, 440, 34345, 13838, 52409, 38035, 55558]
2636E5558J5645p835j6471q0939j0121K1914k9813j2913J2497L0777J2356j1550
2624b0895K5808J0637p2705l6733O7068L0155L2340m8251l736J5839k0123M6224
2612B5628l0756k0178J344L347K7784k8231O3571J5722l1522K321k4568k6945
2600b2483N958k3351R633Q6527o6716j5505O906J3306k3471K2661M6245j3148
2588B6562l928p4199K8455L0646N2024j9906l5041L3080k9663p973q305J1709
2576C461o1638L7997N2052K3116K7638n2595j4493M839O033l1289l0875L6297
2564E43k7390Q2764l8546J0052J228p1377K4831l0010L8412L7652j8883K8675
2552C7951P455m2422J3726j4317P943n3397L4912k4058K8870n2018k5104k2108
$$ y = [55558, 71203, 63368, 46897, -34042, -44163, -22249, -52062, -64975, -52478, -21701, -9345, -20895, 4913, 15550, -57155, -93888, -26820, 3335, 35675, -12576, -16312, -473, -20596, 25628, -5128, -25306, -23962, -20615, 7169, -21062, 42509, 58231, 26709, 29030, 4462, -22483, -16525, -39876, -30243, 56284, -10432, -25937, -19031, -5725, -29196, -6535, 39710, 26562, 22634, -51565, -23110, 7536, 59560, 39654, 4613, 37693, 8030, 57, -8248, 3461, -58177, -20180, 31872, 54988, 82626, 30031, 15538, 20377, 26410, -4879, -35754, 543, -26847, 55917, 17371, 27423, 28651, -42726, -17895, -47905, -9493, 28159, 9276, 37951, 45406, 2984, 16710, 2393, 10336, -43061, -8149, -32207, -3337, -55355, -80459, -102567]
2540a02567L5744M1994J4419K552K2216l846m3894M370k1096j2007r879K1229
2528e0765K7497k0655j7271j462n0833Q3404r157K6670L5975o6420N0723P937
2516A5643m0024K2626P925j2590j2655j2660O9433M7564m4917j3884k1921j532
2504C008o8785J5175J8072p2875o140K3748O5808k4718Q3183j5191m4970j8695
2492d2380J2684J4731N07k0353K6292K0254K1731J7984j1109p7852l9941M9303
2480b8149m7502K7773n001N9900j9227l2037K3390K4175l3517J4379o1464M2996
2468c4284J7834k8380K8057n3746k2968Q8288k6072m0930L6307m4253j2601J6765
2456g5983M1619l5919J1619L0139p8614m497P972N0540K7385k7642L2601o7997
$$ y = [-102567, -66823, -24829, -10410, -7858, 14358, 10512, -33382, -29012, -50108, -62115, -71994, -50765, -23268, -43923, -61194, -62656, -113489, -30085, -39242, -12572, 23403, -43017, 7706, 15643, -24381, -1755, 6170, -6420, -19075, -31735, 37698, 85262, 40345, 26461, 4540, 3008, -65777, -50602, -32530, -105405, -111545, -87797, -21989, -46707, 36476, 21285, -23685, -42380, -29696, -14965, -14458, -34811, -8519, 11735, 33466, 51450, 40341, -37511, -77452, -28149, -75651, -47878, -52879, 7021, -12206, -44243, -20853, 3322, -30195, -15816, -77280, -34284, -16450, -44830, -16773, -70519, -93487, -5199, -31271, -72201, -35894, -80147, -92748, -75983, -34364, -70283, -58664, -28525, -107139, -111636, -103664, -53124, -25739, -53381, -20780, -88777]
2444h8777K1582J8499k8642J0065L8165J9761K9997k3026m0005J700N2496k9903
2432a8088q1207N3809K3154O532K9548k230R507l2917n3482J8087l1131P7807
2420f11Q940L2644j0554n7244L4127L2802q4127K575Q9476n2403K912L2211n2645
2407b1897J1602n482M97k6806O4271N2403j09830p704K1895j4721M3606K0082
2395B7916N8237r2643p2265N7177Q21k9308J3361Q603m0642M7460J3763O6161
2383E8641k8453k8343J9642n746m8953M3815Q6173p3027K7938L8463n0601k3418
2371A6131R078k0619n4803K1525L4556O7426j6340J1641p8676k772P834j3912
2359a8931k5393M4816L5309j3202n6748q246N698M8441M096l1848R2516J3897
$$ y = [-88777, -67195, -48696, -77338, -67273, -29108, -9347, 20650, -2376, -42381, -40681, 11815, -18088, -99295, -45486, -22332, -15800, 13748, 11518, 21025, -11892, -65374, -47287, -78418, -611, 8329, 40973, 30419, -26825, 7302, 40104, -44023, -41448, 48028, -4375, -1463, 30748, -21897, -10295, -15777, -15280, -42086, 22185, 74588, -35242, -42946, -21051, -35772, 7834, 27916, 86153, -6490, -78755, -21578, -20757, -50065, -36704, -28101, -68743, -21283, -7520, 58641, 30188, 1845, 21487, 15741, -33212, 10603, 96776, 23749, 51687, 90150, 39549, 16131, 25209, 4590, -50213, -28688, 5868, 73294, 56954, 68595, -10081, -12853, -5019, -18931, -44324, 492, 35801, 22599, -34149, -42395, -36697, 11744, 15840, -16008, 76508, 90405]
2347I0405L117n2439P5811L8629o2818j6576l9695K1090P5271k9361j14146J18441
2335A07729N8452j349Q154l7683R20m5441L4518L5675N0775L1026J963j1108q023
2322B25608o162p799N6672O5381o4639p2794O7547L018k9712O5575J6465m8422
2310B70738L1600M7378l7459j8141O6285Q0928N1796k8758p9881L7469J78078
2299F00033k0600n0528M4093j8752J0795P8811p088j8759N9637N0441M7284k7619
2287G47748k2412R2282P3588p186O735L7195L0460j3296J20353O3731P5150O9746
2275A274094K9727q812j1185J0485Q5429N8906J15562J12194M9545O4070P2225
2264A852240J00005J41733J14884J73734Q0293O5817P5838J27502J68463P5193
$$ y = [90405, 93522, 41083, 116894, 155523, 92705, 76129, 36434, 57524, 132795, 103434, -10712, 107729, 166181, 164832, 172986, 135303, 136223, 90782, 125300, 160975, 211750, 242776, 244739, 233631, 225608, 219446, 211647, 268319, 333700, 269061, 196267, 263814, 266832, 237120, 302695, 319160, 270738, 302338, 349716, 312257, 294116, 360401, 441329, 493125, 464367, 384486, 421955, 600033, 579433, 528905, 572998, 554246, 565041, 643852, 636764, 618005, 677642, 728083, 775367, 747748, 725336, 817618, 891206, 884020, 890755, 927950, 958410, 945114, 1065467, 1129198, 1204348, 1274094, 1303821, 1295009, 1283824, 1294309, 1379738, 1438644, 1554206, 1666400, 1715945, 1780015, 1852240, 1952245, 2093978, 2208862, 2382596, 2462889, 2528706, 2604544, 2732046, 2900509, 2975702]
2254B975702J47053K88520K97739M12769O53806Q88804J088257J351125O89598
2245H793373q00984j390894j233102r20991p98146o04501m13431k77544k23918
2236B129862j91929j29322j84448j43388p1539j23094q0040j29068j54125o0119
2226H62790L7307o1695j26102p8681q8166M324N8505j2331k3902q0214q6764m8870
2214C56201K5653M2758j5873r1950r565R2154m0745M964j73o2619l2178l993k6976
2201B37658M369l7825n6679K1541n5255K0399K1227J5832n5357K0125L7131k4286
2189A48880J394n2345L0163l9645L2277K878j2074k2271n9100Q0493j4986N019
2177A00683m8491q275K0770m3488L4391r0169L2804O2793j17081L0691P4551j9136
$$ y = [2975702, 3122755, 3411275, 3709014, 4121783, 4775589, 5664393, 6752650, 8103775, 8793373, 7992389, 6601495, 5368393, 4447402, 3649256, 3044755, 2631324, 2353780, 2129862, 1937933, 1808611, 1624163, 1480775, 1409236, 1286142, 1206102, 1077034, 922909, 862790, 900097, 838402, 712300, 633619, 545453, 549777, 608282, 595951, 572049, 491835, 405071, 356201, 381854, 424612, 408739, 316789, 307224, 399378, 358633, 363597, 363424, 300805, 268627, 264634, 237658, 242027, 204202, 147523, 169064, 113809, 134208, 155435, 171267, 115910, 136035, 173166, 148880, 150274, 97929, 128092, 88447, 120724, 123602, 111528, 89257, 30157, 110650, 95664, 100683, 52192, 43917, 64687, 21199, 55590, -34579, -1775, 61018, -56063, -25372, 49179, 30043]
2165C0043l3706N4714J353j8572k0396l9489J5199j6262R076j3341N0838O540
2153B5997p3820R282l2307P3698M5906l8842N66K4045j9400K994m4014m0211l3778
2140i9884M7844j22Q525K0215q899M0078r147J4686l1562N3115J7295o3277K8174
2127A7041k1576L6567L1912k6129n6103q045O3241q3505l4724P628N7841J9691
2115C839P025k0628K100J428m3224l8359K452J1913L7699o051j0614j0956M1604
2102b1772k4236J1220j9402j2008O1419r575k893J8867n434m1869M4954m1097
2090d1826o0134N0949j740L3382J0904L689k3799k8133M8617J7183j1432k4487
2078b6827l8459L5420n6506m8212L2520j7259Q3375L4264j7101l8365J62n256
$$ y = [30043, -3663, 51051, 52404, 33832, 13436, -26053, -10854, -27116, -18040, -31381, 19457, 25997, -47823, -38541, -70848, 2850, 48756, 9914, 10480, 34525, 15125, 18119, -25895, -66106, -99884, -52040, -52162, -43637, -23422, -32321, 7757, -1390, 13296, -18266, 34849, 52144, -11133, 17041, -4535, 32032, 63944, 37815, -18288, -26333, 36908, -46597, -81321, -73693, -15852, 3839, 10864, -9764, -7664, -6236, -49460, -87819, -85367, -73454, -35755, -41806, -52420, -63376, -21772, -46008, -34788, -54190, -66198, -4779, -14354, -17247, 1620, -3814, -45683, -729, -41826, -101960, -51011, -52751, -19369, -8465, -4776, -28575, -56708, -8091, 9092, -2340, -26827, -65286, -29866, -86372, -134584, -102064, -119323, -35948, -1684, -18785, -57150, -56988, -62244]
2066f2244M5204M3460O359k859m7363N1167p2876k4425J6322L5352j8484k4899
2054e5286j7993j8884K9705O3242j0992m0768N7561j925L9794o8155o926J821
2042b8806N357l2352j0404K1240M997l2826k1362J3849L0156M5037j7242n1259
2030g3615j0529R1558j2583k0871M880L814L3324k6035j9271M1536K2964j781
2018C3391p5918J3588K7492l0893N6402j5765K084n9356j6154j5138j3161k566
2006i5994M4162l7274q498K9525Q27R89l8468M1594L7020j0740K6539l6341J7037
1993b9622J1078K2277m7902j9565K2941j919M5675j2878R357J4284n972j4672
1981f918K263j2230r7565M6658J2144k801P8368L7111p5000m0985K3576M266l4802
$$ y = [-62244, -17040, 26420, 32779, 29920, -17443, 33724, -39152, -63577, -47255, -11903, -30387, -55286, -73279, -92163, -62458, 784, -10208, -50976, 6585, 4660, 44454, -23701, -30627, -28806, -23449, -55801, -66205, -44965, -39968, -72794, -94156, -80307, -50151, -5114, -22356, -73615, -84144, 7414, -5169, -26040, -21160, -17346, 15978, -10057, -29328, 12208, 35172, 33391, -42527, -28939, -1447, -32340, 24062, 8297, 10381, -48975, -65129, -80267, -93428, -95994, -51832, -89106, -97604, -68079, -67252, -66263, -104731, -63137, -26117, -36857, -10318, -46659, -29622, -18544, 3733, -44169, -63734, -40793, -42712, 2963, -9915, -558, 13726, 7754, -6918, -4655, -16885, -114450, -67792, -55648, -58449, 19919, 57030, -17970, -58955, -35379, -31113, -65915]
1968f5915K7875N7824n4962M8809l958r332o3745N1491M8974n3614k157J7496
1956a214m7269k1255k7111Q1823k4726J2788j5794p738k967J0951M101N5787J7811
1943C5187k1725n0786p0101J3795Q8609m8337l1900L4264K1485l8599J5864k6503
1931g8747o5918L6603P1258M9203n0696n6205n5211K582O2901N5489K1048K3050
1919A5357m2751K1453O263q6204K3494l0992l0889O6102k8748P163k0271O44K6139
1906g3240l4866M3579O4285l9956J1416n9401P1291k33k2457l9231O0008j1059
1894b9864r8553K6710L897J3221J7436J7175P3970m9012l0833k2363m198L2389
1882e0025k0725k1441M9012k2638n668K6572m6017J317J3025K3796o6395O1252
$$ y = [-65915, -38040, 19784, -35178, 13631, 9673, 341, -63404, -11913, 37061, -16553, -18710, -1214, -48483, -69738, -96849, -15026, -39752, -26964, -42758, -50496, -53463, -42512, -38411, 17376, 35187, 13462, -37324, -107425, -93630, -5021, -53358, -85258, -50994, -29509, -68108, -52244, -78747, -144665, -108062, -36804, 12399, -38297, -94502, -149713, -147131, -84230, -28741, -7693, 15357, -27394, -5941, 322, -85882, -62388, -93380, -124269, -58167, -86915, -79752, -100023, -99379, -73240, -108106, -64527, -242, -40198, -28782, -88183, -16892, -17125, -39582, -78813, -18805, -29864, -128417, -101707, -97810, -84589, -67153, -49978, 23992, -25020, -55853, -78216, -82414, -50025, -70750, -92191, -43179, -65817, -71485, -44913, -90930, -89613, -76588, -52792, -119187, -57935]
1870e7935J9509m063N4357l7047k2859j2930K6373k8887r282M4050m723K714O3986
1857C3263J0568n1519p9331R918L8685j9968K7789K5176n444k7283j4652m845
1845e7643l9108l2717J4977O6928M0251o3928J7800K5560P3115j676m8359M7782
1833D2982l5939m7864k2447J7289J4491k8761M5760J6785M0986l5850m6465R636
1821b9397k6912N9757q185l1924K9233K2712Q819j745m7912M2979p261n7212L1660
1808a5388k710l3896k7772j1834j3718K7600J9784J449n6764j5914N1205J0039
1796f7919J8104l2215K5654N7256j4921j6143N051O7440k3376k8132p2038J4416
1784f6823j7759L6578L9213l3077J9644K8191O039m539Q535j6103n3448m7571
$$ y = [-57935, -38426, -42489, 11868, -25179, -48038, -60968, -34595, -63482, -72764, -28714, -33437, -30723, 33263, 43831, -7688, -87019, -77101, -38416, -58384, -30595, -5419, -10863, -38146, -52798, -57643, -96751, -129468, -114491, -47563, -7312, -71240, -53440, -27880, 45235, 43559, -4800, 42982, 7043, -40821, -63268, -45979, -31488, -60249, -14489, 2296, 43282, 7432, -39033, -29397, -56309, 3448, -4737, -36661, -7428, 15284, 24103, 22358, -25554, 17425, 10164, -47048, -15388, -18098, -51994, -79766, -91600, -105318, -77718, -57934, -56485, -113249, -129163, -77958, -67919, -49815, -82030, -56376, 880, -14041, -30184, -25133, 42307, 18931, -9201, -81239, -66823, -84582, -48004, -8791, -41868, -22224, 5967, 12006, 7467, 16002, -101, -53549, -101120]
1772a01120p640j6017L0135K2176N9839J1728P942j2036j1499L5075n7175K6875
1760a1717J1816K4443n8505m3595N709p773O0600l7780L4362K351j7116r2891
1748a30096k1270R1919J9753L7565l711M014n3043m8328M1905O1548j3675n8062
1736g1481j8179J3912L4112l0660L914K9169M0049K0219r6133J689M1885l3724
1724f5228J8096k1687O1917K7685j4263K9390j5199k800k3929p1985n634M8121
1712c5516k4016J5384k5165j2538j2211L5957l1633L9566n7812j676P6777k5084
1700e7967R68J388k9267n183K1739M367P1649m1203N5J6464k1336n0941M3446
1687d5821L7757L0879j8951p6391J7042O555p1370M8256L3926n86L3689N0541
$$ y = [-101120, -108760, -124777, -94642, -72466, -12627, -899, 7043, -4993, -16492, 18583, -38592, -11717, 99, 24542, -33963, -77558, -71849, -79622, -19022, -56802, -22440, -20089, -37205, -130096, -151366, -59447, -39694, -2129, -5840, -1826, -54869, -103197, -61292, 256, -13419, -71481, -89660, -75748, -41636, -72296, -68382, -39213, 836, 21055, -75078, -73389, -31504, -65228, -47132, -68819, -6902, 20783, 6520, 35910, 20711, 17911, -6018, -78003, -83637, -35516, -59532, -44148, -69313, -81851, -94062, -58105, -89738, -50172, -107984, -109660, -32883, -57967, -56999, -55611, -84878, -90061, -68322, -63955, 7694, -33509, -33454, -16990, -38326, -89267, -45821, -8064, 22815, 3864, -72527, -55485, -48930, -120300, -72044, -38118, -38704, -5015, 45526]
1675D5526j27508N9222K3480m5134J4514j2632J1508k0151l4920O203l6317N0931
1663f5278J9548K0697k6254q369K5974o6863N9025p144O803J071j254K4302K8173
1650A0431J3862p242l872J9694p6126j6207m2101K5260M6403n5103K6629P5113
1638A6741k1563k709n2496J9892N5732n9423N28J927M0772M3117j7419j2925L0643
1625D2817o2012r326P664O1759n4513l6990N8587Q996j2994p9983N659P1513M1443
1612D2620k0018m2604q0149Q8035l1767K3690j8700K2455J4604o465j8400j7781
1600d4480K9563q7365N8051K6851j9744P33N1777p3321j7038Q1261n0355N764
1588c8303j4356N0720k4141l4957j5651O1682k4628K0710L2780n3896j0650N7269
$$ y = [45526, -81982, -22760, 720, -44414, -29900, -42532, -31024, -51175, -86095, -79892, -116209, -65278, -45730, -25033, -51287, -59656, -33682, -100545, -41520, -48664, -41861, -40790, -42044, -17742, 10431, 24293, 17051, 13179, 32873, -43253, -59460, -101561, -76301, -29898, -85001, -58372, 16741, -4822, -7531, -60027, -40135, 15597, -43826, -43298, -41371, -599, 42518, 25099, 12174, 42817, -19195, -28521, -20857, 40902, -13611, -50601, 7986, 16982, 3988, -75995, -70336, 1177, 42620, 22602, -20002, -100151, -12116, -43883, -20193, -38893, -16438, -1834, -8299, -26699, -44480, -14917, -102282, -44231, -17380, -37124, -36391, 15386, -57935, -74973, 6288, -44067, -38303, -52659, -1939, -26080, -61037, -76688, -15006, -39634, -18924, 13856, -40040, -50690, 6579]
1576F579k048j10424k1606N2337K6508k5945P220P7275p3635n9224P5938M2983
1564d042j6613n7624M0429m16O378j0576K9647k81J253o8090m2126K7484J1511
1551h3066P2043L748l408j3227m527K6088M5141m764K8056J5274j09881K1655
1539f868K6832L7J6223l2639l9547n106k9625k3978J9829M8455l599J4363J0942
1526d681j6873L3805J1627m9754R643o113R344j3996N9896R442n6513j4086m4029
1513g2288L1601M6758l2970K5009n6919p7733M3217M4020k045M7302N6173l4081
1501A8044j0170p898k0922L22j3002R756l0800N4169K5036L6902k9179q7524R191
1488d6075K7451J5561n126N2921L594K6273j12967m7733M2801L4178M0015k4851
$$ y = [6579, 4531, -105893, -127499, -75162, -48654, -74599, -67379, 9896, -63739, -122963, -47025, -4042, -20655, -78279, -37850, -38266, -31888, -42464, -12817, -13098, -11845, -79935, -122061, -94577, -83066, -11023, -7275, -10683, -23910, -28437, -2349, 42792, 38028, 66084, 81358, -28523, -6868, 19964, 20001, 36224, 3585, -35962, -41068, -70693, -94671, -74842, -26387, -29986, -15623, -4681, -21554, 12251, 23878, -25876, -16233, -22346, -13002, -26998, 32898, 42340, -14173, -28259, -72288, -40687, 6071, -26899, -1890, -58809, -136542, -93325, -49305, -51350, -4048, 52125, 18044, 7874, -24, -20946, -20624, -33626, -23870, -54670, -501, 24535, 61437, 32258, -55266, -46075, -18624, -3063, -8189, 44732, 48326, 74599, -38368, -86101, -43300, -9122, 30893, 6042]
1476F042m619j1183M39j2447p1988M4244j8547Q4669K3405l9243M1483K4545L5043
1463A01843o7085k987n0327l2695P978o7448O6654K5142l7139M953O3625l768
1451H746k2152p490J6956q975J9120M0491r0200o0371M6202J25132l1552p0425
1439c4518n5198R0685j0408r500l8694k4446P0084M0555o630o7018k9255J5777
1427e8566J7667N6977J2540k3663M3880m9623k6097J5109J0628n2559l0205M9231
1415c4681M9592k648j930l0233j2389N6116m154j3091J4787j3127l7958l6509
1403f6225l6351l061J8192L1279k7583L9181J2051p273J1426j916J5829J1575
1391b876j8907k295M1020l2183k584k1059M959q8903K018M9253M6657q2086K5827
$$ y = [6042, 1423, -9760, -9321, -21768, -93756, -49512, -68059, 16610, 40015, 772, 42255, 66800, 101843, 34758, 31771, -18556, -51251, -43273, -110721, -44067, -18925, -56064, -51111, 12514, 8746, -13406, -20896, -3940, -12915, 6205, 46696, -43504, -103875, -57673, 67459, 35907, -34518, -89716, 969, -9439, -18939, -57633, -82079, -11995, 28560, 21930, -45088, -74343, -58566, -40899, 16078, 28618, 4955, 48835, -788, -26885, -11776, -1148, -53707, -83912, -34681, 14911, 12263, 10333, -19900, -32289, 23827, 19673, 6582, 21369, 8242, -29716, -66225, -102576, -105637, -87445, -56166, -83749, -44568, -32517, -39790, -28364, -30280, -14451, -2876, -21783, -24078, 16942, -15241, -17825, -38884, -33925, -122828, -120810, -71557, -24900, -106986, -81159]
1378h1159P5220j9231k4911N7292L9415p8866N7646j4606m5387M6758l8410M4178
1366A7939j7387m1566K17j7858k5249N1078l144j3920J8023J9487j0362L576k309
1353b1475k0622J4170J8640j4834m2707J3274j449L7927j3139j1613j5638j0296
1341f7762N9383L2292k2078k931K7199q301o2321K1156j0967N3096K3992m0046
1329B712j5825Q713L3425l5752p4437M0881K2532J1655o597K0849N9762j0467
1317E7451p7713r4095k3306J00901j1832Q952R4495q003k4587k780j1796k0205
1305a2518J4826K5856m924K6751m1053j855j5540j6663m1636Q122N2078Q612p2397
1292g0341N5193O1419n2960l8153L4808N92J794p260n5296L8762j336J7728j58
$$ y = [-81159, -5939, -25170, -50081, 7211, 46626, -32240, 25406, 10800, -34587, 12171, -26239, 17939, 552, -41014, -40797, -58655, -83904, -32826, -35970, -49890, -31867, -12380, -22742, -19166, -21475, -42097, -27927, -9287, -24121, -66828, -53554, -55003, -17076, -30215, -41828, -57466, -67762, -8379, 23913, 1835, -1096, 26103, 17802, -44519, -23363, -34330, 18766, 42758, 2712, -13113, -4400, 29025, -6727, -81164, -40283, -17751, -6096, -12693, 8156, 67918, 57451, -20262, -114357, -137663, -36762, -48594, -39642, 54853, 46850, 22263, 19483, 7687, -12518, 2308, 28164, 23240, 49991, 8938, 7083, -8457, -25120, -66756, -58634, -6556, 2056, -70341, -15148, 46271, -6689, -44842, -10034, -9442, -7648, -14908, -70204, -31442, -32778, -15050, -15208]
1279a5208J9375K2129l9957N2450m1221k7278j2482n967m5115J6954N4893P120
1267a4307k0350Q629L5549n1148o170m769K1969L1409M6105p9049j4902N8815
1255A1781M3483r219k6690m0111l9438o1941O4519O3179k7856J4909N6809n1246
1243a821P5006J2020q5874K6498J6991L1460J3118p436J7261k9088m0071m9407
$$ y = [-15208, 4167, 26296, -13661, 38789, -2432, -29710, -42192, -48159, -93274, -76320, -21427, -14307, -34657, -26028, 9521, -41627, -47797, -52566, -30597, 812, 46917, -32132, -47034, 11781, 55264, 46045, 19355, -20756, -60194, -122135, -57616, 5563, -22293, -7384, 49425, -1821, 73185, 85205, -669, 25829, 42820, 74280, 87398, 79962, 97223, 68135, 28064, -21343]
$$ [...]
##END NTUPLES=NMR SPECTRUM
##END=
