##TITLE=1H_CG-1181-b1
 CDCl3
 8 sc, 
 12.4.2024
##JCAMPDX= 6.0         $$ Bruker NMR JCAMP-DX V2.0
##DATA TYPE= NMR SPECTRUM
##DATA CLASS= NTUPLES
##ORIGIN= UXNMR, Bruker Analytische Messtechnik GmbH
##OWNER= root
$$ XWIN-NMR		Version 3.5
$$ Fri Apr 12 14:27:44 2024 Russian Standard Time (UT+4h)  she@DPX200
##.OBSERVE FREQUENCY= 200.1309
##.OBSERVE NUCLEUS= ^1H
##.ACQUISITION MODE= SIMULTANEOUS
##.ACQUISITION SCHEME= undefined
##.AVERAGES= 8
##.DIGITISER RES= 18
##SPECTROMETER/DATA SYSTEM= spect
##.PULSE SEQUENCE= zg30
##.SOLVENT NAME= CDCl3
##.SHIFT REFERENCE= (INTERNAL, CDCl3, 0, 15.5155)
##AUDIT TRAIL= $$ (NUMBER, WHEN, WHO, WHERE, WHAT)
$$ ##TITLE= Audit trail, XWIN-NMR		Version 3.5
$$ ##JCAMPDX= 5.01
$$ ##ORIGIN= Bruker BioSpin GmbH
$$ ##OWNER= she
$$ F:/spectra/data/she/nmr/H-F/1/pdata/1/auditp.txt
$$ ##AUDIT TRAIL=  $$ (NUMBER, WHEN, WHO, WHERE, WHAT)
(   1,<2024-04-12 14:26:30.84 +0400>,<she>,<DPX200>,
      <created by zg, POWCHK disabled, PULCHK disabled
       configuration hash MD5:
       00 E9 B6 7A A2 85 ED C7 34 08 36 98 17 FE 4E 26
       data hash MD5: 16K
       DE E2 A6 E9 CD 30 CD 2E 1E 7B 1C DB 18 3B E3 7C>)
(   2,<2024-04-12 14:26:35.81 +0400>,<she>,<DPX200>,
      <Start of raw data processing
       efp BC_mod = 2 LB = 0.24 FT_mod = 6 PKNL = 1 PHC0 = -25301.39 PHC1 = 11.98731 SI = 16K 
       data hash MD5: 16K
       C0 CF 07 F2 DA 67 54 32 7A 49 8F A0 0F 02 89 A1>)
(   3,<2024-04-12 14:26:53.42 +0400>,<she>,<DPX200>,
      <pk PHC0 = -160.9245 PHC1 = 3.4 
       data hash MD5: 16K
       ED 3F C8 3F 9B 69 73 A3 C6 AC 19 2F 86 1A DF 12>)
(   4,<2024-04-12 14:26:57.14 +0400>,<she>,<DPX200>,
      <abs ABSG = 5 
       data hash MD5: 16K
       13 2C C1 6F EF EA 85 24 C4 EB 70 CF 22 F9 7F A0>)
$$ ##END=
$$ 
$$ hash MD5
$$ 9D AD D5 62 A2 A1 12 7B 7E D2 EB 49 E7 76 0D 2A
##$RELAX= 
##$RELAX= 
##$RELAX= 
##$RELAX= 
##$RELAX= 
##$RELAX= 
$$ Bruker specific parameters
$$ --------------------------
##$DU= <F:/spectra>
##$EXPNO= 1
##$NAME= <H-F>
##$PROCNO= 1
##$TYPE= <nmr>
##$USER= <she>
##$AMP= (0..31)
100 100 100 100 100 100 100 100 100 100 100 100 100 100 100 100 100 100 
100 100 100 100 100 100 100 100 100 100 100 100 100 100 
##$AQSEQ= 0
##$AQ_mod= 1
##$AUNM= <au_zg>
##$AUTOPOS= <>
##$BF1= 200.13
##$BF2= 200.13
##$BF3= 200.13
##$BF4= 200.13
##$BF5= 200.13
##$BF6= 200.13
##$BF7= 200.13
##$BF8= 200.13
##$BYTORDA= 1
##$CFDGTYP= 0
##$CFRGTYP= 5
##$CHEMSTR= <none>
##$CNST= (0..31)
1 1 145 1 1 1 1 1 1 1 1 1 1 1 1 1 1 1 1 1 1 1 1 1 1 1 1 1 1 1 1 1 
##$CPDPRG= <>
##$CPDPRG1= <>
##$CPDPRG2= <>
##$CPDPRG3= <>
##$CPDPRG4= <mlev>
##$CPDPRG5= <mlev>
##$CPDPRG6= <mlev>
##$CPDPRG7= <mlev>
##$CPDPRG8= <mlev>
##$CPDPRGB= <>
##$CPDPRGT= <>
##$D= (0..31)
0 1.2 0 0 0 0 0 0 0 0.06 0 0.03 0 0 0 0 0.0002 0 0 0 0 0 0 0 0 0 0 0 0 
0 0 0 
##$DATE= 1712917590
##$DBL= (0..7)
120 120 120 120 120 120 120 120 
##$DBP= (0..7)
150 150 150 150 150 150 150 150 
##$DBP07= 0
##$DBPNAM0= <>
##$DBPNAM1= <>
##$DBPNAM2= <>
##$DBPNAM3= <>
##$DBPNAM4= <>
$$ [...]
##$SUBNAM3= <"">
##$SUBNAM4= <"">
##$SUBNAM5= <"">
##$SUBNAM6= <"">
##$SUBNAM7= <"">
##$SUBNAM8= <"">
##$SUBNAM9= <"">
##$SW= 18.0517689322627
##$SWIBOX= (0..15)
0 0 2 0 0 0 0 0 0 0 0 0 0 0 0 0 
##$SW_h= 3612.71676300578
##$TD= 16384
##$TD0= 1
##$TE= 0
##$TE2= 300
##$TE3= 300
##$TEG= 300
##$TL= (0..7)
0 120 120 120 120 120 120 120 
##$TP= (0..7)
150 150 150 150 150 150 150 150 
##$TP07= 0
##$TPNAME0= <>
##$TPNAME1= <>
##$TPNAME2= <>
##$TPNAME3= <>
##$TPNAME4= <>
##$TPNAME5= <>
##$TPNAME6= <>
##$TPNAME7= <>
##$TPOAL= (0..7)
0.5 0.5 0.5 0.5 0.5 0.5 0.5 0.5 
##$TPOFFS= (0..7)
0 0 0 0 0 0 0 0 
##$TUNHIN= 0
##$TUNHOUT= 0
##$TUNXOUT= 0
##$USERA1= <user>
##$USERA2= <user>
##$USERA3= <user>
##$USERA4= <user>
##$USERA5= <user>
##$V9= 5
##$VALIST= <valist>
##$VCLIST= <CCCCCCCCCCCCCCC>
##$VD= 0
##$VDLIST= <DDDDDDDDDDDDDDD>
##$VPLIST= <PPPPPPPPPPPPPPP>
##$VTLIST= <TTTTTTTTTTTTTTT>
##$WBST= 1024
##$WBSW= 4
##$XGAIN= (0..3)
0 0 0 0 
##$XL= 0
##$YL= 0
##$YMAX_a= 742770
##$YMIN_a= -875744
##$ZGOPTNS= <>
##$ZL1= 120
##$ZL2= 120
##$ZL3= 120
##$ZL4= 120
##$ABSF1= 15.51224
##$ABSF2= -2.539645
##$ABSG= 5
##$ABSL= 3
##$ALPHA= 0
##$AQORDER= 0
##$ASSFAC= 0
##$ASSFACI= 0
##$ASSFACX= 0
##$ASSWID= 0
##$AUNMP= <proc_1d>
##$AZFE= 0.1
##$AZFW= 0.1
##$BCFW= 0
##$BC_mod= 2
##$BYTORDP= 0
##$COROFFS= 0
##$CY= -3
##$DATMOD= 1
##$DC= 0
##$DFILT= <>
##$DTYPP= 0
##$F1P= 0
##$F2P= 0
##$FCOR= 1
##$FTSIZE= 16384
##$FT_mod= 6
##$GAMMA= 0
##$GB= 0
##$INTBC= 1
##$INTSCL= 3.70164e-10
##$ISEN= 128
##$LB= 0.24
##$LEV0= 0
##$LPBIN= 0
##$MAXI= 10000
##$MC2= 0
##$MEAN= 0
##$ME_mod= 0
##$MI= 1.114404
##$NCOEF= 0
##$NC_proc= -5
##$NLEV= 6
##$NOISF1= 3.799351
##$NOISF2= 2.8
##$NSP= 0
##$NTH_PI= 0
##$NZP= 0
##$OFFSET= 15.51554
##$PC= 1
##$PHC0= -25462.31
##$PHC1= 15.38731
##$PH_mod= 1
##$PKNL= yes
##$PPARMOD= 0
##$PSCAL= 0
##$PSIGN= 0
##$REVERSE= no
##$SF= 200.129601239256
##$SI= 16384
##$SIGF1= 3
##$SIGF2= 2
##$SINO= 5.538805
##$SIOLD= 16384
##$SREGLST= <1H.CDCl3>
##$SSB= 0
##$STSI= 16384
##$STSR= 0
##$SW_p= 3612.71676300577
##$SYMM= 0
##$S_DEV= 0
##$TDeff= 16384
##$TDoff= 0
##$TI= <>
##$TILT= no
##$TM1= 0
##$TM2= 0
##$TOPLEV= 0
##$USERP1= <user>
##$USERP2= <user>
##$USERP3= <user>
##$USERP4= <user>
##$USERP5= <user>
##$WDW= 1
##$XDIM= 16384
##$YMAX_p= 392941032
##$YMIN_p= -183486
$$ End of Bruker specific parameters
$$ ---------------------------------
##NTUPLES= NMR SPECTRUM
##VAR_NAME=  FREQUENCY,     SPECTRUM/REAL,   SPECTRUM/IMAG
##SYMBOL=    X,             R,               I
##VAR_TYPE=  INDEPENDENT,   DEPENDENT,       DEPENDENT
##VAR_FORM=  AFFN,          ASDF,            ASDF
##VAR_DIM=   16384,         16384,           16384
##UNITS=     HZ,            ARBITRARY UNITS, ARBITRARY UNITS
##FACTOR=    0.220516191357247, 1,           1
##FIRST=     3105.11885782483, 0,            0
##LAST=      -507.597905180937, 0,           0
##MIN=       -507.597905180937, -183486,     0
##MAX=       3105.11885782483, 392941032,    0
$$ Real data points
##PAGE= N=1
##DATA TABLE= (X++(R..R)), XYDATA
$$ [...]
6780b1503L652J8364r902j5893J8294j5433J787N301j2845O318J5190J9900j8345
$$ -21503 -17851 513 -9389 -25282 -6988 -22421 -20634 -15333 -28178 -21860 -6670 13230 -5115
6767e115r748m526j900J1496k281L323N998q861r664n573r163J7598m91j5494
$$ -5115 -14863 -19389 -21289 -9793 -12074 -8751 -2753 -11614 -21278 -26851 -36014 -18416 -18907 -34401
6753c4401K2225o568J754m91n124l561P560N441q635r666L2291j5024k8314P691
$$ -34401 -12176 -18744 -16990 -17481 -22605 -26166 -18606 -13165 -21800 -31466 825 -14199 -42513 -34822
6739c4822m74J5484j5296J6099J5212K678j2468j983n082J1021j2450O98l635
$$ -34822 -35296 -19812 -35108 -19009 -3797 -1119 -13587 -15570 -20652 -9631 -22081 -21383 -25018
6726b5018K902J8997l901j0075N544o519j40p093P827o106r886J0861R387n308
$$ -25018 -22116 -3119 -7020 -17095 -11551 -18070 -18210 -25303 -17476 -23582 -33468 -22607 -13220 -18528
6712a8528j118J483J4575r45M564j5877p134K209j050P814j6307L221J0708q487
$$ -18528 -19646 -18163 -3588 -4533 31 -15846 -22980 -20771 -21821 -14007 -30314 -27093 -16385 -24872
6698b4872J941P918K77K924K644k855n101K0771r797o213J394N294N53j7941O938
$$ -24872 -22931 -15013 -14736 -11812 -9168 -12023 -17124 3647 -6150 -12363 -10969 -5675 -5122 -23063 -16125
6683a6125n405P598M348p489K273j1661K0333Q780j4243k80L737j258Q404k930
$$ -16125 -21530 -13932 -9584 -17073 -14800 -26461 -6128 2652 -11591 -11871 -8134 -9392 -988 -3918
6669c918n302K530m789m342J0738m210J386K900R541j3690Q058P219j0118O044
$$ -3918 -9220 -6690 -11479 -15821 -5083 -9293 -7907 -5007 4534 -9156 -1098 6121 -3997 2047
6655B047J1240j3378L829N443k1473o051J3968k887P476j2053N479n768j2417
$$ 2047 13287 -91 3738 9181 -12292 -18343 -4375 -7262 214 -11839 -6360 -12128 -24545
6642b4545K4258M050m220o842N60R378m104K1194m346j3183J0088k128R515p776
$$ -24545 -287 3763 -457 -7299 -6739 2639 -1465 19729 15383 2200 12288 10160 19675 11899
6628A1899j4849j8411J8035N398m259K764K216M842j331j768j3267K399J2386
$$ 11899 -2950 -21361 -3326 2072 -2187 577 2793 7635 6304 4536 -8731 -6332 6054
6615F054J567j3818l014N035q093J2108K107m869J9395K2168J728m074p357j3139
$$ 6054 7621 -6197 -9211 -4176 -12269 -161 1946 -2923 16472 38640 40368 36294 28937 15798
6601A5798p768M446Q454L905J1378j4284J6764j2016j6186o852l929Q039n634
$$ 15798 8030 12476 20930 24835 36213 21929 38693 26677 10491 3639 -290 7749 2115
6588B115J6353q029p880R26J8049M396J3333J48o873M260j4748l308r235L018
$$ 2115 18468 10439 2559 3485 21534 25930 39263 39411 32538 36798 22050 18742 9507 12525
6574A2525M464j467J3860q653j1683k370O312J5654N663j3182O640N354j913j2213
$$ 12525 16989 15522 29382 20729 9046 6676 12988 28642 34305 21123 27763 33117 31204 18991
6560A8991P606L928j1830R213J4334M417p983k2279j0230J3377O367M838Q856
$$ 18991 26597 30525 18695 27908 42242 46659 38676 16397 6167 19544 25911 30749 39605
6547C9605J2006K474j1687L632j109M375j0149j1771J6564Q717p924L564o863
$$ 39605 51611 54085 42398 46030 44921 49296 39147 27376 43940 52657 44733 48297 41434
6534D1434j1459J135r267O038R139j3339q02O280N623L038J429p95R316m884k4546
$$ 41434 29975 31110 21843 27881 37020 23681 22879 29159 34782 37820 39249 38454 47770 42886 18340
6519A8340O681R573L493N442r87o921o761R2K3767R364J766p14j6716j1209O502
$$ 18340 25021 34594 38087 43529 42542 35621 28860 28952 52719 62083 63849 63135 46419 35210 41712
6504D1712J4983k138k378r188O421k044j297O831J5668j303l79j3587R366O967
$$ 41712 56695 54557 52179 42991 49412 47368 46071 52902 68570 67267 66888 53301 62667 69634
6490F9634k769n345j1376J9467j0660R330Q572j1042j538J3848J0647j784r753
$$ 69634 66865 61520 50144 69611 58951 68281 76853 65811 64273 78121 88768 86984 77231
6477G7231Q210k825O866L921p971k6650J1492J3620j4676Q965J1909j4806r068
$$ 77231 85441 82616 89482 93403 85432 58782 70274 83894 69218 78183 90092 75286 66218
6464F6218K212M995P776Q574J316K087p715j602Q910n034k517K997K0626n784
$$ 66218 68430 73425 81201 89775 91091 93178 85463 83861 92771 87737 85220 88217 108843 103059
6450A03059l445J824l3l948Q061J1989p182J0915l6l13o03k207k453n423K1432
$$ 103059 99614 101438 101405 97457 105518 117507 110325 121240 121204 120891 120288 118081 115628 110205 131637
6435A31637K633j3261J2161J701M747o324M774j1522N988Q381M989K307k593M637
$$ 131637 134270 121009 133170 134871 139618 133294 138068 126546 132534 140915 145904 148211 145618 150255
6421A50255J7553p406j369L599j4451J9707J6697m14j5452n76J1667M94L507J6676
$$ 150255 167808 160402 159033 162632 148181 167888 184585 184171 168719 168143 179810 180304 183811 200487
6407B00487J5251J7344J993j0942J1522O268O408K0006n99L251R983J2262j7146
$$ 200487 215738 233082 235075 224133 235655 241923 248331 268337 267738 270989 280972 293234 276088
6394B76088J4282J4980N089O340J2243M866K595J1166n97J6958K5820K6565K5766
$$ 276088 290370 305350 310439 316779 329022 333888 336483 347649 347052 364010 389830 416395 442161
6381D42161K4772K6572L0477L5236M0750M2723N8106O3971L2663L2724L4937J7535
$$ 442161 466933 493505 523982 559218 599968 642691 700797 764768 797431 830155 865092 882627
6369H82627q061l3072n7123l4949l1115l8585l8505n472Q945M246J2798M232K726
$$ 882627 874566 841494 784371 749422 718307 679722 641217 635745 644690 648936 661734 665966 668692
6356F68692M4451M6110N5380L2402J4946J8647l5k1125j4374l8773m1777K23j7452
$$ 668692 713143 759253 814633 847035 861981 880628 880593 859468 845094 806321 764544 764767 747315
6343G47315k6585m0304k2138N703K0826l281J3487L399K5384L9945M6268K3955
$$ 747315 720730 680426 658288 663991 684817 681536 695023 698422 723806 763751 810019 833974
6331H33974O6752P6001P2180J01632Q6510Q8313P8054N2441j2192o3268p7627
$$ 833974 900726 976727 1048907 1150539 1237049 1325362 1403416 1455857 1443665 1380397 1302770
6320A302770j03034r8090q1276n4632l6207o0306j7005j9003l2310j6824M618
$$ 1302770 1199736 1101646 1020370 965738 929531 869225 852220 833217 800907 784083 788701
6309G88701M1093Q784J7522L9047L5749M7154N0976O3542M8808O9973P4186O4779
$$ 788701 829794 838578 856100 895147 930896 978050 1029026 1092568 1141376 1211349 1285535 1350314
6297A350314M8837J4396k7867o5580m0791l6594m2035J537M1082L6544K8154L1667
$$ 1350314 1399151 1413547 1385680 1320100 1279309 1242715 1200680 1202217 1243299 1279843 1307997 1339664
6285A339664J7980l278k0370n6285r1476n4747m4806l3807l3099l0368o200P5
$$ 1339664 1357644 1354366 1333996 1277711 1186235 1131488 1086682 1052875 1019776 989408 983208 983283
6273I83283L338J8201J911K7478J9619L7701O8484M6240O0154J05344J14504J19416
$$ 983283 986621 1004822 1006733 1034211 1053830 1091531 1160015 1206255 1266409 1371753 1486257 1605673
6261A605673J26232J45759J35785O6322q832q7764j38658j36738j47186j38548
$$ 1605673 1731905 1877664 2013449 2079771 2070939 1983175 1844517 1707779 1560593 1422045
6251A422045q7568r2458m7967l7036j2461p458j1431p933J4872J9594N051Q845
$$ 1422045 1334477 1242019 1194052 1157016 1144555 1137097 1125666 1117733 1132605 1152199 1157250 1166095
6239A166095L0229K8566L6151O0595O3709N8774Q0124M5096R087o314n3578o8105
$$ 1166095 1196324 1224890 1261041 1321636 1385345 1444119 1524243 1569339 1578426 1572112 1518534 1450429
6227A450429p7674p3186m6891l4668k6101m957o314J1404m491j1112J5156J7988
$$ 1450429 1372755 1299569 1252678 1218010 1191909 1186952 1180638 1192042 1187551 1176439 1191595 1209583
6215A209583O210r738K7189K6124L2216L3946M0639M1209N0991P0831R7371J17363
$$ 1209583 1215793 1206055 1233244 1259368 1291584 1325530 1366169 1407378 1458369 1529200 1626571 1743934
6203A743934J16148J28289J26039J36308P8406K3996l4407j05166j21075j03094
$$ 1743934 1860082 1988371 2114410 2250718 2329124 2353120 2318713 2213547 2092472 1989378
6193A989378q4951p7526p1930l7454l6909j4079r255j1157L259J3476O0017L5433
$$ 1989378 1904427 1826901 1754971 1717517 1680608 1666529 1657274 1646117 1649376 1662852 1722869 1758302
6181A758302N7906Q7281J03998J13672J14759J47668J68931J96200K30223K51567
$$ 1758302 1816208 1903489 2007487 2121159 2235918 2383586 2552517 2748717 2978940 3230507
6171C230507L26304L92396M21737M28376L58118J79734m9858k61995m35163m81254
$$ 3230507 3556811 3949207 4370944 4799320 5157438 5337172 5287314 5025319 4590156 4108902
6161D108902m24374l48230k66509k01352j54235j34175j04620o9333k1802j7231
$$ 4108902 3684528 3336298 3069789 2868437 2714202 2580027 2475407 2406074 2384272 2367041
6151B367041k6514m25L3059P6910P4878R6706J04567J35465J50706J77029K05514
$$ 2367041 2340527 2340102 2373161 2450071 2524949 2621655 2726222 2861687 3012393 3189422 3394936
6140C394936K34206K83160L46863M06521M49042M60298L49651J21942j24181l58479
$$ 3394936 3629142 3912302 4259165 4665686 5114728 5575026 5924677 6046619 5922438 5563959
6130E563959m88832m70205m05353l19321k45446k00386j44213j12182q7020o2674
$$ 5563959 5075127 4604922 4199569 3880248 3634802 3434416 3290203 3178021 3091001 3028327
6120C028327j3950j3065M992K8806J4378N2558Q1326Q4903J08236J11523J14972
$$ 3028327 3014377 3001312 3006304 3035110 3049488 3102046 3183372 3268275 3376511 3488034 3603006
6109C603006J43129J49070J72336J91452K32710K56794K69631K84150K70983K26494
$$ 3603006 3746135 3895205 4067541 4258993 4491703 4748497 5018128 5302278 5573261 5799755
6099E799755J84756J53197J58000J98169K58661L48643M09956N08891N33559N37768
$$ 5799755 5984511 6137708 6295708 6493877 6752538 7101181 7511137 8020028 8553587 9091355
6089I091355M90446L48401J62067m7843k47938l76499m35667m48792l68623k76848
$$ 9091355 9581801 9930202 10092269 10044426 9796488 9419989 8984322 8535530 8166907 7890059
6079G890059k10476j08445k6614O0927J31422K25701L16408L82703M87149N65870
$$ 7890059 7679583 7571138 7544524 7605451 7736873 7962574 8278982 8661685 9148834 9714704
6069I714704O63532Q08173R43088J056143J176501J197317J090085P72886L05425
$$ 9714704 10378236 11186409 12129497 13185640 14362141 15559458 16649543 17422429 17727854
6060A7727854k94280q32750j224915j403517j373454j256688j056378q75912o95552
$$ 17727854 17433574 16600824 15375909 13972392 12598938 11342250 10285872 9409960 8714408
6051H714408n47353m16671l01235k08887j12602l1981N7479J15297J67172K47370
$$ 8714408 8167055 7750384 7449149 7240262 7127660 7095679 7153158 7268455 7435627 7682997
6041G682997L32248M21236M80325M62818M04195K25629j467k85256n13767p05304
$$ 7682997 8015245 8436481 8916806 9379624 9783819 10009448 10007981 9722725 9208958 8503654
6031H503654p84252p81745p15682o33436n40850m82821m06544l47469k76532k06602
$$ 8503654 7719402 6937657 6221975 5588539 5047689 4564868 4158324 3810855 3534323 3327721
6021C327721k21020j75048j66582j11113q5486j07006j28512j12635j22969q0804
$$ 3327721 3106701 2931653 2765071 2653958 2568472 2461466 2332954 2220319 2097350 2016546
6011B016546q5697p3321p0278j7358n889m1553n9477p7147j00048r0378p0963
$$ 2016546 1930849 1857528 1787250 1769892 1764003 1722450 1662973 1585826 1485778 1395400 1324437
6000A324437q3667o4432m6133l6738l3971l7627k2267l1881m3936m7621j8429
$$ 1324437 1240770 1176338 1130205 1093467 1059496 1021869 999602 967721 923785 876164 857735
5989H57735J788k3843j1083k7455k4532j5752n982l0672j6728j7212k4279M733
$$ 857735 859523 835680 824597 797142 772610 756858 750876 720204 703476 686264 661985 666718
5977F66718j34j1478k2586k442J349j3015o784j8046j471k351j8941J480K128
$$ 666718 666584 655106 632520 630078 631427 618412 611628 593582 592111 589760 570819 572299 574427
5964E74427k3829J0489Q255J159J6278M283J1322L5934P527J2478L8493L7365
$$ 574427 550598 561087 569342 570501 586779 591062 602384 638318 645845 658323 696816 734181
5952G34181L8299Q710k251k0838j9338k705k0030P205K2507K0847K1142m542o663
$$ 734181 772480 781190 778939 758101 738763 736058 716028 723233 745740 766587 787729 783187 776524
5939G76524k4527n2984n2718l9263k6442j1954o786j8736q253J3216J9171j2455
$$ 776524 751997 699013 646295 607032 580590 568636 561850 543114 534861 548077 567248 554793
5927E54793K4733K2464K603q144K238j6192K597R558K4198J0511J1304L4132K3799
$$ 554793 579526 601990 604593 596449 598687 582495 585092 594650 618848 629359 640663 674795 698594
5914F98594L4643L4595L5093L2184O4922M5097M9251O7297M8332J5743o744k2959
$$ 698594 733237 767832 802925 835109 900031 945128 994379 1061676 1110008 1125751 1119007 1096048
5902A096048m0087n2324m7474o1674l2157j6756j1037k6960J083O32R236J6468
$$ 1096048 1055961 1003637 956163 894489 862332 845576 834539 807579 808662 809294 818530 834998
5890H34998L0839L1901N2679K9553P6409R4271N2453R2444R0994R7657R4968O7621
$$ 834998 865837 897738 950417 979970 1056379 1150650 1203103 1295547 1386541 1484198 1579166 1646787
5878A646787L4234J4246k1937n5905n7146o7053r2680r9487p8815p1768n1380
$$ 1646787 1681021 1695267 1673330 1617425 1560279 1493226 1400546 1301059 1222244 1150476 1099096
5867A099096m9430j370Q913K4534J3293Q347J814k8347j9010p507r340J5710L3040
$$ 1099096 1049666 1048296 1057209 1081743 1095036 1103383 1105197 1076850 1057840 1050333 1040993 1056703 1089743
5854A089743L4656J3218K3042J6096m125j0764k0865j5816j9539l370K1375K8464
$$ 1089743 1124399 1137617 1160659 1176755 1172630 1161866 1141001 1125185 1105646 1102276 1123651 1152115
5842A152115L3532l096m5111m0634k1538L271m663K0505o56N8771L6116J7424
$$ 1152115 1185647 1182551 1137440 1096806 1075268 1078539 1073876 1094381 1093725 1152496 1188612 1206036
5830A206036L0142K1495J8674k501L3944M6773O1686Q9844J02747J27251J54088
$$ 1206036 1236178 1257673 1276347 1273846 1307790 1354563 1416249 1506093 1608840 1736091 1890179
5819A890179J88684J93945K25462K66043L33780L44439L06441J93144j6718k13883
$$ 1890179 2078863 2272808 2498270 2764313 3098093 3442532 3748973 3942117 3925399 3711516
5809C711516l39859m31701m08577l38476k84489k22214j64268j50622j16079r7098
$$ 3711516 3371657 2939956 2531379 2192903 1908414 1686200 1521932 1371310 1255231 1158133
5799A158133q7277o7436m7394n0040n7314l4818m7236n9163l2909k2468j9279
$$ 1158133 1070856 1003420 956026 905986 848672 813854 766618 707455 674546 652078 632799
5788F32799j0690k6129l2342j5317k7005j6840M883j0086n619L611m908k4131
$$ 632799 622109 595980 563638 548321 521316 504476 509359 499273 493654 497265 492357 468226
5776D68226n079j1253j0613r422p042N10Q78j2130m460J9565j3388j0764O664
$$ 468226 463147 451894 441281 431859 424817 425327 426205 414075 409615 429180 415792 405028 411692
5763D11692J639r370L799J4328q674M70j18J5206n912N976M033j1250M167J4832
$$ 411692 413331 403961 407760 422088 413414 413884 413766 428972 423060 429036 433069 421819 425986 440818
5749D40818k14j2290R341K094n15j9646K385K2039l175J4744j6030q319J5806
$$ 440818 440604 428314 437655 439749 439234 419588 421973 444012 440837 455581 439551 431232 447038
5736D47038N489Q092J2981P636K1508K7780K4125J1943P949K9933K9488K8636
$$ 447038 452527 460619 473600 481236 502744 530524 554649 566592 574541 604474 633962 662598
5724F62598M0127M2033K4563N6190N8953O6152O5932R1642Q3755M5922J4882p213
$$ 662598 702725 744758 769321 825511 884464 950616 1016548 1108190 1191945 1237867 1252749 1245536
5712A245536l3876q2352q9112o3919m4700m4020k5216l2931j2086m424K2788K3181
$$ 1245536 1211660 1129308 1040196 976277 931577 887557 862341 829410 817324 812900 835688 858869
5700H58869l334M0823M5947M9563P1662O4322Q1542J09383J32011J47310J57160
$$ 858869 855535 896358 942305 991868 1063530 1127852 1209394 1318777 1450788 1598098 1755258
5689A755258J55167Q5845R756q3223j50038j62520j63985j38216j03425p9397
$$ 1755258 1910425 1996270 2006026 1922803 1772765 1610245 1446260 1308044 1204619 1125222
5679A125222p5355n2797o2276n3742j9087K790o382O934k1942j9751J7014K2062
$$ 1125222 1049867 997070 934794 881052 861965 864755 858373 865307 843365 823614 840628 862690
5667H62690M5119N1876N9772O4562O5343M9166K9737L697l3623l7867n7178n5571
$$ 862690 907809 959685 1019457 1084019 1149362 1198528 1228265 1231962 1198339 1160472 1103294 1047723
5655A047723o9295p2269o4635m7607n4729m5203l5243l1873l0363k2266l0479
$$ 1047723 978428 906159 841524 793917 739188 693985 658742 626869 596506 574240 543761
5644E43761j8696n817j1133J242j0895j0448O980p848j9233N649k444K6101J1018
$$ 543761 525065 519248 508115 509357 498462 488014 494994 487146 467913 473562 471118 497219 508237
5631E08237n184j829L981m845j4749R46K678q543j423o512n00k1874m614J1742
$$ 508237 503053 501224 505205 500360 485611 486557 489235 480692 479269 472757 472257 450383 445769 457511
5617D57511p635k818o939K373J532o839N888L3780J5709j1595j8421O433L621
$$ 457511 449876 447058 440119 442492 444024 437185 443073 476853 492562 480967 462546 468979 472600
5604D72600K438j283j373J4804o633N602K1854j872r288K1244J6806J5463j1803
$$ 472600 475038 473755 472382 487186 480553 486155 508009 506137 496849 518093 534899 550362 538559
5591E38559J1733j505J3707P679O041K137J8067K7664J5398J2755l648Q946J4794
$$ 538559 550292 548787 562494 570173 576214 578351 596418 624082 639480 652235 648587 657533 672327
5578F72327K1098J2951R505n221J4037J8219K3819J1094Q853J120L7335L3884
$$ 672327 693425 706376 715881 710660 724697 742916 766735 777829 786682 787802 825137 859021
5566H59021J2315J3801K1208J4556K2859L3478O003J3728K6091K5408M1238M1582
$$ 859021 871336 885137 906345 920901 943760 977238 983241 996969 1023060 1048468 1089706 1131288
5554A131288L2765L1093L5830K9714L6785M2220L0864M0729L9772L2206L5605
$$ 1131288 1164053 1195146 1230976 1260690 1297475 1339695 1370559 1411288 1451060 1483266 1518871
5543A518871L8437M2826N3539L8273M3853O0776N5712M4843N9327N3570N9845
$$ 1518871 1557308 1600134 1653673 1691946 1735799 1796575 1852287 1897130 1956457 2010027 2069872
5532B069872O7892N8964Q3385O6838O2596R7299J01589J11972J14510J14741J36556
$$ 2069872 2137764 2196728 2280113 2346951 2409547 2506846 2608435 2720407 2834917 2949658 3086214
5521C086214J48748J39465J70628J74669K02911K25323K67781K98491L40545L51676
$$ 3086214 3234962 3374427 3545055 3719724 3922635 4147958 4415739 4714230 5054775 5406451
5511E406451M02482M66067N28517N90949O66409P56274P52819O85587N38880L10151
$$ 5406451 5808933 6275000 6803517 7394466 8060875 8817149 9569968 10255555 10794435 11104586
5501A1104586J803k77143m87536n72620n92150n04922l98453l04204k04131j28782
$$ 11104586 11106389 10829246 10341710 9769090 9176940 8672018 8273565 7969361 7765230 7636448
5491G636448m442P7762J78634K89091L68314M46319N40618O76472P84757R63953
$$ 7636448 7632006 7709768 7888402 8177493 8545807 8992126 9532744 10209216 10993973 11957926
5481A1957926J128616J276429J361807J235756Q77527L24136l43419r51960j363893
$$ 11957926 13086542 14362971 15724778 16960534 17838061 18162197 17818778 16866818 15502925
5472A5502925j518230j468005j301302j099962r15846p37499n86575m55395l38375
$$ 15502925 13984695 12516690 11215388 10115426 9199580 8462081 7875506 7420111 7081736
5463G081736k46353j62297q1118k0095M2745J30710J92501K59777L17055L95791
$$ 7081736 6835383 6673086 6591968 6571873 6614618 6745328 6937829 7197606 7514661 7910452
5453G910452M10689L64595K41925N4742j94896m17759o18446o86838o78166o28177
$$ 7910452 8321141 8685736 8927661 8982403 8787507 8369748 7751302 7064464 6386298 5758121
5443E758121n53996m98565l82991l30205k84161k59986k38826k07370j49535j35351
$$ 5758121 5204125 4705560 4322569 3992364 3708203 3448217 3209391 3002021 2852486 2717135
5433B717135j40656p7742o9907p4797o9589r8524r4828q5328p3251l7442j2927
$$ 2717135 2576479 2498737 2428830 2354033 2284444 2185920 2091092 2005764 1932513 1895071 1882144
5422A882144l4387j9491N313N000k1562k587j9842j4587J1353J9352K7446M0567
$$ 1882144 1847757 1828266 1833579 1838579 1817017 1814430 1794588 1780001 1791354 1810706 1838152 1878719
5410A878719O6349O3078P7188N5375p165k2372p7223j08986r6148j17749j00586
$$ 1878719 1945068 2008146 2085334 2140709 2133544 2111172 2033949 1924963 1828815 1711066 1610480
5399A610480n9120o8779o9674j1969J1008j0660m142L7742O5272Q3430Q1367Q0010
$$ 1610480 1551360 1482581 1412907 1400938 1411946 1401286 1397144 1434886 1500158 1583588 1664955 1744965
5387A744965J03180Q0219N1407j0461l8714n3979j02044j20515j39920j39542
$$ 1744965 1848145 1928364 1979771 1969310 1930596 1876617 1774573 1654058 1514138 1374596
5377A374596j07602r0052q4302n3527n3728l4866k5013p406j3768j3178O070o896
$$ 1374596 1266994 1176942 1092640 1039113 985385 950519 925506 918100 904332 891154 897224 890328
5365H90328j782J3063K849J7838K3406K5352J6952M1841L9611O1665P3475P2089
$$ 890328 888546 901609 904458 922296 945702 971054 988006 1029847 1069458 1131123 1204598 1276687
5353A276687O8243P3925J06091J28425J36255R0499N8040K2881l0219k5312o4467
$$ 1276687 1344930 1418855 1524946 1653371 1789626 1880125 1938165 1961046 1930827 1905515 1841048
5342A841048j27619j17091q6292p0055o2268j2955k164q57p083K6301L0377M1622
$$ 1841048 1713429 1596338 1510046 1439991 1377723 1364768 1362604 1361747 1354664 1380965 1411342 1452964
5330A452964O3729O2556N5030N9628N2581K7916j6310m3607p4203j08988j22713
$$ 1452964 1516693 1579249 1634279 1693907 1746488 1774404 1758094 1714487 1640284 1531296 1408583
5319A408583j21349r7598p6035m4044k2234k2345l7487k4050l1569n4728m8976
$$ 1408583 1287234 1189636 1113601 1069557 1047323 1024978 987491 963441 931872 877144 828168
5308H28168m8173j2522m2433j6153j455J206L0039R729j4801k1089k7315m1031
$$ 828168 779995 767473 725040 708887 707432 708638 738677 748406 733605 712516 685201 644170
5296F44170l0610p021m211n622r661K238j4819l8885l8396n8359m5694j4171j3084
$$ 644170 613560 606539 602328 596706 587045 589283 574464 535579 497183 438824 393130 378959 365875
5283C65875j5453k0282m25j4344j1343k7169j0776M974j6748m537P934j3051M538
$$ 365875 350422 330140 329715 315371 304028 276859 266083 271057 254309 249772 257706 244655 249193
5270B49193j3649j1985J4758p366O590K130q96j5515p620K906j0610r005K100
$$ 249193 235544 223559 238317 230951 237541 239671 238775 223260 215640 218546 207936 198931 201031
5257B01031j35O09K313J487q002q74O381m173p453R903j3488j664j2174p29k295
$$ 201031 200896 201505 203818 205305 197303 196429 202810 198637 191184 201087 187599 185935 173761 173032 170737
5242A70737o248R439K2801l621j1751r758J5306n436j2941M840r342J6253l648
$$ 170737 164489 173928 196729 193108 181357 171599 186905 181469 168528 173368 164026 180279 176631
5229A76631k885m726J034J9420q518J760k0572J6307k218m63M88j2415l969K218
$$ 176631 173746 169020 170054 189474 180956 182716 162144 178451 176233 175770 176258 163843 159874 162092
5215A62092J295K2754k211p945r826J2118R592j5360j0402k128J3167N230N3J3245
$$ 162092 163387 186141 183930 175985 166159 178277 187869 172509 162107 159979 173146 178376 178429 191674
5201A91674q572l350p619n843R127j1295k553n287R098K651J4059n659J138L33
$$ 191674 183102 179752 172133 166290 175417 164122 161569 156282 165380 168031 182090 176431 177569 177902
5187A77902j1672j7954P098J7376o267K788K006j0885K2462L324l998n396J40
$$ 177902 166230 148276 155374 172750 166483 169271 171277 160392 182854 186178 182180 176784 176924
5174A76924j1452j565n856j5955L359P427p992l189J4596J5312J54p581N060o080
$$ 176924 165472 163907 158051 142096 145455 152882 144890 141701 156297 171609 171763 164182 169242 163162
5160A63162O351L0873J970Q157K113j0516O356J0807q290j7719Q481l588r38r327
$$ 163162 169513 200386 202356 210513 212626 202110 208466 219273 210983 193264 201745 198157 197219 187892
5146A87892j8037O839j2934K104o987J50r232o433J650j37J0387L384J7827L021
$$ 187892 169855 176694 163760 165864 158877 159027 149795 143362 145012 144875 155262 158646 176473 179494
5132A79494j0444l996j226J3517K619k1620n748n384O674J1385j6043N300l905
$$ 179494 169050 165054 163828 177345 179964 158344 152596 147212 153886 165271 149228 154528 150623
5119A50623l274K159j1542p42P864j1420J0892J0097j8237j2264L388l187N71
$$ 150623 147349 149508 137966 137224 145088 133668 144560 154657 136420 124156 127544 124357 124928
5106A24928J2190n632M720P449P352j1196j3213l914R985N392L237k536P093M60
$$ 124928 137118 131486 136206 143655 151007 139811 126598 122684 132669 138061 141298 138762 145855 146315
5092A46315L752N958n620j218k2776K2782J5297L839j427R566J484j5434K148
$$ 146315 150067 156025 150405 149187 126411 149193 164490 168329 166902 176468 177952 162518 164666
5079A64666k385j261J0807j902o567k296o478J144J6295P71J665O681L766J1406
$$ 164666 162281 161020 171827 169925 163358 161062 154584 155728 172023 172794 174459 181140 184906 196312
5065A96312o652J967J4987j8180l481K6794R019N652j5421J621J4024K4577J3755
$$ 196312 189660 191627 206614 188434 184953 211747 220766 226418 210997 212618 226642 251219 264974
5052B64974J1684M897M195j7143Q574J613l910M145j4605l318Q36l017j1563j4762
$$ 264974 276658 281555 285750 268607 277181 278794 274884 279029 264424 261106 261942 258925 247362 232600
5038B32600m027J0329l228l667j1753J870J2568j1120j855J4143P672l656J5986
$$ 232600 228573 238902 235674 232007 220254 222124 234692 223572 221717 235860 243532 239876 255862
5025B55862K5244n613J7367J1360J8988K2001k47K6517J4143J1328k1003N519
$$ 255862 281106 275493 292860 304220 323208 345209 344962 371479 385622 396950 375947 381466
5013C81466K1349k4665j9410o521m454j4698l7843k6612j9146j1677n055Q04q136
$$ 381466 402815 378150 358740 352219 347765 333067 295224 268612 249466 237789 232734 233538 225402
5000B25402p922J677K768r017R289p30o639O900J0341J3205P307J4469M175J035
$$ 225402 217480 219157 221925 212908 222197 221467 214828 221728 232069 245274 252581 267050 271225 272260
4986B72260J7672N857m988Q152J0965j5920l800n079M731j5319o570j6390r110
$$ 272260 289932 295789 290801 298953 309918 293998 290198 285119 289850 274531 267961 251571 242461
4973B42461j8814j1597O609j1311l353j0746m787J2142j24j264J251n479j3795
$$ 242461 223647 212050 218659 207348 203995 193249 188462 200604 200480 199216 200467 194988 181193
4960A81193j3075K8237J492l591R692P684o951k3707k697J5874O164j7409j3111
$$ 181193 168118 196355 197847 194256 203948 211632 204681 180974 178277 194151 200315 182906 169795
4947A69795J5421o310R209q111M826o888j0887K0291n680j4900n700J4860J1344
$$ 169795 185216 178906 188115 180004 184830 177942 167055 187346 181666 166766 161066 175926 187270
4934A87270l295J0390r653j4507r107K3914R923N669Q44K334R023L283m229k395
$$ 187270 183975 194365 184712 170205 161098 185012 194935 200604 201448 203782 212805 216088 211859 209464
4920B09464J86P369m183k704N466l63j1374J2516k557m597K492K0529K246o080
$$ 209464 209650 217019 212836 210132 215598 215235 203861 216377 213820 209223 211715 232244 234490 228410
4906B28410J2953j776n503P653j094L974o056O809p984J805L704j604N938k4776
$$ 228410 241363 239587 234084 241737 240643 244617 238561 245370 237386 239191 242895 241291 247229 222453
4892B22453q395J6013N391p490N971O634k730N051r6J0892J0581P866J512k18
$$ 222453 214058 230071 235462 227972 233943 240577 237847 242898 242802 253694 264275 272141 273653 273435
4878B73435J0056J9540P302p350K6017J0085k0931Q382J9424j2090M408j1078
$$ 273435 283491 303031 310333 302983 329000 339085 318154 326536 345960 333870 338278 327200
4866C27200J0709L0191M019k2401p13J7028K3873K1477K8510N538P167n254j388
$$ 327200 337909 368100 372119 349718 349005 366033 389906 411383 439893 445431 452598 447344 445956
4853D45956l0752k1248j6235l9951k2861l154m830K879m278r643n634N541J5068
$$ 445956 415204 393956 377721 337770 314909 311755 306925 309804 305526 295883 290249 295790 310858
4840C10858j9787P133J7645n968p168M717O240j100J224k2799o2l734o086k628
$$ 310858 291071 298204 315849 309881 302713 307430 313670 312570 313794 290995 290933 287199 281113 278485
4826B78485P090m582j7107o899r274J7573K894j0744L362l399O267L505N216m157
$$ 278485 285575 280993 263886 256987 247713 265286 268180 257436 260798 257399 263666 267171 272387 268230
4812B68230j3016q118n834j0313N877R629J4005r987Q973q223j0901j2221Q552
$$ 268230 255214 247096 241262 230949 236826 246455 260460 250473 259446 251223 240322 228101 236653
4799B36653N755K5968P276k6929J196Q33N236m619r910L203P209N04Q897q125
$$ 236653 242408 268376 275652 248723 249919 250752 255988 251369 241459 244662 251871 252375 261272 253147
4785B53147q796L640K0633l736k490R613r593j2205j797k1192K3447k524J6757
$$ 253147 244351 247991 268624 264888 262398 272011 262418 250213 248416 227224 250671 248147 264904
4772B64904P760j4807n279K516R684o339M641J1509N162j0322k36K306Q805N014
$$ 264904 272664 257857 252578 255094 264778 258439 263080 274589 279751 269429 269193 271499 280304 285318
4758B85318r709O455q175O20l041K447J7703j2186m506K0899Q997j0021M620J6879
$$ 285318 275609 282064 273889 274509 271468 273915 291618 279432 274926 295825 304822 294801 299421 316300
4744C16300j429N754J6525p977p489O059P255J3770k372r012j4037j852P710o689
$$ 316300 314871 320625 337150 329173 321684 327743 334998 348768 346396 337384 323347 321495 329205 322516
4730C22516j0641j1464n849J1092l485p846j6445J3229Q826j246k507R68J7252
$$ 322516 311875 300411 294562 305654 302169 294323 277878 291107 299933 298687 296180 297148 314400
4717C14400J241L49J272K610M446p468l285J0798K1526J466j3519L884N854o980
$$ 314400 315641 315990 317262 319872 324318 316850 313565 324363 345889 347355 333836 337720 343574 336594
4703C36594j0098L688N100K2137R085j13K1715l903m864L379R049L186j3989q962
$$ 336594 326496 330184 335284 357421 366506 366393 388108 384205 379341 382720 391769 394955 380966 372004
4689C72004Q478n083O387j3716L743Q008M667J3506J4424J2120n235r798n682
$$ 372004 380482 375399 381786 368070 371813 379821 384488 397994 412418 424538 419303 409505 403823
4676D03823P386M835J7588l362k499K234r595J0294N842j107M442m921J6500N34
$$ 403823 411209 416044 433632 430270 427771 430005 420410 430704 436546 435439 439881 434960 451460 451994
4662D51994r5R862J8485N835K60j2597j5410L46N967p476j5367l315L1007j667
$$ 451994 451899 461761 480246 486081 486341 473744 458334 458680 464647 457171 441804 438489 469496 467829
4648D67829J639Q996R794K221Q94K86J7779N582J1287j5495J0559K3715n965o40
$$ 467829 469468 478464 488258 490479 491373 491659 509438 515020 526307 510812 521371 545086 539121 538481
4634E38481l579P82j13J196j3776J2776J1668m541J4000o261k0909o338m358K3245
$$ 538481 534902 535684 535571 536767 522991 535767 547435 542894 556894 550633 529724 523386 519028 542273
4620E42273l963l258P841N397k109P07J2476j5249J0072K577P111L0838j186n772
$$ 542273 538310 535052 542893 548290 546181 546888 559364 544115 554187 556764 563875 594713 593527 587755
4606E87755J4390l079q096J2921P870J9968J8592j2279p957M832J7552R920m785
$$ 587755 602145 599066 590970 603891 611761 631729 650321 638042 630085 634917 652469 662389 657604
4593F57604J1372q401O359n617J2505o809J2228r564M823J273M886K4314M407
$$ 657604 668976 660575 666934 661317 673822 667013 679241 669677 674500 675773 680659 704973 709380
4580G09380R608M161K0062J3588K234j7493l050J6587P336j603q503n061k184
$$ 709380 718988 723149 743211 756799 759033 741540 738490 755077 762413 760810 752307 747246 745062
4567G45062j1629O312o691N991o203R339K765n50j6064m1P091J5426R499K4503
$$ 745062 733433 739745 733054 739045 732842 742181 744946 744396 728332 728291 735382 750808 760307 784810
4553G84810K1980l673J1618j558R485J7421J0949K0707Q450K1753L5439K1066
$$ 784810 806790 803117 814735 813177 822662 840083 851032 871739 880189 901942 937381 958447
4541I58447K8496K4435M0588M2386N4707Q6815P8405J17606J13283J22519J24291
$$ 958447 986943 1011378 1051966 1094352 1149059 1235874 1314279 1431885 1545168 1667687 1791978
4530A791978Q8743P4066L2400K0362k5396m9254o1091p6773p2085k6127j9621
$$ 1791978 1880721 1954787 1987187 2007549 1982153 1932899 1871808 1795035 1722950 1696823 1677202
4519A677202k0155n0390q5321j14188r9499r9016p2690n5892m7912m7117m2834
$$ 1677202 1657047 1606657 1521336 1407148 1307649 1208633 1135943 1080051 1032139 985022 942188
4508I42188l8991m4035j9413k4601j9059j5101j8301p558j6996j5275m086j5644
$$ 942188 903197 859162 839749 815148 796089 780988 762687 755129 738133 722858 718772 703128
4496G03128M23j2614j2444o55r038j510l600J9775o156j9509n345J9320q790p070
$$ 703128 703551 690937 678493 677838 668800 667290 663690 683465 677309 657800 652455 671775 662985 655915
4482F55915k2118K289J1704J078N170j3683j1119r684J1463r460Q118J5061J899
$$ 655915 633797 636086 647790 648868 654038 640355 629236 619552 631015 621555 629673 644734 646633
4469F46633N888n742r542J006J5543L531j2740J9880Q912O070Q199J6350p166
$$ 646633 652521 646779 637237 638243 653786 657317 644577 664457 673369 679439 687638 703988 696822
4456F96822o63K3965L648J5834R177J4340K0288J9461L4483L7297K4325K4937
$$ 696822 696159 720124 723772 739606 748783 763123 783411 802872 837355 874652 898977 923914
4444I23914J5659J3614K1252k6960m3021k2239k5207l7508j7526j1488k5088k1221
$$ 923914 939573 953187 974439 947479 904458 882219 857012 819504 801978 790490 765402 744181
4432G44181j166q011J0500j3232j3902M912m68j6317j5326Q216K697J413n870
$$ 744181 743015 735004 745504 732272 718370 723282 722814 706497 691171 699387 702084 703497 697627
4419F97627j2321K249j1215j005O496P429P068K845j4626j2767J5375M938j5967
$$ 697627 685306 687555 676340 675335 681831 689260 696328 699173 684547 671780 687155 692093 676126
4406F76126M087K797P758K6550j19q49J8072Q136J2759K567j006O042J2442n401
$$ 676126 680213 683010 690768 717318 717199 716350 734422 742558 755317 757884 756878 762920 775362 769961
4392G69961K197O471J8097K5429K4406Q112J1036K2600K7445N567K4610K1283
$$ 769961 772158 778629 796726 822155 846561 854673 865709 888309 915754 921321 945931 967214
4380I67214J127K4149J1284J0114J5635K4631j7781P431P818q127j686N639N656
$$ 967214 968341 992490 1003774 1013888 1029523 1054154 1036373 1043804 1051622 1043495 1041809 1047448 1053104
4367A053104j8169P801j5039O21K9976P481K2303K0782J8221J6400K235N817K541
$$ 1053104 1034935 1042736 1027697 1028318 1058294 1065775 1088078 1108860 1127081 1143481 1145716 1151533 1154074
4354A154074J2704J5442J2022M7910J4120Q097m503P880R406p67K087J8343J5879
$$ 1154074 1166778 1182220 1194242 1242152 1256272 1264369 1259866 1267746 1277152 1276385 1278472 1296815 1312694
4341A312694J1196J2902r02J1327J4374J3853J9362J3890K7641K7166L7236L4113
$$ 1312694 1323890 1336792 1335890 1347217 1361591 1375444 1394806 1408696 1436337 1463503 1500739 1534852
4329A534852P0206P2754O0439Q2385J02538O9078O7876J8212l3918k9628m1543
$$ 1534852 1605058 1677812 1738251 1820636 1923174 1992252 2060128 2078340 2044422 2014794 1973251
4318A973251k6894L231J8540Q054q678m858j628J7862J8667J1665n221l0243l5757
$$ 1973251 1946357 1949588 1968128 1976182 1967504 1962646 1961018 1978880 1997547 2009212 2003991 1973748 1937991
4305A937991l6399n2174l7099k9792l3732l7639l7064j8423k9268L309O6J7878
$$ 1937991 1901592 1849418 1812319 1782527 1748795 1711156 1674092 1655669 1626401 1629710 1629776 1647654
4293A647654J5067J2299K4738L7865P211J2105p3J1044K8293M829J5772M137J6189
$$ 1647654 1662721 1675020 1699758 1737623 1744834 1756939 1756866 1767910 1796203 1801032 1816804 1820941 1837130
4280A837130K6355J8747L9863N0093P7697J03818Q8908J16797J58741J58056K07098
$$ 1837130 1863485 1882232 1922095 1972188 2049885 2153703 2242611 2359408 2518149 2676205 2883303
4269B883303K53673K96054L71055M25898M12519L30954Q9513k25979m20173m65174
$$ 2883303 3136976 3433030 3804085 4229983 4642502 4973456 5062969 4836990 4416817 3951643
4259C951643l99512l33077k32592j31199r7180j31689j70939j85425j50108j38572
$$ 3951643 3552131 3219054 2986462 2855263 2758083 2626394 2455455 2270030 2119922 1981350
4249A981350j05317r8999q8074p2571n6046m4201m7129j5415k5012l2188j6819
$$ 1981350 1876033 1777034 1688960 1616389 1560343 1516142 1469013 1453598 1428586 1396398 1379579
4238A379579k601j0652k9279j0039M255l245L806m291m149j4637N739j4473j734
$$ 1379579 1376978 1366326 1337047 1327008 1331263 1328018 1331824 1327533 1323384 1308747 1314486 1300013 1298279
4225A298279l577J6341q757O961K8131J3915p225L244j0206J711N745M668O381
$$ 1298279 1294702 1311043 1302286 1309247 1337378 1351293 1344068 1347312 1337106 1338817 1344562 1349230 1355611
4212A355611l065j344J1869J4402J7039K7674K2918R049R693L2005K0371o317
$$ 1355611 1352546 1351202 1363071 1377473 1394512 1422186 1445104 1454153 1463846 1495851 1516222 1509905
4200A509905j5646N212K691Q219n539P19j1094L052j31j4185J9473J5212K0208
$$ 1509905 1494259 1499471 1502162 1510381 1504842 1505561 1494467 1497519 1497388 1483203 1502676 1517888 1538096
4187A538096j4810O766M689p014m397k2992P1L168R956P677P03J4579K7918k185
$$ 1538096 1523286 1530052 1534741 1527727 1523330 1500338 1500409 1503577 1513533 1521210 1521913 1536492 1564410 1562225
4173A562225J1836m42J9161J2731K3587J7017R555J0697k15J5581J0849O741J6125
$$ 1562225 1574061 1573619 1592780 1605511 1629098 1646115 1655670 1666367 1666152 1681733 1692582 1699323 1715448
4160A715448J4906J6275J5503K0899J1315J9778J7285K3808J34J0995k31P560
$$ 1715448 1730354 1746629 1762132 1783031 1794346 1814124 1831409 1855217 1855351 1866346 1866115 1873675
4148A873675J7411K8395Q531k422N712K9798J9161R657M1185N723J4847J6977
$$ 1873675 1891086 1919481 1928012 1925590 1931302 1961100 1980261 1989918 2031103 2036826 2051673 2068650
4136B068650K6183K1746K071L9148K6513j282J6918K3997J7901O929O271J8437
$$ 2068650 2094833 2116579 2118650 2157798 2184311 2183029 2199947 2223944 2241845 2248774 2255045 2273482
4124B273482K6971J4239M63R442K5378M1624p120L829J9953K6558P603J310K2215
$$ 2273482 2300453 2314692 2315155 2324597 2349975 2391599 2384479 2388308 2408261 2434819 2442422 2443732 2465947
4111B465947J1991K9616L7857K4787K0323J7844K4108J7152J0194J5968K4590
$$ 2465947 2477938 2507554 2545411 2570198 2590521 2608365 2632473 2649625 2659819 2675787 2700377
4100B700377K9801R553J3503O100K4740L5865K4149J6191J9003N868J9009J3620
$$ 2700377 2730178 2739731 2753234 2759334 2784074 2819939 2844088 2860279 2879282 2885150 2904159 2917779
4088B917779K3306L0146K2185Q970K6751P867K2544K5115J5364K975K8480J9731
$$ 2917779 2941085 2971231 2993416 3002386 3029137 3037004 3059548 3084663 3100027 3103002 3131482 3151213
4076C151213K2606K6741P420K1697J9820J5535L4419J6280M17K1147K2059J5390
$$ 3151213 3173819 3200560 3207980 3229677 3249497 3265032 3299451 3315731 3316148 3337295 3359354 3374744
4064C374744M326J9328j352Q204K6745J4663K0261J1542M157J6182L2888K2671
$$ 3374744 3379070 3398398 3397046 3405250 3431995 3446658 3466919 3478461 3482618 3498800 3531688 3554359
4052C554359K7846J6395R285J7348L4204K8717P040q970J8317Q190K26K4631K2685
$$ 3554359 3582205 3598600 3607885 3625233 3659437 3688154 3695194 3686224 3704541 3712731 3712957 3737588 3760273
4039C760273J737P371J3339K0523J9072N750J5710j978R941K7893L1956Q360M99
$$ 3760273 3762010 3769381 3782720 3803243 3822315 3828065 3843775 3841797 3851738 3879631 3911587 3919947 3920446
4026C920446N941K4475J6365J6925J7871M34J572J6056J4328K8852K2550R807
$$ 3920446 3926387 3950862 3967227 3984152 4002023 4002457 4004029 4020085 4034413 4063265 4085815 4095622
4014D095622J0463J6400J2713J517J3655K3694L4897J6654J9496K6435J0460J2126
$$ 4095622 4106085 4122485 4135198 4136715 4150370 4174064 4208961 4225615 4245111 4271546 4282006 4294132
4002D294132K0599K7851K3164K0669J9142R456K4860L3810K0306M016K9574K1474
$$ 4294132 4314731 4342582 4365746 4386415 4405557 4415013 4439873 4473683 4493989 4498005 4527579 4549053
3990D549053K452K2115L3309K0038J1452J9450L3328K3228J7181K4896K2234J7437
$$ 4549053 4551505 4573620 4606929 4626967 4638419 4657869 4691197 4714425 4731606 4756502 4778736 4796173
3978D796173K6796L6444n491J9072M1204J3588J6460L2080L0247L7453J9044L5493
$$ 4796173 4822969 4859413 4853922 4872994 4914198 4927786 4944246 4976326 5006573 5044026 5063070 5098563
3966E098563M2083K8297P637K3013K5042M5076L6760N345L8910L3815J0467L2231
$$ 5098563 5140646 5168943 5176580 5199593 5224635 5269711 5306471 5311816 5350726 5384541 5395008 5427239
3954E427239L7088M5940K3768L4795L8026K2442M3922M0453M8458L2555M9845
$$ 5427239 5464327 5510267 5534035 5568830 5606856 5629298 5673220 5713673 5762131 5794686 5844531
3943E844531N3340M1992N8895L8905N5610N1281M2507M6637N6276N2474N9875
$$ 5844531 5897871 5939863 5998758 6037663 6093273 6144554 6187061 6233698 6289974 6342448 6402323
3932F402323O2057L8286L0480O9193P2503N4865M5919N3987N2158O6119M6256
$$ 6402323 6464380 6502666 6533146 6602339 6674842 6729707 6775626 6829613 6881771 6947890 6994146
3921F994146N2572O9931O1494N3075O4848P2730N3495P2126M3407N6569N9720
$$ 6994146 7046718 7116649 7178143 7231218 7296066 7368796 7422291 7494417 7537824 7594393 7654113
3910G654113O4650Q1982O7792N9731N2232O1411P1183M5763P0153N4829P5668
$$ 7654113 7718763 7800745 7868537 7928268 7980500 8041911 8113094 8158857 8229010 8283839 8359507
3899H359507Q5262N7738M8839Q5895P3759R0540J02199P7781P0231P2187Q9300
$$ 8359507 8444769 8502507 8551346 8637241 8711000 8801540 8903739 8981520 9051751 9123938 9213238
3888I213238Q6207R6687J07409Q7338Q9128Q8266R4029R5662R9938P7303R8007
$$ 9213238 9299445 9396132 9503541 9590879 9680007 9768273 9862302 9957964 10057902 10135205 10233212
3877A0233212Q9157O1476N9018O5987O3483P9884O5256N7569P0580P1174N9882
$$ 10233212 10322369 10383845 10442863 10508850 10572333 10652217 10717473 10775042 10845622 10916796 10976678
3866A0976678P1939O6972N1359Q0131P1256L5621N0738O0450K9550O7783M7307
$$ 10976678 11048617 11115589 11166948 11247079 11318335 11353956 11404694 11465144 11494694 11562477 11609784
3855A1609784K4696L9753O2144K8499K0922K4772L6471J8638R056L0835J6262
$$ 11609784 11634480 11674233 11736377 11764876 11785798 11810570 11847041 11865679 11874735 11905570 11921832
3844A1921832O504K3546N906K7105L3394J6783J2213L3863L4034M1562J7193Q167
$$ 11921832 11928336 11951882 11957788 11984893 12018287 12035070 12047283 12081146 12115180 12156742 12173935 12182102
3832A2182102J8653J1698L9117N0862K3088L7844N0831L9713L0184K9409L5689
$$ 12182102 12200755 12212453 12251570 12302432 12325520 12363364 12414195 12453908 12484092 12513501 12549190
3821A2549190K9313N9453M2581L3173L8270L9696M4843L8243L6105K0878M0358
$$ 12549190 12578503 12637956 12680537 12713710 12751980 12791676 12836519 12874762 12910867 12931745 12972103
3810A2972103K4028p628J9336Q631n948j0008J4884o157j5246k8753j9338l7903
$$ 12972103 12996131 12988503 13007839 13016470 13010522 13000514 13015398 13009241 12993995 12965242 12945904 12908001
3798A2908001l6946k0119l6630n0120k8012k3143k7140j9651l1865k8447k5998
$$ 12908001 12871055 12850936 12814306 12764186 12736174 12713031 12685891 12666240 12634375 12605928 12579930
3787A2579930j9614K455j6185m0573j3721O232j1927k5815j0470p08k830k884
$$ 12579930 12560316 12562771 12546586 12506013 12492292 12498524 12486597 12460782 12450312 12449604 12446774 12443890
3775A2443890K2934K0419P65J5753J2521O251J5636K2136J9282K3700K4281K2114
$$ 12443890 12466824 12487243 12488008 12503761 12516282 12522533 12538169 12560305 12579587 12603287 12627568 12649682
3763A2649682K1865K3202M5958K9301L0646K1452N5582N1457M2559M4808N5604
$$ 12649682 12671547 12694749 12740707 12770008 12800654 12822106 12877688 12929145 12971704 13016512 13072116
3752A3072116O3520N0034M4031M0019L6324O9588P9427M5400K6912O5369Q4073
$$ 13072116 13135636 13185670 13229701 13269720 13306044 13375632 13455059 13500459 13527371 13592740 13676813
3741A3676813M9537N3599Q1142N7328M9767P0825O4140R3333P1035M7506M3444
$$ 13676813 13726350 13779949 13861091 13918419 13968186 14039011 14103151 14196484 14267519 14315025 14358469
3730A4358469N8420P1777N1649L1243O1153P5757Q0383Q0444Q4298R5681J06039
$$ 14358469 14416889 14488666 14540315 14571558 14632711 14708468 14788851 14869295 14953593 15049274 15155313
3719A5155313J08081R3028J22920J32937J08373J17602J26613J24635J20637J08854
$$ 15155313 15263394 15356422 15479342 15612279 15720652 15838254 15964867 16089502 16210139 16318993
3709A6318993J01770R9274R0766P9570J07986Q3767N5904N2612L7719K3734K0299
$$ 16318993 16420763 16520037 16610803 16690373 16798359 16882126 16938030 16990642 17028361 17052095 17072394
3698A7072394J1275J4774K9987K1127M7246N5202N8226O4050N0338P7336J00934
$$ 17072394 17083669 17098443 17128430 17149557 17196803 17252005 17310231 17374281 17424619 17501955 17602889
3687A7602889R7848Q5953P7130J03429J12029R9646Q5739R1120Q9446Q8948P7122
$$ 17602889 17700737 17786690 17863820 17967249 18079278 18178924 18264663 18355783 18445229 18534177 18611299
3676A8611299O4235Q6695N0002J5067K5235n567j0614j2000k3293k0554k5076
$$ 18611299 18675534 18762229 18812231 18827298 18852533 18846966 18836352 18824352 18801059 18780505 18755429
3665A8755429j4730R325M7891K5312M1403O0557O0100O6820R3410O8465R7921
$$ 18755429 18740699 18750024 18797915 18823227 18864630 18925187 18985287 19052107 19145517 19213982 19311903
3654A9311903J16123O3954R1729R2968R6949J08575P8792R4092P8052P4738P8861
$$ 19311903 19428026 19491980 19583709 19676677 19773626 19882201 19960993 20055085 20133137 20207875 20286736
3643B0286736N3335K5540P192K0195L5115J1483J7998L4332M9902N8355N9148
$$ 20286736 20340071 20365611 20372803 20392998 20428113 20439596 20457594 20491926 20541828 20600183 20659331
3632B0659331O9877Q5467R3034R6531J16240R9650J30744J30586J08283J11123
$$ 20659331 20729208 20814675 20907709 21004240 21120480 21220130 21350874 21481460 21589743 21700866
3622B1700866J53950J31982J35977J38835J42602J31821J47885J35967J16811
$$ 21700866 21854816 21986798 22122775 22261610 22404212 22536033 22683918 22819885 22936696
3613B2936696J19930J04715J02286R7906Q1563Q3164J21667J42032J11454J16272
$$ 22936696 23056626 23161341 23263627 23361533 23443096 23526260 23647927 23789959 23901413 24017685
3603B4017685J53727J23328J50010J74332J69236J80545J77867K06102J88217
$$ 24017685 24171412 24294740 24444750 24619082 24788318 24968863 25146730 25352832 25541049
3594B5541049K06774K30292K19733K22303K30885K32436K64430K55351K44309
$$ 25541049 25747823 25978115 26197848 26420151 26651036 26883472 27147902 27403253 27647562
3585B7647562K43647K66715K73277K57178K91739K77619K71446K84843K88139
$$ 27647562 27891209 28157924 28431201 28688379 28980118 29257737 29529183 29814026 30102165
3576C0102165K79502L07853L03147L22151L34456L22192L27345L37407L68177
$$ 30102165 30381667 30689520 30992667 31314818 31649274 31971466 32298811 32636218 33004395
3567C3004395L61011L48487L60811L99596M20421M16440M13438M41481M65072
$$ 33004395 33365406 33713893 34074704 34474300 34894721 35311161 35724599 36166080 36631152
3558C6631152M80042N21143N34530N68079O15601O23047O70100P33375Q06265
$$ 36631152 37111194 37632337 38166867 38734946 39350547 39973594 40643694 41377069 42183334
3549D2183334Q93253R42434R54245R37507P46097M37464J74112L6062M1327J18558
$$ 42183334 43076587 44019021 44973266 45910773 46656870 47094334 47268446 47304508 47345835 47464393
3539D7464393K40516L27068M06882M84791N71050O18380O66364P15346P84566
$$ 47464393 47704909 48031977 48438859 48923650 49494700 50113080 50779444 51494790 52279356
3530E2279356Q27155Q71304R16020R69172J037964J093512J150831J209996J293861
$$ 52279356 53106511 53977815 54893835 55863007 56900971 57994483 59145314 60355310 61649171
3521F1649171J351516J389408J514219J666161J801336J964049K115861K197909
$$ 61649171 63000687 64390095 65904314 67570475 69371811 71335860 73451721 75649630
3513G5649630K059774J541590Q77202K61396J805J4782J50602L72987O05478Q19782
$$ 75649630 77709404 79250994 80128196 80389592 80391397 80406179 80556781 80929768 81535246 82355028
3503H2355028R64900J106947J238383J344090J431305J515122J575639J623912
$$ 82355028 83319928 84426875 85665258 87009348 88440653 89955775 91531414 93155326
3495I3155326J728486J762433J815185J883224J914277J937786J965363J989876
$$ 93155326 94883812 96646245 98461430 100344654 102258931 104196717 106162080 108151956
3487A08151956K030026K067792K134386K225113K288980K349513K385875K312066
$$ 108151956 110181982 112249774 114384160 116609273 118898253 121247766 123633641 125945707
3479A25945707K075217J861391J733412J737076J872046K064015K262798K482499
$$ 125945707 128020924 129882315 131615727 133352803 135224849 137288864 139551662 142034161
3471A42034161K621587K794885K978203L192249L392587L620693L865051M146303
$$ 142034161 144655748 147450633 150428836 153621085 157013672 160634365 164499416 168645719
3463A68645719M449651M811669N233813N696174O156498O690901P257526P885855
$$ 168645719 173095370 177907039 183140852 188837026 194993524 201684425 208941951 216827806
3455B16827806Q538943R208345R951172J0659141J1338409J1948411J2512158
$$ 216827806 225366749 234575094 244526266 255185407 266523816 278472227 290984385
3448B90984385J2990677J3328334J3512925J3449046J3007002J2074334J0442026
$$ 290984385 303975062 317303396 330816321 344265367 357272369 369346703 379788729
3441C79788729P997054M649056N06193m108353q639619j2357191j4698830j5565011
$$ 379788729 387785783 392434839 392941032 388832679 380193060 367835869 353137039 337572028
3433C37572028j5313232j4397198j3284475j2093129j0916043r892710q952873
$$ 337572028 322258796 307861598 294577123 282483994 271567951 261675241 252722368
3426B52722368q089338p398313o799077o282331n800389n402927n113838m865271
$$ 252722368 244633030 237234717 230435640 224153309 218352920 212949993 207836155 202970884
3418B02970884m666021m496225m386250m294467m243548m168035m167035m133052
$$ 202970884 198304863 193808638 189422388 185127921 180884373 176716338 172549303 168416251
3410A68416251m134666m108618m067563m036980l965572l861503l770466l666495
$$ 168416251 164281585 160172967 156105404 152068424 148102852 144241349 140470883 136804388
3402A36804388l523266l393169l290928l150856l037655k901271k763032k667497
$$ 136804388 133281122 129887953 126597025 123446169 120408514 117507243 114744211 112076714
3394A12076714k519673k383591k294011k162697k030684j971874j874007j790393
$$ 112076714 109557041 107173450 104879439 102716742 100686058 98714184 96840177 95049784
3386I5049784j697776j623128j587119j503764j452494j429564j394105j363454
$$ 95049784 93352008 91728880 90141761 88637997 87185503 85755939 84361834 82998380
3378H2998380j327937j297062j231795j205712j161048j115548j053516j019592
$$ 82998380 81670443 80373381 79141586 77935874 76774826 75659278 74605762 73586170
3370G3586170r83339r37979r17032q66626q36983q14566q03630p59476p22896
$$ 73586170 72602831 71664852 70747820 69881194 69044211 68229645 67426015 66666539 65943643
3361F5943643p40894o90262o66090o57622o33029o17507n86161n68824n64028
$$ 65943643 65202749 64512487 63846397 63188775 62555746 61938239 61352078 60783254 60219226
3352F0219226n49924n58918n60846n47493n48160n55349n43520n47438n37599
$$ 60219226 59669302 59110384 58549538 58002045 57453885 56898536 56355016 55807578 55269979
3343E5269979n45008n39008n05171n10737n01240m78643m70101m53195m68263
$$ 55269979 54724971 54185963 53680792 53170055 52668815 52190172 51720071 51266876 50798613
3334E0798613m53524m22519m41966m14036l93784m16736l98156l86709l89812
$$ 50798613 50345089 49922570 49480604 49066568 48672784 48256048 47857892 47471183 47081371
3325D7081371l90937l57987l56286l41353l16606l27571k99663k83900k89678
$$ 47081371 46690434 46332447 45976161 45634808 45318202 44990631 44690968 44407068 44117390
3316D4117390k98179k92079k53327k71183k63746k62783k66620k41396k45346
$$ 44117390 43819211 43527132 43273805 43002622 42738876 42476093 42209473 41968077 41722731
3307D1722731k40256k26137k18658k03741k10139j93678j87355j69356j51821
$$ 41722731 41482475 41256338 41037680 40833939 40623800 40430122 40242767 40073411 39921590
3298C9921590j72847j41478j51205j40765j43290j37220j59636j44132j36025
$$ 39921590 39748743 39607265 39456060 39315295 39172005 39034785 38875149 38731017 38594992
3289C8594992j50997j25133j36119j45204j41027j57402j80368j72206j65811
$$ 38594992 38443995 38318862 38182743 38037539 37896512 37739110 37558742 37386536 37220725
3280C7220725j91885k02590k25648k12324k41573k59768k50325k48218k52521
$$ 37220725 37028840 36826250 36600602 36388278 36146705 35886937 35636612 35388394 35135873
3271C5135873k41917k56995k43475k50626k32490k30772k49935k38235k09306
$$ 35135873 34893956 34636961 34393486 34142860 33910370 33679598 33429663 33191428 32982122
3262C2982122k19610k14624k09914j96177j97207j90116j69757j83224j73394
$$ 32982122 32762512 32547888 32337974 32141797 31944590 31754474 31584717 31401493 31228099
3253C1228099j52761j63173j57947j55519j84071j99381j99758k07891k38542
$$ 31228099 31075338 30912165 30754218 30598699 30414628 30215247 30015489 29807598 29569056
3244B9569056k55398k66943k67197k68256k68918k76067k68661k47536k41739
$$ 29569056 29313658 29046715 28779518 28511262 28242344 27966277 27697616 27450080 27208341
3235B7208341k54276k25928k08166j91084j76252j60513j47703j36223j20967
$$ 27208341 26954065 26728137 26519971 26328887 26152635 25992122 25844419 25708196 25587229
3226B5587229j12643r4637q4018p4172n9154l7140l8631n8708k1566l0956j0762
$$ 25587229 25474586 25379949 25295931 25221759 25162605 25125465 25086834 25028126 25006560 24975604 24964842
3215B4964842j9006o146P864j8327J1111m162l559j3185l258M820L741M0859M7854
$$ 24964842 24945836 24939690 24947554 24929227 24940338 24936176 24932617 24919432 24916174 24920994 24924735 24965594 25013448
3202B5013448O5426Q6882J07305J01641J39192J41090J75472K05277J96566K16047
$$ 25013448 25078874 25165756 25273061 25374702 25513894 25654984 25830456 26035733 26232299 26448346
3192B6448346K22151K23326K29972K22571K23797K25133K58700K75475K84124
$$ 26448346 26670497 26893823 27123795 27346366 27570163 27795296 28053996 28329471 28613595
3183B8613595K94053L16513L72202L84398L75903L91355L91429M24511L78153
$$ 28613595 28907648 29224161 29596363 29980761 30356664 30748019 31139448 31563959 31942112
3174C1942112L54034L38734L30133L26585L34663L28221L38390L63948M05255
$$ 31942112 32296146 32634880 32965013 33291598 33626261 33954482 34292872 34656820 35062075
3165C5062075M41945M66732M73783M88703M82415N04635N53920N74437O27777
$$ 35062075 35504020 35970752 36444535 36933238 37415653 37920288 38474208 39048645 39676422
3156C9676422O50520O90857P44201Q10031Q40841R12961R68644R94937J019449
$$ 39676422 40326942 41017799 41762000 42572031 43412872 44325833 45294477 46289414 47308863
3147D7308863J067617J104031J168556J201425J261019J345916J421872J500957
$$ 47308863 48376480 49480511 50649067 51850492 53111511 54457427 55879299 57380256
3139E7380256J569378J627647J691410J799839J849765J913534J950218J949215
$$ 57380256 58949634 60577281 62268691 64068530 65918295 67831829 69782047 71731262
3131G1731262J935176J841349J742963J595105J445572J273632J123513J024937
$$ 71731262 73666438 75507787 77250750 78845855 80291427 81565059 82688572 83713509
3123H3713509J018898J063787J152544J280442J394615J542957J730000J895240
$$ 83713509 84732407 85796194 86948738 88229180 89623795 91166752 92896752 94791992
3115I4791992K137377K411595K673946K949539L204619L428234L582022L709545
$$ 94791992 96929369 99340964 102014910 104964449 108169068 111597302 115179324 118888869
3107A18888869L891376M097430M256055M295118M218189L875046L283835K360595
$$ 118888869 122780245 126877675 131133730 135428848 139647037 143522083 146805918 149166513
3099A49166513J065510o02886k422268l654050l894115l378447k624694j871464
$$ 149166513 150232023 149629137 147206869 143552819 139658704 136280257 133655563 131784099
3091A31784099j116819m30913K22475P50471J206990J621377J912653K087189
$$ 131784099 130667280 130236367 130458842 131209313 132416303 134037680 135950333 138037522
3083A38037522K210423K320401K371562K393658K306095K093000J747730J220429
$$ 138037522 140247945 142568346 144939908 147333566 149639661 151732661 153480391 154700820
3075A54700820N03860l01694j132736j817893k311539k638911k963097l444755
$$ 154700820 155204680 154902986 153770250 151952357 149640818 147001907 144038810 140594055
3067A40594055l996178m286292m109302l602384l028872k471094j997958j579250
$$ 140594055 136597877 132311585 128202283 124599899 121571027 119099933 117101975 115522725
3059A15522725j183510q52834o25052m62103m20015m92659o65818r68820j324131
$$ 115522725 114339215 113486381 112861329 112399226 111979211 111486552 110820734 109851914 108527783
3050A08527783j684370k017050k392990k850164l307669l702244l927890l956947
$$ 108527783 106843413 104826363 102433373 99583209 96275540 92573296 88645406 84688459
3042H4688459l819204l598999l395811l151380k931835k712920k452095k227759
$$ 84688459 80869255 77270256 73874445 70723065 67791230 65078310 62626215 60398456
3034F0398456k028808j829364j683868j538787j416698j315205j236817j156472
$$ 60398456 58369648 56540284 54856416 53317629 51900931 50585726 49348909 48192437
3026D8192437j080367j079666j066194j069263j090256j073322j098116j081654
$$ 48192437 47112070 46032404 44966210 43896947 42806691 41733369 40635253 39553599
3018C9553599j075648j101298j069840j016155r77176r51451q99901q53843q15565
$$ 39553599 38477951 37376653 36306813 35290658 34313482 33362031 32462130 31608287 30792722
3009C0792722p79571p37411p02848o86666o58584o16443o15707n99814n84934
$$ 30792722 30013151 29275740 28572892 27886226 27227642 26611199 25995492 25395678 24810744
3000B4810744n40831m87557m41509m02551l64170l36443l13443k98783k73603
$$ 24810744 24269913 23782356 23340847 22938296 22574126 22237683 21924240 21625457 21351854
2991B1351854k65688k72987k72365k83104k77068k79814l02598l24984l40254
$$ 21351854 21086166 20813179 20540814 20257710 19980642 19700828 19398230 19073246 18732992
2982A8732992l68830l68839l70754l86915l69659l98364l86497l76271l63896
$$ 18732992 18364162 17995323 17624569 17237654 16867995 16469631 16083134 15706863 15342967
2973A5342967l27577l00753k81497k67604k59606k30536j91486j93320k01890
$$ 15342967 15015390 14714637 14433140 14165536 13905930 13675394 13483908 13290588 13088698
2964A3088698j52935j21119j46156j45313j39474j42287j68225j86830j79130
$$ 13088698 12935763 12814644 12668488 12523175 12383701 12241414 12073189 11886359 11707229
2955A1707229j90775k06068k10432k11887k10463k06654j88345j82722j89586
$$ 11707229 11516454 11310386 11099954 10888067 10677604 10470950 10282605 10099883 9910297
2946I910297j82952j80907j97548j55328j76485j71273j87692j42405j39230j40679
$$ 9910297 9727345 9546438 9348890 9193562 9017077 8845804 8658112 8515707 8376477 8235798
2936H235798j44727j33683j22695j06653j26668j35746j02557j00577r6507j02844
$$ 8235798 8091071 7957388 7834693 7728040 7601372 7465626 7363069 7262492 7165985 7063141
2926G063141q2708q7140p9205j09653r9695r8719q5046q6033p5208p4604q9317
$$ 7063141 6980433 6893293 6814088 6704435 6604740 6506021 6420975 6334942 6259734 6185130 6095813
2915F095813p8599q1761q0949m7344n7737o6745n3823p1630m3074l3199l1728
$$ 6095813 6017214 5935453 5854504 5807160 5749423 5682678 5628855 5557225 5514151 5480952 5449224
2904E449224l6956m8156k5874k8002m7252l6647k8750n0727m4976k0989k4238
$$ 5449224 5412268 5364112 5338238 5310236 5262984 5226337 5197587 5146860 5101884 5080895 5056657
2893E056657j1055l1270m0939m1429m9698m1657n1700k0782k8931m1275m6315
$$ 5056657 5045602 5014332 4973393 4931964 4882266 4840609 4788909 4768127 4739196 4697921 4651606
2882D651606m6625j5545l6946j8001k2789n9379o668l8942l5192k6062l0405l3996
$$ 4651606 4604981 4589436 4552490 4534489 4511700 4452321 4445653 4406711 4371519 4345457 4315052 4281056
2870D281056j6467k0481k8423k7139r146j6859k1071l8155l8902l657q020m167
$$ 4281056 4264589 4244108 4215685 4188546 4179400 4162541 4141470 4103315 4064413 4060756 4052736 4048569
2858D048569k6330q582j6502k2225j3334k5484k882j3486j268J866k1710j2109
$$ 4048569 4022239 4013657 3997155 3974930 3961596 3936112 3933230 3919744 3918476 3920342 3898632 3886523
2846C886523p951j3281j4904j4040j9481k7684q945k4770j3266r059m8952j0943
$$ 3886523 3878572 3865291 3850387 3836347 3816866 3789182 3780237 3755467 3742201 3733142 3684190 3673247
2834C673247K686j5310k0994p558n748J9323J9753j4689k0153k3226J646J6540
$$ 3673247 3675933 3660623 3639629 3632071 3626323 3645646 3665399 3650710 3630557 3607331 3608977 3625517
2822C625517l966M773k948J3860O5j6535L654l0921k5618k5902l3986l2010m0552
$$ 3625517 3621551 3626324 3623376 3637236 3637301 3620766 3624420 3593499 3567881 3541979 3507993 3475983 3435431
2809C435431k6521l5923q009k3291j4431j7150j178j5386m553K448L380p069j4404
$$ 3435431 3408910 3372987 3364978 3341687 3327256 3310106 3308928 3293542 3288989 3291437 3294817 3287748 3273344
2796C273344k318m927Q32n897l303j0125j3789k1526r390j0995m8423j8823k7088
$$ 3273344 3271026 3266099 3266931 3261034 3257731 3247606 3233817 3212291 3202901 3191906 3143483 3124660 3097572
2783C097572m6532j9354k5289l8082j8867j8769l0666j9975k2340r891j1383k8382
$$ 3097572 3051040 3031686 3006397 2968315 2949448 2930679 2900013 2880038 2857698 2847807 2836424 2808042
2771B808042q856k4444n702j8197j2934k9436l3035k5281k4435l7555l7544k5099
$$ 2808042 2799186 2774742 2769040 2750843 2737909 2708473 2675438 2650157 2625722 2588167 2550623 2525524
2759B525524m9077l3611l5439l0497l7023k0013m1351m0803l5824j4140k7163
$$ 2525524 2476447 2442836 2407397 2376900 2339877 2319864 2278513 2237710 2201886 2187746 2160583
2748B160583p576k2127l0947j7382k1910j0569k511j8634j3823q79k216k2903
$$ 2160583 2153007 2130880 2099933 2082551 2060641 2050072 2047561 2028927 2015104 2014225 2012009 1989106
2736A989106j3438l374j4654k1601j4496J7409q345k3806j1532k0905M88j4340
$$ 1989106 1975668 1972294 1957640 1936039 1921543 1938952 1930607 1906801 1895269 1874364 1874852 1860512
2724A860512j0109j0476j5909j5176k3470r964m662k5342j2577k227q891j7079
$$ 1860512 1850403 1839927 1824018 1808842 1785372 1775408 1770746 1745404 1732827 1730600 1721709 1704630
2712A704630J0625k1139k7241o303j2633k4791j0972k0541j0499j2320j6051J840
$$ 1704630 1715255 1694116 1666875 1660572 1647939 1623148 1612176 1591635 1581136 1568816 1552765 1554605
2700A554605j0180j3634k1897k0731j4289j6532m984j8083l0451n798j251j0166
$$ 1554605 1544425 1530791 1508894 1488163 1473874 1457342 1452358 1434275 1403824 1398026 1396775 1386609
2688A386609l865l382j7681j3293k8377p021k2099k357l968K348p959r767j386
$$ 1386609 1382744 1379362 1361681 1348388 1320011 1312990 1290891 1288534 1284566 1286914 1278955 1269188 1267802
2675A267802O339K053j2774L791l135n301j4667j8260j9745j2357M613l0034j3195
$$ 1267802 1274141 1276194 1263420 1267211 1264076 1258775 1244108 1225848 1206103 1193746 1198359 1168325 1155130
2662A155130R336j2777k1561j6308O827j1726O941P03k3807j4011j5488p390q
$$ 1155130 1164466 1151689 1130128 1113820 1120647 1108921 1115862 1116565 1092758 1078747 1063259 1055869 1055861
2649A055861k058j9138j1511j837k5458j4740r093j5074n524j9213l057j1295
$$ 1055861 1053803 1034665 1023154 1021317 995859 981119 972026 956952 951428 932215 929158 917863
2637I17863k0795K560p432j4285j5840j2042j5648j2134q781o148N837j1822M778
$$ 917863 897068 899628 892196 877911 862071 850029 834381 822247 813466 807318 813155 801333 806111
2624H06111M139j7875r515J0871j5530J068l866N847k8541j1858L434j0072j8825
$$ 806111 810250 792375 782860 793731 778201 779269 775403 781250 752709 740851 744285 734213 715388
2611G15388p976R595r925q242j4025N226J0087j1852k2292k875j918r670k287
$$ 715388 707412 717007 707082 698840 684815 690041 700128 688276 665984 663109 661191 651521 649234
2598F49234r78j6806j43o802k2609J0063n147j8546p298j1151j7821q453j5579
$$ 649234 648256 631450 631307 624505 601896 611959 606812 588266 580968 569817 551996 543543 527964
2585E27964n656Q375M262j69m722j4264k734L751k2045j4866j268J261L534j3234
$$ 527964 522308 530683 534945 534776 530054 515790 513056 516807 494762 479896 478628 479889 483423 470189
2571D70189j2932n001m523m585j0709j305p647p591k0670K1680K07j7473l328
$$ 470189 457257 452256 447733 443148 432439 431134 423487 415896 395226 416906 417113 399640 396312
2558C96312m347J9521N640j4220O671j0032j9467l360M309j9991M459K0612j6149
$$ 396312 391965 411486 417126 402906 409577 399545 380078 376718 381027 361036 365495 386107 369958
2545C69958J936l120j3608m548j1497j3336O974j390J4409j2930k4331r005M050
$$ 369958 371894 368774 355166 350618 339121 325785 332759 331369 345778 332848 308517 299512 303562
2532C03562J4271p943j6032j3536j587j074J395J773N868J089J206m664J3697
$$ 303562 317833 309890 293858 280322 278735 277661 279056 280829 286697 287786 288992 284328 298025
2519B98025j6890j3970j4096K801J3477M288o780k507n270r32j2675m755M99j115
$$ 298025 281135 267165 253069 255870 269347 273635 266855 264348 259078 258146 245471 240716 241215 240100
2505B40100M961j5687j0717L645L005N884j2117M830n113p726m808j913J0188
$$ 240100 245061 229374 218657 222302 225307 231191 219074 223904 218791 211065 206257 204344 214532
2492B14532j5575j371R553j1137k186l412j1641O295J5360J8716j0371l6557J1498
$$ 214532 198957 197586 207139 196002 193816 190404 178763 185058 200418 219134 208763 172206 183704
2479A83704R548p974Q404j1477j0173J3926n49q056N683R326j166p553k232p346
$$ 183704 193252 185278 193682 182205 172032 185958 185409 177353 183036 192362 191196 183643 181411 174065
2465A74065k3516p029R094k305J5177k1204j716L50J5822j2675N162j2051O86
$$ 174065 150549 143520 152614 150309 165486 144282 142566 142916 158738 146063 151225 139174 139860
2452A39860P312o24J1408k424j8680n060k558L705j410P099n708L570M232j0230
$$ 139860 147172 146548 157956 155532 136852 131792 129234 132939 131529 138628 132920 136490 140722 130492
2438A30492m666m158K191Q89M840L059j4417o53k318r275J485P668R533N559p99
$$ 130492 125826 121668 123859 124748 129588 132647 118230 117577 115259 105984 107469 115137 124670 130229 129430
2423A29430n840p20J3739k532J35L62j8955j0469J1492J8999j2055j1064p392
$$ 129430 123590 122870 136609 134077 134212 134574 115619 105150 116642 135641 123586 112522 105130
2410A05130o81P448N759j7887N594j5584Q137N94q59l881o83J8507O335J6889
$$ 105130 104449 111897 117656 99769 105363 89779 97916 98510 97651 93770 93087 111594 117929 134818
2396A34818r403k7486j114o361n635L983m35O14K3442j841o122N859L448k829
$$ 134818 125415 97929 96815 90454 84819 88802 88367 88981 112423 110582 104460 110319 113767 110938
2382A10938J749J1680l032k0041j0178l278L611j6417R750m837j843K1414Q255
$$ 110938 112687 124367 121335 101294 91116 87838 91449 75032 84782 79945 78102 99516 107771
2369A07771j515K880j8111j729k002m824J7086J7124J5326j6398p874J4093K0291
$$ 107771 106256 109136 91025 89296 87294 82470 99556 116680 132006 115608 107734 121827 142118
2356A42118j8654n413r351N945k384K500J3510K806j1481N432J0749m523j3568
$$ 142118 123464 118051 108700 114645 112261 114761 128271 131077 119596 125028 135777 131254 117686
2343A17686k886Q343p149R16L3904l301j3169L983Q566J8860j3949p928K8118
$$ 117686 114800 123143 115994 116910 150814 147513 134344 138327 146893 165753 151804 143876 171994
2330A71994J0218N632P691l391R888J8441l383J4413J2812P157K6478J6698J3344
$$ 171994 182212 187844 195535 192144 202032 220473 217090 231503 244315 251472 277950 294648 307992
2317C07992R015Q540L0840M3136M9873L1683K9989P4714O5219R2214J07568J46408
$$ 307992 317007 325547 356387 399523 449396 481079 511068 585782 651001 743215 850783 997191
2305I97191J87013J89679K42481J62220p3672k45145k80417k08043j57560j24998
$$ 997191 1184204 1373883 1616364 1778584 1704912 1459767 1179350 971307 813747 688749
2295F88749r7664q0892p1680o0083l5100k3925k7555o714N269j1498k8853k3522
$$ 688749 591085 510193 438513 378430 343330 319405 291850 285136 290405 278907 250054 226532
2283B26532j9313k0283k206r872j3514k2548p777O59j054j5853j4780M629J0464
$$ 226532 207219 186936 184730 174858 161344 138796 131019 131678 130624 114771 99991 104620 115084
2270A15084q264k0992m636j4923Q885R978k011l736M78o503L063m705l334J3578
$$ 115084 106820 85828 81192 66269 75154 85132 83121 79385 79863 73360 76423 71718 68384 81962
2256H1962m494o581l697p601J0318j6053o295j4768L260J2156L540J7009k2671
$$ 81962 77468 70887 67190 59589 69907 53854 47559 32791 36051 48207 51747 68756 46085
2243D6085K058N566j1289n965K277J919k453M330L654m571J0861j0331q516m025
$$ 46085 48143 53709 42420 36455 38732 40651 38198 42528 46182 41611 52472 42141 33625 29600
2229B9600N81M899J8489j0234j8984J1746J1486p950q983k598M94M761j7686j1963
$$ 29600 30181 35080 53569 43335 24351 36097 47583 39633 30650 28052 28546 33307 15621 3658
2215C658K511J5887N734j5323p024o49Q831J0033k953L248j5443M088O434K3831
$$ 3658 6169 22056 27790 12467 5443 4794 13625 23658 20705 23953 8510 12598 19032 42863
2201D2863M343k1408m538J787k522l739k076m353J9838J0401j224P090j4306j5855
$$ 42863 47206 25798 21260 23047 20525 16786 14710 10357 30195 40596 39372 46462 32156 16301
2187A6301K137q684k447k222j972j0751J1864K734M621j5755K14J6438j3421j943
$$ 16301 18438 9754 7307 5085 3113 -7638 4226 6960 11581 -4174 -3960 12478 -943 -2886
2173b886p734L982K1435o457L345p751n93J0731n263o66J837j5815R590N587k5320
$$ -2886 -10620 -6638 14797 8340 11685 3934 3341 14072 8809 8143 9980 -5835 3755 9342 -15978
2158a5978N599O942j5453L112J8915M200n422K660K013O895j0733J0475L703k815
$$ -15978 -10379 -3437 -18890 -15778 3137 7337 1915 4575 6588 13483 2750 13225 16928 14113
2144A4113N498M011l008j9135K730P964j0602q830J630j2133P666K263p553m199
$$ 14113 19611 23622 20614 1479 4209 12173 1571 -7259 -5629 -17762 -10096 -7833 -15386 -19585
2130a9585J0182o903J4175o193P319l733m97l787J0801m463N644m971J094j4257
$$ -19585 -9403 -16306 -2131 -8324 -1005 -4738 -5235 -9022 1779 -2684 2960 -2011 -917 -15174
2116a5174J5059R244j4902k316L762j3079N775K279J231J3170j028M161m04m691
$$ -15174 -115 9129 -5773 -8089 -4327 -17406 -11631 -9352 -8121 5049 4021 8182 7778 3087
2102C087m091Q742j9181R512j5742N799K992J8392j1530r983o929P073l051J861
$$ 3087 -1004 7738 -11443 -1931 -17673 -11874 -8882 9510 -2020 -12003 -18932 -11859 -14910 -13049
2088a3049Q431J5167j3339p480m041q968L132j4197J3026k19L131J1613n107q123
$$ -13049 -4618 10549 -2790 -10270 -14311 -23279 -20147 -34344 -21318 -21537 -18406 -6793 -11900 -20023
2074b0023J6341J6497j2117j1109P393K163j1545K219N018M619J5690l623m262
$$ -20023 -3682 12815 698 -10411 -3018 -855 -12400 -10181 -5163 -544 15146 11523 7261
2061G261p545j5083Q503j0558J1749J2448r720j7196j9685J6518k667M341K7545
$$ 7261 -284 -15367 -6864 -17422 -5673 6775 -2945 -20141 -39826 -23308 -25975 -21634 5911
2048E911p985M54Q503K753Q663j6592j0202O01j1457J052K1872J3226o591j9977
$$ 5911 -2074 -1620 6883 9636 18299 1707 -8495 -7894 -19351 -18299 3573 16799 10208 -9769
2034i769J9387J7009j6638o698j999K93k834q878O090K752K919J0660k2523M871
$$ -9769 9618 26627 9989 3291 1292 1585 -1249 -10127 -4037 -1285 1634 12294 -10229 -5358
2020e358M420J0751j1800J275J1732k787L638r887J1271j7300r66n326J4048j6532
$$ -5358 -938 9813 -1987 -712 11020 8233 11871 1984 13255 -4045 -5011 -10337 3711 -12821
2006a2821M996O653l177l982J2205O776o423m285j2658j2581Q389J7709J684R44
$$ -12821 -7825 -1172 -4349 -8331 3874 10650 4227 -58 -12716 -25297 -16908 801 2485 3429
1992C429o330Q21q404N493n161M12O367k625j7048L805L648J0664j159j3084Q867
$$ 3429 -2901 -2080 -10484 -4991 -10152 -9740 -3373 -5998 -23046 -19241 -15593 -4929 -6088 -19172 -10305
1977a0305N197l52j1084R586Q696j2661j1925M613o214M566J1987J297K694N25
$$ -10305 -5108 -5460 -16544 -6958 1738 -10923 -22848 -18235 -24449 -19883 -7896 -6599 -3905 -3380
1963c380p039j430n845j7895L0333j507m881N165n562j1405J0519M99p574M01
$$ -3380 -10419 -11849 -17694 -35589 -5256 -6763 -11644 -6479 -12041 -23446 -12927 -12428 -20002 -19601
1949a9601j0645J5045o639J2099R621l829n904J062j1306J3049K1066n486n022
$$ -19601 -30246 -15201 -21840 -9741 -120 -3949 -9853 -8791 -20097 -7048 14018 8532 3510
1936C510k1303K9406p088k0262l568O312l026J1077J6120j7854L140N909N536
$$ 3510 -17793 11613 4525 -15737 -19305 -12993 -16019 -4942 11178 -6676 -3536 2373 7909
1923G909l866j241k5187m03J6202m54M329J833p580l9P061l966r153P33j189J3632
$$ 7909 4043 2802 -22385 -22788 -6586 -7040 -2711 -878 -8458 -8497 -1436 -5402 -14555 -13822 -15011 -1379
1907a379K083o058j6495q223l075K1647P952n484R270j4432L881O337j5806J40
$$ -1379 704 -5354 -21849 -30072 -33147 -11500 -3548 -9032 238 -14194 -10313 -3976 -19782 -19642
1893a9642K082r62Q22K039J188K111J8177J2446q714j6590l549Q76M618o862J0248
$$ -19642 -17560 -18522 -17700 -15661 -14473 -12362 5815 18261 9547 -7043 -10592 -9716 -5098 -11960 -1712
1878a712o086N041N400o058K0711l002j6854l047r786J9091L974J870r991j4598
$$ -1712 -7798 -2757 2643 -3415 17296 14294 -2560 -5607 -15393 3698 7672 9542 -449 -15047
1864a5047j1010J1208j948n570O416P315p89N195k7924j812J9268M545R047J1391
$$ -15047 -26057 -14849 -16797 -22367 -15951 -8636 -9425 -4230 -32154 -33966 -14698 -10153 -1106 10285
1850A0285J1228j6557k3655J6800M594j9628m488k98o02j2540P930J0416k014
$$ 10285 21513 4956 -18699 -1899 2695 -16933 -21421 -21719 -22321 -34861 -26931 -16515 -18529
1837a8529j8931O440Q393L316k869m036K911J2281Q703p749L181n04l824P058
$$ -18529 -37460 -31020 -22627 -19311 -22180 -26216 -23305 -11024 -2321 -10070 -6889 -7393 -11217 -4159
1823d159j4253N518n715j0155J0484J1428j0267l205J2445P660k4179K942n79
$$ -4159 -18412 -12894 -18609 -28764 -18280 -6852 -17119 -20324 -7879 -219 -24398 -21456 -22035
1810b2035k169J8007m524k096k60j3242J0175p462j9129J6135o546N745J3380
$$ -22035 -24204 -6197 -10721 -12817 -13077 -26319 -16144 -23606 -42735 -26600 -33146 -27401 -14021
1797a4021R475M095n085O030q490q47j7648J6485J7585p696o791R273K422K772
$$ -14021 -4546 -451 -5536 494 -7996 -8843 -26491 -10006 7579 -117 -6908 2365 4787 7559
1783G559j7150j4752j711J3706M407j2539J5297O180k999l895l188j4933K6840
$$ 7559 -9591 -24343 -26054 -12348 -7941 -20480 -5183 997 -2002 -5897 -9085 -24018 2822
1770B822j0294q387K269J5050n68j0543O123J764n600J0020J108q097N24m581
$$ 2822 -7472 -15859 -13590 1460 892 -9651 -3528 -1764 -7364 2656 3764 -4333 -3809 -8390
1756h390J0035k3726K703n649J3088L608R798j7827o649J0205l84p851L1K173
$$ -8390 1645 -22081 -19378 -25027 -11939 -8331 1467 -16360 -23009 -12804 -13188 -21039 -21008 -18835
1742a8835j8500J4952k611j25J4481P870L716j1711j0197R105Q096l78j1036p558
$$ -18835 -37335 -22383 -24994 -25119 -10638 -2768 948 -10763 -20960 -11855 -3759 -4137 -15173 -22731
1728b2731m265J6594M103o352l844m338l873J9407Q736o282o180P41q254L641
$$ -22731 -26996 -10402 -6299 -12651 -16495 -20833 -24706 -5299 3437 -2845 -9025 -8284 -16538 -12897
1714a2897p976N956n645J6468O325m376L169j3549N08J2892j489q165j1364Q777
$$ -12897 -20873 -14917 -20562 -4094 2231 -2145 1024 -12525 -12017 875 -614 -8779 -20143 -11366
1700a1366Q811j1202L570l191j5234k728r11J3759J3093k856j3455L951n02l92
$$ -11366 -2555 -13757 -10187 -13378 -28612 -31340 -32251 -18492 -5399 -8255 -21710 -17759 -18261 -18653
1686a8653LN511P070j0985o419K825P896j389L072N971P419p241j0724R27M762
$$ -18653 -18650 -13139 -6069 -17054 -23473 -20648 -12752 -14141 -11069 -5098 2321 -4920 -15644 -14717 -9955
1671i955n600P899r363N937o731l336J6554J4983j4663k193J8144o159o80J556
$$ -9955 -15555 -7656 -17019 -11082 -17813 -21149 -4595 10388 -4275 -6468 11676 5517 4837 6393
1657F393q054j726o981j588q931k299L393j8118K9460r94p486r602m270J5620
$$ 6393 -1661 -3387 -10368 -11956 -20887 -23186 -19793 -37911 -8451 -9445 -16931 -26533 -30803 -15183
1643a5183M648Q743k2871k919K1908L297j0286p580l369J0082O370j9509o538
$$ -15183 -10535 -1792 -24663 -27582 -5674 -2377 -12663 -20243 -23612 -13530 -7160 -26669 -33207
1630c3207J9248Q043Q011N875o429j3793p263l71P244L891P258j2176O986p790
$$ -33207 -13959 -5916 2095 7970 1541 -12252 -19515 -19886 -12642 -8751 -1493 -13669 -6683 -14473
1616a4473O356M252j8882P250J2311o790M377N192j9231R481R338J562p929M884
$$ -14473 -8117 -3865 -22747 -15497 -3186 -9976 -5599 -407 -19638 -10157 -819 743 -7186 -2302
1602b302k770j2608k443q50k538l930J4254q070K351j326J3008q671K1029j090
$$ -2302 -5072 -17680 -20123 -20973 -23511 -27441 -13187 -21257 -18906 -20232 -7224 -15895 5134 4044
1588D044r812j604l093J3047j4189O406J064L185K15k225q188R492O697j5089
$$ 4044 -5768 -7372 -10465 2582 -11607 -5201 -4137 -952 -737 -2962 -11150 -1658 5039 -10050
1574a0050M038m466j909J3287j8844M434K004J6951O059j7931j0819k85j2117
$$ -10050 -6012 -10478 -12387 900 -17944 -13510 -11506 5445 11504 -6427 -17246 -17531 -29648
1561b9648J6356R580j294O786M920o587o308n895j1407m944P776J4180N796l674
$$ -29648 -13292 -3712 -5006 1780 6700 113 -6195 -12090 -23497 -28441 -20665 -6485 -689 -4363
1547d363J7422o477k8991k912j460J0479K8028l02n214j8658j1763K0385O619
$$ -4363 13059 6582 -22409 -25321 -26781 -16302 11726 11424 6210 -12448 -24211 -3826 2793
1534B793m241l015j3691q339J116l063N241k201J9432J90J622P65j1109j0320
$$ 2793 -1448 -4463 -18154 -26493 -25377 -28440 -23199 -25400 -5968 -5778 -4156 -3391 -14500 -24820
1520b4820P090l236N155P03J5151j7860n517P107P921J1571m361k061j2416o468
$$ -24820 -17730 -20966 -15811 -15108 43 -17817 -23334 -16227 -8306 3265 -1096 -3157 -15573 -22041
1506b2041r750L896J2881L004l631K5561j9190j1360J3482O621l114j479L238
$$ -22041 -31791 -27895 -15014 -12010 -15641 9920 -9270 -20630 -7148 -527 -3641 -5120 -1882
1493a882j5223l21J1707m401j0564J0902K01l144L249J1901j4943L518Q00j8648
$$ -1882 -17105 -17426 -5719 -10120 -20684 -9782 -9581 -12725 -9476 2425 -12518 -9000 -8200 -26848
1479b6848N738j3719K3395K2571l333o308K141K827q867q403J7733Q097M012r403
$$ -26848 -21110 -34829 -11434 11137 7804 1496 3637 6464 -2403 -10806 6927 15024 19036 9633
1465I633k8402P009J4371N10J107j7143J0692K259L610P130K07l305N723j3502
$$ 9633 -18769 -11760 2611 3121 4228 -12915 -2223 36 3646 10776 10983 7678 13401 -101
1451a01r933O472j0638J2304j0894n524o008O009J1807k94q878Q45J0660K331
$$ -101 -10034 -3562 -14200 -1896 -12790 -18314 -24322 -18313 -6506 -6800 -15678 -14833 -4173 -1842
1437a842K250k5060k976J7627l740M500n16p310J2372N061n555K011l211R052
$$ -1842 408 -24652 -27628 -10001 -13741 -9241 -9757 -17067 -4695 366 -5189 -3178 -6389 2663
1423B663k372j9269P528n464p528O969L287K0220L429k0146m452J5692n239M244
$$ 2663 291 -18978 -11450 -16914 -24442 -17473 -14186 6034 9463 -10683 -15135 557 -4682 -438
1409d38K228r23n60J153j1015p663J775L547N366j6264J1818L166L593j1027k055
$$ -438 1790 867 307 1460 -9555 -17218 -15443 -11896 -6530 -22794 -10976 -7810 -4217 -15244 -17299
1394a7299Q758L612R877q553J076r399M074P109Q536n640O832k661l333Q919o199
$$ -17299 -8541 -4929 4948 -3605 -2529 -11928 -7854 -745 7791 2151 8983 6322 2989 11908 5709
1379E709r014q457J683M688J4272m907k0448O928J0271O349n183j9413k748J4652
$$ 5709 -3305 -11762 -10079 -5391 8881 3974 -16474 -9546 725 7074 1891 -17522 -20270 -5618
1365e618N395j152J2917N802j4027q129m429J5629o739k702J312n295M148n185
$$ -5618 -223 -1375 11542 17344 3317 -4812 -9241 6388 -351 -3053 -1741 -7036 -2888 -8073
1351h073J3423q567N053j1728P679Q152r244R126M419J120n734q179L321k956
$$ -8073 5350 -3217 1836 -9892 -2213 5939 -3305 5821 10240 11360 5626 -2553 768 -2188
1337b188Q760n332j0091j1383r179P626l356J5766j226n319K38M175J2316N299
$$ -2188 6572 1240 -8851 -20234 -29413 -21787 -25143 -9377 -10603 -15922 -15684 -11509 807 6106
1323F106j0815j8224J33q392J9637J9315o401K879o591k6156P066K4209p543J505
$$ 6106 -4709 -22933 -22800 -31192 -11555 7760 1359 4238 -2353 -28509 -21443 2766 -4777 -3272
1309c272j3241K3851k8413n153N506L256N631M526l48j0354P014R491P188l386
$$ -3272 -16513 7338 -21075 -26228 -20722 -17466 -11835 -7309 -7657 -18011 -10997 -1506 5682 2296
1295B296j8928R912L348j0012J2192k630o324m384K0117j422J7371n259r361k2730
$$ 2296 -16632 -6720 -3372 -13384 -1192 -3822 -10146 -14530 5587 4165 21536 16277 6916 -15814
1281a5814J1385J2898J0348j341j3094j1018K983Q121q940j7131J0407J9050p935
$$ -15814 -4429 8469 18817 17476 4382 -6636 -3653 4468 -4472 -21603 -11196 7854 -81
1268h1m272q500o060J809k042J1274J1040j0166j6100K385Q142j562R607Q087
$$ -81 -4353 -12853 -18913 -17104 -19146 -7872 3168 -6998 -23098 -20713 -12571 -14133 -4526 3561
1254C561L063p569m523q065N036J4471K515J63j462J536j3107J5872j7299J2633
$$ 3561 6624 -945 -5468 -13533 -8497 5974 8489 8652 7190 8726 -4381 11491 -5808 6825
1240F825M351k9236j243J7214J511p327o503j498J5191K1j0674q77R164k1214
$$ 6825 11176 -18060 -19303 -2089 -578 -7905 -14408 -15906 -715 -694 -11368 -12245 -3081 -24295
1226b4295O281N924L713j503P623R15l777o065n188K8473K390j8225j1452J7648
$$ -24295 -18014 -12090 -8377 -9880 -2257 -1342 -5119 -11184 -16372 12101 14491 -3734 -15186 2462
1212B462l929l133p270j6054J7633R050J0297r486l279q627J3530N048m794r465
$$ 2462 -1467 -4600 -11870 -27924 -10291 -1241 9056 -430 -3709 -12336 1194 6242 1448 -8017
1198h017P435M75N187R60P655J006P574L990j2974j4952n489M087M340J1207P072
$$ -8017 -582 -107 5080 6040 13695 14701 22275 26265 13291 -1661 -7150 -3063 1277 12484 19556
1183A9556o350R45n300N897j427n017J4816k3682l032q788L866J540N38J1488
$$ 19556 13206 14151 8851 14748 13321 8304 23120 -562 -3594 -12382 -8516 -6976 -6438 5050
1169E050L801j5988l697R258k1354QP343N862P872N743j0757R184j0683N880J1896
$$ 5050 8851 -7137 -10834 -1576 -22930 -22922 -15579 -9717 -1845 3898 -6859 2325 -8358 -2478 9418
1154I418l620n72k1322Q030J573q350L107J6729k694K208O102Q111j0285j464
$$ 9418 5798 5226 -16096 -8066 -6493 -14843 -11736 4993 2299 4507 10609 18720 8435 6971
1140F971K832p042q917J7280J8254k9429R169k618q155K2306j257q017j2241J752
$$ 6971 9803 2761 -6156 11124 29378 -51 9118 6500 -1655 20651 19394 11377 -864 888
1126H88N788r550L174J1880j1369K057k031K628l777j3762R401J4925N93J4315
$$ 888 6676 -2874 300 12180 811 2868 837 3465 -312 -14074 -4673 10252 10845 25160
1112B5160j9785k1708J1960J1344p635LJ4699l375j1709j309J810L83o141p024
$$ 25160 5375 -16333 -4373 6971 -664 -661 14038 10663 -1046 -2355 -545 -162 -6303 -13327
1098a3327j091O508o841l400J7779m60k219J8660p451q335O411j2556M611p102
$$ -13327 -14418 -7910 -14751 -18151 -372 -832 -3051 15609 8158 -177 6234 -6322 -1711 -8813
1084h813N431P825N493p818K197J171j2542j5550R763J7234l322j7375J0044J3296
$$ -8813 -3382 4443 9936 2118 4315 5486 -7056 -22606 -12843 4391 1069 -16306 -6262 7034
1070G034L658n291j6678p460Q010J884q776J2848K167M435m008J921P779j2658
$$ 7034 10692 5401 -11277 -18737 -10727 -8843 -17619 -4771 -2604 1831 -2177 -256 7523 -5135
1056e135M708M121P760j4808k47O074l289r602m301K0593n940j437Q38j1176K576
$$ -5135 -427 3694 11454 -3354 -3601 2473 -816 -10418 -14719 5874 -66 -1503 -665 -11841 -9265
1041i265J2300N550M015m26L318k348l948j254J184r689K145M273n018j8520L043
$$ -9265 3035 8585 12600 12174 15492 13144 9196 7942 9126 -563 1582 5855 837 -17683 -14640
1026a4640R138R592l960l059K253K821M389P39j0488R181j404R193n959m566n182
$$ -14640 -5502 4090 130 -2929 -676 2145 6534 7273 -3215 5966 4562 13755 7796 3230 -1952
1011a952n458J7826k302j1694k573j043n947N52J2304Q977j1637r0q180l340J3968
$$ -1952 -7410 10416 8114 -3580 -6153 -7196 -13143 -12591 -287 8690 -2947 -3037 -11217 -14557 -589
996e89M302r527J9141L687k048p171l440q619K415j911K1881p614l844r162J9498
$$ -589 3713 -5814 13327 17014 14966 7795 4355 -4264 -1849 -3760 18121 10507 6663 -2499 16999
981A6999k855j3351Q969m80r084J768P933K117J112j0824J393Q599o060k575n62
$$ 16999 14144 793 9762 9282 198 1966 9899 12016 13128 2304 3697 12296 6236 3661 3099
966C099p866J7739r582m899J0484m020r652J6800k131K583k7783J6336P652l886
$$ 3099 -4767 12972 3390 -1509 8975 4955 -4697 12103 9972 12555 -15228 1108 8760 4874
952D874P680m117p330k692k396o596j0781O044P558O237P924l833n435J2655o501
$$ 4874 12554 8437 1107 -1585 -3981 -10577 -21358 -15314 -7756 -1519 6405 2572 -2863 9792 3291
937C291q873l353J3339l123k326J4434j3036P697J402n53M937r62j1095L621N400
$$ 3291 -5582 -8935 4404 1281 -1045 13389 353 8050 9452 8899 13836 12874 1779 5400 10800
922A0800j8004q537Q792m566M961P797J4209j3019j7862o42Q65J6449Q157K373
$$ 10800 -7204 -15741 -6949 -11515 -6554 1243 15452 2433 -15429 -16071 -15206 1243 9400 11773
908A1773J5031k1310n103q469J2030N012o922M094o204L352j3803m566J7513R248
$$ 11773 26804 5494 391 -8078 3952 8964 2042 6136 -68 3284 -10519 -15085 2428 11676
894A1676J58P373j0820j3620J7803j0079J7600L638k0974j9976J3277J7915K848
$$ 11676 11834 19207 8387 -5233 12570 2491 20091 23729 2755 -17221 -3944 13971 16819
881A6819n2P136r976j9947j532o509K697J912R70J023O044K0813j1004q363J9532
$$ 16819 16767 23903 13927 -6020 -7552 -14061 -11364 -9452 -8482 -7459 -1415 19398 8394 31 19563
866A9563k0858L278j7788p471N666J2510O805j1878j0532K4852M391k879m802
$$ 19563 -1295 1983 -15805 -23276 -17610 -5100 1705 -10173 -20705 4147 8538 5659 857
853H57j4653J1110m660p088J3151q48R6J857N669j569p656J8652O143j934m818
$$ 857 -13796 -2686 -7346 -14434 -1283 -2131 -2035 -178 5491 3922 -3734 14918 21061 19127 14309
838A4309j659k468l757J8974j6672j515M077j5551O188q741j2194N614L0849j0340
$$ 14309 12650 10182 6425 25399 8727 7212 11289 -4262 1926 -6815 -19009 -13395 17454 7114
824G114j8617J5091J5773J394k1277o415Q040M319q12J441O646J297q631K821
$$ 7114 -11503 3588 19361 20755 -522 -6937 1103 5422 4610 6051 12697 13994 5363 8184
810H184j0117n549M346J3329j4175j3071M577K585m634K98j5163O882L1768r653
$$ 8184 -1933 -7482 -3136 10193 -3982 -17053 -12476 -9891 -14525 -14227 -29390 -22508 9260 -393
796c93K4N649k664P630P893L913n932m703p620m551j853J1373k374m83l083q131
$$ -393 -369 5280 2616 10246 18139 22052 16120 11417 3797 -754 -2607 8766 6392 5909 2826 -5305
780e305J1395j3956N770N96O458K90j5191M933P943R019l699J44j364j3271J5765
$$ -5305 6090 -7866 -2096 -1500 4958 5248 -9943 -5010 2933 11952 8253 8397 7033 -6238 9527
765I527L239O148k7361M030q729L708J904N665l42Q163k712J2598N934k428L119
$$ 9527 12766 18914 -8447 -4417 -13146 -9438 -7534 -1869 -2211 5952 3240 15838 21772 19344 22463
750B2463q206j1273n483N709r198k831O015K1867r775j0322j0170P432l504R002
$$ 22463 14257 2984 -2499 3210 -5988 -8819 -2804 19063 9288 -1034 -11204 -3772 -7276 1726
736A726J780R061p694K229J7364j1292j1192J37k977M204R66K79k1538O250R801
$$ 1726 3506 12567 4873 7102 24466 13174 1982 2119 -858 3346 4312 4591 -16947 -10697 -896
721h96q545J0833J7513j0248j0810J0457J3063o331m543j5339j5431J9212J5032
$$ -896 -9441 1392 18905 8657 -2153 8304 21367 15036 10493 -4846 -20277 -1065 13967
708A3967J104j9124J5143K812q295q617J468J1359k87j1482M433l556K818O354
$$ 13967 15071 -4053 11090 13902 5607 -3010 -1542 9817 9530 -1952 2481 -1075 1743 8097
694H097p967J5336j6029Q21J1369j7930O332R726R47m108p187J2235l29R61j1189
$$ 8097 130 15466 -563 258 11627 -6303 29 9755 10702 6594 -593 11642 11313 12274 1085
679A085n112J8514l495K785o791J5561K238j4061M650m670j843o102N915R51Q473
$$ 1085 -4027 14487 10992 13777 6986 22547 24785 10724 15374 10704 8861 2759 8674 9625 18098
664A8098m446j2639j984J5984r089j8244J6824N399M890r092j488J3599j1362
$$ 18098 13652 1013 -971 15013 5924 -12320 4504 9903 14793 5701 4213 17812 6450
651F450j5197J1092O520J3716k420l4793M035Q826n938K401O886Q337J1748m941
$$ 6450 -8747 2345 8865 22581 20161 -14632 -10597 -1771 -7709 -5308 1578 9915 21663 16722
637A6722K04j0721J6464j798k6600J0439O622Q239P03j0056J985p493r763m182
$$ 16722 16926 6205 22669 20871 -5729 4710 11332 19571 20274 10218 12203 4710 -5053 -9235
623i235O274p748N601J6517n727n724l135P434p399N057j881L295O013O675m077
$$ -9235 -2961 -10709 -5108 11409 5682 -42 -3177 4257 -3142 1915 34 3329 9342 16017 11940
608A1940j6680l808n971J5080P578N381Q930j4685j786j2394M135O069R830J0200
$$ 11940 -4740 -8548 -14519 561 8139 13520 22450 7765 5979 -6415 -2280 3789 13619 23819
594B3819o319j326j1735m866J7932j0326p056Q182P001R717r179j5338K057N389
$$ 23819 17500 16174 4439 -427 17505 7179 123 8305 15306 25023 15844 506 2563 7952
580G952K144q680o229R3r07P198p788q747J2162Q813P046k26k0245n83M162l126
$$ 7952 10096 1416 -4813 -4720 -5627 1571 -6217 -14964 -2802 6011 13057 12831 -7414 -7997 -3835 -6961
564f961L213J9198n957K491J2225o913j3214J5583n361r556o361Q242J4749K267
$$ -6961 -3748 15450 9493 11984 24209 17296 4082 19665 14304 4748 -1613 6629 21378 23645
550B3645Q722j3934J0077k0867j0053J6403k001j4175K762J2954M396j2111K487
$$ 23645 32367 18433 28510 7643 -2410 13993 11992 -2183 579 13533 17929 5818 8305
537H305J773r86k929m03k186L526p514o373L296J012J5303k921k721Q150q63M841
$$ 8305 10078 9092 6163 5760 3574 7100 -414 -6787 -3491 -2479 12824 9903 7182 15332 14469 19310
521A9310j2948m351J3122j5964J349k022P140J040j566J8204l627j5116L508O3
$$ 19310 6362 2011 15133 -831 518 -1504 5636 6676 5110 23314 19687 4571 8079 8142
507H142R605j996L778m275J9824q476l4538J2802M068n970O758J0925l678j5728
$$ 8142 17747 15751 19529 15254 35078 26602 -7936 4866 8934 2964 9722 20647 16969 1241
493A241J896J1799o963m975p575j3900J3757J9179l050N512J6607r41j7625o259
$$ 1241 3137 14936 7973 2998 -4577 -18477 -4720 14459 11409 16921 33528 32587 14962 8703
479H703O591M324q656J116p136j238J0979m676j5354j1504J3255K1221k0673j5025
$$ 8703 15294 19618 10962 12078 4942 3704 14683 10007 -5347 -16851 -3596 17625 -3048 -18073
465a8073J1964N119M111k197J3914J1355R03j9437k532l156M700N360N026m181
$$ -18073 -6109 -990 3121 924 14838 26193 27096 7659 5127 1971 6671 12031 17057 12876
451A2876j5442n645L175J5674p436j1917j4587J2950J6229J1154Q216r337j1432
$$ 12876 -2566 -8211 -5036 10638 3202 -8715 -23302 -10352 5877 17031 25247 15910 4478
438D478p576P818K8821l2854Q28J2777r034R531M408q27j601j7758L964j454K007
$$ 4478 -3098 4720 33541 687 1515 14292 5258 14789 19197 18370 16769 -989 2975 1521 3528
423C528J4017j742M172j9785M675J764j4303k618J3122n479J6675j3364o675J3450
$$ 3528 17545 15803 19975 190 4865 6629 -7674 -10292 2830 -2649 14026 662 -6013 7437
409G437J0069j1672p335J764K759J3905J032J5417r382q847P155r380j6559o709
$$ 7437 17506 5834 -1501 263 3022 16927 17959 33376 23994 15147 22302 12922 -3637 -10346
395a0346m623j196k611N568K1359j0632j823M006r809O046N490Q329n251p12l548
$$ -10346 -14969 -16165 -18776 -13208 8151 -2481 -4304 -298 -10107 -4061 1429 9758 4507 3795 247
380B47R78N064q732N961j3130K791P466j3778J813J5996l75n543J775J182q051
$$ 247 1225 6289 -2443 3518 -9612 -6821 645 -13133 -11320 4676 4301 -1242 533 1715 -6336
365f336L293K3278o675M465k3745l260J3227j539J6870q183j3326l820J5514P492
$$ -6336 -3043 20235 13560 18025 -5720 -8980 4247 2708 19578 11395 -1931 -5751 9763 17255
351A7255k0152K64O66J0484j0266j3331Q297J2667r067j0397n478J4954o697Q493
$$ 17255 -2897 -2633 -1967 8517 -1749 -15080 -6783 5884 -3183 -13580 -19058 -4104 -10801 -2308
337b308K7080j4990L771l233j4861J0028J2829j3868J4467k996o301n158o878
$$ -2308 24772 9782 13553 10320 -4541 5487 18316 4448 18915 15919 9618 4460 -2418
324b418J0873O744j3617N503J0353r042J3231r258m601r852J3076k467r022j6997
$$ -2418 8455 15199 1582 7085 17438 8396 21627 12369 7768 -2084 10992 8525 -497 -17494
310a7494J878J864O018M824P9K5163J765j625r225L943m660r927J0058J8059l590
$$ -17494 -15616 -13752 -7734 -2910 -2831 22332 24097 22472 13247 17190 12530 2603 12661 30720 27130
295B7130j7188j3421R139l364M864M835j0507O12k897l376R875o086o73M053l398
$$ 27130 9942 -3479 5660 2296 7160 11995 1488 2100 -797 -4173 5702 -384 -1057 2996 -402
280d02P274q693P26K574J0916p253K48J678j2141K5027m455j2212k769J5545J1547
$$ -402 6872 -1821 -1095 1479 12395 5142 5390 7068 -5073 19954 15499 3287 518 16063 27610
265B7610j2794j3790m406o862J8702n593K808R855j7886J0230p236K366L581q328
$$ 27610 14816 1026 -3380 -10242 8460 2867 5675 15530 -2356 7874 638 3004 6585 -1743
251a743J4955n193l59k78O707k301k0809p41J3096p276n482j452l342q389P969
$$ -1743 13212 8019 7660 7382 14089 11788 -9021 -9762 3334 -3942 -9424 -10876 -14218 -22607 -14638
236a4638P16K1330J070j675k532n307l554J948O543k307k606R731L958k426j2375
$$ -14638 -13922 7408 8478 6803 4271 -1036 -4590 -2642 3901 1594 -1012 8719 12677 10251 -2124
221b124Q362P472j3510k919J6399k804J42K370j0680J988j0742J0887M81k559
$$ -2124 6238 13710 200 -2719 13680 10876 11018 13388 2708 4696 -6046 4841 5322 2763
207B763j0746J2207Q439o532j3861j739q268J6540N455J0654q543l267n127J3531
$$ 2763 -7983 4224 12663 6131 -7730 -9469 -17737 -1197 4258 14912 6369 3102 -2025 11506
193A1506L660k539j7679P592O870j4660q587N985o651j2433L0744j504m306K809
$$ 11506 15166 12627 -5052 2540 9410 -5250 -13837 -7852 -14503 -26936 3808 2304 -2002 807
179H07J2632K391p572j792m139J2176m271j7504q80K0316M539K066j3159j594
$$ 807 13439 15830 8258 6466 2327 14503 10232 -7272 -8152 12164 16703 18769 5610 4016
165D016K421J6515j7720M076J7329n548m38j4430q972K603j1742P646L353j0159
$$ 4016 6437 22952 5232 9308 26637 21089 20651 6221 -2751 -148 -11890 -4244 -891 -11050
151a1050L303J8930L409j2118o421J2800J2501j3673L862q364K219j446m075L325
$$ -11050 -7747 11183 14592 2474 -3947 8853 21354 7681 11543 3179 5398 3952 -123 3202
137C202J0409j7561R807n444K227P644j1089J47o42Q366M929j5288N477R116N344
$$ 3202 13611 -3950 5857 413 2640 10284 -805 -658 -1300 7066 11995 -3293 2184 11300 16644
122A6644R90j4186Q039J3944j3293j3638L484N174O588J1862j5697J4308j8961
$$ 16644 17634 3448 11487 25431 12138 -1500 1984 7158 13746 25608 9911 24219 5258
109E258k207R84p62r482j1069J5351J1523M126N587K653j5075m383J675k976K251
$$ 5258 3051 4035 3273 -6209 -17278 -1927 9596 13722 19309 21962 6887 2504 4179 1203 3454
94C454n84p372n198J3633J3655p663j495L538r702K786M421R515k253q020r8j974
$$ 3454 2870 -4502 -9700 3933 17588 9925 8430 11968 2266 5052 9473 18988 16735 8715 8617 6643
78F643m831q155R456J5438P93p207j4204K1R728Q077R91j094K080j2880N471k077
$$ 6643 1812 -6343 3113 18551 19344 12137 -2067 -2046 7682 15759 16750 15656 17736 4856 10327 8250
62H250J1609p068j8623m761J4704j57j4626J2802M632m296L945M55p359L145q343
$$ 8250 19859 12791 -5832 -10593 4111 3954 -10672 2130 6762 2466 6411 6866 -493 2652 -5691
47e691k969J1785l841K710J214n388J179N032j5K429m003j1070P23J6099n85k138
$$ -5691 -8660 3125 -716 1994 3208 -2180 -1001 4031 4016 6445 2442 -8628 -7905 8194 7609 5471
31E471O954M145j9896k414J3735M826j6270o462K021k50J9532L014j3276J455
$$ 5471 12425 16570 -3326 -5740 7995 12821 -3449 -9911 -7890 -8140 11392 14406 1130 2585
17B585l209J3326L403j6187m270R666M595O469M664k059J647n443q519K83o421
$$ 2585 -624 12702 16105 -82 -4352 5314 9909 16378 21042 18983 20630 15187 6668 6951 530
2E30J2692k52
$$ 530 13222 12970
0A2970
$$ 12970
$$ Imaginary data points
##PAGE= N=2
##DATA TABLE= (X++(I..I)), XYDATA
16383a842907K9644L8025K9251K6844O719K6152K1290L1602K0551K2068K2837
$$ -1842907 -1813263 -1775238 -1745987 -1719143 -1712424 -1686272 -1664982 -1633380 -1612829 -1590761 -1567924
16372a567924K4369J9296K1809K7808K3780K3667K4223J9620J9555J9174L5993
$$ -1567924 -1543555 -1524259 -1502450 -1474642 -1450862 -1427195 -1402972 -1383352 -1363797 -1344623 -1308630
16361a308630J7660K9203K9517J1135J2613K5725L2207K2122K7378K7975K7482
$$ -1308630 -1290970 -1261767 -1232250 -1221115 -1208502 -1182777 -1150570 -1128448 -1101070 -1073095 -1045613
16350a045613J7785K0893J8989J2306K4441K7193K1252K5096J6696K5481J8970
$$ -1045613 -1027828 -1006935 -987946 -975640 -951199 -924006 -902754 -877658 -860962 -835481 -816511
16339h16511M0992K1538P614K5233J9386K3813K4495K0931L5308J7339J3155K0854
$$ -816511 -775519 -753981 -746367 -721134 -701748 -677935 -653440 -632509 -597201 -579862 -566707 -545853
16327e45853L4758J4919K0186K7170J2915K2353J7580L1910J4819L721K9878K3339
$$ -545853 -511095 -496176 -475990 -448820 -435905 -413552 -395972 -364062 -349243 -345522 -315644 -292305
$$ [...]
##END NTUPLES=NMR SPECTRUM
##END=
