##TITLE=1H_CG-1181-b0
 CDCl3
 8 sc, 
 12.4.2024
##JCAMPDX= 6.0         $$ Bruker NMR JCAMP-DX V2.0
##DATA TYPE= NMR SPECTRUM
##DATA CLASS= NTUPLES
##ORIGIN= UXNMR, Bruker Analytische Messtechnik GmbH
##OWNER= root
$$ XWIN-NMR		Version 3.5
$$ Fri Apr 12 14:32:02 2024 Russian Standard Time (UT+4h)  she@DPX200
##.OBSERVE FREQUENCY= 200.1309
##.OBSERVE NUCLEUS= ^1H
##.ACQUISITION MODE= SIMULTANEOUS
##.ACQUISITION SCHEME= undefined
##.AVERAGES= 8
##.DIGITISER RES= 18
##SPECTROMETER/DATA SYSTEM= spect
##.PULSE SEQUENCE= zg30
##.SOLVENT NAME= CDCl3
##.SHIFT REFERENCE= (INTERNAL, CDCl3, 0, 15.5089)
##AUDIT TRAIL= $$ (NUMBER, WHEN, WHO, WHERE, WHAT)
$$ ##TITLE= Audit trail, XWIN-NMR		Version 3.5
$$ ##JCAMPDX= 5.01
$$ ##ORIGIN= Bruker BioSpin GmbH
$$ ##OWNER= she
$$ F:/spectra/data/she/nmr/H-F/1/pdata/1/auditp.txt
$$ ##AUDIT TRAIL=  $$ (NUMBER, WHEN, WHO, WHERE, WHAT)
(   1,<2024-04-12 14:30:49.93 +0400>,<she>,<DPX200>,
      <created by zg, POWCHK disabled, PULCHK disabled
       configuration hash MD5:
       00 E9 B6 7A A2 85 ED C7 34 08 36 98 17 FE 4E 26
       data hash MD5: 16K
       96 21 77 E7 D2 57 A6 70 26 8A 11 58 F9 D3 4F 34>)
(   2,<2024-04-12 14:30:53.31 +0400>,<she>,<DPX200>,
      <Start of raw data processing
       efp BC_mod = 2 LB = 0.24 FT_mod = 6 PKNL = 1 PHC0 = -25462.31 PHC1 = 15.38731 SI = 16K 
       data hash MD5: 16K
       79 08 6A BD A5 20 B0 1A 97 34 38 BB 1E 5B 78 08>)
(   3,<2024-04-12 14:31:11.32 +0400>,<she>,<DPX200>,
      <pk PHC0 = 163.9887 PHC1 = -7 
       data hash MD5: 16K
       CA 0F 9C 3C 1F F5 46 F1 0B A0 7F C7 BC 65 08 3B>)
(   4,<2024-04-12 14:31:15.07 +0400>,<she>,<DPX200>,
      <abs ABSG = 5 
       data hash MD5: 16K
       B6 7F 96 61 F5 9A EF 10 BF E1 2B F4 7A C3 A7 B6>)
$$ ##END=
$$ 
$$ hash MD5
$$ 75 ED 03 62 C1 C5 EC FE F4 BB 7A D5 EE 85 8B 68
##$RELAX= 
##$RELAX= 
##$RELAX= 
##$RELAX= 
##$RELAX= 
##$RELAX= 
$$ Bruker specific parameters
$$ --------------------------
##$DU= <F:/spectra>
##$EXPNO= 1
##$NAME= <H-F>
##$PROCNO= 1
##$TYPE= <nmr>
##$USER= <she>
##$AMP= (0..31)
100 100 100 100 100 100 100 100 100 100 100 100 100 100 100 100 100 100 
100 100 100 100 100 100 100 100 100 100 100 100 100 100 
##$AQSEQ= 0
##$AQ_mod= 1
##$AUNM= <au_zg>
##$AUTOPOS= <>
##$BF1= 200.13
##$BF2= 200.13
##$BF3= 200.13
##$BF4= 200.13
##$BF5= 200.13
##$BF6= 200.13
##$BF7= 200.13
##$BF8= 200.13
##$BYTORDA= 1
##$CFDGTYP= 0
##$CFRGTYP= 5
##$CHEMSTR= <none>
##$CNST= (0..31)
1 1 145 1 1 1 1 1 1 1 1 1 1 1 1 1 1 1 1 1 1 1 1 1 1 1 1 1 1 1 1 1 
##$CPDPRG= <>
##$CPDPRG1= <>
##$CPDPRG2= <>
##$CPDPRG3= <>
##$CPDPRG4= <mlev>
##$CPDPRG5= <mlev>
##$CPDPRG6= <mlev>
##$CPDPRG7= <mlev>
##$CPDPRG8= <mlev>
##$CPDPRGB= <>
##$CPDPRGT= <>
##$D= (0..31)
0 1.2 0 0 0 0 0 0 0 0.06 0 0.03 0 0 0 0 0.0002 0 0 0 0 0 0 0 0 0 0 0 0 
0 0 0 
##$DATE= 1712917849
##$DBL= (0..7)
120 120 120 120 120 120 120 120 
##$DBP= (0..7)
150 150 150 150 150 150 150 150 
##$DBP07= 0
##$DBPNAM0= <>
##$DBPNAM1= <>
##$DBPNAM2= <>
##$DBPNAM3= <>
##$DBPNAM4= <>
$$ [...]
##$SUBNAM3= <"">
##$SUBNAM4= <"">
##$SUBNAM5= <"">
##$SUBNAM6= <"">
##$SUBNAM7= <"">
##$SUBNAM8= <"">
##$SUBNAM9= <"">
##$SW= 18.0517689322627
##$SWIBOX= (0..15)
0 0 2 0 0 0 0 0 0 0 0 0 0 0 0 0 
##$SW_h= 3612.71676300578
##$TD= 16384
##$TD0= 1
##$TE= 0
##$TE2= 300
##$TE3= 300
##$TEG= 300
##$TL= (0..7)
0 120 120 120 120 120 120 120 
##$TP= (0..7)
150 150 150 150 150 150 150 150 
##$TP07= 0
##$TPNAME0= <>
##$TPNAME1= <>
##$TPNAME2= <>
##$TPNAME3= <>
##$TPNAME4= <>
##$TPNAME5= <>
##$TPNAME6= <>
##$TPNAME7= <>
##$TPOAL= (0..7)
0.5 0.5 0.5 0.5 0.5 0.5 0.5 0.5 
##$TPOFFS= (0..7)
0 0 0 0 0 0 0 0 
##$TUNHIN= 0
##$TUNHOUT= 0
##$TUNXOUT= 0
##$USERA1= <user>
##$USERA2= <user>
##$USERA3= <user>
##$USERA4= <user>
##$USERA5= <user>
##$V9= 5
##$VALIST= <valist>
##$VCLIST= <CCCCCCCCCCCCCCC>
##$VD= 0
##$VDLIST= <DDDDDDDDDDDDDDD>
##$VPLIST= <PPPPPPPPPPPPPPP>
##$VTLIST= <TTTTTTTTTTTTTTT>
##$WBST= 1024
##$WBSW= 4
##$XGAIN= (0..3)
0 0 0 0 
##$XL= 0
##$YL= 0
##$YMAX_a= 119690
##$YMIN_a= -140467
##$ZGOPTNS= <>
##$ZL1= 120
##$ZL2= 120
##$ZL3= 120
##$ZL4= 120
##$ABSF1= 15.51554
##$ABSF2= -2.536345
##$ABSG= 5
##$ABSL= 3
##$ALPHA= 0
##$AQORDER= 0
##$ASSFAC= 0
##$ASSFACI= 0
##$ASSFACX= 0
##$ASSWID= 0
##$AUNMP= <proc_1d>
##$AZFE= 0.1
##$AZFW= 0.1
##$BCFW= 0
##$BC_mod= 2
##$BYTORDP= 0
##$COROFFS= 0
##$CY= -3
##$DATMOD= 1
##$DC= 0
##$DFILT= <>
##$DTYPP= 0
##$F1P= 0
##$F2P= 0
##$FCOR= 1
##$FTSIZE= 16384
##$FT_mod= 6
##$GAMMA= 0
##$GB= 0
##$INTBC= 1
##$INTSCL= 3.70164e-10
##$ISEN= 128
##$LB= 0.24
##$LEV0= 0
##$LPBIN= 0
##$MAXI= 10000
##$MC2= 0
##$MEAN= 0
##$ME_mod= 0
##$MI= 1.114404
##$NCOEF= 0
##$NC_proc= -8
##$NLEV= 6
##$NOISF1= 3.799351
##$NOISF2= 2.8
##$NSP= 0
##$NTH_PI= 0
##$NZP= 0
##$OFFSET= 15.50893
##$PC= 1
##$PHC0= -25298.32
##$PHC1= 8.38731
##$PH_mod= 1
##$PKNL= yes
##$PPARMOD= 0
##$PSCAL= 0
##$PSIGN= 0
##$REVERSE= no
##$SF= 200.129602561657
##$SI= 16384
##$SIGF1= 3
##$SIGF2= 2
##$SINO= 5.538805
##$SIOLD= 16384
##$SREGLST= <1H.CDCl3>
##$SSB= 0
##$STSI= 16384
##$STSR= 0
##$SW_p= 3612.71676300577
##$SYMM= 0
##$S_DEV= 0
##$TDeff= 16384
##$TDoff= 0
##$TI= <>
##$TILT= no
##$TM1= 0
##$TM2= 0
##$TOPLEV= 0
##$USERP1= <user>
##$USERP2= <user>
##$USERP3= <user>
##$USERP4= <user>
##$USERP5= <user>
##$WDW= 1
##$XDIM= 16384
##$YMAX_p= 301537534
##$YMIN_p= -1580885
$$ End of Bruker specific parameters
$$ ---------------------------------
##NTUPLES= NMR SPECTRUM
##VAR_NAME=  FREQUENCY,     SPECTRUM/REAL,   SPECTRUM/IMAG
##SYMBOL=    X,             R,               I
##VAR_TYPE=  INDEPENDENT,   DEPENDENT,       DEPENDENT
##VAR_FORM=  AFFN,          ASDF,            ASDF
##VAR_DIM=   16384,         16384,           16384
##UNITS=     HZ,            ARBITRARY UNITS, ARBITRARY UNITS
##FACTOR=    0.220516191357247, 1,           1
##FIRST=     3103.79603834306, 0,            0
##LAST=      -508.920724662708, 0,           0
##MIN=       -508.920724662708, -1580885,    0
##MAX=       3103.79603834306, 301537534,    0
$$ Real data points
##PAGE= N=1
##DATA TABLE= (X++(R..R)), XYDATA
$$ [...]
11834E07792j60449L29350o79240j25568k512n5993N50574J89358j258268M71224
11824b33732K54047p0319P3347k68662L28275k46904j89265k38717O37795K27295
11814B73160L79949o93658k19201j84823J61757L30170k02447K31315K65798q89192
11804e47172J70174L43471J19561p15633P82983k28291J84473p3276k17349j27064
11794c08123L15502p27539l73432K36834n17083M22657N46415K20737n41309P90767
11784F5426l06495j45388q6321K60947Q46185L6063k71396m20909r50460N32995
11774d39353J25471k81638M85145L95672j87457p1964o16055k66663M24559K05630
11764b26653K33319K62648q1492L57244m48289n87229K39284M89481k5184k92084
$$ y = [507792, 347343, 676693, -2547, -128115, -130627, -186620, 363954, 553312, -704956, -233732, 20315, -50004, 23343, -245319, 82956, -163948, -353213, -591930, 45865, 273160, 653109, -40549, -259750, -444573, -282816, 47354, -155093, 76222, 342020, -547172, -376998, -33527, 86034, -629599, 153384, -74907, 109566, 36290, -181059, -308123, 7379, -720160, -1093592, -856758, -1373841, -951184, -404769, -184032, -725341, 65426, -241069, -386457, -472778, -211831, 634354, 670417, 399021, -21888, -972348, -439353, -313882, -595520, -110375, 285297, 97840, 25876, -590179, -856842, -432283, -226653, 6666, 269314, 187822, 545066, 96777, -490452, -251168, 238313, 213129, -78955]
11754g8955n71853j79363K77028M85739O8537L7644o6567n25642o68737P98329
11744d23840N28434q9669K05038J13227K69296l14688m9183R1292p1934l18266
11734f0293J20401j365M60655m09400N2001k77835J0321p6051K01326N6147L92550
11723D68457j01498J65441N6826K23758k78951l69161n2969o88253k47374M91734
11713c31990P127j45306J39221M74757L68714n20479q23490J44132L33038Q4911
11703b69365l971j94269Q0708P58116j67869l10487P78942J59499J96357j096519
11693f8858o45753L49975M99011o3705Q00687k2615r05970K25312m14554M05346
11683A58876k28497Q26426m48572m56021k5653m40766O167L78609q2868M06060
$$ y = [-78955, -650808, -830171, -553143, -67404, 1133, 38777, -27790, -553432, -1222169, -423840, 104594, 14925, 219963, 333190, 602486, 287798, 238615, 329907, 257973, -60293, 60108, 58743, 519398, 109998, 161999, -115836, -105515, -181566, 19760, 75907, 468457, 366959, 532400, 589226, 812984, 534033, 164872, 111903, -576350, -823724, -331990, -324863, -470169, -330948, 143809, 512523, -7956, -831446, -687314, -354276, -269365, -273336, -467605, -386897, 371219, 203350, -107137, 671805, 831304, 1027661, -68858, -714611, -364636, 134375, 70670, 871357, 848742, -57228, 168084, -246470, 158876, -69621, 756805, 308233, -147788, -173441, -614207, -608040, -229431, -312299, 93761]
11673I3761r1026k02634M59085L999J54026j76192l43166L32140K9341q17316
11663e57982L74092j70189K45509n15630k96423R2509K7258L96526J93594l31215
11653e41951K32087J38210r5081n1055N44032M96364k67347J17493o0842q17702
11643c05792L62420n04582p355K09994p0377O5834O19648J2428j34659m38808
11633a91249L79042N4509J13215J17365m11124K5685q8185N5946q3150j77575
11623b05521J73129l19206J08527P98716j55189K37911M3524m08479k7911k12003
11613C3498O92321j81448r00756K86887P80372l65651n16722M30791k52648L38065
11603C44709K50578J2376n05039k10264R7575j23961n82521P18204k69391k79362
$$ y = [93761, 2735, -199899, 259186, 263185, 417211, 241019, -102147, 229993, 259334, -557982, -183890, -354079, -108570, -624200, -920623, -828114, -800856, -404330, -210736, -541951, -309864, -171654, -266735, -317790, 226242, 722606, 455259, 572752, 511910, -305792, 56628, -447954, -455309, -245315, -315692, -249858, 369790, 382218, 247559, -191249, 187793, 242302, 355517, 472882, 61758, 87443, -742, 55204, -27946, -205521, -32392, -351598, -243071, 555645, 400456, 638367, 681891, 273412, 245501, 33498, 725819, 544371, -356385, -69498, 710874, 345223, -171499, 259292, 6644, 344709, 595287, 607663, 102624, -107640, -10065, -134026, -716547, 1657, -267734, -547096]
11593e47096P90401n0224J40916k93391K04675J24286j59026j0443k35113K9187
11583e828n11682P7864K29290O23924P7912m38415M2747Q28304l05435p44500
11573a25819n99051l43926M69570K80263k75424N35913K99516q0661l43260q8523
11563b71402j30238K78526K45458m3957P48855l33479p39419J72506Q17144q6956
11553F57038m4293J41924o94935k63834P77590l41129l24052L53500L56238k05488
11543D12559o33490p01139Q39153P00696j84670k9431j61800o03265M73265k42980
11533a31102M3294n96568M16259L71560J39001K3285p75673L51365K6594K51630
11523A19645P3493n54974k8214J09050M57851M24244K19433k44678q83212r1191
$$ y = [-547096, 243305, 193081, 333997, 40606, 245281, 369567, 210541, 200098, -35015, -5828, -517510, -439646, -210356, 413568, 491480, 53065, 95812, 924116, 618681, -125819, -724870, -1068796, -599226, -318963, -594387, -58474, 241042, 160381, -182879, -271402, -401640, -123114, 122344, 78387, 827242, 493763, -245656, -73150, 743994, 657038, 612745, 754669, 59734, -204100, 573490, 232361, -91691, 261809, 618047, 412559, -220931, -922070, -82917, 617779, 433109, 403678, 241878, -361387, 111878, -131102, -87808, -684376, -268117, 103443, 242444, 265729, -509944, -158579, -131985, 119645, 193138, -361836, -390050, -281000, 176851, 601095, 820528, 575850, -307362, -398553]
11513c98553P37034J13933m89584l02792J36513N0513l34317L26996l0079N31421
11503C41085l88003j67766L47645L25480m71556l93836n30379L59586Q13437m73019
11493b37326n2058o80733L97851M94386M53265O3421j31382l10036j08840M73522
11483C62070l17432M74335l01730J95517J206j90157q1369L63382M4638n55972
11473e512m52474K2809m1505j50171m95414P43506L97816P2103m32936l24240
11463f66018l07932R81966m15195L07610P800j50642Q9036l4576K97212l51464
11453b42203K62720k30273K66177k17294J04647J2068k5952m5845L71670k84728
11443b9013M50630m127m83313M09366l90357l16500k02853K10821J70550j69588
$$ y = [-398553, 338481, 452414, -37170, -339962, -203449, -152936, -487253, -160257, -190336, 341085, -46918, -214684, 132961, 458441, -13115, -406951, -937330, -577744, 235693, -237326, -289384, -970117, -572266, -77880, 375385, 438806, 307424, -2612, -111452, 362070, 44638, 518973, 217243, 412760, 413966, 223809, 142440, 505822, 550460, -5512, -457986, -435177, -476682, -626853, -1122267, -378761, 19055, 91158, -341778, -666018, -973950, 8016, -407179, -99569, -91769, -242411, -153375, -187951, 109261, -242203, 20517, -209756, 56421, -160873, -56226, -44158, -70110, -115955, 255715, -29013, 421617, 417490, -65823, 343543, -46814, -363314, -566167, -355346, -184796, -354384]
11433c54384N6691j29649J46421L51174j57318O1300M58994N54935K72431n22562
11423G38033L24757q25219p93887L250M34235K49132K2889K64917Q6953L2965
11413E38025o42925m70942K87226k99289K80798K7960N93086M70605k72581l45779
11403A66184k97877l20077j11232m59413R9530J33411K73435j17063l0082P44786
11393H1602K74594J50289M50695r93330J09766J73561J14455k42606L6962k04678
11383d8690m35590P75700j63195Q69563l0790l92918n33539n03638M72013J17240
11373A26156M43770m28149J45560j63386M26943M74855m07160p2862m79500N40288
11363F06515K21952j55799m6106L06477r42326j79813l9864O1370j57549O53286
$$ y = [-354384, -297693, -427342, -280921, 70253, -87065, -25765, 433229, 988164, 1260595, 738033, 1062790, 237571, -556316, -553066, -118831, 130301, 153190, 418107, 505060, 538025, -104900, -575842, -288616, -587905, -307107, -279147, 313939, 784544, 511963, 166184, -131693, -451770, -563002, -1022415, -922885, -789474, -516039, -633102, -663184, 81602, 356196, 506485, 957180, -36150, 73616, 247177, 361632, 119026, 155988, -48690, -484280, 291420, 128225, 997788, 966998, 574080, 40541, -463097, 8916, 126156, 569926, 141777, 287337, 123951, 550894, 1025749, 618589, 545727, 66227, 606515, 828467, 672668, 626562, 933039, -9287, -189100, -228964, -167594, -325143, 328143]
11353C28143m8508K13181j89676m43725M19427M0211o15358j98078L0589k13670
11343f77464J31981K62090n6558J29787N0398n68020k2436j98388Q68682o5011
11333a44939n23593K13434J038601K16938j83653q6067m57353n51769N49569K0898
11323I2066K76569j66803j84598J7290K64202r0607m48126L89243L58779j146995
11313f38980o02499Q17941j5554k52075M07861j52877K77966L89348n74195L51657
11303H593R7794j99034q9572j57231L05455m9242J25945L56909k11163k10861
11293b2407Q4977M61522p38845J68103L91878L63643l11123o98755L00814K24689
11283B24496p90248j47912Q16899j08934k62739O19610j57060j10241q1926K7561
$$ y = [328143, 279635, 492816, 303140, -140585, 278842, 319053, -296305, -494383, -463794, -677464, -545483, -283393, -339951, -210164, -159766, -727786, -750222, -948610, -79928, -144939, -668532, -455098, 583503, 800441, 616788, 530721, 73368, -478401, 71168, 92066, 368635, 201832, 17234, 34524, 298726, 208119, -240007, 149236, 508015, -638980, -1241479, -423538, -439092, -691167, -283306, -436183, -158217, 231131, -343064, 8593, 106387, -92647, -182219, -339450, -33995, -83237, 42708, 399617, 188454, -22407, 62570, 524092, -214753, -46650, 345228, 708871, 397748, -301007, -193, 224496, -565752, -713664, 103235, -5699, -268438, 351172, 194112, 83871, 1945, 29506]
11273B9506j06193J84607J78149L4158p8042k17697m77642L34569l9983M78062
11263C19494l65079p49230k65079P97085N45050p8827L88344m98401j64122O91613
11253F20848o43872l37515n09232M433O0917L38933J38141l48502m05522O40608
11243d40763P52339m92486L22871m87221j01194J26603N69465l01033P34134q0356
11233F02359p87327K32585l0444J7824l19756K48153O95430j60871j33355l07124
11223E7474q542R3887j38217J02900P49247j46464o21839j84424m6160K88703
11213A46565k26059k17593O41308K90878m76328O56738L1799p79754O04954K92562
11203I65070k83739j68926j21547q28035L3579K42515J01707N51568n70471j41273
$$ y = [29506, -76687, 107920, 286069, 320227, 242185, 24488, -453154, -118585, -158568, 319494, -45585, -794815, -1059894, -262809, 282241, 203414, 591758, 93357, -70765, 620848, -23024, -360539, -869771, -865338, -804421, -465488, -327347, -675849, -1081371, -440763, 311576, -180910, 141961, -345260, -446454, -319851, 249614, -51419, 682715, 602359, -184968, 47617, 17173, 34997, -284759, -36606, 658824, 497953, 364598, 57474, 48932, 142819, 4602, 107502, 856749, 710285, 88446, -95978, -142138, 146565, -79494, -297087, 344221, 635099, 158771, 815509, 847308, 67554, 672508, 965070, 681331, 512405, 390858, -437177, -403598, -161083, -59376, 492192, -78279, -219552]
11193b19552Q99214m22493K8137L8522n5143m95683M36941L77469j96901L13651
11183G04162k19730j89452l39837N13108l22847M22844K51922o94816J80630j34614
11173A71370k94780N19041J78974K02307k70611n12377L70491m65119J4870O46134
11163E60300m41453m83920K01067j10763j39221j46959K14540J26927O09982M24521
11153H15021l11458K36530n30331k67629N54069n42259N04308j036204k52646
11144h30599K9669L62983N40296j61465L43974M69752l52002p20892l44303j08289
11134g70876N10753Q5869j09413L86422j14883K0384L25322J14030j73365K90844
11124E65087M38491n61265L01166j89128K73135k22178m60546N8327K05327N76710
$$ y = [-219552, 679662, 257169, 285306, 323828, 268685, -226998, 209943, 587412, 390511, 704162, 484432, 294980, -44857, 468251, 145404, 568248, 820170, 125354, 305984, 171370, -123410, 395631, 574605, 776912, 506301, -6076, 364415, -100704, -85834, 560300, 118847, -365073, -164006, -274769, -413990, -560949, -346409, -219482, 390500, 815021, 503563, 740093, 209762, -57867, 496202, -46057, 458251, -577953, -830599, -800930, -437947, 102349, -59116, 284858, 754610, 402608, -318284, -662587, -770876, -260123, -174254, -283667, 102755, -12128, 8256, 333578, 447608, 274243, 565087, 1003578, 442313, 743479, 554351, 827486, 605308, 144762, 203089, 408416, 985126]
11114I85126p58817l01264j74308k66818K56917L4111l44880l11549K16856L29338
11104c35288J43373j3185K62834m1378J83448K59998j55977K26040j04546O9473
11094D94792k4463q37105j37835J98106L11130k28181l72387l30928O95071r7094
11084c28894J11496N2220L42390J25929l72986r26289M06048K80878J24994k62389
11074d46603K8014J57985M0944K00772K02124L6338m44182m8080J38705J5113
11064a18870N3950L43514r28692O80324N09357q5163k73420j08691K9488O5798
11054A67595K66570J52067J20650p80768m24948K5711L15729j30826M75211q2542
11044A04449P43388Q3043m43624k50809J27057l13492p33709q1401O46267M49055
$$ y = [985126, 226309, -74955, -249263, -516081, -259164, -225053, -569933, -881482, -664626, -335288, -191915, -205100, 57734, 16356, 199804, 459802, 303825, 529865, 425319, 494792, 470329, -366776, -504611, -306505, 4625, -223556, -595943, -926871, -231800, -328894, -217398, -165178, 177212, 303141, -69845, -996134, -590086, -309208, -184214, -446603, -418589, -260604, -219660, -18888, 183236, 219574, -224608, -272688, -133983, -118870, -64920, 278594, -650098, 30226, 539583, 454420, 181000, 72309, 101797, 167595, 434165, 586232, 706882, -73886, -498834, -473123, -157394, -288220, 186991, 104449, 847837, 930880, 487256, 236447, 363504, 50012, -683697, -765098, -118831, 330224]
11034C30224k7541o29704K69179N30632q70763K43043J28365K50287k3720m12891
11024b12889j70096J47742N23692J74254o3432R2761o44100j31876K3075J53336
11014a07533j1711l1560R1981k51666L46617N0229R1240N90135J99085j48790
11004H18027j16733M13131j057031Q3078L72700n72478K31851L10012o30226o07851
10994g55520O7693P8543L26717m94451o55804O02230K38231K28351j75086Q34260
10984B95164j42676k28576K98446k17411k81752P8864M89126Q14307l25348o00470
10974A79674L26675n3874m95375j11956K08194K451M63345J26764r8159j29316
10964D18423p16491k77288Q3954m43485K20832J65003j7190M92443J22646k03782
$$ y = [330224, 302683, -327021, -57842, 472790, -397973, -154930, -26565, 223722, 200002, -212889, -382985, -235243, 288449, 462703, 399271, 492032, -152068, -283944, -260869, -107533, -119244, -150804, -58823, -310489, 36128, 86357, 177597, 767732, 966817, 818027, 701294, 1114425, 57394, 140472, 513172, -59306, 172545, 482557, -147669, -755520, -687827, -609284, -282567, -777018, -1432822, -830592, -592361, -364010, -539096, 295164, 152488, -76088, 222358, 4947, -276805, -197941, 291185, 1105492, 780144, 179674, 506349, 452475, -42900, -154856, 53338, 55789, 519134, 645898, 547739, 418423, -298068, -575356, -491402, -934887, -714055, -549052, -566242, -73799, 48847, -154935]
10954a54935j55195L59363l06175k97454L72149k93714k25128M06866M51410q0179
10944G7008j33966J12501J38347j49091n05233K48559N2813j46739j75429l59216
10934h40446N25892j94977M961L13672K58981M26123j33830n49528k3057J08954
10924a03255J15712k68220K23547K75459l36550J12002R08905J07326q46095k52050
10914f3219n16970M82416j62676J40192m7973q88887L32377O36671L22442K71097
10904E05470l10341l81856L78614O5561l14841j67480K00875m01626K57375j58080
10894c26329M0351O29061K92848m7744J12134n01738n2447L30609m69862j70355
10884a63472K77286J5383k74149q2808L23011j2003K97136n40068J80401P0731
$$ y = [-154935, -310130, 49233, -256942, -554396, -182247, -475961, -701089, -294223, 157187, 77008, -56958, 55543, 193890, 44799, -460434, -211875, -159062, -305801, -481230, -840446, -314554, -509531, -504570, -190898, 68083, 494206, 360376, -189152, -212209, -103255, 12457, -255763, -32216, 243243, -93307, 18695, 927600, 1034926, 188831, -63219, -580189, -97773, -260449, -120257, -168230, -1057117, -724740, -88069, 234373, 505470, 195129, -186727, 191887, 257448, -57393, -224873, -23998, -425624, -168249, -326329, -285978, 343083, 635931, 588187, 700321, 198583, 146136, 476745, 6883, -163472, 113814, 129197, -144952, -227760, 95251, 83248, 380384, -159684, 20717, 91448]
10874I1448l65096J07321k10609o31206j15982N4976L07678L75672n41139J40055
10864g86882R99580m8425K04623L88369l64529m29674n1646j56743K94285r1124
10854d2166k79084J72808J49020N46701k88794N6349o14878k52103M80414K64523
10844A92790j88324Q9538k70887l79186j18267J56229N7237O97669m48575k33860
10834d45636K97535l64966L97487Q1235L6556M74807m31921J91749J49298j0502
10824C75642j92444J42326l80404n96047J32543L88925L938j51735J60807k00239
10814c16688m15779M13200k09677J66103Q27521l82450p8129L3804L85596J44263
10804E67764o61969l28409k1580l55841M34321M08496l90011n08670M47526O61460
$$ y = [91448, -273648, -166327, -376936, -1008142, -1124124, -1069148, -761470, -385798, -926937, -786882, 212698, 164273, 368896, 757265, 392736, -36938, -88584, -245327, 48958, -42166, -321250, -148442, 578, 547279, 258485, 314834, -300044, -552147, -71733, 192790, 4466, 94004, -176883, -556069, -674336, -518107, -460870, 236799, -211776, -445636, -148101, -513067, -115580, -34345, 2211, 477018, 45097, 236846, 386144, 375642, 183198, 325524, -54880, -650927, -518384, -129459, -125521, -277256, -116449, -316688, -732467, -319267, -528944, -362841, 464680, 82230, 4101, 37905, 423501, 567764, -94205, -422614, -444194, -800035, -365714, 42782, -347229, -855899, -408373, 253087]
10794B53087J93121m71892L62437k74734M00354m8967o93592J72998l55563N59303
10784I6552m00029L2375L41463j60348n51631L04843L30667K8888J51607r84475
10774h10088m83152O71691N32275o37962j67940L31636K16805n07626L58780j56823
10764f52404P20631J53605j95830K18564M2935k85045k09976m22900K2018N07934
10754a00468l10517l47516M30081K50601k04538L92219k65544J11103L14410j37500
10744A32331N05998k45985n8608J98657m43632m17289N19105l6262j20579k88851
10734b55115R7179O5680l36151L18458N36017m4568m87120L25799n48705J67912
10724a60614k64501k38941N11090K03954K033j48058k00780Q85427o1144j87255
$$ y = [253087, 446208, -25684, 336753, 62019, 462373, 413406, -280186, -107188, -462751, 96552, -303477, -271102, 70361, -89987, -641618, -336775, -6108, 22780, 174387, -810088, -1293240, -621549, -89274, -727236, -895176, -563540, -346735, -854361, -495581, -652404, 68227, 221832, 26002, 244566, 287501, 2456, -207520, -630420, -608402, -100468, -410985, -758501, -328420, -77819, -282357, 109862, -155682, -44579, 269831, 132331, 638329, 392344, 333736, 532393, 88761, -328528, 190577, 154315, 33736, -255115, -157936, -92256, -428407, -109949, 426068, 381500, -105620, 220179, -328526, -160614, -425115, -664056, -152966, 50988, 53021, -95037, -295817, 589610, 528466, 341211]
10714C41211J14953K95080o25452k65565J54878L13312J02070l25684j2986K17850
10704C09667r61480Q7429l11980l29156N61316P76853J90716P4191N4144o00277
10694a48577N3523k12744k38155K81030N55216J24277J663k80941j187773q088
10684a060569R20981m03027M51226M72468p09892j23768Q74838l38782k62951
10675a79476j49695J28352k28042L4549Q545K92458p60280J40412P18968l55766
10665c49975k06142M18043N08059j40158J183k59346J01030j09366L08901j96788
10655G5441n1028j7482j56325m27733K0640K09083k33731L81779O7699o74420
10645h06077J86252J66483k95193j63502k57310j74493J237463N92150k50812
$$ y = [341211, 456164, 751244, 125792, -139773, 15105, 328417, 430487, 104803, 91817, 309667, -651813, -564384, -876364, -1205520, -644204, 132649, 323365, 397556, 451700, -148577, -95054, -307798, -545953, -264923, 290293, 414570, 416233, 135292, -1052481, -1060569, -139588, -542615, -91389, 381079, -328813, -452581, 422257, 83475, -179476, -329171, -200819, -428861, -394312, -385767, -93309, -853589, -713177, 5791, -349975, -556117, -138074, 369985, 229827, 231010, -28336, 72694, -36672, 272229, 75441, 24413, 6931, -149394, -577127, -556487, -347404, -581135, -199356, -131657, -806077, -619825, -453342, -748535, -912037, -1169347, -1343840, -106377, 485773, 234961]
10636B34961J29484q12417r4187O17603k10227O1154J57513r3798j06402N40303
10626D23987J22467m78144l23616P4678J15877R2589K48501m12082o07982O8113
10616f75612M25095K68672Q5151j07610l3040M755M10652L453K53310l08417J1315
10605C37724n40344L09610j06863L95163o315k99971L20771o49706j66918J93402
10595b13447J39319Q1966M9138p52293q6397Q99643L56455m63096M28132n89712
10585a50292l13475r5921l17366J42817O02804k2747j63769N43217l65546k9480
10575a69758m60202K03642j86370l58752j50547l2421k71729P33604P32865k11947
10565a71615k33043J80717o06878K92313j2522O78853J18556m46593l54250k54763
$$ y = [234961, 364445, -447972, -542159, 75444, -134783, -73629, 83884, -9914, -116316, 423987, 546454, 68310, -255306, -180628, -64751, 27838, 276339, -135743, -743725, -675612, -250517, 18155, 103306, -4304, -37344, -32589, 378063, 381516, 634826, 326409, 337724, -202620, 106990, 127, 395290, 388975, 89004, 409775, -239931, -406849, -213447, -74128, 7838, 56976, -695317, -781714, 117929, 474384, 11288, 439420, -150292, -463767, -559688, -877054, -734237, -131433, -154180, -317949, 225268, -140278, -169758, -629960, -426318, -612688, -971440, -1121987, -1154408, -1426137, -692533, 40332, -171615, -404658, -223941, -830819, -538506, -551028, 127825, 246381, -200212, -554462, -809225]
10555h09225M80729P02067m1157m71684o20198J01227P17689J77552L08458l83178
10545A62280n28700N19191j67074J62015L47014p93208J10981k04212j67309j81595
10535g40617N61091J94201M73o0428k43508L71296Q05387o02603l73855q51862
10525i40425K09893J36615L06828N1951N24112l01174N8491K79230j92116k04284
10515g0879k13420M5017M95722l78596j78623N98548R9071l61028j69727k55023
10505c88938q4719K68768p35022Q70531J055761l67716r35538J36105K97562J03454
10495B20248j50340k17757M72656n85319L509L21832J03278l1099j44751O18575
10485F10832K32093L45369l29388p86026R1319K92121K76930L36842n39749n24355
$$ y = [-809225, -328496, 373571, 332414, -139270, -759468, -658241, 59448, 237000, 545458, 162280, -366420, 152771, -14303, 147712, 494726, -298482, -187501, -391713, -559022, -740617, -179526, 14675, 15148, -45280, -288788, 82508, 887895, 285292, -88563, -940425, -730532, -593917, -287089, -235138, 288974, -12200, 46291, 325521, 133405, -70879, -284299, -239282, 256440, -122156, -300779, 297769, 396840, 35812, -133915, -388938, -473657, -204889, -939911, -69380, 986381, 618665, -316873, -180768, 116794, 220248, 69908, -147849, 324807, -260512, -257003, 64829, 168107, 137008, -7743, 610832, 842925, 1188294, 858906, 72880, 164199, 456320, 733250, 1070092, 530343, 5988]
10475E988O40388l25447k66818o09450j58092R31594J05249J47240L07997o42010
10465A36639k59290M10316k20538j82947R8786j74942j31248P86251K142l15736
10455A49433K93162l78025k03492L5081M70154j50634n64166P64560K56682k29816
10445D42939k20205K61500o87211l43866k60217O55746r7927L11053L82521j60957
10435B83376J59481N59162k07038k01887m06435p51931o9960N68020K60168j96008
10425c052J97284o73998K98217N72606j66804j4488O18301n41667o49558K59022
10415a04137L79195N50417j70452o30771J35248N23397o06110p01999J11335K29711
10405b84166O84582m88644k03630Q28224m41691j95255O87072K74596j52995o11548
$$ y = [5988, 646376, 320929, 54111, -555339, -713431, 218163, 323412, 470652, 778649, 136639, -122651, 287665, 67127, -115820, -17034, -191976, -323224, 463027, 465169, 149433, 442595, 64570, -138922, -103841, 366313, 215679, -348487, 416073, 672755, 442939, 222734, 484234, -202977, -546843, -807060, -151314, -249241, 61812, 444333, 283376, 442857, 1002019, 794981, 593094, 186659, -565272, -635232, -67212, 192956, -3052, 194232, -479766, -181549, 391057, 224253, 209765, 828066, 286399, -363159, -104137, 275058, 825475, 655023, 24252, 159500, 682897, 76787, -625212, -513877, -284166, 400416, -88228, -291858, 536366, 94675, -100580, 586492, 861088, 708093, 96545]
10395I6545K65502n44304l43572M7108J64594M64560j98271J56947N4344N77534
10385G40987m49136j55495K76866m93262n1748O40485m13910n38784J35692K22975
10375h5330j46545k75794O45448m5435K00099n80333N21313K83475P2718K51923
10365H41539n50485J89044k08219j95711J99586m72294m0288r4821L06890P9332
10355E4573k4018m29748l61027O11875m87838L97061L47276N0429q5073J76264
10345B49774l09507J89339N57420q23211o50274N33190P23729K88634n83794k15331
10335d0031n37305L58534M71411J28967j22742M320L8814N71343l32126p36770
10325a95585k24193J013884K06922j173528k3743L8975J82366k64964J90130J50847
$$ y = [96545, 362047, -182257, -525829, -478721, -314127, 150433, -47838, 109109, 163453, 740987, 291851, 136356, 413222, -80040, -131788, 508697, 94787, -443997, -308305, -85330, -231875, -507669, 137779, 92344, 292443, -287890, 233423, 516898, 589616, 841539, 291054, 480098, 271879, 76168, 275754, -196540, -236828, -331649, -24759, 54573, 30555, -399193, -760220, -148345, -636183, -239122, 108154, 158583, 73510, 249774, -59733, 129606, 687026, -136185, -786459, -253269, 470460, 759094, 175300, -40031, -577336, -218802, 252609, 381576, 258834, 263154, 301968, 873311, 541185, -195585, -419778, 594106, 801028, -372500, -396243, -357268, -174902, -439866, -249736, -98889]
10315i8889j70693L4545k02573J23235m2316p338k56585L21673P73344J11897
10305E86300l90879R7836O13790j78088o27782p38995P46550K75465J07449k21275
10295B70371r9898o08785K94894K92866j25767m35107N36987O10870m3129l60770
10285C32532m11205L07457k87600J65912l24961o85751M72066M8735P62285O71698
10275A051168p06700m4244o6803p5218k35772j10088N1286o30324L9753N38371
10265a88571M32836J63034L5729k96482k82533L54973k81053m069j25330m6143
10255b37609L65655J40880q0115k77307O20068k99718J82877M67705o10310m85539
10245b13413j31948J07060J99301J76266j91305J52657K68731j71596n23254m56371
$$ y = [-98889, -269582, -235037, -437610, -314375, -356691, -364029, -620614, -298941, 474403, 586300, 195421, 293257, 907047, 728959, 101177, -637818, 108732, 384197, 491646, 270371, 170473, -438312, -143418, 149448, 23681, -411426, 125561, 736431, 693302, 332532, -78673, 228784, -58816, 107096, -217865, -903616, -431550, -382815, 379470, 1051168, 344468, 300224, 233421, 158203, -77569, -187657, -136371, -766695, -726942, -188571, 244265, 407299, 443028, 146546, -135987, 218986, -62067, -66136, -191466, -237609, 128046, 268926, 188811, -88496, 531572, 231854, 414731, 882436, 272126, -213413, -345361, -238301, -39000, 137266, -54039, 98618, 367349, 195753, -327501, -783872]
10235g83872k5145j25080J90657P05061L87428m47221l33661N72528M5288K03836
10225C89819k43546K30576k28942m87665O41154p26713N21214P34768m17834o07797
10215a94966l81825L03154J65768m4856J953L59634M63084k8877k01955k83145
10205A57969l14166L31381O92340n37033j190353M6409K36779P56636K59109r2815
10195C46256k5231j65221o8979o42561P6141M01884R03778p28051j45797K67308
10185B19527J73856O1455o02186k19638L44616P5306R0908l6844l11602N01559
10175B96957l72661O41899o25715M66128j90002k7230k38701k82457Q68225J36714
10165F73157n65268k2220l74605R6510N87573n06593p785o5367P6271L89757r4266
$$ y = [-783872, -809017, -934097, -743440, -38379, 349049, -98172, -431833, 140695, 185983, 389819, 146273, 376849, 147907, -339758, 301396, -425317, 95897, 830665, 412831, -194966, -576791, -273637, -107869, -152725, -150772, 208862, 671946, 643069, 441114, 157969, -156197, 175184, 867524, 330491, -859862, -813453, -576674, 179962, 439071, 346256, 321025, 155804, 86825, -555736, -479595, -77711, 826067, 98016, -47781, 219527, 393383, 454838, -147348, -366986, -22370, 52936, 143844, 107000, -204602, 296957, -75704, 566195, -59520, 406608, 216606, 189376, -49325, -331782, 536443, 673157, 107889, 85669, -288936, -192426, 395147, -111446, -119231, -184598, -108327, 281430, 187164]
10154A87164P8809J98674k11641n21487P97677k04627k79310K89329L93835l19682
10144D08741k17639J75454j18140L09395j7576N03293q51376n66756L12648m09658
10134d71614K35520M30525K32714p9760q2115M42469K5163n21304J76598n0354
10124C37842m92846K41511j76632O07814M3218q54667K1769M88454m57544K57840
10114A6759L53792p1511n66075j33193l85891j05600N15660L90912M2742k46364
10104a88769J68172N11371n13653j71058k39266m67413m28733Q03172L87251J36789
10094b137K34653K94652k6396K78020o69657m3077K93144q2413J57382j83196
10084B50975J96205k63657k46220n0493N19252J29483M4116m48595K52122N3403
$$ y = [187164, 265973, 464647, 253006, -268481, 529196, 324569, 45259, 334588, 728423, 408741, 191102, 366556, 248416, 557811, 540235, 1043528, 192152, -374604, -61956, -471614, -236094, 194431, 427145, 347385, 265270, 707739, 732902, 211598, 388196, 337842, -155004, 86507, -90125, 517689, 560907, -293760, -271991, 216463, -241081, 16759, 370551, 299040, -267035, -400228, -786119, -891719, -376059, 14853, 57595, -188769, -20597, 490774, -22879, -193937, -433203, -900616, -1329349, -526177, -138926, -2137, 232516, 527168, 500772, 778792, 109135, 66058, 359202, 276789, 434171, 250975, 447180, 183523, -62697, -113190, 406062, 535545, 579661, 131066, 383188, 436591]
10074D36591K0002o48093M44070l02392N2387J39754j81258J80010m95538O21102
10064B66635L31323r50490l5021M04760Q8776M9648M21723N56958N3517l53226
10054H34603K58729m15254j54664n7031M10846N24722p4068j166691r8003N34892
10044E98081J46723l28325p2405K59904n56274R39437j56198p5848l3958k08513
10034E12624l18109L43184R3807n3888K15429L47877j32949l39206J3149O50588
10024A332506N57251j85873J05754k12091k53267r9063j70155J11420L65857m9081
10014A503258l89408M33388q1576m0636k55081j51111o11203j61706L82324N86257
10004A214506L09040p04207j64968K15072N9250p9061M5282L83011M26600P6149
$$ y = [436591, 456593, -191500, 252570, -49822, 2565, 142319, -38939, 141071, -354467, 266635, 597958, -352532, -387553, 17207, 105983, 155631, 577354, 1134312, 1187829, 834603, 1093332, 678078, 523414, 466383, 877229, 1401951, 1327883, 161192, 63189, 598081, 744804, 416479, 344074, 603978, 47704, 987141, 830943, 755095, 721137, 512624, 194515, 537699, 631506, 577618, 793047, 1140924, 1007975, 668769, 681918, 1332506, 1889757, 1703884, 1809638, 1597547, 1344280, 1245217, 1075062, 1186482, 1552339, 1503258, 1113850, 1547238, 1465662, 1425026, 1169945, 1018834, 407631, 245925, 628249, 1214506, 1523546, 819339, 654371, 869443, 928693, 849632, 894914, 1277925, 1704525, 1780674]
9994A780674n49446l67821m12540J92032O40798L82117j76177M35483j92937q08636
9984I23547N12915N333p5183j37879l36461j46327L71053O1987j0640k12068K96777
9973A253054o0680k94383l08664l35250K11149N8196j02871K8406L30351j05278
9963F74030J70586o44692P20015L91761k09962k25695o24713N96226K24799J65772
9953A238127k92913o42133k38374J54857l16473O43416J98439K27005n06237L1520
9943D97234j09482o34903n5642M77623J46020O41256L45912j59933k1051k88755
9933H38279K17184K9727K02178k23352r50889L14517M61238j17840J0189k2188
9923G59043M1273M85673Q8293K54135j86114l58804j14165J35565n63370P0090
$$ y = [1780674, 1231228, 863407, 450867, 642899, 1283697, 1665814, 1489637, 1925120, 1732183, 923547, 1436462, 1441795, 1366612, 1228733, 892272, 745945, 1116998, 1178985, 1168345, 956277, 1253054, 1192374, 897991, 589327, 254077, 465226, 523422, 420551, 448957, 779308, 674030, 844616, 199924, 919939, 1311700, 1101738, 876043, 251330, 847556, 1072355, 1238127, 945214, 303081, 64707, 219564, -96909, 546507, 744946, 971951, 465714, 497234, 387752, -247151, -302793, 174830, 320850, 962106, 1308018, 1148085, 1127034, 838279, 1055463, 1085190, 1287368, 1064016, 113127, 427644, 888882, 771042, 781231, 759043, 800316, 1285989, 1374282, 1628417, 1442303, 1083499, 969334, 1104899, 541529, 611619]
9913F11619L13970k89420N26896j7793o6123L01338m39634j46185N28394n22188
9903H00874L68425L07043m35862l20527p33536Q31314J024902n04254J586j33003
9893A206962k18277K06577P2524n26890k40683j84760M60604n2325j73300M51707
9883A002139K50581j08524J461J93689K04409J3235k39322l04905j38356J09885
9873I84292R5390j1169j16228J1590L43946o2335j38535J5309J90093n8646j37738
9862A115969j25553Q7320o11382k030M52820k28399j07016L13897k87934R29096
9852A536788k83724j00032L41284L80741K23861o30778M89528p60274K55241m62601
9842I90034n13785N04103M28626K70344J26323l40218k47956m30920l58557Q17847
$$ y = [611619, 925589, 636169, 1163065, 1145272, 1079149, 1380487, 940853, 794668, 1323062, 800874, 1169299, 1476342, 1040480, 719953, -13583, 817731, 1842633, 1338379, 1339965, 1206962, 988685, 1195262, 1267786, 740896, 500213, 315453, 776057, 723732, 550432, 1002139, 1252720, 1144196, 1145657, 1339346, 1543755, 1556990, 1317668, 1012763, 874407, 984292, 1079682, 1068513, 952285, 963875, 1307821, 1245486, 1106951, 1122260, 1312353, 1253707, 1115969, 990416, 1077736, 466354, 464324, 917144, 688745, 581729, 895626, 607692, 1536788, 1253064, 1153032, 1494316, 1875057, 2098918, 1468140, 1957668, 1197394, 1452635, 990034, 476249, 980352, 1408978, 1679322, 1805645, 1465427, 1217471, 786551, 427994, 1245841]
9832A245841n4933n3425P49849n62850l32858L74313k99248N38717P6401j85966
9822A495841L84931J55419j0935N45686n9337M46346q59914o29122K99282j05384
9812A662813m48744J15271K64102N7071k41005l97743N35795L15751j5302k87535
9802A560474L29143o4324O30786n24996P18109j68407K51103k22829l9768m34384
9792B034907J03076R00113j87523n9909m27298J24933M56930K91462J61796q515
9782C389972p29145R24934K27222j97471j73223k9627l67507K15255j75354K13517
9772C298573O52866L1416m66304j33806j35369L91673K38961k97233k1082L0361
9762C590056O06349K45684M08782J93076J92073j72959k53144j99251l3170K96017
$$ y = [1245841, 1190908, 1137483, 1887332, 1324482, 991624, 1365937, 1066689, 1605406, 1681807, 1495841, 1880772, 2036191, 2025256, 2570942, 2511605, 2957951, 2098037, 1468915, 1768197, 1662813, 1214069, 1329340, 1593442, 1650513, 1409508, 1011765, 1547560, 1863311, 1848009, 1560474, 1889617, 1825293, 2456079, 1931083, 2649192, 2480785, 2731888, 2509059, 2469291, 2034907, 2137983, 3038096, 2850573, 2790664, 2363366, 2488299, 2945229, 3236691, 3398487, 3389972, 2660827, 3585761, 3812983, 3615512, 3442289, 3412662, 3045155, 3260410, 3085056, 3298573, 3951439, 3982855, 3516551, 3382745, 3247376, 3639049, 3878010, 3580777, 3559695, 3590056, 4196405, 4442089, 4850871, 5043947, 5236020, 5063061, 4809917, 4610666, 4577496, 4873513]
9752D873513J28197J98561Q03808P13585o76377k71753N55559J64964N50300k27882
9742F812475L85314r3755J8184Q31301o26931M10834Q33739m00917P88558J39470
9732I098272J57411L58929l26459M7948O53059M33277J251732j62017M72800M24433
9722A2409385J05750M68474O48368Q8842K4096L17767J05417J141396L88334L40056
9712A6037885M37335N86723P21847O98501k9429N51762P77124J46317O56743O33383
9702B1218191M39062O76760P17761N94268R83409J534137J01846R37104Q64847
9693B8067385O11326O75597J206203P88814R97340J004415J655076J531908J714787
9684C8252851J802801J721307K366372K834136K430197L169106L383843K836308
$$ y = [4873513, 5001710, 5200271, 6004079, 6717664, 6041287, 5769534, 6325093, 6490057, 7040357, 6812475, 7197789, 7104034, 7122218, 7953519, 7326588, 7737422, 8571161, 8170244, 8958802, 9098272, 9255683, 9614612, 9288153, 9336101, 9989160, 10422437, 11674169, 11512152, 11984952, 12409385, 12515135, 12983609, 13631977, 13720819, 13744915, 14062682, 14168099, 15309495, 15697829, 16037885, 16475220, 17061943, 17783790, 18482291, 18452862, 19004624, 19781748, 19928065, 20584808, 21218191, 21657253, 22334013, 23051774, 23646042, 24629451, 26163588, 26265434, 27202538, 28067385, 28678711, 29354308, 30560511, 31349325, 32346665, 33351080, 35006156, 36538064, 38252851, 40055652, 41776959, 44143331, 46977467, 49407664, 52576770, 55960613, 58796921]
9676E8796921L242036N664793O001981O701564P477739Q617557J1253219J4242196
9668A21998006J6273043J6494319J5781062J5220246J1484800P340823O784524
9661B11376823J782954l142608o510262j0319515j4178097j4915149j6797115
9654A47297031j6529189j3994997j1597440q029210n699410m826534l443409l059633
9646H0117209j180178K90668J67436O67670J421745K520626K965588L762237N144829
9637I5877830O610460Q012031J1205599J3518006J5722563J6587410J5688569
9630A83222468J5127305J0973713O992690M901701P879m510237o938262j2345893
9622A97431364j6736927j6900384j9818149k0151542j7057044j3921706j0815268
$$ y = [58796921, 62038957, 67703750, 73705731, 80407295, 87885034, 96502591, 107755810, 121998006, 138271049, 154765368, 170546430, 185766676, 197251476, 204592299, 211376823, 213159777, 210017169, 203506907, 193187392, 179009295, 164094146, 147297031, 130767842, 116772845, 105175405, 97146195, 91446785, 86620251, 83176842, 80117209, 78937031, 79227699, 79395135, 80062805, 81484550, 84005176, 86970764, 90733001, 95877830, 102488290, 110500321, 121705920, 135223926, 150946489, 167533899, 183222468, 198349773, 209323486, 216316176, 221217877, 221225756, 216715519, 209777257, 197431364, 180694437, 163794053, 143975904, 123824362, 106767318, 92845612, 82030344]
9615H2030344r203025o733535n688731m992250m028636l551213l066011k403927
9607D2363016k723251j735324k808843j582287k217949j587219r75510k015692
9599B6716941j653309j150482j773050j005758q9269j252828o51301o41838j326873
9590A7172233l90501r63472p79983n5453o10208o18720l67715o2155l87475l48672
9580A2587879p31207j172400j0053P07419j20331l26430p22558k74145m20718
9571I517456L8665L04797l48381m48941l44324k40098k2170r21018r0855k2619
9561G422512m48231L85344m58910m78671j63523m5565O51739l85944l59412j06915
9551F012424j81370k88556o46836j57834J055016j48428j38990n24560J34800
$$ y = [82030344, 72827319, 66093784, 60405053, 55412803, 51384167, 47832954, 44766943, 42363016, 39639765, 37904441, 35095598, 33513311, 31295362, 29708143, 28732633, 26716941, 25063632, 23913150, 22140100, 21134342, 21045073, 19792245, 19140944, 18499106, 17172233, 16781732, 15818260, 15038277, 14982824, 14372616, 13753896, 13386181, 13324026, 12936551, 12587879, 11856672, 10684272, 10674219, 11381638, 11261307, 10934877, 10212319, 9938174, 9517456, 9556121, 9860918, 9512537, 9063596, 8719272, 8479174, 8457004, 7535986, 7445131, 7422512, 6974281, 7359625, 6900715, 6422044, 6258521, 6212956, 6864695, 6478751, 6119339, 6012424, 5831054, 5542498, 4895662, 4737828, 5792844, 5644416, 5505426, 4980866, 5115666]
9542E115666r4384o07340k57403l07550k86810O19932m43581M5455m03987k71046
9532C108952K98087l81680L69355K85977j4749r94980M9507k40921K19958O35399
9522C334905J08461p01476k39275O4606n9463P52442j32688k70913O81584L21388
9512C859571m35407m17227r0521J07612k21313N34117M23247p39425o87407j44977
9502B188270Q4805k11108r9073Q5423M34787N46392L2534l0502m88078r44850
9492A598600P41350L72452j3693j81994k84072M61377J28782r90693J77606k93731
9482A715984L92076L18205o54867j82639K3738L97963n42350P4001j43892K14831
9472A613050K13486k34607l09961L203L51175J70437M27109o11551p73911K52233
$$ y = [5115666, 5021282, 4413942, 4156539, 3848989, 3562179, 4182111, 3738530, 3783985, 3379998, 3108952, 3407039, 3025359, 3394714, 3680691, 3665942, 2670962, 2720469, 2479548, 2699506, 3334905, 3443366, 2741890, 2502615, 2567221, 2507758, 3260200, 3127512, 2856599, 3538183, 3859571, 3424164, 3006937, 2916416, 3024028, 2802715, 3336832, 3760079, 3020654, 2333247, 2188270, 2273075, 2061967, 1962894, 2048317, 2483104, 3029496, 3062030, 3031528, 2543450, 1598600, 2339950, 2712402, 2698709, 2516715, 2232643, 2694020, 2822802, 1832109, 2009715, 1715984, 2108060, 2426265, 1771398, 1588759, 1612497, 2010460, 1468110, 1542111, 1398219, 1613050, 1826536, 1591929, 1281968, 1285171, 1636346, 1806783, 2233892, 1622341, 848430, 1100663]
9462A100663M6922K74789J76257R4983M1962M26893m6105j33108J45496r8383
9452B030369n91168o48926Q79061j54569M40152Q14173q32040l86444K22030L12892
9442B085530p4084j002512J12393L75212j44731k45258J09944L58524J25569k35251
9432A465336K12848R21527p64307j59106R52997K0345k71599r43892o41767K63703
9422A056085M50660M92578R5438M01568k1087m10769M47060j29013j08926j65776
9412B107818K40634P5623k10491K71356m33777L37315j02665m5598J45354m81081
9402A904488L08225M00126J78675o31879q66572L74150J25518m08915K07342j93862
9392A397296J62601k91219M36639N31427J41486J33622p87762o61381n34457R97981
$$ y = [1100663, 1147585, 1422374, 1598631, 1693614, 1735576, 2162469, 2116364, 1983256, 2128752, 2030369, 1439201, 790275, 1669336, 1514767, 1954919, 2769092, 1937052, 1550608, 1772638, 2085530, 2011446, 1008934, 1121327, 1496539, 1351808, 1106550, 1216494, 1575018, 1700587, 1465336, 1678184, 2599711, 1835404, 1676298, 2629295, 2649640, 2378041, 1434149, 792382, 1056085, 1506745, 1999323, 2094761, 2496329, 2475242, 2064473, 2511533, 2382520, 2273594, 2107818, 2348452, 2424075, 2213584, 2484940, 2051163, 2388478, 2285813, 2240215, 2385569, 1904488, 2212713, 2612839, 2791514, 2159635, 1293063, 1667213, 1792731, 1383816, 1591158, 1397296, 1559897, 1268678, 1705317, 2236744, 2378230, 2511852, 1724090, 1062709, 528252, 1526233]
9382A526233N66012N58436j107617n70899N47910N56765q5759L20N21088n99604
9372A912885N28021j42452N7336m53878p17913k18098Q0112O04472L91798o2912
9362A979371k44150l1062P3276l91868J54966R6936N08967N69543R3050k28535
9352B580494l22387j9889J28067k84326k41025n82560J48911N18608j21432l92069
9342A412392N22386k43718m062k34880L57372N94802n18993L73273M68834j70710
9332B556696J44899j62973P54452j89165m77490M94571p41094k07736n21939J125015
9322B775236q6973q0756M06883L63009j027471M65376q9668K58305k81785j15444
9312B586712L65777n60661L33795k16016N19222N82402k07560k36867J56797K52592
$$ y = [1526233, 2092245, 2650681, 1543064, 972165, 1520075, 2076840, 1991081, 1991401, 2512489, 1912885, 2440906, 2298454, 2355790, 1901912, 1183999, 965901, 1046013, 1650485, 2042283, 1979371, 1735221, 1704159, 1777435, 1385567, 1540533, 1637469, 2146436, 2715979, 2809029, 2580494, 2258107, 2238218, 2366285, 2081959, 1840934, 1258374, 1407285, 1925893, 1804461, 1412392, 1934778, 1691060, 1686998, 1452118, 1809490, 2404292, 1885299, 2258572, 2727406, 2556696, 2701595, 2538622, 3293074, 3103909, 2626419, 3120990, 2379896, 2172160, 1650221, 2775236, 2688263, 2607507, 3014390, 3377399, 2349928, 2815304, 2725636, 2983941, 2702156, 2586712, 2952489, 2391828, 2725623, 2509607, 3028829, 3611231, 3403671, 3166804, 3323601, 3576193]
9302C576193K79277K3506k41322l79909n97588N31840N5970J66335p7795k6181
9292C310326l8669j12478J26605K42524k2964o742p9473k60118R5560K34311P42633
9281D231515j8104J50479N0899m89850J61877k9473l5951k85789N13724J84468
9271D433795L64888J04174N436j55961n21333k53272l13031O85025j61824j53958
9261D033939j72938j35440K3367l35767K1912m2120o6887L41245k11050k03530
9251C252731Q3627n8536j43952J91923n61818R7460j38882J255814K77847l29160
9241C927054J00982J57391j286082L32101M06791L37425N37787k96503K66313
9232D483259L11273l45258k32713J33309j17936n65233M52892M44243n09670l35523
$$ y = [3576193, 3855470, 3878976, 3637654, 3257745, 2660157, 3191997, 3247967, 3414302, 3336507, 3310326, 3271657, 3159179, 3285784, 3528308, 3505344, 3498602, 3419129, 3159011, 3254571, 3488882, 4231515, 4213411, 4363890, 4414789, 3924939, 4086816, 4057343, 4021392, 3735603, 4249327, 4433795, 4798683, 4902857, 4908293, 4752332, 4230999, 3977727, 3664696, 4349721, 4187897, 4033939, 3861001, 3725561, 3748928, 3413161, 3435073, 3392953, 3326066, 3667311, 3456261, 3252731, 3336358, 3277822, 3133870, 3325793, 2763975, 2861435, 2722553, 3978367, 4256214, 3927054, 4028036, 4185427, 2899345, 3231446, 3638237, 3975662, 4513449, 4216946, 4483259, 4794532, 4449274, 4216561, 4349870, 4231934, 3666701, 4119593, 4563836, 4054166, 3718643]
9222C718643O46564M79908n88221N22172k93720j94737L01941M2516j53168j66517
9212D315381L04552L03186k77816p49606J56021K88959R3898N60708k88962N81783
9202E288104l732m67539l8198O66520l41484M86502J47607p99452k08330K10219
9192D940217M7840N09153J95389n80996P27149l38220m08952L17708L55059j043062
9182D721285L24013J75715O65489L96908p9560m42606M26617L75279J7219j02542
9172F477817n8858J56578j52209L620J96807l89833L40956P00409q46101M28179
9162F857365Q23705Q44416n99226j84283P14829P50206n17678m49210O08843O09580
9152I458547L15864R06509n86570j61999p0645N31061L79111O24300J062607q14245
$$ y = [3718643, 4365207, 4845115, 4256894, 4779066, 4485346, 4290609, 4592550, 4635066, 4481898, 4315381, 4619933, 4923119, 4645303, 3895697, 4051718, 4340677, 4434575, 4995283, 4706321, 5288104, 5284372, 4816833, 4778635, 5445155, 5103671, 5590173, 5737780, 4938328, 4729998, 4940217, 4988057, 5497210, 5692599, 5111603, 5838752, 5500532, 5091580, 5409288, 5764347, 4721285, 5045298, 5221013, 5886502, 6283410, 6203850, 5761244, 6187861, 6563140, 6580359, 6477817, 6418959, 6575537, 6423328, 6426948, 6623755, 6233922, 6574878, 7275287, 6429186, 6857365, 7681070, 8525486, 7926260, 7741977, 8456806, 9207012, 8689334, 8240124, 8848967, 9458547, 9774411, 10680920, 10094350, 9932351, 9861706, 10392767, 10771878, 11396178, 12458785, 11644540]
9142A1644540o66754L36561R47673M14604M06463O85757O80210n6543J75371L94586
9132A4962468N28924R09655J51688K58491J59963L47754L30171R95863P60641
9123A9405618Q05458J88967O81015L89495M40367N71517K10431P61361O39590
9114B4093819R84039J087261O41752Q35413J329226J353287Q07317J064744J007726
9105C3204584J153788K618631J071625J446576K512977K576375K668665L331045
9097E0584266M169567N551867O323499O967690O826088N836590M851892K550508
9089I3661967J700106J603231Q40590j028697j911792n106743o250279m576696
9081G8931687m075430l479996j765092r06331q28714m35950J201824J673001J443801
$$ y = [11644540, 10977786, 11314347, 12262020, 12676624, 13083087, 13768844, 14449054, 14392511, 14567882, 14962468, 15491392, 16401047, 16552735, 16811226, 16971189, 17318943, 17649114, 18644977, 19405618, 20211076, 20400043, 21081058, 21470553, 21910920, 22482437, 22692868, 23454229, 24093819, 25077858, 26165119, 26806871, 27642284, 28971510, 30324797, 31132114, 32196858, 33204584, 34358372, 36977003, 38048628, 39495204, 42008181, 44584556, 47253221, 50584266, 54753833, 60305700, 66629199, 73596889, 80422977, 86259567, 91111459, 93661967, 95362073, 96965304, 97805894, 96777197, 94865405, 89758662, 83508383, 78931687, 74856257, 71376261, 69611169, 68704838, 67876124, 67440174, 68641998, 70314999, 71758800]
9072G1758800K952772K593021L190178K645813M060817M694854O014461Q356576
9064A06267292J0145419J1066972J1993783J1681394J0828077J0295892Q560991
9057A80839820R024812J0330524O881521K643508j941528p915988q539539p287225
9049A84035905q961790q938166j1752028j5113515j3413991j0684613r002715
9042A06169087o934418n029204l857333k246970j045750m70598k52218R09022
9034H7241618J528974J940315K815175L925892M657621N418998P670749R930122
9026A25129464J2850717J5757208J4628805J0647912O743255J255391k199866
9019A84812886j722949k332046m454994r109865j3439953j7157969j5145433j2723466
$$ y = [71758800, 74711572, 77304593, 80494771, 83140584, 87201401, 91896255, 97910716, 106267292, 116412711, 127479683, 139473466, 151154860, 161982937, 172278829, 180839820, 189864632, 200195156, 207076677, 209720185, 207778657, 199862669, 191323130, 184035905, 175074115, 166135949, 154383921, 139270406, 125856415, 115171802, 106169087, 99234669, 94205465, 90348132, 88101162, 87055412, 86584814, 86332596, 87241618, 88770592, 90710907, 93526082, 97451974, 102109595, 107528593, 115199342, 125129464, 137980181, 153737389, 168366194, 179014106, 185757361, 187012752, 184812886, 183089937, 180757891, 176302897, 167193032, 153753079, 136595110, 121449677, 108726211]
9011A08726211j0515719q374877o139798m892126l914820l129652l744152k136363
9003F5878704k078286j887389j500911j664706r28322j014747j593934n79454
8995E4630955n31483j141299j044831p15409O3537r6929O48908l54402n45679
8986E0913368j92670M8749J436939M22804O31959O76353Q97787M46309J219129
8977E6500727J014347J715921J814806K083778K346090J806638K338113K629980
8969G2250400K988219L579345L926344M903727N055802O139094P310205Q421855
8961A14574991R917496J1214778J3659536J7040824J9788155K0714148K0954173
8954B27864101K0571874J9145719J5588239J2013259O354342j631113q852026
$$ y = [108726211, 98210492, 89835615, 83695817, 78803691, 74888871, 71759219, 68015067, 65878704, 63800418, 61913029, 60412118, 58747412, 57819090, 56804343, 55210409, 54630955, 54099472, 52958173, 51913342, 51197933, 51261470, 51164541, 51813449, 51459047, 50913368, 50720698, 50769447, 52206386, 52629190, 53261149, 53937502, 54835289, 55281598, 56500727, 57515074, 59230995, 61045801, 63129579, 65475669, 67282307, 69620420, 72250400, 75238619, 78817964, 82744308, 87648035, 92703837, 98842931, 106153136, 114574991, 124492487, 135707265, 149366801, 166407625, 186195780, 206909928, 227864101, 248435975, 267581694, 283169933, 295183192, 301537534, 299906421, 291054395]
8947B91054395j4425047j9844850k1983763k4000805k4247105k0861345j7219448
8940A48472032j2632435j0587628q562214n951538m446077l018109k471982j724379
8932I9077670j556804k34740L56717R27773J745247J836394M111509M224265N259450
8923A15747481O631206P557372R574504J1933464J2555442J2959837J3339219
8916A90298525J2102266R359032O584364L945474J650480j117392k279513k603601
8908B17939635j853070p84506J297062L307657J257033J098840k590420o683104
8900B12989127n450456o989065q106660r056392j2906726j2977839j1481996q296384
8892A37723609n314522l661605j018728K20218K151969M505710N656476P883463
$$ y = [291054395, 276629348, 256784498, 234800735, 210799930, 186552825, 165691480, 148472032, 135839597, 125251969, 116689755, 110738217, 106292140, 103274031, 100802049, 99077670, 97520866, 97286126, 97642843, 98570616, 100315863, 102152257, 106263766, 110488031, 115747481, 122378687, 129936059, 139510563, 151444027, 163999469, 176959306, 190298525, 202400791, 211759823, 218344187, 222289661, 223940141, 222822749, 220543236, 217939635, 216086565, 215302059, 216599121, 219906778, 221163811, 222262651, 219672231, 212989127, 207538671, 200549606, 192442946, 183386554, 170479828, 157501989, 146019993, 137723609, 132409087, 128747482, 127728754, 127948972, 130100941, 134606651, 140263127, 148146590]
8884A48146590J2579583J5303826K0999742J9314787J0140124P058982o796631
8877B26747003j3504632p819810j811761L923979Q481124Q975927J0024383Q216979
8869B43233192M682559K390705k727406q449161j0884209j5595149j6847308j6140030
8861A79663193j9560007j8355922j5993481j2310778r924648p938625o354131
8854H9225601n332283l903766l264548k290354k400530j607419k30477m5051M41359
8845G0592532O61923J113768K167113L463153M243441N897703P941573Q173734
8837A04254940M748489L465735l24086l240644j604749l719324n270610q224124
8829I0085627j0372590r495593q175793p415564n063429m826907l436016k668697
$$ y = [148146590, 160726173, 176029999, 197029741, 216344528, 226484652, 233543634, 226747003, 213242371, 205422561, 203610800, 207534779, 216015903, 224991830, 235016213, 243233192, 247915751, 250306456, 247579050, 239129889, 228245680, 212650531, 195803223, 179663193, 160103186, 141747264, 125753783, 113443005, 103518357, 95579732, 89225601, 83893318, 79989552, 76725004, 74434650, 72034120, 70426701, 70196224, 70151173, 70592532, 71254455, 72368223, 74535336, 77998489, 82241930, 88139633, 96081206, 104254940, 109003429, 112469164, 112145078, 108904434, 107299685, 103580361, 98309751, 90085627, 79713037, 70217444, 62041651, 54626087, 49562658, 44735751, 41299735, 38631038]
8821C8631038k212354k165133k154218j559646j562037j146304j908476n81235
8813B5341635j325297q67596j465252r34037M4921k28570j043490j38131j458910
8804A7925273p88925p25978l12522K9478j163330r00437J08561m37785p32076
8795A3002259k95034p55058j4485K10088m00997k44145k88618o47439M75729q0651
8785A0961649r86157r1807n13816o49142m59074M83637j91221j74017O8570o5679
8775H382943K86630l00151r0660m60896l89762K59230m09103q25581M17266j62379
8765F707537K75343m29691o32176Q8631j84171p7724P03989l31847p45146k19334
8755E155411K47460Q19446n563r49046L9687P23620p59380o46106M28340J70068
$$ y = [38631038, 36418684, 34253551, 32099333, 30539687, 28977650, 27831346, 25922870, 25341635, 24016338, 23148742, 21683490, 20749453, 20794374, 20565804, 19522314, 19384183, 17925273, 17136348, 16410370, 16097848, 16127326, 14963996, 14063559, 14172120, 13734335, 13002259, 12707225, 11952167, 11937682, 12147770, 11746773, 11502628, 11214010, 10566571, 11042300, 10961649, 9975492, 9883685, 9369869, 8720727, 8261653, 8745290, 8554069, 8380052, 8448622, 8382943, 8669573, 8369422, 8278762, 7817866, 7428104, 7687334, 7278231, 6452650, 6869916, 6707537, 6982880, 6553189, 5921013, 6009644, 5825473, 5747749, 6451738, 6119891, 5374745, 5155411, 5402871, 6222317, 6216754, 5267708, 5307395, 6031015, 5271635, 4625529, 5053869, 5223937]
8745E223937n37412n37973O47296l51610L04852J62429j19506m17098l06109J22440
8735D191246J72871k79222m48028M80198k78574O188P62231l36703o66598N65744
8725D169353k02256N4547N12329J04388j24041l53129J48474K26865p21051N5979
8715C871458M78686j71743Q4795k72817m19359k44384j39013P493J65603L76013
8705C736732L58030J11376n89412k49674n67112l9989r30441N87078J001665k09453
8695C208800K10869m31520k36935K05186m2874N75508l01861k15064L39486J36934
8685C448529P9825K48802k5430m89882m0617k03507J1229k90596j77056l3262
8675B528035j48369J39272r6558m56992k20236M98082L39721k95177n61745J10172
$$ y = [5223937, 4686525, 4148552, 4795848, 4444238, 4749090, 4911519, 4792013, 4374915, 4068806, 4191246, 4364117, 4084895, 3636867, 4117065, 3838491, 3844679, 4606910, 4270207, 3603609, 4169353, 3967097, 4021644, 4533973, 4638361, 4514320, 4161191, 4309665, 4536530, 3815479, 3871458, 4350144, 4178401, 4263196, 3990379, 3571020, 3326636, 3187623, 3195116, 3360719, 3736732, 4094762, 4206138, 3616726, 3367052, 2799940, 2759951, 1829510, 2416588, 3418253, 3208800, 3419669, 2988149, 2751214, 2956400, 2913526, 3489034, 3187173, 2972109, 3311595, 3448529, 3528354, 3777156, 3751726, 3261844, 3221227, 3017720, 3028949, 2738353, 2561297, 2528035, 2379666, 2518938, 2422380, 1965388, 1745152, 2243234, 2582955, 2287778, 1726033, 1836205]
8665A836205l28608k13376L79505M42099k44989k82294K19692j25401M53026L77820
8655B513679M10062q01075k59405r6269m4778Q1033Q2294k64993o8665n21470
8645A030413L17240n40K73390j04522j13715Q3284L58213l55577l36736k05550
8635I45900L53666P25191k66565k04633k59608J81816M41696k51n43564k6706
8625A346942q953L01802M0233O4412l92562Q7779p7080J89029J73334l27724J24091
8614A521303j16944r18692j0816O62997j73798m4790J19761p0337n98087J066661
8604A437258p9338k07043N27371L1803j48289L59529j71641N0910l26431J15428
8594A589557P79188k68002K76748j1989m72069J98534P365k16347q7275k59442
$$ y = [1836205, 1507597, 1294221, 1673726, 2115825, 1870836, 1588542, 1808234, 1682833, 2135859, 2513679, 2923741, 2122666, 1863261, 1766992, 1722214, 1803247, 1885541, 1620548, 1551883, 1030413, 1347653, 1347113, 1620503, 1515981, 1402266, 1485550, 1843763, 1488186, 1151450, 945900, 1299566, 2024757, 1758192, 1553559, 1293951, 1475767, 1917463, 1917212, 1373648, 1346942, 1337989, 1639791, 1680024, 1744436, 1351874, 1439653, 1362573, 1551602, 1724936, 1397212, 1521303, 1404359, 485667, 474851, 1137848, 964050, 919260, 1039021, 968684, 370597, 1437258, 1357920, 1150877, 1678248, 1710051, 1561762, 1921291, 1749650, 1800560, 1474129, 1589557, 2368745, 2100743, 2377491, 2365502, 1893433, 2091967, 2099332, 1882985, 1795710, 1536268]
8584A536268J66331J47615O40456m71753k70529K41026l03288j047607J7054K81509
8574I37082j59347J79619j98870j33190k6019O18377K95078m24403N27529J29597
8564A745453n9728p43461P1140P68223l50244o96325P14089P36103J13393l35009
8554A963634n92418M2006N6123J12746L79935M3867K42594k01865o4093J3318
8544A995847K28823J69438k74101m24932m33574j37835J63081q8706O41898L00633
8534B140572j98529j046169n67023P77081P27222p54529k28626j27143Q7243J86064
8524I96163m80990J57860L08625M22087k38895N7754l13299n17393L1801K35576
8514F59289J05035L28895M50769n2223L86411J6781m21525p3563L85447P03227
$$ y = [1536268, 1702599, 1850214, 2490670, 2018917, 1748388, 1989414, 1686126, 638519, 655573, 937082, 777735, 957354, 758484, 625294, 599275, 1217652, 1512730, 1088327, 1615856, 1745453, 1685725, 942264, 1013404, 1781627, 1431383, 735058, 1449147, 2185250, 2298643, 1963634, 1371216, 1413222, 1469345, 1582091, 1962026, 2005893, 2248487, 2046622, 1982529, 1995847, 2224670, 2394108, 2120007, 1695075, 1261501, 1123666, 1286747, 1198041, 1839939, 2140572, 1942043, 895874, 328851, 1105932, 1833154, 1078625, 849999, 722856, 810099, 996163, 515173, 673033, 981658, 1403745, 1164850, 1222604, 909305, 391912, 423713, 659289, 764324, 1093219, 1543988, 1491765, 1878176, 1894957, 1473432, 1399869, 1785316, 2488543]
8504B488543k54659n19808m19515M07778q8521m69878r476J25142o17835J09847
8494G51618M66001n40053K80430m23564k26706N01708L43873J02689R6579n74020
8484G78555n1847Q19460m8403l43294n05536J39523k49214n71825J64914J30808
8474B63141O28809P0849m52665N45572L08371k68212p28160Q9784M88686O61506
8464A607681m43047n96028N09452j40548j00540k197q9986o10823n05968K13542
8454a58462q7612K05119K27261M67873O2257k24480J46377P0055k30222M96674
8444I74840L2612K22956q99575l87331K182j91974N86419p9205K9738L90216k06400
8433D74478k32689n44063K11564K62803L7016j51034J68187j92536n64030L45179
$$ y = [2488543, 2233884, 1714076, 1294561, 1702339, 1613818, 1143940, 1134464, 1259606, 641771, 751618, 1217619, 677566, 957996, 534432, 307726, 809434, 1153307, 1255996, 1352575, 778555, 726708, 1546168, 1497765, 1154471, 648935, 788458, 539244, -32581, 132333, 263141, 891950, 962799, 510134, 1055706, 1364077, 1095865, 367705, 457489, 946175, 1607681, 1164634, 568606, 1078058, 937510, 836970, 834773, 744787, 133964, -372004, -158462, -246074, -40955, 186306, 654179, 716436, 491956, 638333, 708388, 478166, 974840, 1007452, 1230408, 330833, -56498, -54316, -246290, 340129, 260924, 290662, 680878, 474478, 241789, -302274, -90710, 172093, 209109, 58075, 226262, 33726, -530304, -185125]
8423a85125j56754N08893p5408J95672K24800j094826L10526k83720N96774j62761
8413a21929Q7029o7345K26044N09688l90135P29985M54219P7193l74629j81073
8403I49047L03582k58112O194k55399n52995K32565N387l44060k78760k01155
8393c93706Q68510K06314o19085P40071k27913m69396k78579J30200k74011J31016
8383a86579J36870R86261L93524m59276m3705l30676j26249m11154n89328J96117
8373d34195J1608L82434M22125K06903P6310l9026n52809m22146K23796J64601
8363C9601L8339j09162M25828k11465n42453M61509j13502n31843l44131Q60064
8353b7215N42882r5460n9909J47524m15185K75848J82381P41463l96087m24051
$$ y = [-185125, -341879, 167014, 91606, 287278, 512078, -582748, -272222, -555942, 40832, -121929, -34900, -102245, 123799, 633487, 243352, 973337, 1427556, 1504749, 1130120, 949047, 1252629, 994517, 1000711, 745312, 192317, 424882, 430269, 86209, -192551, -393706, 474804, 681118, 62033, 802104, 574191, 104795, -173784, -43584, -317595, -186579, -49709, 936552, 1330076, 870800, 827095, 496419, 370170, -40984, -630312, -434195, -422587, -40153, 381972, 588875, 665185, 626159, 73350, -348796, -125000, 39601, 77940, -31222, 394606, 183141, -359312, 102197, -11305, -543148, -887279, -27215, 515667, 420207, 360298, 507822, 92637, 368485, 550866, 1292329, 896242, 472191]
8343D72191K93884m24561K00259l140r39165L35652K21750O0417R1308l73015
8333f4420j28893l13068M33794M24742j7368l42246r22622o50804J197428K42587
8323a40870L5668O59393m32108K93476J28170j93408k97049K30973l18870l23467
8313c58092Q59018l04004Q8394N34564r64500m24453L27410K04505L75504n49914
8303b11568j2055K557k61397J41924N4214l73206O23808L17817l31996j75496
8293b25398m33877J38284L96292m08092r1599N57396K50235k31062l7203L10112
8283B25088J71461j19458J42766k60424j1454m51041K35125l06259J6686j6548
8273c74058L00482K74189m24475J57898l18727N42519O82189p11633m04240N20993
$$ y = [472191, 766075, 341514, 541773, 538633, -400532, -64880, 156870, 217287, 308595, -64420, -193313, -506381, -72587, 352155, 334787, -7459, -930081, -1580885, -383457, -140870, -105202, 554191, 122083, 415559, 543729, 350321, 53272, 284245, -34625, -358092, 500926, 196922, 285316, 819880, -144620, -569073, -241663, -37158, 338346, -211568, -223623, -221066, -482463, -340539, -286325, -659531, -35723, 282094, -49902, -225398, -659275, -520991, -124699, -532791, -624390, -66994, 183241, -47821, -85024, 225088, 396549, 277091, 419857, 159433, 147979, -303062, -67937, -374196, -357510, -374058, -73576, 200613, -223862, -65964, -384691, 157828, 840017, 128384, -275856, 245137]
8263B45137n66657n6371k51784K07718K32873Q8002r3230O8485j49554O1142M21008
8252B06769K0609p21574K83813L06325o04849J96110L12890K72979j90692K47416
8242C29796n02620N13839k39694m28653o4843P5671j19043n31521L57264K78438
8232c31366J67292K88887M70700J34049m60341j87684k93741j71239J71253l3937
8222b46127k38439k54662K95359M31259l54603J92348k52371j05269p05223N67970
8212f69758L51707L36210l36759K5015j5516q0431M92514K24572J51077r7645
8202C80986j11299k16956K3566l5125j67410l06331p08062N93295k42890K213887
8192A423661O865018m493454k752557l51711j35186K55150q53095K08805q1633
$$ y = [245137, -321520, -377891, -629675, -421957, -189084, -101082, -194312, -125827, -275381, -214239, 206769, 227378, -494196, -210383, 95942, -508907, -312797, 93, 273072, 82380, 329796, -172824, 341015, 101321, -327332, -392175, -316504, -435547, -967068, -609804, -331366, -164074, 124813, 595513, 729562, 269221, 81537, -212204, -383443, -212190, -246127, -484566, -739228, -443869, -12610, -367213, -174865, -427236, -532505, -1237728, -669758, -318051, 18159, -318600, -293585, -309101, -389532, 102982, 327554, 478631, 380986, 269687, 52731, 76297, 41172, -126238, -432569, -1140631, -547336, -790226, 1423661, 8288679, 3795225, 1042668, 690957, 555771, 810921, -42174, 166631, 84998]
8183H4998K96359J95487q37510M3338N69376q6227L0237M65046p508l56373K46044
8172F43267p41011l3555k82812m6637L36048K83558l33879J64059q30614l65744
8162a207320M09656P60381Q19069q4262p30075K975j15525L20904M1693m10426
8152a92930J15098J76344m92439L86593J5327L9267m7963P01254j05837j146401
8142e51687l63227L85618k67341M85094l22774K5588L36431M76922K55004N23984
8132I83612j92133n60972k99251J56889K44442n06540L03625j66240l20494n21823
8122h78885M80261O12560N76741m75209M28742k36826p0227j95130J61310p72146
8112c68809l5362L8938O5899L47500K17466J78285Q7521q6743K66251o27976p8722
$$ y = [84998, 381357, 576844, -260666, -217328, 352048, 265821, 296058, 761104, 753596, 397223, 643267, -97744, -131299, -414111, -460748, -124700, 158858, -175021, -10962, -841576, -1207320, -797664, -37283, 781786, 697524, -32551, -29576, -145101, 175803, 217496, -192930, -77832, 98512, -393927, -7334, 7993, 47260, -703, 700551, 594714, -551687, -914914, -529296, -796637, -311543, -634317, -608729, -272298, 204624, 459628, 983612, 791479, 230507, -68744, 88145, 332587, -173953, 129672, -36568, -357062, -878885, -398624, 213936, 790677, 315468, 744210, 507384, 437157, 242027, 403337, -368809, -404171, -365233, -299334, 48166, 265632, 443917, 531438, 444695, 710946, 82970, 4248]
8101D248J26051o34626L45663M75600l0735L26388q07490K14157j19527K2041
8091g8230K12505K49629n3594p8401k12556q06126J85493Q76509l05171n54738
8081e64680o09938L95778L33690j21618K26612J5065m8420m23865O71372j37076
8071b63080n2199L63686L14148l35355l92258k37907P52074J44125J24411J24660
8061E42305l75277M8076K00497l57956j08705m9224n72720K6705P57247j53113
8051d2165l13447o39624M15870J87621J8817L88900l8333k66269M54626m98053
8041c32057R2629M79231k31252r4707K87280j52345M29738Q6990n96439J16472
8031H5540j89126K22280k85631r2917L458l26812M2226K86925l32499N4711J75994
$$ y = [4248, 130299, -504327, -158664, 316936, 286201, 612589, -194901, 19256, -100271, -78230, 134275, 383904, 330310, 251909, 39353, -766773, -581280, 295229, -9942, -564680, -1174618, -778840, -445150, -566768, -340156, -325091, -373511, -797376, -126004, -263080, -315279, 48407, 362555, 27200, -365058, -602965, 149109, 293234, 417645, 542305, 167028, 215104, 415601, 57645, -51060, -100284, -673004, -646299, 110948, -42165, -355612, -995236, -579366, -391745, -372928, 15972, -22361, -288630, 165996, -332057, -239428, 239803, 8551, -86156, 201124, 48779, 478517, 565507, -30932, 85540, -103586, 118694, -166937, -259854, -256396, -583208, -540982, -254057, -586556, -531845, -355851]
8020c55851J54756P03048J10786m43910n81193M72653K3024q43601Q98203O05766
8010G43681n32365J67783j04722k35857j31971n1915K39837n50209k4432J062280
8000E82110M50548M63635p58391o46355j44694L28384l62272o3079J91052M5273
7990H6211j40078k44010L08496q4078L15407j1283o1660N45308N2826l87694J95931
7979E75376o54802m21783j03720l76049R57983l27657j42504Q93469m7865n36922
7969a84474r6965J16736J32071K15172L967O0699l11847m26417k05527k8286j67275
7958h92146K63326k57383J021962K29540M3822n77255r56237L06552R75810K69018
7948D27009n29137N28115q1614q5263k89582l92342j73164j68737K28022l24819
$$ y = [-355851, -201095, 501953, 612739, 168829, -412364, 60289, 83313, -760288, 137915, 743681, 211316, 379099, 274377, 38520, -93451, -145366, 94471, -455738, -480170, 582110, 1032658, 1496293, 737902, 91547, -53147, 275237, -87035, -150114, 40938, 86211, -53867, -297877, 10619, -73459, 241948, 230665, 169005, 714313, 767139, 379445, 575376, -79426, -501209, -604929, -980978, -22995, -350652, -493156, 400313, 352448, -184474, -281439, -164703, -32632, 182540, 186507, 247206, -64641, -491058, -696585, -724871, -892146, -628820, -886203, 135759, 365299, 409121, -168134, -1124371, -817819, 157991, 427009, -102128, 425987, 344373, 259110, -30472, -422814, -595978, -764715, -536693, -861512]
7938h61512J53031P33795n1813l3479r2829o8880K7259J8056m08749k51567M34020
7927d02668n5979M43533K28794n0642R7278m99706K64184l9264n56320k4910M1016
7916e54684M7522M8693K64238m0278M48787l51005L0154N77123m61511l37612
7906c28573l02471k88176O18771R739l72442m96452N33052L48359k44635M46984
7896g5844j48346o59674P17369k50231m0515O13313p49084K23637M1898J88630
7886a38847L03630O7960k66842o74100M52244k8563j34907M8450K4787L29994
7876a6194n39424j35106n377L91552K97756k33779M5842q09265j81685N93065
7866e92615K43980n80438j58583R9057O85462N72005o73809j71115L7096L05959
$$ y = [-861512, -708481, 25314, -26499, -59978, -152807, -221687, -194428, -176372, -585121, -836688, -402668, -458647, -15114, 213680, 163038, 260316, -239390, 24794, -14470, -570790, -595700, -554684, -507162, -458469, -194231, -234509, 214278, -136727, -106573, 470550, 9039, -328573, -631044, -919220, -300449, -290710, -663152, -1159604, -626552, -278193, -522828, -75844, -224190, -883864, -166495, -416726, -457241, 156072, -593012, -369375, -327477, -138847, 164783, 232743, -34099, -708199, -255955, -284518, -419425, -370975, -346188, -16194, -555618, -690724, -696101, -304549, -6793, -240572, -194730, -1003995, -1185680, -592615, -348635, -929073, -1087656, -988599, -303137, 268868, -404941, -576056, -538960, -233001]
7856b33001P586p5160j72682k03807M90162L1356m40647j38596L35637J72220
7846b26932K16301Q6598r99600L1936L74999j03186L38388j23227N11397K71289
7836C77963o12482K76000n6989P4213o3945K42666J34449k91610j22163L01146
7826B59248J20557n01185J15593j08719j39027N8255j49998j80920J11517J71206
7816b43473m56118K28049J45128l5633j06097j53149l33364K9869J315522J63073
7806E53807j017925O83215l1649o86494K52118J46716l71998L01707J70105J2699
7796A2301K83140j23200l01454N12570J4113p77911l57967L03625m4038L14639
7786a64182L76383j48431k9407P8703j50121J40001j89370j58374k39486m1485
$$ y = [-233001, -225415, -300575, -473257, -677064, -186902, -155546, -596193, -734789, -399152, -226932, -10631, 75967, -923633, -891697, -516698, -619884, -281496, -404723, 106674, 377963, -234519, 41481, -15508, 58705, -5240, 237426, 371875, 80265, -41898, 259248, 379805, -121380, -5787, -114506, -253533, -195278, -345276, -526196, -414679, -243473, -699591, -471542, -326414, -362047, -468144, -621293, -954657, -924788, 390734, 553807, -464118, 219097, 187448, -499046, -246928, -100212, -472210, -170503, -398, 12301, 295441, 172241, -129213, 383357, 397470, -380441, -738408, -434783, -478821, -164182, 212201, 63770, 34363, 113066, -37055, 102946, -86424, -244798, -484284, -525769]
7776e25769J51641J36461P94799o78989j9362o07414l37321M00839j14066K20428
7766e78753J68844n09224J79661R86228j71038L77281l95345m04438J55538p3229
7756b64475K57585l63618M67389Q0028k95689m31142P02470J48294L3000J07546
7746D41388j84237k66811M04606J17593n43227n9876r4693L7398j40032p6819
7736c64710j61772J54413Q74715l20723p01759l82223j96532N21250M24992Q10324
7726F57975j81078q07935m62247P40860K06936l89801M25253J91652j131213K08481
7716e41117j06431J69351k97326J4659K74508N76784L82835m77204L01909m86462
7706a88494k94370P08319j9951m87186R679l0517Q4414j59308j62744L90045O92910
$$ y = [-525769, -374128, -237667, 557132, -121857, -141219, -748633, -1085954, -685115, -799181, -578753, -409909, -919133, -739472, 246756, 75718, 452999, 57654, -346784, -191246, -264475, -6890, -370508, 96881, 176909, -118780, -549922, 152548, 300842, 333842, 441388, 257151, -9660, 394946, 512539, -30688, -90564, -185257, -147859, -287891, -364710, -526482, -372069, 502646, 181923, -519836, -902059, -1098591, -577341, -152349, 657975, 476897, -331038, -793285, -52425, 154511, -235290, 189963, 381615, -749598, -541117, -647548, -478197, -775523, -760864, -486356, 90428, 473263, -3941, 297968, -188494, -482864, 225455, 205504, -281682, -272003, -302520, -218106, -377414, -540158, -150113, 542797]
7695E42797m18337N9638j57492j37334j21389J97716j58952j68234O49623K24889
7685E12925m29889M69054k49000n63410K40358k99265L46161J14119m44701O24865
7675C21217q6523n26596m61928L32449N19853J39219M18227o91402l19671N65232
7665B10077J5484L6167P3989j38350p5289q3683l30010k71168J19649m30360L20410
7654e53084L12325j50127O04216m10389k90161j11653K98403j59268O99942q44723
7644f04519K11551L50216M98357j9280p72798k95447J36437o8675k89951M33600
7634d20509J73362k41010p53304Q06981N16884J44678m51585l11489K84645K51161
7624a86j55422n06304j2354L84649k7948K91566m0103j8736M3405N18942p12800
$$ y = [542797, 124460, 184098, 26606, -110728, -232117, -34401, -193353, -361587, 288036, 512925, 83036, 552090, 303090, -260320, -19962, -319227, 26934, 141053, -303648, 321217, 234694, -291902, -753830, -421381, 98472, 237691, 655918, -35484, -355155, 210077, 225561, 261728, 335717, 197367, 122078, 38395, -291615, -562783, -443134, -873494, -553084, -240759, -390886, 213330, -197059, -487220, -598873, -300470, -459738, 240204, -604519, -392968, -42752, 455605, 436325, -336473, -631920, -495483, -564158, -854109, -420509, -247147, -488157, -1241461, -434480, 82404, 227082, -224503, -535992, -251347, -186, -155608, -661912, -674266, -289617, -317565, -25999, -66102, -84838, -41433, 477509, -235291]
7613b35291m4070j82423J01674L15700K35757l20225O5521j83679K00243P3645
7603B6852K16333N2707K55832j4134K7453L1847m51554j10121k89001m46039k11591
7592i11416q6356L31099J27346j69260j14588M81631n43161l24808N00106N7609
7582f51798O13943N70205J05678o99985l98567N85430L35070J93759l40415n63784
7572b50464j56583J19430M27339l93725J72680k36629J68733p3585N11448l84292
7562i5648l74472K87550P98003K9351o28705k11684o3426l51696J54640k53026
7552g09113m2262O84552O14456r06596O7893P4191n16579L71646M52887l90302
7542b99227j60504J056510k52214n93073Q3650l67337j70127P88960m53540Q6499
$$ y = [-235291, -279361, -461784, -360110, -44410, 191347, -128878, -63357, -247036, -46793, 26852, 243185, 295892, 551724, 537590, 565043, 596890, 145336, 35215, -253786, -699825, -911416, -997772, -666673, -539327, -708587, -823175, -341544, -884705, -1209513, -709407, -651798, -37855, 532350, 638028, -61957, -460524, 124906, 459976, 653735, 313320, -250464, -407047, -287617, 139722, -254003, -81323, -317952, -149219, -222804, 288644, -95648, -470120, -182570, 615433, 644784, 16079, -195605, -259031, -610727, -456087, -709113, -751375, -66823, 547633, -358963, -291070, -216879, -733458, -361812, 91075, -299227, -459731, 596779, 344565, -248508, -164858, -532195, -702322, 86638, -366902, -280403]
7532b80403r7886m87510K21360L88050L30593k36361j71048k93949j84625Q33212
7522B1433j24504M48079K80444k39246l15174K39501k83572k87068P71959m24882
7512H6970l84645L87006j94065L74821k14351j84340M50931K37987l51980k31516
7502b3182M0808K12922M24737j50403J7288n43710r5400l34782n9905p7990M96817
7491i2800J97651j62921K57117Q88621o92936o37394K93754K65886j39213o92561
7481e14796M35730J08856r7657L9777l47958r012L18959M36512K33201N3787k46615
7470D10784J1753l33818o27337O14176l28038l75510k79475R24496N47021o00704
7460c6652j82007j40619j40239r7541L8641O8601K260J47420P77850j66497k24357
$$ y = [-280403, -378289, -865799, -644439, -256389, 74204, -162157, -333205, -627154, -811779, 21433, -103071, 345008, 625452, 386206, 71032, 310533, 26961, -260107, 511852, 86970, -297675, 89331, -104734, 270087, 55736, -128604, 322327, 560314, 208334, -23182, 17626, 230548, 655285, 504882, 522170, -21540, -116940, -451722, -511627, -589617, -92800, 104851, -58070, 199047, 1087668, 394732, -242662, 51092, 316978, 177765, -514796, -79066, 29790, -67867, -28090, -376048, -385060, -66101, 370411, 603612, 657399, 410784, 422537, 88719, -538618, 75558, -252480, -627990, -907465, 17031, 564052, -36652, -218659, -359278, -499517, -597058, -558417, -489816, -487556, -340136, 437714, 271217, 46860]
7449D6860o08731L25335O58470n48995j30554l7538m85029j4393P32129m79689
7439e42135o4812J23355R3290j98089P81259O0663o4871K58583m43041N76818
7429E81020l88148k29569K01511m38677q0517k56842L03196N76309J02255K97110
7419F67648n73849p03163L77728J6476M13268R0308n40696k44523m11291O0999
7409h47095l79268L51395N74437P76487j23469L87092L08105q01464l13378L01678
7399B34520l77383k56151k04446P4080O05867j69385J01320j1033m68896J67444
7389c04063O98341k11024k6471l65269m26909J058552m00169n11537o8026J99257
7379c57318K53155m5630j5686j63571L47709k21361k31777n50749M44420L22963
$$ y = [46860, -561871, -236536, 421934, -127061, -257615, -295153, -780182, -794575, -62446, -542135, -606947, -483592, -390302, -588391, 192868, 253531, 188660, 447243, 4202, 581020, 192872, -36697, 164814, -273863, -354380, -611222, -308026, 268283, 370538, 667648, 93799, -609364, -231636, -215160, 198108, 288416, -252280, -496803, -908094, -847095, -1226363, -874968, -300531, 475956, 352487, 739579, 1047684, 246220, -67158, 234520, -142863, -399014, -603460, -529380, 76487, -92898, 8422, -2611, -471507, -304063, 394278, 183254, 156783, -208486, -635395, 423157, 22988, -488549, -556575, -357318, -104163, -149793, -165479, -329050, 18659, -202702, -434479, -985228, -540808, -217845]
7369b17845m31894L34279n728O4799k3418l54452M29417L93329k57212K1717J42720
7358I5712m17371Q2767J78921J28198k90657l8055J4061m45964N49579n21L78015
7347B34685J20106n90777J59366p9250M49273o61714k40865O40608j87646L15327
7337A59113n41677J94268R9624M36177k7413m57680O19123k06784p54906k3210
7327e03365p160o38601Q67258K4521q9887J09314L21836L01730p07715p077P14856
7316C85710l00202R3802k56089L21322r2583O6571m39560j16792L87285K02630
7306B52094K30807j4208J26380O5691n01105k54186j37791J06924k09223N13298
7296A78681O88510r08458j69632J55336k58633m6363M92355l18190M70371l09740
$$ y = [-217845, -649739, -315460, -321188, -256389, -279807, -634259, -204842, 188487, -68725, -47008, 95712, -321659, -238892, -59971, 68227, -222430, -260485, -246424, -692388, -142809, -143330, 234685, 354791, -235986, -76620, -155870, 293403, -368311, -609176, 31432, -156214, 159113, -382564, -188296, -88672, 347505, 320092, -137588, 481535, 274751, -480155, -503365, -510525, -1149126, -281868, -257347, -347234, -237920, 83916, 385646, -322069, -329146, 385710, 85508, 179310, -76779, 244543, 151960, 218531, -221029, -337821, 49464, 252094, 482901, 468693, 595073, 660764, 159659, -94527, -232318, -125394, -334617, 178681, 867191, -41267, -210899, -55563, -314196, -360559, 131796, -186394, 283977, -25763]
7286b5763k6032J4777j78253o7659j11943k34533K23860j79565N11251O28869
7276E55009j24896p67122N77687l68383l68279R2723O2540O49429m29547m34869
7266e55708j12103N18072O18686N63673p05378k99830j89191m82556M25620K56215
7256C7500L29673J26881n60270n07283L46649K36802J97702l2345m69575k45327
7246e39593O07437P46741m29169p85673n1436O44954K66708m77786p46473L75526
7236c88764J14785J88451O56279L5308k47188L74717n04444l95550L05391J34331
7226B73316K08957k53861p52783K99712L1598K52105O6585L82565n5529k87860
7216A64805o75909M86107L37291o98347J4745K30927j2198m18122O12217n45356
$$ y = [-25763, -51795, -37018, -215271, -282930, -394873, -629406, -405546, -585111, -73860, 555009, 430113, -337009, 240678, -127705, -495984, -403261, -340721, 308708, -120839, -555708, -667811, -149739, 468947, 1032620, 327242, 27412, -161779, -644335, -218715, 37500, 367173, 494054, -66216, -573499, -226850, 9952, 207654, 175309, -294266, -539593, 67844, 814585, 385416, -400257, -451693, 193261, 459969, -17817, -764290, -388764, -273979, -85528, 570751, 606059, 358871, 733588, 229144, -166406, 138985, 273316, 482273, 228412, -524371, -224659, -193061, 59044, 125629, 508194, 452665, 164805, -511104, -24997, 312294, -386053, -371308, -140381, -152579, -570701, 41516, -503840]
7206e03840N08494Q4392M88741q32802J9700j00393M15124L22277j66625K54301
7196D89369m68440j51096M52874o6255n01092K52472n94795q1302M83434L30615
7186A45784q86450M65574K11651m26805J10278N80664k61809m63677P0843J66520
7176b87427L16088j67906K67289N41705m58572n23601j28820j51057M38984J24226
7166b9091Q5977O32674J10339o37753j95895N57590k89364l33337j32307k67215
7156d98382m67613l56880N59251M43273K0596q1341n68683N50371K2782m37630
7146h14256L14596K78033K32289p74549n92391k5480N61802N77901N58518o11764
7136b95301O2519l44032J69923J22619M69031J22554L0099k09641k17693K54324
$$ y = [-503840, 4654, 89046, 577787, -255015, -235315, -335708, 79416, 401693, 235068, 489369, 20929, -130167, 322707, 256452, -244640, 7832, -586963, -668265, -184831, 145784, -740666, -275092, -63441, -490246, -379968, 200696, -61113, -524790, -453947, -287427, 28661, -139245, 128044, 669749, 211177, -312424, -441244, -592301, -153317, -29091, 56886, 689560, 799899, 162146, -33749, 523841, 234477, -98860, -231167, -498382, -965995, -1322875, -763624, -320351, -299755, -381096, -949779, -399408, -376626, -814256, -499660, -221627, 10662, -763887, -1356278, -1381758, -819956, -242055, 316463, -295301, -232782, -576814, -406891, -284272, 184759, 307313, 337412, 127771, -89922, 164402]
7126A64402O48637j60486q70595N50663n08288N95209J45667j77612j047561N42975
7116a16989l16070j74067l59636O58559M27755J49840J99390j63982O8000r7434
7106B75366l28976m15766L53210K58493k40473m09432j09175m01011P32368O9633
7096b15763N4916m28397N73584M01313L9873m30360l58813J94263k26058q2326
7086d77768L17752m61766J58621J35485M54803n20393K5211l02831l83480J05526
7076i48840L42175L92593k3852M17561n58936j49482m63207O91175Q2146m02226
7066f20893M39983M37843r2664J74441j28667N1154M422j180597J31384K52977
7056e30617j50602J144072j58282n11836j71287K46527k34718p5833P02092j73565
$$ y = [164402, 813039, 652553, -218042, 332621, -175667, 419542, 565209, 387597, -659964, -116989, -433059, -607126, -966762, -308203, 119552, 269392, 468782, 304800, 372800, 275366, -53610, -469376, -116166, 142327, -98146, -507578, -616753, -1017764, -285396, -215763, -160847, -589244, -15660, 385653, 425526, -4834, -363647, -169384, -395442, -477768, -160016, -621782, -463161, -327676, 127127, -393266, -368055, -670886, -1054366, -948840, -606665, -214072, -237924, 179637, -379299, -528781, -991988, -300813, -218667, -620893, -180910, 256933, 164269, 338710, 210043, 261197, 265619, -914978, -783594, -530617, -681219, 462853, 304571, -207265, -378552, -132025, -366743, -442576, 259516, 85951]
7046H5951j42220K71804K15460l61203j70089K44699l35603J18602J47128p42295
7036f67766l77945M09802O00076M18060l70495k62858n51485P06678M97436j12252
7026B89251N33547j056639j3320K40059j41579K20617L44955J315j18465l36937
7016c7196O77928j42818K3016j67450l93104q2882n52638O69832K47150o07142
7006c65304N4369J50540O851k50606R4183M18752L41885l69765m0559j37879M7992
6995d9541K37701J39323J66218l79431L61218L5825M1405J94487l72772K85166
6985F59599m06608n35010J66649J04105J089198L366N52970K6157J67116m49457
6975A378085l30205j92635r3030l29161l52635l50187N3577n49370J6136N69673
$$ y = [85951, -56269, 215535, 430995, 69792, -100297, 144402, -191201, -72599, 74529, -667766, -1045711, -635909, -35833, 382227, 11732, -251126, -802611, -95933, 401503, 289251, 822798, -233841, -247161, -7102, -148681, 71936, 416891, 418206, 299741, -37196, 640732, 497914, 520930, 353480, -39624, -122506, -675144, -5312, 241838, -365304, -310935, -160395, -153544, -404150, -309967, 108785, 450670, 80905, 40346, -97533, -49541, 188160, 327483, 493701, 114270, 475488, 511313, 552718, 747205, 374433, 659599, 252991, -282019, -115370, -11265, 1077933, 1081299, 1634269, 1660426, 1827542, 1378085, 1047880, 855245, 762215, 433054, 80419, -269768, -216191, -765561, -749425, -179752]
6965a79752K19312L75970q09654k59082L4411m97327L89129L62629O66019K52308
6955E53963l85184O65275m75147m58266j95353J1134p87919N41203K07446r6660
6945d19508l00838j08001P2641q867L99768K28138K56249l78449K28662K54536
6935B24331j02776k8203m8190p20482q7509K97182O4490K29364p56330k90300
6925a218423Q42276J39687l10211O78123N1869k4353L87286k2553r6228l28325
6915I9148m55872K02833M1434j4227K85053j03129l93648R7324K85981J11142
6905A56039O16410J05893J1134o48983k89111J78356J5655o30056J77471K65312
6895d1880l71632K82004J63825J20004K10876N2425o00768Q46540L56540M8234
$$ y = [-179752, 39560, 415530, -394124, -653206, -618795, -1116122, -726993, -364364, 301655, 553963, 168779, 834054, 358907, -99359, -294712, -283578, -1071497, -530294, -322848, -419508, -720346, -828347, -755706, -764573, -364805, -136667, 119582, -258867, -30205, 224331, 121555, 93352, 45162, -675320, -762829, -465647, -401157, -171793, -928123, -1218423, -376147, -236460, -546671, 131452, 183321, 158968, 546254, 523701, 427473, 99148, -356724, -153891, -112457, -126684, 158369, 55240, -338408, -241084, 44897, 156039, 772449, 878342, 889476, 240493, -48618, 129738, 145393, -484663, -307192, -41880, -413512, -131508, 32317, 152321, 363197, 415622, -185146, 661394, 1017934, 1066168]
6885A066168l42108j42006r00154j44454N10107o43969K80956N38241o43658R324
6875d11553M38881k54555J60238k47877k25960Q2119k83634N53165Q9346l70293
6865d70123P82531k94533k63495J0608n7699Q885M71278r459j93209m03062P89260
6854C70982K16427o5040L00229n66908j44464N3952m88374k88J44417j89575n7875
6843d26517j98266j25414N9251M17016J13307j21528o06321J7680N76773k17617
6833e11636N4142K18360o8141k17809L26941J67361j51852J61284J92353L5778
6823B06781j79451J19443P8776k1780k6815J232k08279k65385k37740J45244q5806
6812d73780L18048N69306J31090m12790l63286M23441O66189l03066n16385q32947
$$ y = [1066168, 724060, 582054, -318100, -462554, 47553, -596416, -315460, 222781, -420877, -411553, 27328, -227227, -66989, -314866, -540826, -458707, -742341, -189176, -99830, -470123, 312408, 17875, -245620, -235012, -292711, -283826, 187452, 177993, -15216, -418278, 370982, 587409, 522369, 822598, 255690, 111226, 165178, -323196, -323484, -179067, -368642, -426517, -624783, -750197, -690946, -273930, -160623, -282151, -888472, -870792, -294019, -511636, -457494, -239134, -307275, -525084, -198143, -30782, -182634, -21350, 171003, 206781, 27330, 146773, 225549, 203769, 176954, 178186, -30093, -295478, -533218, -387974, -473780, -155732, 413574, 544664, 131874, -231412, 192029, 858218, 555152, 38767, -794180]
6802g94180n5672K36243K1272Q06330P4968K00165k5609J76802m56875J61917
6792C45361m09016J12053l33791J00839L53817o07366K6715K84745K25506J491
6782A00354l46707M130m7465Q0496M39392j24061k71679m81854N03164J47530
6772C300o0687J35764J4501J68951n95497N18496J79214n15968j86057m06603
6762g44586Q33729K23995l66489j29746P6677q26200j50132O67988L89326k04990
6752b30428M09982J11741k14814J28689j046827j27701J257323l55226l49278
6743d16539k64919K42114K31644J14235K27275j18757L19159J26670m76467n84157
6733e99742K50728N07957K6730l04276o15845K15728M40290K66399O1700N4009
$$ y = [-794180, -849852, -613609, -592337, 213993, 288961, 489126, 463517, 640319, 183444, 345361, -63655, 48398, -285393, -184554, 169263, -438103, -411388, -126643, 98863, 100354, -246353, -242223, -289688, -209192, 230200, 106139, -165540, -647394, -144230, 3300, -57387, 78377, 92878, 261829, -333668, 184828, 364042, -151926, -337983, -744586, 89143, 313138, -53351, -183097, -106420, -932620, -1082752, -414764, -25438, -230428, 179554, 291295, 76481, 205170, -841657, -969358, 287965, -67261, -416539, -681458, -439344, -207700, -93465, 133810, 15053, 334212, 460882, -15585, -599742, -349014, 158943, 185673, -118603, -734448, -518720, -78430, 187969, 249669, 303678]
6723C03678J43836L06433R8913J85729q20456o45544O31411O8448n34448n96332
6713h58332L75698j15179K54179m88258M99366M52546Q9037m628p08562L54968
6703a49165L27104k30388J64447o59863j95251N12723K85573m34977m18665J48744
6693f49718J95735Q42600p89978R35292k96403o16033q4364O25026L76777j14706
6683D24228K49728p46812N27928k35749n949M04587m68846R7933J40292K58026
6673F45366l12776j50673P62456j74648k08266k96092M4641l51241l1034N77692
6663E05425L40221l15548l16984n7954L98850k12995l33151K65774l32308k08864
6653b67534R73105O1035q10105L8601J55075r31M89078j96395l32032P8581o29218
$$ y = [303678, 447514, 753947, 852860, 1038589, 218133, -427411, 204000, 272448, -262000, -858332, -482634, -597813, -343634, -831892, -332526, 120020, 209057, 204429, -504133, -149165, 177939, -52449, 111998, -547865, -743116, -230393, 55180, -379797, -798462, -649718, -453983, 388617, -401361, 533931, 237528, -378505, -462869, 162157, 538934, 424228, 673956, -72856, 455072, 219323, 213374, 617961, 149115, 247048, 387340, 645366, 332590, 181917, 944373, 769725, 561459, 265367, 310008, -41233, -72267, 505425, 845646, 530098, 213114, 155160, 554010, 341015, 7864, 273638, -58670, -267534, 705571, 766606, -43499, -4898, 150177, 149246, 638324, 441929, 109897, 188478, -440740]
6642d40740N6115O05555J06886L83974k91307m149m71878j69218K85366L51755
6632D12359J00240m49685P677m10103M19549l95388O66517O76534p83564o17350
6622c73214J71568K46503m34l09363J37282J41072J58608l1269l60562Q78455
6612F58646L14714j077870j01723J41787L91641K87690o24657K96475m6488R3039
6602C33254k82996k01685N00018m0819r5380k34612N14997n77510l61800L16768
6592a29765L0168L61517p5147L04436K17142j78496J62590n75647Q2124N09496
6582G08418K6307p0368r33247P66035k410L65681j57182K20113n88394m41769
6572a06816k98002Q03850K21100l02618R56253K56828k44103k93153n18182N03656
$$ y = [-440740, -384625, 220930, 327816, 711790, 420483, 416334, -55544, -224762, 60604, 412359, 512599, 62914, 70591, -339512, 80037, -315351, 351166, 1027700, 244136, -373214, -201646, 44857, 44423, -264940, -127658, 13414, 172022, 140753, -219809, 658646, 973360, -104510, -206233, -64446, 327195, 614885, -9772, 286703, 240215, 333254, 50258, -151427, 348591, 307772, 212392, -22220, 492777, -84733, -446533, -129765, -99597, 261920, 186773, 491209, 708351, 529855, 692445, 116798, 198922, 708418, 734725, 664357, -268890, 497145, 494735, 860416, 703234, 923347, 334953, -106816, -404818, 399032, 620132, 317514, 1273767, 1530595, 1286492, 993339, 475157, 978813]
6562I78813K51135m71612J57810O4064r01836n71711J299511L1241m53758J2724
6552C96381K79145J25530O8996N54780n66574J59886P06007k42041O07494J24961
6542B214565o70597l95037l69225l30955K38606N70024M41287m92483Q36778J42679
6532B185642n06706m11065k60750j3100Q54768l06546l47710K17068o19504j66812
6522F25285k30748M3706K52281m82160P66969K11488m12152J01750J098084o2442
6512A912061J76414n03044j79274K80941m0309O168k28869o9518O4147n13805
6502I04912p6577K60889l24901j88663K2186L84304N21212j28399L31971M26029
6492B132963p96082k23620M0682J82682k25163j29721L49730L83941n34157K66116
$$ y = [978813, 1229948, 758336, 916146, 980210, 78374, -493337, 806174, 837415, 383657, 396381, 675526, 801056, 870052, 1424832, 858258, 1018144, 1724151, 1482110, 2089604, 2214565, 1543968, 1148931, 779706, 448751, 687357, 1257381, 1698668, 1206185, 2042963, 2185642, 1678936, 1267871, 1007121, 994021, 1848789, 1542243, 1194533, 1411601, 792097, 625285, 394537, 438243, 690524, 208364, 975333, 1186821, 774669, 876419, 1974503, 1912061, 2088475, 1585431, 1406157, 1687098, 1646789, 1652957, 1424088, 1354570, 1418717, 904912, 828335, 1089224, 764323, 575660, 597846, 982150, 1503362, 1374963, 1706934, 2132963, 1336881, 1113261, 1153943, 1336625, 1111462, 981741, 1331471, 1715412, 1181255, 1447371]
6482A447371L38877k16289m76204M8251N51992l31242o4626o55638P40824M7942
6472A431258n08241L90526J24277P26413O0615J83992p21129m13510K28232n35269
6462I67164j5430L74550k34870K89535N04025N46008k10615k82861K6948R5057
6452B059511m05479O29280K36144m44660J06915L6593J21634J53512n3429K02266
6442B642287j92080J4662O79238m8380M7475k11720k55990p6855k54261O12916
6432B957292m05712J19929n7197L61395P75379O67273N1874k30717j24648L30352
6422D445220K08312j58357Q80970K91646L9074J6093j48790k57173k29623K9786
6412E117158O19391o16911o62057N21505J54964k2341L51765K09845l04540L11870
$$ y = [1447371, 1786248, 1569959, 1093755, 1142006, 1693998, 1362756, 1298130, 642492, 1383316, 1431258, 923017, 1313543, 1437820, 2164233, 2224848, 2408840, 1687711, 1274201, 1502433, 967164, 951734, 1326284, 1091414, 1380949, 1884974, 2430982, 2220367, 1937506, 1964454, 2059511, 1654032, 2283312, 2519456, 2074796, 2181711, 2218304, 2339938, 2493450, 2440021, 2642287, 2450207, 2464869, 3144107, 3095727, 3143202, 2931482, 2675492, 2598637, 2344376, 2957292, 2551580, 2671509, 2614312, 2975707, 3751086, 4418359, 4470233, 4239516, 4114868, 4445220, 4653532, 4495175, 5376145, 5667791, 5706865, 5722958, 5574168, 5316995, 5087372, 5117158, 5736549, 5119638, 4457581, 4979086, 5134050, 5111709, 5463474, 5673319, 5368779, 5680649]
6402E680649R3284M92432O22142M55870k2590L17857J136316N69803L01484L21441
6392I968688m12272L10921n50694r14489p34487p40342j014292l18943p8297m73202
6382E042591M15637Q0664L69424j18959O05392L48435n19407m41585N18420j89591
6372F111021P98353O24510K78273Q45817m16605k99605j07830p4169m53160m65592
6362F841013P7169r1079j35520j96093J74921k75159k82675L52323j08615o07853
6352E748432P09377K2130n3967J87908J29149n33352R3161j19146M07618O79699
6342G271009n98457M83322O14180k59547J84233N7400N14208O17791N34440O65128
6332A0083707j40274n32317k02218m20946l36634M26373K57075K81232N00625
$$ y = [5680649, 5773933, 6266365, 6888507, 7344377, 7321787, 7639644, 8775960, 9345763, 9647247, 9968688, 9556416, 9867337, 9316643, 8402154, 7667667, 6927325, 5913033, 5594090, 5515793, 5042591, 5458228, 5538892, 5908316, 5789357, 6394749, 6743184, 6223777, 5782192, 6300612, 6111021, 6909374, 7533884, 7812157, 8657974, 8241369, 7941764, 7833934, 7759765, 7306605, 6841013, 6918182, 6827103, 6691583, 6495490, 6670411, 6395252, 6112577, 6464900, 6356285, 5748432, 6457809, 6479939, 6425972, 6613880, 6743029, 6209677, 6302838, 6183692, 6591310, 7271009, 6672552, 7155874, 7770054, 7510507, 7694740, 7752140, 8266348, 8884139, 9418579, 10083707, 9943433, 9411116, 9208898, 8787952, 8451318, 8877691, 9134766, 9415998, 9916623]
6323I916623P2307K22717K05836J50767P3696k10456N19102N80883P27443L81443
6313A2640361K93369j2212L36752M0861K33843q9418N76809N24158O11818O05398
6303A5761739L66938P9991N47920L47272K49482O69554M14024Q42823M17564l7988
6293A9659319O36481Q11656L81447J063349N71257O57749J6610R31319J326348
6284B6055535M06574N70001O22953Q15391J091083J191809O75579J359154J966846
6275C4754925J711708P81382J794086K446059J431230K212098L279631K803283
6267E1214402M142608M206745M002484N124573N410846O835086Q307950Q487791
6259I7732485R306544R270242Q328345O533783K055526k494198o228708o829614
$$ y = [9916623, 9988930, 10211647, 10417483, 10568250, 10641946, 10431490, 10950592, 11531475, 12258918, 12640361, 12933730, 12921518, 13258270, 13299131, 13532974, 13443556, 14020365, 14544523, 15156341, 15761739, 16128677, 16208668, 16756588, 17103860, 17353342, 18022896, 18436920, 19279743, 19697307, 19659319, 20295800, 21107456, 21488903, 22552252, 23123509, 23781258, 23797868, 24729187, 26055535, 26462109, 27032110, 27655063, 28470454, 29561537, 30753346, 31428925, 32788079, 34754925, 36466633, 37248015, 39042101, 41488160, 42919390, 45131488, 48411119, 51214402, 55357010, 59563755, 63566239, 68690812, 74101658, 80936744, 89244694, 97732485, 107039029, 116309271, 124637616, 131171399, 133226925, 130732727, 124504019, 117674405]
6251A17674405p691972o896108n680326m316071k932585j229684M39816O40731
6243I0008206J486024L537515M207221O114201O912517P402532R942508J1588677
6235A41199401J3048929J5911560J8279406K0075284J8477637J3885387N673562
6228B46551166n096609j4355947k0901958k2752103k1131631j7396488j4766160
6221A30150270j2101671r155474p946368o142323l874263k997412j752292N57550
6213H6738017J580753J023287L020188L738802M250466O293881Q364153R480524
6205A24490071Q305438N890071K149747l268923p640551j1171682j2583303j2399698
6197I3771170j0606131r137730q714571p253386n694023m664061l626088m248138
$$ y = [117674405, 109982433, 103086325, 97405999, 93089928, 90157343, 88927659, 89367475, 90008206, 91494230, 95031745, 99238966, 105353167, 112265684, 119668216, 129610724, 141199401, 154248330, 170159890, 188439296, 208514580, 226992217, 240877604, 246551166, 241454557, 227098610, 206196652, 183444549, 162312918, 144916430, 130150270, 118048599, 108893125, 100946757, 94804434, 90930171, 87932759, 86180467, 86738017, 88318770, 89342057, 92362245, 96101047, 100351513, 106645394, 115009547, 124490071, 132795509, 138685580, 140835327, 137566404, 129925853, 118754171, 106170868, 93771170, 83165039, 74027309, 65312738, 58059352, 52365329, 47701268, 44075180, 39827042]
6189C9827042l035503k937478k354692j985967j491697k363160j393668r22155
6181B3342722j023341j173281l39146q21509j093085m88745p13378j524073r75096
6172A5191068m02466n44459j23346l01664N6287o87835K46687j203202p41469
6163A1489601l02165m09388J74657N0623o44042q52076l04149N32207m36324l70685
6153H928259p89465J43272K1932m34811n96195K19809K59336q22578P3345N49701
6143G552605o88990q5865N4954n39134J30766m18928p7624Q6191J80684q00078
6133E394581J1785n67493j73808l108M99635J148809o02358m65365k64899J38724
6123E116503n23753M75779J13466J38813L07016q5009l92638n93009K38583K68950
$$ y = [39827042, 36791539, 33854061, 31499369, 29513402, 28021705, 25658545, 24264877, 23342722, 22319381, 21146100, 20806954, 19985445, 18892360, 18403615, 17690237, 16166164, 15191068, 14788602, 14244143, 14120797, 13819133, 13875420, 13187585, 13434272, 12231070, 11489601, 11187436, 10778048, 10952705, 11003328, 10359286, 9507210, 9203061, 9735268, 9298944, 8928259, 8138794, 8282066, 8303998, 7869187, 7272992, 7492801, 7752137, 6929559, 7002904, 7552605, 6863615, 6777750, 6832704, 6293570, 6424336, 6005408, 5927784, 6013975, 6194659, 5394581, 5406366, 4838873, 4665065, 4661957, 5161592, 6310401, 5708043, 5242678, 4977779, 5116503, 4592750, 5068529, 5181995, 5320808, 5627824, 5542815, 5150177, 4557168, 4795751, 5064701]
6113E064701q6907O69273k00128j31398M22167k17725P05903M60860Q9088l23940
6103F451894J10925J41689l00709m05543K02299M9196j2187l39491K03197M25943
6093F527213J3208q0962l94028J92608j97766L20654j50719Q68972j84176j69160
6083F745844M2790n21346J36949m06904M84632m04713q767M88672l71490m8851
6073F136816p62882L18998j87444m510q162j26669P8982P977O88988l51796m00749
6062E389549k74457l97099k15938k90104n41649o27555K79922l50582n91226M49586
6052B830447L8576l25901l34569O3887J15385k64243J00847K700Q14218l88431
6042B652916o12515K93550j59534R4149k91143J07785n5686L56350q46370j85092
$$ y = [5064701, 4977794, 5647067, 5446939, 5315541, 5737708, 5519983, 6225886, 6686746, 6775834, 6451894, 6562819, 6704508, 6403799, 5998256, 6200555, 6249751, 6237564, 5898073, 6101270, 6527213, 6540421, 6459459, 6065431, 6258039, 6060273, 6380927, 6230208, 7099180, 6915004, 6745844, 6788634, 6267288, 6404237, 5997333, 6481965, 6077252, 6068485, 6557157, 6185667, 6136816, 5373934, 5692932, 5505488, 5500978, 5492816, 5366147, 5445129, 5453106, 6142094, 5790298, 5389549, 5115092, 4717993, 4502055, 4211951, 3670302, 3042747, 3322669, 2972087, 2380861, 2830447, 2869023, 2543122, 2208553, 2272440, 2387825, 2123582, 2224429, 2227129, 3041347, 2652916, 2040401, 2333951, 2174417, 2268566, 1977423, 2085208, 2029522, 2385872, 1539502, 1354410]
6032A354410M19755K36133o0329q02447J95105P60778m04694K52396j02383j21531
6022A727193k93850N29516O37364j16189o3406L47811o96795k77935n1438M39273
$$ y = [1354410, 1774165, 2010298, 1949969, 1147522, 1342627, 2103405, 1698711, 1951107, 1848724, 1727193, 1433343, 1962859, 2600223, 2484034, 2420628, 2768439, 2071644, 1793709, 1742271, 2181544]
$$ [...]
##END NTUPLES=NMR SPECTRUM
##END=
