##TITLE=1H_CG-1181-b
 CDCl3
 8 sc, 
 11.4.2024
##JCAMPDX= 6.0         $$ Bruker NMR JCAMP-DX V2.0
##DATA TYPE= NMR SPECTRUM
##DATA CLASS= NTUPLES
##ORIGIN= UXNMR, Bruker Analytische Messtechnik GmbH
##OWNER= root
$$ XWIN-NMR		Version 3.5
$$ Thu Apr 11 13:45:33 2024 Russian Standard Time (UT+4h)  she@DPX200
##.OBSERVE FREQUENCY= 200.1309
##.OBSERVE NUCLEUS= ^1H
##.ACQUISITION MODE= SIMULTANEOUS
##.ACQUISITION SCHEME= undefined
##.AVERAGES= 8
##.DIGITISER RES= 18
##SPECTROMETER/DATA SYSTEM= spect
##.PULSE SEQUENCE= zg30
##.SOLVENT NAME= CDCl3
##.SHIFT REFERENCE= (INTERNAL, CDCl3, 0, 15.5299)
##AUDIT TRAIL= $$ (NUMBER, WHEN, WHO, WHERE, WHAT)
$$ ##TITLE= Audit trail, XWIN-NMR		Version 3.5
$$ ##JCAMPDX= 5.01
$$ ##ORIGIN= Bruker BioSpin GmbH
$$ ##OWNER= she
$$ F:/spectra/data/she/nmr/H-F/1/pdata/1/auditp.txt
$$ ##AUDIT TRAIL=  $$ (NUMBER, WHEN, WHO, WHERE, WHAT)
(   1,<2024-04-11 13:44:28.29 +0400>,<she>,<DPX200>,
      <created by zg, POWCHK disabled, PULCHK disabled
       configuration hash MD5:
       00 E9 B6 7A A2 85 ED C7 34 08 36 98 17 FE 4E 26
       data hash MD5: 16K
       9A D8 FB 2A B2 EC BC 27 2B 2C 59 3E 11 8B CA 55>)
(   2,<2024-04-11 13:44:31.43 +0400>,<she>,<DPX200>,
      <Start of raw data processing
       efp BC_mod = 2 LB = 0.24 FT_mod = 6 PKNL = 1 PHC0 = -25301.69 PHC1 = 12.38731 SI = 16K 
       data hash MD5: 16K
       8B 85 71 38 35 07 DF 11 84 4B 94 CF 74 1D A0 BE>)
(   3,<2024-04-11 13:44:46.78 +0400>,<she>,<DPX200>,
      <pk PHC0 = 1.636163 PHC1 = -3.6 
       data hash MD5: 16K
       ED 90 9E C3 83 50 63 DF 7E D4 93 8E E8 3C 51 4D>)
(   4,<2024-04-11 13:44:50.15 +0400>,<she>,<DPX200>,
      <abs ABSG = 5 
       data hash MD5: 16K
       2A FD C6 51 19 08 83 A0 8D 45 78 35 FC E4 22 30>)
$$ ##END=
$$ 
$$ hash MD5
$$ AF 86 05 7D 27 F0 D5 A2 68 48 AC B0 11 05 9E AB
##$RELAX= 
##$RELAX= 
##$RELAX= 
##$RELAX= 
##$RELAX= 
##$RELAX= 
$$ Bruker specific parameters
$$ --------------------------
##$DU= <F:/spectra>
##$EXPNO= 1
##$NAME= <H-F>
##$PROCNO= 1
##$TYPE= <nmr>
##$USER= <she>
##$AMP= (0..31)
100 100 100 100 100 100 100 100 100 100 100 100 100 100 100 100 100 100 
100 100 100 100 100 100 100 100 100 100 100 100 100 100 
##$AQSEQ= 0
##$AQ_mod= 1
##$AUNM= <au_zg>
##$AUTOPOS= <>
##$BF1= 200.13
##$BF2= 200.13
##$BF3= 200.13
##$BF4= 200.13
##$BF5= 200.13
##$BF6= 200.13
##$BF7= 200.13
##$BF8= 200.13
##$BYTORDA= 1
##$CFDGTYP= 0
##$CFRGTYP= 5
##$CHEMSTR= <none>
##$CNST= (0..31)
1 1 145 1 1 1 1 1 1 1 1 1 1 1 1 1 1 1 1 1 1 1 1 1 1 1 1 1 1 1 1 1 
##$CPDPRG= <>
##$CPDPRG1= <>
##$CPDPRG2= <>
##$CPDPRG3= <>
##$CPDPRG4= <mlev>
##$CPDPRG5= <mlev>
##$CPDPRG6= <mlev>
##$CPDPRG7= <mlev>
##$CPDPRG8= <mlev>
##$CPDPRGB= <>
##$CPDPRGT= <>
##$D= (0..31)
0 1.2 0 0 0 0 0 0 0 0.06 0 0.03 0 0 0 0 0.0002 0 0 0 0 0 0 0 0 0 0 0 0 
0 0 0 
##$DATE= 1712828667
##$DBL= (0..7)
120 120 120 120 120 120 120 120 
##$DBP= (0..7)
150 150 150 150 150 150 150 150 
##$DBP07= 0
##$DBPNAM0= <>
##$DBPNAM1= <>
##$DBPNAM2= <>
##$DBPNAM3= <>
##$DBPNAM4= <>
$$ [...]
##$SUBNAM3= <"">
##$SUBNAM4= <"">
##$SUBNAM5= <"">
##$SUBNAM6= <"">
##$SUBNAM7= <"">
##$SUBNAM8= <"">
##$SUBNAM9= <"">
##$SW= 18.0517689322627
##$SWIBOX= (0..15)
0 0 2 0 0 0 0 0 0 0 0 0 0 0 0 0 
##$SW_h= 3612.71676300578
##$TD= 16384
##$TD0= 1
##$TE= 0
##$TE2= 300
##$TE3= 300
##$TEG= 300
##$TL= (0..7)
0 120 120 120 120 120 120 120 
##$TP= (0..7)
150 150 150 150 150 150 150 150 
##$TP07= 0
##$TPNAME0= <>
##$TPNAME1= <>
##$TPNAME2= <>
##$TPNAME3= <>
##$TPNAME4= <>
##$TPNAME5= <>
##$TPNAME6= <>
##$TPNAME7= <>
##$TPOAL= (0..7)
0.5 0.5 0.5 0.5 0.5 0.5 0.5 0.5 
##$TPOFFS= (0..7)
0 0 0 0 0 0 0 0 
##$TUNHIN= 0
##$TUNHOUT= 0
##$TUNXOUT= 0
##$USERA1= <user>
##$USERA2= <user>
##$USERA3= <user>
##$USERA4= <user>
##$USERA5= <user>
##$V9= 5
##$VALIST= <valist>
##$VCLIST= <CCCCCCCCCCCCCCC>
##$VD= 0
##$VDLIST= <DDDDDDDDDDDDDDD>
##$VPLIST= <PPPPPPPPPPPPPPP>
##$VTLIST= <TTTTTTTTTTTTTTT>
##$WBST= 1024
##$WBSW= 4
##$XGAIN= (0..3)
0 0 0 0 
##$XL= 0
##$YL= 0
##$YMAX_a= 319102
##$YMIN_a= -318220
##$ZGOPTNS= <>
##$ZL1= 120
##$ZL2= 120
##$ZL3= 120
##$ZL4= 120
##$ABSF1= 15.48579
##$ABSF2= -2.566095
##$ABSG= 5
##$ABSL= 3
##$ALPHA= 0
##$AQORDER= 0
##$ASSFAC= 0
##$ASSFACI= 0
##$ASSFACX= 0
##$ASSWID= 0
##$AUNMP= <proc_1d>
##$AZFE= 0.1
##$AZFW= 0.1
##$BCFW= 0
##$BC_mod= 2
##$BYTORDP= 0
##$COROFFS= 0
##$CY= -3
##$DATMOD= 1
##$DC= 0
##$DFILT= <>
##$DTYPP= 0
##$F1P= 0
##$F2P= 0
##$FCOR= 1
##$FTSIZE= 16384
##$FT_mod= 6
##$GAMMA= 0
##$GB= 0
##$INTBC= 1
##$INTSCL= 3.70164e-10
##$ISEN= 128
##$LB= 0.24
##$LEV0= 0
##$LPBIN= 0
##$MAXI= 10000
##$MC2= 0
##$MEAN= 0
##$ME_mod= 0
##$MI= 1.114404
##$NCOEF= 0
##$NC_proc= -7
##$NLEV= 6
##$NOISF1= 3.799351
##$NOISF2= 2.8
##$NSP= 0
##$NTH_PI= 0
##$NZP= 0
##$OFFSET= 15.52987
##$PC= 1
##$PHC0= -25300.05
##$PHC1= 8.78731
##$PH_mod= 1
##$PKNL= yes
##$PPARMOD= 0
##$PSCAL= 0
##$PSIGN= 0
##$REVERSE= no
##$SF= 200.129598372572
##$SI= 16384
##$SIGF1= 3
##$SIGF2= 2
##$SINO= 5.538805
##$SIOLD= 16384
##$SREGLST= <1H.CDCl3>
##$SSB= 0
##$STSI= 16384
##$STSR= 0
##$SW_p= 3612.71676300577
##$SYMM= 0
##$S_DEV= 0
##$TDeff= 16384
##$TDoff= 0
##$TI= <>
##$TILT= no
##$TM1= 0
##$TM2= 0
##$TOPLEV= 0
##$USERP1= <user>
##$USERP2= <user>
##$USERP3= <user>
##$USERP4= <user>
##$USERP5= <user>
##$WDW= 1
##$XDIM= 16384
##$YMAX_p= 491237086
##$YMIN_p= -1923009
$$ End of Bruker specific parameters
$$ ---------------------------------
##NTUPLES= NMR SPECTRUM
##VAR_NAME=  FREQUENCY,     SPECTRUM/REAL,   SPECTRUM/IMAG
##SYMBOL=    X,             R,               I
##VAR_TYPE=  INDEPENDENT,   DEPENDENT,       DEPENDENT
##VAR_FORM=  AFFN,          ASDF,            ASDF
##VAR_DIM=   16384,         16384,           16384
##UNITS=     HZ,            ARBITRARY UNITS, ARBITRARY UNITS
##FACTOR=    0.220516191357247, 1,           1
##FIRST=     3107.9866525354, 0,             0
##LAST=      -504.730110470372, 0,           0
##MIN=       -504.730110470372, -1923009,    0
##MAX=       3107.9866525354, 491237086,     0
$$ Real data points
##PAGE= N=1
##DATA TABLE= (X++(R..R)), XYDATA
$$ [...]
7466c23820P7332j38216L4799J60341J32895R0419j60970l3284R2453j04562K39003
$$ -323820 -246488 -384704 -349905 -189564 -56669 33750 -127220 -160504 -68051 -172613 66390
7455F6390n1194k68286M0684J07376K23196q9327j23276Q4711r0961j50142L34965
$$ 66390 15196 -253090 -212406 -105030 118166 28839 -94437 -9726 -100687 -250829 84136
7444H4136l0155r0649j7365j05385o5754p6763R8102l0691j66158Q0067n3443
$$ 84136 53981 -36668 -54033 -159418 -225172 -301935 -203833 -234524 -400682 -320615 -374058
7433c74058J71863Q2079R5371q4930k59785J1389K5648l8279J03507J88711J7744
$$ -374058 -202195 -120116 -24745 -109675 -369460 -358071 -332423 -370702 -267195 -78484 -60740
7422f0740j2733k2556j02259m2508J159j27989J95526K36841r6054k97812J04397
$$ -60740 -73473 -96029 -198288 -240796 -239637 -367626 -172100 64741 -31313 -329125 -224728
7411b24728K63954J35256k00318J08277J25596j30802l6058M3150k69104j15461
$$ -224728 39226 174482 -25836 82441 208037 77235 41177 84327 -184777 -300238
7401c00238K69878j52223J0790R905j8236j12086Q5398J40566J8412q2772k84099
$$ -300238 -30360 -182583 -171793 -161888 -180124 -292210 -206812 -66246 -47834 -130606 -414705
7390d14705J5468J19679K18973O1789l8238J44326J72698L6199k53880N2692R0123
$$ -414705 -399237 -279558 -60585 1204 -37034 107292 279990 316189 62309 115001 205124
7379B05124j63694j1534L8257p4536J14195o6065J1926Q0869n5698k03508j07774
$$ 205124 41430 29896 68153 -6383 107812 41747 53673 134542 78844 -124664 -232438
7368b32438Q9927j10139J56728j8986j36460n4699J32187K21412k13289p3792
$$ -232438 -142511 -252650 -95922 -114908 -251368 -306067 -173880 47532 -165757 -239549
7358b39549P7845R8360p153m0361j15180p138J76613J01645k75377J72210J68284
$$ -239549 -161704 -63344 -70497 -110858 -226038 -233176 -56563 45082 -230295 -58085 110199
7347A10199k32175Q7564k965J08107J72598p9356P7424q4808N7752M3471J67193
$$ 110199 -121976 -34412 -37377 70730 243328 163972 241396 156588 214340 257811 425004
7336D25004j98396j97304J23976R8504J6677j18176j79153m7200R3230l8398l3245
$$ 425004 226608 29304 153280 251784 268461 150285 -28868 -76068 17162 -21236 -54481
7325e4481r7603J01287L3509q4280k6612M4889K9991j50849J53948J46959j20941
$$ -54481 -152084 -50797 -17288 -101568 -128180 -83291 -53300 -204149 -50201 96758 -24183
7314b4183J63230j04008N8055m7642o4076q8922J37225N9916J10443J02254L1051
$$ -24183 139047 35039 93094 45452 -18624 -107546 29679 89595 200038 302292 333343
7303C33343j02208o6106Q5780p7882j39762J13663j81717j29502L7269j6562O6538
$$ 333343 231135 165029 250809 172927 33165 146828 -34889 -164391 -127122 -143684 -77146
7292g7146J50541q4086N119q7018j08211P3084j57113P6077K3583j08364P1054
$$ -77146 73395 -10691 -5572 -92590 -200801 -127717 -284830 -208753 -185170 -293534 -222480
7281b22480R6991m1574k1113K3783K18015q7213j01211m4207L4661J67725q8106
$$ -222480 -125489 -167063 -188176 -164393 53622 -33591 -134802 -179009 -144348 23377 -64729
7270f4729P3212o484K51431J61461o2870j15970r2017P6482l9209j53007J27825
$$ -64729 8483 1999 253430 414891 352021 236051 144034 220516 181307 28300 156125
7259A56125K12316j93769j00414J4826n1487k06658K2639m6691l8737M2154K35823
$$ 156125 368441 174672 74258 89084 37597 -169061 -146422 -193113 -231850 -189696 46127
7248D6127L1665r4918j27420J7950K10850j34947L6539P3248n4976k01469j50372
$$ 46127 77792 -17126 -144546 -126596 84254 -50693 -14154 59094 4118 -197351 -347723
7237c47723J16635P7679J03741J04389j03401J01141J0362r7224O1970j1418K2374
$$ -347723 -231088 -153409 -49668 54721 -48680 52461 62823 -34401 27569 16151 38525
7226C8525p767j6380m6983J45398J2145J9785p8607k90605M67j9543J08263R4872
$$ 38525 30758 14378 -32605 112793 124938 144723 66116 -224489 -224022 -243565 -135302 -40430
7214d0430n3272q1308l9528O2145k37718K08263k0975m8376j9736J28442J25554
$$ -40430 -93702 -175010 -214538 -152393 -390111 -181848 -202823 -251199 -270935 -142493 -16939
7203a6939J17066n172j4780j47782N1570N3829M4312J7034J5143p2674j65160
$$ -16939 100127 94955 80175 -67607 -16037 37792 82104 99138 114281 41607 -123553
7192a23553L6539j09960O4699J46244J55397L9784j55854m14262R5206n300m8578
$$ -123553 -87014 -196974 -132275 13969 169366 209150 53296 -360966 -265760 -271060 -319638
7181c19638J51459P7085N8855j66396j88879J91367j67675J48686n0755M2559
$$ -319638 -168179 -91094 -32239 -198635 -387514 -196147 -363822 -215136 -265891 -223332
7171b23332j28109R6434K10951N8379P4945j11060j94727j7669J67820J07801
$$ -223332 -351441 -255007 -44056 14323 89268 -21792 -216519 -234188 -66368 41433
7161D1433j07447N4753O8218j18780j67897J43712J67622k1871n0710j3305M6984
$$ 41433 -66014 -11261 56957 -61823 -229720 -86008 81614 59743 9033 -4272 42712
7150D2712J5928K002L1919m5278m270M0472k08563k1953J77501j18698K13447
$$ 42712 58640 60642 92561 47283 43013 83485 -125078 -147031 30470 -88228 125219
7139A25219O63j15666K6848n2710l5474O7318J99415r6102r5365o7471m0511r0876
$$ 125219 125882 10216 37064 -15646 -51120 16198 215613 119511 24146 -43325 -83836 -174712
7127a74712J29459o6257M2889r9701K72424o4696Q34j08474J00300J6635m954
$$ -174712 -45253 -111510 -68621 -168322 104102 39406 40240 -68234 32066 48701 43747
7116D3747m7049J08939j21614J22028k4501j71810j3291K86797k5914k40551K0485
$$ 43747 -3302 105637 -15977 106051 81550 -90260 -103551 183246 157332 -83219 -62734
7105f2734J39875K3164q2807K2224p9473J9083n7346k6689j53354n6857K28510
$$ -62734 77141 100305 17498 39722 -39751 -20668 -78014 -104703 -258057 -314914 -86404
7094h6404J33466N4553j68799n6117J69892j51998J59190N1789j49419J33935
$$ -86404 47062 101615 -67184 -123301 46591 -105407 53783 105572 -43847 90088
7084I0088j86555M0533K11187J00859j63994K197J8980K41236J21861l36790r8585
$$ 90088 -96467 -55934 155253 256112 92118 94315 113295 354531 476392 139602 41017
7073D1017r9379Q2929j49489K7730l3802M8643p9540L6032k1422J48081j70133
$$ 41017 -58362 24567 -124922 -97192 -130994 -82351 -161891 -125859 -147281 800 -169333
7062a69333q1211J34296j9558L0855Q142k26360l9336K62840J35678j33121N5086
$$ -169333 -250544 -116248 -135806 -104951 -96809 -323169 -362505 -99665 36013 -97108 -42022
7051d2022R6945J28764r7968K07866M4515k78685k17175J89784J92622o1685j51069
$$ -42022 54923 183687 85719 293585 338100 59415 -157760 32024 224646 162961 11892
7040A1892J65511o5860n2599m4447J78888o8959j31760j42964n8565p8230M5754
$$ 11892 177403 111543 58944 14497 193385 124426 -7334 -150298 -208863 -287093 -241339
7029b41339K43256m0593j11423L9771R5053K7690R1861l35573K17824J86199m36973
$$ -241339 1917 -38676 -150099 -110328 -15275 12415 104276 -231297 -13473 172726 -264247
7018b64247R7128L28255K4301r317j04122j08152J2548k1710L1845J54930K83663
$$ -264247 -167119 161136 185437 176120 71998 -36154 -23606 -45316 -13471 141459 425122
7007D25122J002j99281j82809L3256o0758J98343j89229l57413K00142m5390J41196
$$ 425122 426124 226843 44034 77290 16532 214875 25646 -331767 -131625 -177015 -35819
6996c5819P423R3509n0072J44104j95410l3422L3923J6179L5875j3604k04117
$$ -35819 -28396 65113 15041 159145 -36265 -69687 -35764 -19585 16290 2686 -201431
6985b01431P8706j4855J27530K06966P33r2031J38774l4017L7039k1377r2234
$$ -201431 -122725 -137580 -10050 196916 197649 105618 244392 210375 247414 226037 133803
6974A33803J08697P3130r0754J6563K02859j8791K16622j2617k74318k3484r6000
$$ 133803 242500 315630 224876 241439 444298 425507 642129 629512 355194 331710 235710
6963B35710j08468j1504r3895j8774j11958J18391J55168K149k15623M7750J37714
$$ 235710 127242 115738 21843 3069 -108889 9502 164670 166819 -48804 -1054 136660
6952A36660k390j19154R4141J09335j34307J37666j89929o7930O0063J28844j160
$$ 136660 134270 15116 109257 218592 84285 221951 32022 -35908 24155 152999 151839
6941A51839j74255J82712J57554k14897K0228N8346J68291P4312k02594M0757
$$ 151839 -22416 160296 317850 102953 123181 181527 349818 424130 221536 262293
6931B62293K23203j43063j90L30667J30777P902J14013q8703n5776j50522j46407
$$ 262293 485496 342433 342243 672910 803687 811589 925602 836899 781123 630601 484194
6920D84194J2830M458m2732j21503r3050q9077J01306k47983m7353n2149j5786
$$ 484194 497024 501482 458750 337247 244197 155120 256426 8443 -38910 -91059 -106845
6909a06845J87890J7543O3646L4375j01522p1767Q5992R9120q302j16537L80951
$$ -106845 81045 98588 162234 196609 95087 23320 109312 208432 200130 83593 464544
6898D64544j51157l35258J92994K28848j11953q3561M0626m6960j64933q3844
$$ 464544 313387 -21871 171123 399971 288018 204457 245083 198123 33190 -50654
6888e0654J0307Q5124j8202R4878j04474j5339J36221j1543j65128k32214J94248
$$ -50654 -40347 44777 26575 121453 16979 1640 137861 126318 -38810 -271024 -76776
6877g6776R038J8859j5903K77331p3707j59734O8984J49093k21004L9071Q5937
$$ -76776 -67738 -48879 -64782 212549 138842 -20892 48092 197185 -23819 15252 101189
6866A01189M6248J55534j74613l3279p8879J40020J70356k99490J87281k5103
$$ 101189 147437 302971 128358 95079 16200 156220 326576 27086 214367 189264
6856A89264l822m4780R8531N4967R3029n6982k09989l6373j34116j05584Q1331
$$ 189264 185442 140662 239193 294160 387189 330207 120218 83845 -50271 -155855 -74524
6845g4524L1546J84114k7453l3763j15918J15979J04598m7580J7836L0716j1906
$$ -74524 -42978 141136 113683 79920 -35998 79981 184579 136999 154835 185551 173645
6834A73645L5329O2072O1432J15713O2186q9257j30084O8507J589j9599k3934
$$ 173645 208974 271046 332478 448191 510377 421120 291036 359543 361132 341533 317599
6823C17599P8699m0797l8816o6460K0101J11381j84602p2467j6130L3073J49191
$$ 317599 396298 355501 316685 250225 270326 381707 197105 124638 108508 141581 290772
6812B90772J56684k9042k94617q9861p1170R6230l2497p7443o520M8345J7758
$$ 290772 447456 418414 123797 33936 -37234 58996 26499 -50944 -57464 -9119 8639
6801H639q1367l9859K65386P2906j31573k8773m6518R1539o5165q566J37896j1147
$$ 8639 -72728 -112587 152799 225705 94132 65359 18841 110380 45215 36649 174545 163398
6789A63398J46858o9666r0266J33928J22730l3090m9794J5664J0738n493j56861
$$ 163398 310256 240590 150324 284252 406982 373892 324098 339762 350500 345007 188146
6778A88146k4560J30199p993O2460p1688j0075J14446j42369j08693L1615j63420
$$ 188146 163586 293785 285792 348252 276564 266489 380935 238566 129873 161488 -1932
6767a932k3720Q0640J82198j29272j09178N539n1456M7845N2881J74904J00621
$$ -1932 -25652 54988 237186 107914 -1264 4275 -47181 664 53545 228449 329070
6756C29070L1315O0747j20909M6869L7991j81082P7919J80206J056K6034j09071
$$ 329070 360385 421132 300223 347092 385083 204001 281920 462126 463182 489216 380145
6745C80145p5877J95889R5251m30529o9451R1590M0553J13288R8419k50958O856
$$ 380145 304268 500157 595408 164879 95428 187018 227571 340859 439278 188320 195176
6734A95176O4086p096j69434p6498O0633N6383p56J07593j590k8539r3415N3125
$$ 195176 259262 252166 82732 6234 66867 123250 122494 230087 228497 199958 106543 159668
6722A59668m903O8063j06531r4741J09551P2204P5167K7921J07849m3951K3188
$$ 159668 154765 222828 116297 21556 131107 203311 278478 306399 414248 370297 393485
6711C93485n3960k09246Q898K32846J80206q9453j99901O3577n2030K16070j51559
$$ 393485 339525 130279 139177 372023 552229 462776 262875 326452 274422 490492 338933
6700C38933j31658R2053k8586n1945J43524j51091N4672J38171n1488q6971r3974
$$ 338933 207275 299328 270742 218797 362321 211230 265902 404073 352585 265614 171640
6689A71640P213M8935N7606J23277N3601q8347K17486M1592k25993J21962Q4429
$$ 171640 178853 227788 285394 408671 462272 373925 591411 633003 407010 528972 613401
6678F13401o0949r0497Q3519K65019r8748j07738K37492j35473k6916J20341j80972
$$ 613401 552452 461955 545474 810493 711745 604007 841499 706026 679110 799451 618479
6667F18479j44742R2624J8415J63570M0214m8352l3819O590k0407q0728K1946
$$ 618479 473737 566361 584776 748346 788560 740208 706389 712979 692572 611844 633790
6656F33790J57033o3368j31348k26625L43J91786J51926j11283K2417R1267J83187
$$ 633790 790823 727455 596107 369482 369825 561611 713537 602254 624671 715938 899125
6645H99125j88734P7823J3197k50194K91692K31380k5559j8090M5407R7502J49937
$$ 899125 710391 788214 801411 551217 842909 1074289 1048730 1030640 1076047 1173549 1323486
6634A323486J18200k6602j05809j09611l4314P1359M4234n8084o6453m9125O1773
$$ 1323486 1441686 1415084 1309275 1199664 1165350 1236709 1280943 1222859 1156406 1107281 1169054
6623A169054r6514l27235m3752K17056n9076J17116j64200j23840N5324j88520
$$ 1169054 1072540 745305 701553 918609 859533 976649 812449 688609 743933 555413
6613E55413P9104P465J00504K86655J85279j15772q8875R5244o3234j33178P4288
$$ 555413 634517 641982 742486 1029141 1214420 1098648 1009773 1105017 1041783 908605 982893
6602I82893Q5566J60313j02784j62883m8336j50973l8965K5913o706J13476n4632
$$ 982893 1068459 1228772 1125988 963105 914769 763796 724831 750744 744038 857514 802882
6591H02882j33742j26687J10465Q701J81973k1451j33671n8386J74053k06936
$$ 802882 669140 542453 652918 661619 843592 822141 688470 630084 804137 597201
6581E97201K950l5312k0517J23924q1155J37040q2286j32491k5468J95306J34129
$$ 597201 600151 564839 544322 668246 587091 724131 641845 509354 483886 679192 813321
6570H13321k4281l9490J29637p0917O824K74690L3595J16832p0241J44507J29515
$$ 813321 789040 749550 879187 808270 815094 1089784 1123379 1240211 1169970 1314477 1443992
6559A443992j2956l5666Q567j20683k7907j6169l2662j56185o7558J35068m2946
$$ 1443992 1431036 1395370 1403937 1283254 1255347 1239178 1206516 1050331 982773 1117841 1074895
6548A074895J02803q1096R3382k5386m0493j66480j76783J38301j1491J76922
$$ 1074895 1177698 1096602 1189984 1164598 1124105 957625 780842 919143 907652 1084574
6538A084574M954L9764N3377J93331q0589J89529P4814r1474k43216K54762l6093
$$ 1084574 1089528 1129292 1182669 1376000 1295411 1484940 1559754 1468280 1225064 1479826 1443733
6527A443733K13773J81509j99795J26007j96665o5332P7464j9943r7270J38769
$$ 1443733 1657506 1839015 1639220 1765227 1568562 1503230 1580694 1560751 1463481 1602250
6517A602250n2022J60212j21322j02405K4873p4433j01087K5715M2929O0673O9860
$$ 1602250 1550228 1710440 1589118 1486713 1511586 1437153 1336066 1361781 1404710 1465383 1535243
6506A535243Q6939L4494J66661l8505r5684K00069j164J9602Q9025J9670J19252
$$ 1535243 1622182 1656676 1823337 1784832 1689148 1889217 1888053 1907655 1996680 2016350 2135602
6495B135602j99850K12205J04595J36705r3652j69680J71211J5997K9326j24912
$$ 2135602 1935752 2147957 2252552 2389257 2295605 2125925 2297136 2313133 2342459 2217547
6485B217547J20899R0786N8744O1420R3907O2544o9953K01737k49720j29236m9201
$$ 2217547 2338446 2429232 2487976 2549396 2643303 2705847 2635894 2837631 2587911 2458675 2409474
6474B409474J24240O2150j27054J39144J32324m7863j23257N5917J6625l3950
$$ 2409474 2533714 2595864 2468810 2607954 2740278 2692415 2569158 2625075 2641700 2607750
6464B607750J43447o6482N6645N5719r3293M1800J91576J83385R309j42554m1807
$$ 2607750 2751197 2684715 2741360 2797079 2703786 2745586 2937162 3120547 3129856 2987302 2945495
6453B945495R8436J44027J59121P5627J59359J61853J11951K01925P5459j78013
$$ 2945495 3043931 3187958 3347079 3422706 3582065 3743918 3855869 4057794 4133253 3955240
6443C955240Q0221K5317L2785K2121j18951J57858j62285q0240O9212L67082j55280
$$ 3955240 4035461 4060778 4093563 4115684 3996733 4154591 3992306 3912066 3981278 4348360 4193080
6432D193080j58367J54797J80532M23923l3395L6364O184J56527P9171k3356K28813
$$ 4193080 4034713 4189510 4370042 4793965 4760570 4796934 4803118 4959645 5038816 5015460 5244273
6421E244273L10139K99302J40685J07522K92464Q3356J09892K93299L50492K43954
$$ 5244273 5554412 5853714 5994399 6101921 6394385 6477741 6587633 6880932 7231424 7475378
6411G475378K12279J45763J78517J52372J28687M30402N48032J12540J73037M29048
$$ 7475378 7687657 7833420 8011937 8164309 8292996 8723398 9271430 9383970 9557007 9986055
6401I986055R8340k7039Q4173N4451J73468K56292J55088K74963J68110K64550
$$ 9986055 10084395 10057356 10141529 10195980 10369448 10625740 10780828 11055791 11223901 11488451
6391A1488451M21646L25837L32971K15312K05326M81581M19042M60580M69781
$$ 11488451 11910097 12235934 12568905 12784217 12989543 13471124 13890166 14350746 14820527
6382A4820527M80987N88925O79747N56473N74407P98977O18348P52026O77462
$$ 14820527 15301514 15890439 16570186 17126659 17701066 18500043 19118391 19870417 20547879
6373B0547879P00947J013526P38789P15730O85842J096800J089194J316680J430321
$$ 20547879 21248826 22262352 23001141 23716871 24402713 25499513 26588707 27905387 29335708
6364B9335708J504797J773878J490230J798779J986311K749585K720570K916056
$$ 29335708 30840505 32614383 34104613 35903392 37889703 40639288 43359858 46275914
6356D6275914L425134M361448N419096N877061O203018N952935M310392J920374
$$ 46275914 49701048 54062496 59481592 65358653 71561671 77514606 81824998 83745372
6348H3745372j146907k935320m180813l900785l272271k746958j724753r91198
$$ 83745372 82598465 79663145 75482332 71581547 68309276 65562318 63837565 62846367
6340F2846367k20091N67402Q25344J600375K306935K481940L271315L849790M847841
$$ 62846367 62626276 63193678 64019022 65619397 67926332 70408272 73679587 77529377 82377218
6331H2377218N849347P474561R028245J0614142J1780183J1252490P990129K608588
$$ 82377218 88226565 95701126 104729371 115343513 127123696 138376186 146366315 148974903
6323A48974903l936292r182142j1998906j2544102j0980211r109308p399156o069772
$$ 148974903 145038611 135856469 123857563 111313461 100333250 91223942 83824786 77755014
6315G7755014m720092l499747k528228j680457j203331p47138k63966J74562P76354
$$ 77755014 73034922 69535175 67006947 65326490 64123159 63376021 63112055 63286617 64062971
6306F4062971J598044K422826L501049M467997N229465M949459K966254K40844
$$ 64062971 65661015 68083841 71584890 76052887 81282352 86231811 89198065 89438909
6298H9438909l126322n592095p334993p533666o470447n911977m978578m173493
$$ 89438909 86312587 80720492 73385499 65851833 59381386 53469409 48490831 44317338
6290D4317338l161513k692119k386237j890303j448325j154837j226356j445995
$$ 44317338 41155825 38463706 36077469 34187166 32738841 31584004 30357648 28911653
6282B8911653j456609j665325j594396j259731j226957j034478q74134q90185
$$ 28911653 27455044 25789719 24195323 22935592 21708635 20674157 19800023 18909838
6274A8909838n62144m06966o85255o27839m44859l83402k36307l06336k40692
$$ 18909838 18347694 17940728 17255473 16627634 16182775 15799373 15563066 15256730 15016038
6265A5016038N4513j8691k13654j01692J56084n5830j07302K02125n8538L7540
$$ 15016038 15070551 15051860 14838206 14736514 14892598 14836768 14729466 14931591 14873053 14910593
6255A4910593j65496l76876j52684p4232k13568k39126m02496j64066j02453P0426
$$ 14910593 14745097 14368221 14215537 14141305 13927737 13688611 13286115 13122049 13019596 13090022
6245A3090022J5694M0269K17341o7520J06516J76860L60696J97699L92826K87708
$$ 13090022 13105716 13145985 13363326 13295806 13402322 13579182 13939878 14137577 14530403 14818111
6235A4818111K03574J43084J00735P034j04214k25120j10590J8718J68708J66079
$$ 14818111 15021685 15164769 15265504 15272538 15168324 14943204 14832614 14851332 15020040 15186119
6225A5186119m4739J72815J18549L64115J27002K28030L13102O31685N47988M15479
$$ 15186119 15141380 15314195 15432744 15796859 15923861 16151891 16464993 17096678 17644666 18060145
6215A8060145L31017O79751N51328P89658J005190P49661J172791P70696M97649
$$ 18060145 18391162 19070913 19622241 20411899 21417089 22166750 23339541 24110237 24607886
6206B4607886O36501O70900P21599Q85999J063335J249464J201646J177936J353864
$$ 24607886 25244387 25915287 26636886 27522885 28586220 29835684 31037330 32215266 33569130
6197C3569130J577610J902334J984894K419635K934337L085225L528435L094336
$$ 33569130 35146740 37049074 39033968 41453603 44387940 47473165 51001600 54095936
6189E4095936K609525J173759j72960j088264j703727j555355j317110j226167
$$ 54095936 56705461 57879220 57706260 56617996 54914269 53358914 52041804 50815637
6181E0815637j066517q99344j166999q58948l71844J55758N77135J160610J641688
$$ 50815637 49749120 48849776 47682777 46823829 46451985 46607743 47184878 48345488 49987176
6172D9987176K057765K570676L065783L854875M423583N487783N930843O761325
$$ 49987176 52044941 54615617 57681400 61536275 65959858 71447641 77378484 84139809
6164H4139809O522920M864548K317734j182826m602182o743045o965995o953640
$$ 84139809 90662729 95527277 97845011 96662185 92060003 85316958 78350963 71397323
6156G1397323o043063n066868m100260l595296l319347k586198j826384j524446
$$ 71397323 65354260 60287392 56187132 52591836 49272489 46686291 44859907 43335461
6148D3335461j366898m68400k51458J8297N82366R44384J361247J959435K293473
$$ 43335461 41968563 41500163 41248705 41267002 41849368 42793752 44154999 46114434 48407907
6139D8407907K699285K462088J819044N45958j242039k795866l713499m304652
$$ 48407907 51107192 53569280 55388324 55934282 54692243 51896377 48182878 43878226
6131D3878226m165672l639503l203202k691661k394229k199877j442572j439900
$$ 43878226 39712554 36073051 32869849 30178188 27783959 25584082 24141510 22701610
6123B2701610j398450r44437r69762r61744r35600o40135n83581n87566n62538
$$ 22701610 21303160 20358723 19388961 18427217 17491617 16851482 16267901 15680335 15117797
6114A5117797n57077m60608m59616l83247j35669k92169l24831k36306j98268
$$ 15117797 14560720 14100112 13640496 13257249 13121580 12829411 12504580 12268274 12070006
6105A2070006j36121k23561j09485n242p3115j11146q1369L08553J16138L26649
$$ 12070006 11933885 11710324 11600839 11595597 11522482 11411336 11329967 11638520 11754658 12081307
6095A2081307O4767J72320L00117J18155J37079K50187j1918J83451K76245Q5757
$$ 12081307 12146074 12318394 12618511 12736666 12873745 13123932 13112014 13295465 13571710 13657467
6085A3657467j5273J14629L99424N07977K79148J76693R9704J948J23466J72214
$$ 13657467 13642194 13756823 14156247 14664224 14943372 15120065 15219769 15221717 15345183 15517397
6075A5517397L79402K67647K14430J11056M46394K15767J68536L56634J23983
$$ 15517397 15896799 16164446 16378876 16489932 16936326 17152093 17320629 17677263 17801246
6066A7801246L40301M11423L37870M65504N93945P95533O75617L51856Q08975
$$ 17801246 18141547 18552970 18890840 19356344 19950289 20745822 21421439 21773295 22582270
6057B2582270Q44187Q88138J068069J267530J018772J350027J758738J631375
$$ 22582270 23426457 24314595 25382664 26650194 27668966 29018993 30777731 32409106
6049C2409106J869318K236213K626336K742233K882758L232436L867302M593688
$$ 32409106 34278424 36514637 39140973 41883206 44765964 47998400 51865702 56459390
6041E6459390N639601P036656P979392Q386586P155961M306583K81964l610858
$$ 56459390 62098991 69135647 77115039 85501625 92657586 96964169 97246133 93635275
6033I3635275m827007m101625k537851j182149N09891J845172L260949M484695
$$ 93635275 88808268 84706643 82168792 80986643 81496534 83341706 86602655 91087350
6025I1087350M419886L119367J291898o1223R17145K772683L900896M366738L037160
$$ 91087350 95507236 98626603 99918501 99857278 100774423 103547106 107448002 111814740 114851900
6016A14851900R5497k831564m968099n350529m140963j989844k01772J087088
$$ 114851900 114947397 112115833 107147734 101797205 97656242 95666398 95464626 96551714
6008I6551714P42768p88499k969365m461590l960836k475340n13341J267975L002337
$$ 96551714 97294482 96505983 93536618 89075028 85114192 82638852 82125511 83393486 86395823
5999H6395823M476251N185851L443122l88730n153092q896854j0481182r355384
$$ 86395823 90872074 96057925 99501047 99112317 93959225 85062371 74581189 65225805
5991F5225805p739663o631911n343225m929017l868780l248992k903145k434704
$$ 65225805 57486142 50854231 45511006 40581989 36713209 33464217 30561072 28126368
5983B8126368k036279j794210j549683j398129j327627r64394r45431q65060r38418
$$ 28126368 26090089 24295879 22746196 21348067 20020440 19056046 18110615 17245555 16307137
5974A6307137q79163p10732p33395m63021l84973m50792o32701m01007j05217
$$ 16307137 15427974 14717242 13983847 13520826 13135853 12685061 12052360 11651353 11546136
5965A1546136m24766k10141m56007k94581j64114j89773k78317m40439j47641
$$ 11546136 11121370 10911229 10455222 10160641 9996527 9806754 9528437 9087998 8940357
5956H940357j75252l33857K4861k5456j73882k20085j78982L0874k82095j6587
$$ 8940357 8765105 8431248 8456109 8430653 8256771 8036686 7857704 7888578 7606483 7589896
5946G589896l8342j57377J05041j60426K7136k20417j89079k59393j11047N2281
$$ 7589896 7551554 7394177 7499218 7338792 7365928 7145511 6956432 6697039 6585992 6638273
5936F638273Q3838m3886k50896q1418j87605m8195r6311j42139q4541l3451R4660
$$ 6638273 6722111 6678225 6427329 6345911 6158306 6110111 6013800 5871661 5787120 5753669 5848329
5925E848329q3778m9782j79454Q2769J22592Q0680K5790o5651k3441J0476j1633
$$ 5848329 5764551 5714769 5535315 5618084 5740676 5821356 5847146 5781495 5758054 5768530 5756897
5914E756897j75994j20439J66248J13844j03779l8070J33871q0941L2084n9903
$$ 5756897 5580903 5460464 5626712 5740556 5636777 5598707 5732578 5651637 5683721 5623818
5904E623818m3655O6137o7766l232J78564p2405q1816K4803P6043L31225q4198
$$ 5623818 5580163 5646300 5578534 5575302 5753866 5681461 5599645 5624448 5700491 6031716 5947518
5893E947518k38498l6174K01183M6253K17790P675k20139J57328J33589j40231
$$ 5947518 5709020 5672846 5874029 5920282 6138072 6145747 5925608 6082936 6216525 6076294
5883F076294K03398m9989Q0942r8368j08672K69535R3472k19718K07203J79412
$$ 6076294 6279692 6229703 6310645 6212277 6103605 6373140 6466612 6246894 6454097 6633509
5873F633509J96431M6010J17088J66989J33954J0649J13860K94480K27205K56566
$$ 6633509 6829940 6875950 6993038 7160027 7293981 7304630 7418490 7712970 7940175 8196741
5863H196741J51959j5600K13707M94820L01651K65894K77690L4215K12137L46414
$$ 8196741 8348700 8333100 8546807 9041627 9343278 9609172 9886862 9921077 10133214 10479628
5853A0479628K84543K26739K09782L53982L12120L33005K49393K60888N06295
$$ 10479628 10764171 10990910 11200692 11554674 11866794 12199799 12449192 12710080 13216375
5844A3216375M04841L24883K53713J19513J32063P3477l9173J9421Q2228K59584
$$ 13216375 13621216 13946099 14199812 14319325 14451388 14524865 14485692 14505113 14587341 14846925
5834A4846925K19202M38452O49731K98517L46724O62547L97373L72927P08911
$$ 14846925 15066127 15504579 16154310 16452827 16799551 17462098 17859471 18232398 18941309
5825A8941309O70191N77647Q34428R73258O36665P20047O72001J084348J255169
$$ 18941309 19611500 20189147 21023575 21996833 22633498 23353545 24025546 25109894 26365063
5816B6365063J083330J387119J632284J658521J898206K138110K440325K583460
$$ 26365063 27448393 28835512 30467796 32126317 34024523 36162633 38602958 41186418
5808D1186418K777779L258604L848555M467263N073625O006800P059216P399578
$$ 41186418 43964197 47222801 51071356 55538619 60612244 66619044 73678260 81077838
5800H1077838O982127N393813K445748j261835l967432n543854o040769n123103
$$ 81077838 88059965 93453778 95899526 94637691 90670259 85126405 79085636 73962533
5792G3962533l900186l052760k128657j034784m08785M35888J270708J842044
$$ 73962533 70062347 67009587 64880930 63846146 63437361 63873249 65143957 66986001
5784F6986001K529593L235795M308223N048101O360204P759010R916359J1458351
$$ 66986001 69515594 72751389 77059612 82107713 88467917 96226927 106143286 117601637
5776A17601637J2459777J1672776Q372913K342248m478458j0286077j3183155
$$ 117601637 130061414 141734190 150107103 152449351 147970893 137684816 124501661
5769A24501661j3286914j1963401r862230q237229o793613n472948m358223l402299
$$ 124501661 111214747 99251346 89389116 81151887 74358274 68885326 64527103 61124804
5761F1124804k505022j582321j050616n29108J40910P78188J234907K146152K881243
$$ 61124804 58619782 57037461 55986845 55457737 55598647 56376835 57611742 59757894 62639137
5752F2639137L771526M406871M011686K818159M13364k220783n070635o678985
$$ 62639137 66410663 70817534 74829220 77647379 78060743 75839960 70769325 64090340
5744F4090340o843391n919609n268037m360122l697451l041125k546418k439313
$$ 64090340 57246949 51327340 46059303 41699181 38001730 34960605 32414187 29974874
5736B9974874k216907j614362j489821j215857j071376j066791q28657n87989
$$ 29974874 27757967 26143605 24653784 23437927 22366551 21299760 20471103 19883114
5728A9883114p13067n23806n71218n29467k88779k77720j28365k9309j3834p0353
$$ 19883114 19170047 18646241 18075023 17545556 17256777 16979057 16850692 16821383 16807549 16737196
5718A6737196J52089j42696J1320j9321n62156n36019j54463j95354l17402q6896
$$ 16737196 16889285 16746589 16757909 16738588 16176432 15640413 15485950 15290596 14973194 14886298
5708A4886298K122J81390K07132P995P7796j52759N3696J45052j19618K88780
$$ 14886298 14888420 15069810 15276942 15284937 15362733 15209974 15263670 15408722 15289104 15577884
5698A5577884M18285N4991K37431M46850M66155M01514N04805P75670P40417N20188
$$ 15577884 15996169 16051160 16288591 16735441 17201596 17603110 18107915 18883585 19624002 20144190
5688B0144190k53069m11521k78262l01892m81038L332o5168k10798K06980J31113
$$ 20144190 19891121 19479600 19201338 18899446 18418408 18421740 18356572 18145774 18352754 18483867
5678A8483867L52992N27558n7367Q5377n3218l40113j81140k65309l17268J64414
$$ 18483867 18836859 19364417 19307050 19392427 19339209 18999096 18817956 18552647 18235379 18399793
5668A8399793K29130K79732K16359O7678L18096J42551O6727J56438O7684j96027
$$ 18399793 18628923 18908655 19125014 19192692 19510788 19653339 19720066 19876504 19944188 19748161
5658A9748161k69024j66489k89028l49386k12276j41051j26687Q1528K2099J22850
$$ 19748161 19479137 19312648 19023620 18674234 18461958 18320907 18194220 18275748 18297847 18420697
5648A8420697J4915r855M29967L66085l1791L8738L48730L90865L14066L94966
$$ 18420697 18435612 18425757 18855724 19221809 19190018 19228756 19577486 19968351 20282417 20677383
5638B0677383N22360L70193M35343L12459K57675J95701N16864O04351R56173
$$ 20677383 21199743 21569936 22005279 22317738 22575413 22771114 23287978 23892329 24848502
5629B4848502R49793J078251J464946J126796J543881J664054K130700K365742
$$ 24848502 25798295 26876546 28341492 29468288 31012169 32676223 34806923 37172665
5621C7172665K752847L080727L622848M075557M181047M281332L445704K068965
$$ 37172665 39925512 43006239 46629087 50704644 54885691 59167023 62612727 64681692
5613F4681692O870j649302k512206k730698k588434k132329k281043j882067j250516
$$ 64681692 64688562 63039260 60527054 57796356 55207922 53075593 50794550 48912483 47661967
5604D7661967q34652k70850K02701P07812J176710J421494K115123K454414L030001
$$ 47661967 46827315 46556465 46759166 47466978 48643688 50065182 52180305 54634719 57664720
5595E7664720M049190M797713N831178O737476P711182P629285O333703L049296
$$ 57664720 61713910 66511623 72342801 79080277 86791459 94420744 100754447 103803743
5587A03803743j183899m850202o987594p097985o665910n511100n556003n043442
$$ 103803743 102619844 97769642 90782048 83684063 77018153 71507053 65951050 60907608
5579F0907608m481689l756152k991204k199663j662529j295006r57986q06368
$$ 60907608 56425919 52669767 49678563 47478900 45816371 44521365 43563379 42757011
5571D2757011o821M20415L79773J148625J338804J783998K242988K425757J962087
$$ 42757011 42750190 43170605 43550378 44699003 46037807 47821805 50064793 52490550 54452637
5562E4452637P99855m83659j940519l054141l459924l315447l244642k553645
$$ 54452637 55252492 54768833 52828314 49774173 46314249 42998802 39754160 37200515
5554C7200515k357293k455964k154108j626000j287276j320949r45368q11849
$$ 37200515 34843222 32387258 30233150 28607150 27319874 25998925 25053557 24241708
5546B4241708k64649r13703q27271m30754m44685l75109m20702o5663l65984j97524
$$ 24241708 23977059 23063356 22236085 21805331 21360646 20985537 20564835 20499172 20133188 19935664
5536A9935664m0446L0402j45624L1139n0803K8286O4747K32706J83513L13515
$$ 19935664 19895218 19925620 19779996 19811135 19760332 19788618 19853365 20086071 20269584 20583099
5526B0583099K38756L01689J26749K40783J67304L18776N93674L48229K28165
$$ 20583099 20821855 21123544 21250293 21491076 21658380 21977156 22570830 22919059 23147224
5517B3147224O42947K65910M58444L91186P39371P44248R14557R97105R61221
$$ 23147224 23790171 24056081 24514525 24905711 25645082 26389330 27303887 28300992 29262213
5508B9262213J006091J164301J352407J708929K136657K087948K578707K506186
$$ 29262213 30268304 31432605 32785012 34493941 36630598 38718546 41297253 43803439
5500D3803439K959676L454264L683278M080264N128831O219777P472311Q582827
$$ 43803439 46763115 50217379 53900657 57980921 63109752 69329529 76801840 85384667
5492H5384667Q986100P666399N179205J399108k016296m761238n360272m072018
$$ 85384667 94370767 102037166 107216371 108615479 106599183 101837945 96477673 92405655
5484I2405655k341583k38664J621096K853466L370740K492263J303896N5363q85352
$$ 92405655 90064072 89825408 91446504 94299970 97670710 100162973 101466869 101522232 100636880
5475A00636880k73140J545435L613681M685840M293128K431157N5019k789443
$$ 100636880 100363740 101909175 105522856 110208696 114501824 116932981 116988000 114198557
5467A14198557m463011m795740l536010j960101j256434j838487k466009l796932
$$ 114198557 109735546 104939806 101403796 99443695 98187261 96348774 93882765 90085833
5459I0085833m735228m222179k743762j155501M02417K185045L165848L795576
$$ 90085833 85350605 81128426 78384664 77229163 77631580 79816625 82982473 86778049
5451H6778049K835575k25640l064089o273881q209215q240712p385026o260325
$$ 86778049 89613624 89387984 86323895 80050014 71840799 63600087 56215061 49954736
5443D9954736n157633m697500l812553l015784k560715k219441j761853j620140
$$ 49954736 44797103 40099603 36287050 33271266 30710551 28491110 26729257 25109117
5435B5109117j574909j460947j304404j204438j001070p67457p59223n08505k84156
$$ 25109117 23534208 22073261 20768857 19564419 18563349 17795892 17036669 16528164 16244008
5426A6244008k09974o88379m25352n08027l99443m33765n82662n65759k18558
$$ 16244008 16034034 15345655 14920303 14412276 14012833 13579068 12996406 12430647 12212089
5417A2212089k20733o02687l09683j02862m60636l00060k28705J3134r7568n0998
$$ 12212089 11991356 11388669 11078986 10976124 10515488 10215428 9986723 9999857 9902289 9851291
5407I851291m9680Q7967j95122k32156m0512N8585k95615j45732j73081l53409
$$ 9851291 9801611 9889578 9694456 9462300 9421788 9480373 9184758 9039026 8865945 8512536
5397H512536k82860k37201m95362k69665j4818j24669q5306p0811k44198j81687
$$ 8512536 8229676 7992475 7497113 7227448 7212630 7087961 7002655 6931844 6687646 6505959
5387F505959l28983j32691m3447p7547p141r2200j17533K086p8482M2806K78071
$$ 6505959 6176976 6044285 6000838 5923291 5916150 5823950 5706417 5708503 5630021 5672827 5950898
5376E950898k3560L3341k34362j29155j35352O4342J10997j35846O7254J33744
$$ 5950898 5927338 5960679 5726317 5597162 5461810 5526152 5637149 5501303 5568557 5702301
5366E702301j69105k86343j70365j43652m5700P8988j71006J98308j61647n4044
$$ 5702301 5533196 5246853 5076488 4932836 4887136 4966124 4795118 4993426 4831779 4777735
5356D777735K39574j38491J96979R8006Q9797K0265l2841j35451N5064J93035
$$ 4777735 5017309 4878818 5075797 5173803 5263600 5283865 5251024 5115573 5170637 5363672
5346E363672J23614K572j0134q1544J85496L98766j30829O34K52782J62537K00364
$$ 5363672 5487286 5489858 5479724 5398180 5583676 5982442 5851613 5852247 6105029 6267566 6467930
5335F467930Q1715l5085M9445P9302J05674J18884J79501K02461K09135L4336
$$ 6467930 6549645 6514560 6564005 6643307 6748981 6867865 7047366 7249827 7458962 7493298
5325G493298J10347m3662J46731K54075L4330J58779J92051J96440L80786M53465
$$ 7493298 7603645 7559983 7706714 7960789 7995119 8153898 8345949 8542389 8923175 9376640
5315I376640M45274K95406L54274N22501N75049M37580L94226K65828N72240P80335
$$ 9376640 9821914 10117320 10471594 10994095 11569144 12006724 12400950 12666778 13239018 14019353
5305A4019353O84403L82415K73822K45429J06748j35253L8031K90755N36294L96125
$$ 14019353 14703756 15086171 15359993 15605422 15712170 15576917 15614948 15905703 16441997 16838122
5295A6838122N53319M49197J9851j38093j1619R0851L12849O33805O71110P71653
$$ 16838122 17391441 17840638 17860489 17722396 17710777 17801628 18114477 18748282 19419392 20191045
5285B0191045J092605J108673J380998J121023O0154j433405k411142k037269
$$ 20191045 21283650 22392323 23773321 24894344 24954498 23521093 21109951 19072682
5277A9072682j687044j406303j272423q26079j018715r42435o64880p22827p25768
$$ 19072682 17385638 15979335 14706912 13880833 12862118 11919683 11254803 10531976 9806208
5268I806208m85047o21902n82950J4557q309m56765l98864l06886l04599k0517
$$ 9806208 9321161 8699259 8116309 8130866 8122557 7665792 7266928 6960042 6655443 6634926
5258F634926k72786k07566P2232l17012k41746N1948J04070k1570J76124J76530
$$ 6634926 6362140 6154574 6226806 5909794 5668048 5719996 5824066 5802496 5978620 6155150
5248F155150J14244M12564L07466J69652N12522M08040j4154l99313n72304o97737
$$ 6155150 6269394 6681958 6989424 7159076 7671598 8079638 8065484 7666171 7093867 6396130
5238F396130o24750m41715n06025m31895j9712J28096k56988j79970K0671k08531
$$ 6396130 5771380 5329665 4823640 4391745 4372033 4500129 4243141 4063171 4083842 3875311
5228C875311j67848k13368J604R0946n83r1426M6577J04206M98K60418L07937
$$ 3875311 3707463 3494095 3495699 3586645 3586062 3494636 3541213 3645419 3645917 3906335 4214272
5217D214272J60979L1462K90070L68423M73585O10802M66052J26178k95000o48751
$$ 4214272 4375251 4406713 4696783 5065206 5538791 6149593 6615645 6741823 6446823 5798072
5207E798072o02162n24214l73501l37714j65632k06688m36507j66632N7275j92624
$$ 5798072 5195910 4671696 4298195 3960481 3794849 3588161 3151654 2985022 3042297 2849673
5197B849673k48246j46357J1175r6994n9484Q7163J29815K3307j50416m8182K80
$$ 2849673 2601427 2455070 2466245 2369251 2309767 2396930 2526745 2550052 2399636 2351454 2351734
5186B351734P8407R8833R3694K8133J18794L87953j2110J2186K24394p6105k40013
$$ 2351734 2430141 2528974 2622668 2650801 2769595 3157548 3145438 3157624 3382018 3305913 3065900
5175C065900j83531l05849k40417M384p674P4243p7969l5498j42669m482k8274
$$ 3065900 2882369 2576520 2336103 2340487 2332813 2407056 2329087 2293589 2150920 2146438 2118164
5164B118164Q1596J18328j44472k64714j48377Q2815m3615m705K5829j27163N3944
$$ 2118164 2199760 2318088 2173616 1908902 1760525 1843340 1799725 1795020 1820849 1693686 1747630
5153A747630O9313P4956j75278Q6597L34320R60j74556K0407k3659j81001n1814
$$ 1747630 1816943 1891899 1716621 1803218 2137538 2138498 1963942 1984349 1960690 1779689 1727875
5142A727875K36553k9781L0533k21391K8772K10851N6385n9851Q6723J3960k71623
$$ 1727875 1964428 1934647 1965180 1743789 1772561 1983412 2039797 1979946 2066669 2080629 1809006
5131A809006j09939J6151P0732k58926P2904K20694M474q2929Q2576m4473k37920
$$ 1809006 1699067 1715218 1785950 1527024 1599928 1820622 1825096 1742167 1824743 1780270 1542350
5120A542350q8890K27516M3657k11660P5560P4024m7120q3122j86874j0484J2749
$$ 1542350 1453460 1680976 1724633 1512973 1588533 1662557 1615437 1532315 1345441 1334957 1347706
5109A347706m8401J75410M0581j36543L8329R919l6932L166R7264j39980o4366
$$ 1347706 1299305 1474715 1515296 1378753 1417082 1427001 1390069 1393235 1490499 1350519 1286153
5098A286153K8845k21850l0169o8053j38645J75570J4525j31244j16281J36101
$$ 1286153 1314998 1093148 1062979 994926 856281 1031851 1046376 915132 798851 934952
5088I34952L307R8460K13000p4685j16331L5223O1166l3863p9340j2611k9740
$$ 934952 938259 1036719 1249719 1175034 1058703 1093926 1155092 1121229 1041889 1029278 999538
5077I99538J26565K27416j36596k7697J2010J55067n4079K24515j07638j89472
$$ 999538 1126103 1353519 1216923 1189226 1201236 1356303 1302224 1526739 1419101 1229629
5067A229629j35577k2732J24560k07140j31897j74907j28891N0622J24523M7213
$$ 1229629 1094052 1071320 1195880 988740 856843 681936 553045 603667 728190 775403
5057G75403m7140j00957K95974J3700p4976R407K41332K48780J04559n3045J74308
$$ 775403 728263 627306 923280 936980 862004 871411 1112743 1361523 1466082 1413037 1587345
5046A587345J86873K33191K09479J19888J05263J74038Q6361L69939K46814N01655
$$ 1587345 1774218 2007409 2216888 2336776 2442039 2616077 2702438 3072377 3319191 3820846
5036C820846M22649O91290O57492O35562L75437k50347r01404q53734n48932n71763
$$ 3820846 4243495 4934785 5592277 6227839 6603276 6352929 5451525 4597791 4048859 3477096
5026C477096j30844k59306k48805j25978j37568j20212k92201R8148j89520l14734
$$ 3477096 3346252 3086946 2838141 2712163 2574595 2454383 2162182 2260330 2070810 1756076
5016A756076n2069J01745N8613N6371O1037k25876K878j62043j98135L0913m2232
$$ 1756076 1704007 1805752 1864365 1920736 1981773 1755897 1758775 1596732 1398597 1429510 1387278
5005A387278n8437M7315k04470P691j51583K94936r8513j75705J8648j85416n012
$$ 1387278 1328841 1376156 1171686 1179377 1027794 1322730 1224217 1048512 1067160 881744 876732
4994H76732K05206j94179j56200r58j23935o3467J85617M6968j9962P1177L213
$$ 876732 1081938 887759 731559 730601 606666 543199 728816 775784 755822 826999 830212
4983H30212m0025l9625p6161j43278L04763J46130l6475M5574J744J46649k259
$$ 830212 790187 750562 674401 531123 835886 982016 945541 991115 992859 1139508 1137249
4972A137249J31857J77552N1204P669J11044O6556p2011o7274K19160K00939k10297
$$ 1137249 1269106 1446658 1497862 1505531 1616575 1683131 1611120 1543846 1763006 1963945 1753648
4961A753648r4535j868o2016p8325j98204n9251q8775K16282o626q7999j37290
$$ 1753648 1659113 1657245 1595229 1516904 1318700 1259449 1170674 1386956 1380330 1292331 1155041
4950A155041j56158j26639K14719q1812O3459p989J77968P6691J11822J41125
$$ 1155041 998883 872244 1086963 1005151 1068610 1060621 1238589 1315280 1427102 1568227
4940A568227R1545K94971J81598L73899M13219L92882K47761k42859l0813j88807
$$ 1568227 1659772 1954743 2136341 2510240 2923459 3316341 3564102 3321243 3290430 3101623
4930C101623k75193j76504k16604p0009k68736j34488k30718j74527J2583r1050
$$ 3101623 2826430 2649926 2433322 2363313 2094577 1960089 1729371 1554844 1567427 1476377
4920A476377n2887J30904j57398m0251j32909j47542o2675J27928l05276k8471
$$ 1476377 1423490 1554394 1396996 1356745 1223836 1076294 1013619 1141547 836271 807800
4910H07800J91017l1269k79853J21424o5072L9526K09627J43281n7148J21052
$$ 807800 998817 967548 687695 809119 744047 783573 993200 1136481 1079333 1200385
4900A200385J45281R4027M0581J07925J16983k4366j24592j16670J3159M6890
$$ 1200385 1345666 1439693 1480274 1588199 1705182 1680816 1556224 1439554 1452713 1499603
4890A499603r5343K25902J53286o2872n7405J30589j00191j91278N6218j95461
$$ 1499603 1404260 1630162 1783448 1720576 1663171 1793760 1693569 1502291 1558509 1363048
4880A363048J13332j05248j71916j16354J95064O5758k17723J4186M0096Q6151
$$ 1363048 1476380 1371132 1199216 1082862 1277926 1343684 1125961 1140147 1180243 1266394
4870A266394k3966P421J12023o8525J83194J81044J11492K08646L62813m1943
$$ 1266394 1242428 1249849 1361872 1293347 1476541 1657585 1769077 1977723 2340536 2298593
4860B298593J35374K03758k0843J76013j59520p7429J14817K7561K9660P264n8128
$$ 2298593 2433967 2637725 2616882 2792895 2633375 2555946 2670763 2698324 2727984 2735248 2677120
4849B677120l19188J37588p864j83951J27091k2563n3281j80998J44289L6548
$$ 2677120 2357932 2495520 2487656 2303705 2430796 2408233 2354952 2173954 2318243 2354791
4839B354791L0791J14598R1090O1606K20053N1309M7158k46284J37129L23985
$$ 2354791 2385582 2500180 2591270 2652876 2872929 2924238 2971396 2725112 2862241 3186226
4829C186226K91612M75344L27788L31959M77750M07547P5621J96549L93311M58935
$$ 3186226 3477838 3953182 4280970 4612929 5090679 5498226 5573847 5770396 6163707 6622642
4819F622642N36433N25915L21564P40561J101809J410323J405473J755690J700384
$$ 6622642 7159075 7684990 8006554 8747115 9848924 11259247 12664720 14420410 16120794
4810A6120794k1153j513922k303245j751935j648197j110140q69240q03277o01708
$$ 16120794 16099641 14585719 12282474 10530539 8882342 7772202 6902962 6099685 5497977
4801E497977q27908m24256l04962l53061m38840j01997j94254L1809j54996O2215
$$ 5497977 4670069 4245813 3940851 3587790 3148950 3046953 2852699 2884508 2729512 2791727
4791B791727K5372N0763J643k9498J58783O7240P9842k06550J99955K44904M0308
$$ 2791727 2817099 2867862 2869505 2840007 2998790 3066030 3145872 2939322 3139277 3384181 3424489
4780C424489P9264P6559j64346m773j75697k39927N515j34755J17007M0402M3239
$$ 3424489 3503753 3580312 3415966 3411193 3235496 2995569 3001084 2866329 2983336 3023738 3066977
4769C066977k79937p7938j27305m3334j75293p5804m7060j38016J34359k53161
$$ 3066977 2787040 2709102 2581797 2538463 2363170 2287366 2240306 2102290 2236649 1983488
4759A983488j46314J14401K20026k0277J85060K49022J10809L54212Q2982m1087
$$ 1983488 1837174 1951575 2171601 2151324 2336384 2585406 2696215 3050427 3133409 3092322
4749C092322K85157L25670K06839M9289J04401J46750J76731j4736k72942N1376
$$ 3092322 3377479 3703149 3909988 3959277 4063678 4210428 4387159 4372423 4099481 4150857
4739D150857J31801k2671M6893Q925j46346P5913k65119L8971k13136j49146M6536
$$ 4150857 4282658 4259987 4306880 4315805 4169459 4245372 3980253 4019224 3806088 3656942 3703478
4728C703478N5660k20301j67240K26358N53o9272O6640J76944K60901M68556L94942
$$ 3703478 3759138 3538837 3371597 3597955 3598508 3529236 3595876 3772820 4033721 4502277 4897219
4717D897219J60032L50173L56239L70173L49837L03155K66193M71821L69568L98425
$$ 4897219 5057251 5407424 5763663 6133836 6483673 6786828 7053021 7524842 7894410 8292835
4707H292835L55002M26749L68626K19871L97431J87367K50196J82308J55528O6252
$$ 8292835 8647837 9074586 9443212 9663083 10060514 10247881 10498077 10680385 10835913 10902165
4697A0902165J07857J31391j81555J64248L16397k79233n5454J63124P8793K54219
$$ 10902165 11010022 11141413 10959858 11124106 11440503 11161270 11105816 11268940 11347733 11601952
4687A1601952K08692J94885L75760M16798N84627N79353P43759O84815N78858
$$ 11601952 11810644 12005529 12381289 12798087 13382714 13962067 14705826 15390641 15969499
4678A5969499P78799J032787P79605J124542Q14850R85340J183994R39674R09371
$$ 15969499 16748298 17781085 18560690 19685232 20500082 21485422 22669416 23609090 24518461
4669B4518461P07302P56499P44751N68651M54966L10301M65844L16918K39976
$$ 24518461 25225763 25982262 26727013 27295664 27750630 28060931 28526775 28843693 29083669
4660B9083669K78683K03473J77176K76322K84850K63455O72672O66591O61556
$$ 29083669 29362352 29565825 29743001 30019323 30304173 30567628 31240300 31906891 32568447
4651C2568447P71141Q36456J064040J378651J784069J574035K151442K239658
$$ 32568447 33339588 34176044 35240084 36618735 38402804 39976839 42128281 44367939
4643D4367939K624150L077405L395786L940754M301887M882570N393694O449232
$$ 44367939 46992089 50069494 53465280 57406034 61707921 66590491 71984185 78433417
4635G8433417P610510Q576328R815140J0811739J2184983J3296790J4960887J6854230
$$ 78433417 86043927 94620255 104435395 115247134 127432117 140728907 155689794 172544024
4627A72544024K0097951K4998940L2832792M2403914N1295118N6892656O1520963
$$ 172544024 192641975 217640915 250473707 292877621 344172739 401065395 462586358
4620D62586358K8650728l8409775p1616203o5848798n0475997l8946281l1846056
$$ 462586358 491237086 452827311 381211108 315362310 264886313 225940032 194093976
4613A94093976k6356655k1426817j7830876j4911934j2675119j0693955r553666
$$ 194093976 167737321 146310504 128479628 113567694 100892575 90198620 80644954
4606H0644954p942342o673886n991275n381772m953114m528606m136664l747869
$$ 80644954 72702612 66028726 60037451 54655679 49702565 45173959 41037295 37289426
4598C7289426l315575k861954k379212k173912j812921j435373j173707j135781
$$ 37289426 33973851 31111897 28732685 26558773 24745852 23310479 22136772 21000991
4590B1000991q70833o57858n23878o28871l45791k91970n026k76786k3132k78833
$$ 21000991 20130158 19472300 18948422 18319551 17973760 17681790 17676764 17399978 17376846 17098013
4580A7098013o1766j21130l3122j65911n08702l37204p50368m32722l07233o30810
$$ 17098013 17036247 16915117 16881995 16716084 16207382 15870178 15119810 14687088 14379855 13749045
4570A3749045p42629o83368n52070p63529o40700n30988o77803n88406l08586
$$ 13749045 13006416 12323048 11770978 11007449 10366749 9835761 9157958 8569552 8260966
4561H260966m47591n74267n64136l48903j75281j79443j35665k34425L697K60131
$$ 8260966 7813375 7239108 6674972 6326069 6150788 5971345 5835680 5601255 5604952 5865083
4551E865083l9382m5364J13091O5696m8401L6050J84067L3042J27606r3684k63976
$$ 5865083 5825701 5780337 5893428 5959124 5910723 5946773 6130840 6163882 6291488 6197804 5933828
4540E933828J02329q3556P1617j17189j92901l27429k03162M760l15149j6998
$$ 5933828 6036157 5952601 6024218 5907029 5714128 5386699 5183537 5188297 4873148 4856150
4530D856150j08704l90613l61946l38435m85182j41703l15109r675k11734l97940
$$ 4856150 4747446 4356833 3994887 3656452 3171270 3029567 2714458 2704783 2493049 2095109
4520B095109j35846l5788j61820J43300O5293k31702J40601O34146n6775M3411
$$ 2095109 1959263 1923475 1761655 1904955 1970248 1738546 1879147 2513293 2456518 2499929
4510B499929K10141J76394M9895N5931J52445P2601K68440R2038J33178k85605
$$ 2499929 2710070 2886464 2936359 2992290 3144735 3217336 3485776 3577814 3710992 3425387
4500C425387K7666K29261p8650k9376m36870j04273l55191k67904k03763j22203
$$ 3425387 3453053 3682314 3603664 3574288 3137418 3033145 2677954 2410050 2206287 2084084
4490B084084j58957j67283j73114k76869Q1404l08710j54820O3887N604j1346
$$ 2084084 1925127 1757844 1584730 1307861 1389265 1080555 925735 989622 995226 983880
4480I83880p9727J17862K12263Q9049l9126L8632p3293K53839J67850P6819N5971
$$ 983880 904153 1022015 1234278 1323327 1284201 1322833 1249540 1503379 1671229 1748048 1804019
4469A804019K45370R4174j48124l2958j10669K44179J11654J46926p2138L0528
$$ 1804019 2049389 2143563 1995439 1962481 1851812 2095991 2207645 2354571 2282433 2312961
4459B312961k87172j11995j28211k84950l07274k42145J83566j43974k604j94784
$$ 2312961 2025789 1913794 1785583 1500633 1193359 951214 1134780 990806 988202 793418
4449G93418k69416n3108P8890r6770j40330J00072P0617K02921J7259r9828k44886
$$ 793418 524002 470894 549784 453014 312684 412756 483373 686294 703553 603725 358839
4438C58839R3955J95160j0196K62604J20124R9704o193K65275L7106p9576j4707
$$ 358839 452794 647954 637758 900362 1020486 1120190 1113997 1379272 1416378 1336802 1322095
4427A322095j8804J71652o3714P4568n1708O309k32355r6475M1959k66588j26508
$$ 1322095 1303291 1474943 1411229 1485797 1434089 1440398 1208043 1111568 1153527 886939 760431
4416G60431o109l697l08315o5177J58639k45721Q2986j33261o8804K0988n1660
$$ 760431 754322 750625 442310 377133 535772 290051 373037 239776 170972 191960 140300
4405A40300J3183O3627L16897Q1958r2615R4448J04245J39975K6127Q1538J49847
$$ 140300 153483 217110 534007 615965 523350 617798 722043 862018 888145 969683 1119530
4394A119530J43249K33479k37767k7797N3543J25471J1915P841Q2399j08724k05275
$$ 1119530 1262779 1496258 1258491 1230694 1284237 1409708 1421623 1429464 1511863 1403139 1197864
4383A197864j25679J34870k7898o7028k91791j04462p9441J44568o4316j5412
$$ 1197864 1072185 1207055 1179157 1112129 820338 715876 636435 781003 716687 701275
4373G01275k32916k02380J84343K4725Q2201L0628J0057K902M9250j36499J27927
$$ 701275 468359 265979 450322 475047 557248 587876 597933 600835 650085 513586 641513
4362F41513J65012J28742K76413K27065O9154j07673K5205r0484O8305K07138
$$ 641513 806525 935267 1211680 1438745 1507899 1400226 1425431 1334947 1403252 1610390
4352A610390j72379j28442P7768r821n1305J5654j90244J00281Q1410l35002n3807
$$ 1610390 1438011 1309569 1387337 1377516 1326211 1341865 1151621 1251902 1333312 998310 944503
4341I44503n0138k7048Q1224j69522l4127K25600J90863m3650J17479l69591M87158
$$ 944503 894365 867317 948541 779019 744892 970492 1161355 1117705 1235184 865593 1352751
4330A352751K87p0371J42590j16384K73101j14141Q3256R8096p1447o7828J69692
$$ 1352751 1353038 1282667 1425257 1308873 1581974 1467833 1551089 1649185 1577738 1509910 1679602
4319A679602K69658L83232j97347k4458J39975R3729l0216o3309m7789k8439o2213
$$ 1679602 1949260 2332492 2135145 2110687 2250662 2344391 2314175 2250866 2203077 2174638 2112425
4308B112425K59869K18835K63390L96349K95328p4126k82980n09058m99646k17989
$$ 2112425 2372294 2591129 2854519 3250868 3546196 3472070 3189090 2680032 2180386 1962397
4298A962397M8564N7028k71434k63768j38330j6305j42320K78268r3946l4714
$$ 1962397 2010961 2067989 1796555 1532787 1394457 1378152 1235832 1514100 1420154 1385440
4288A385440L8562k0114K12745M2225o1248K07151J21763q7177J25754R7110J46146
$$ 1385440 1424002 1403888 1616633 1658858 1597610 1804761 1926524 1839347 1965101 2062211 2208357
4277B208357J21468J79524J83571J49787L33930K83845l2057j01181m43260k75276
$$ 2208357 2329825 2509349 2692920 2842707 3176637 3460482 3428425 3327244 2883984 2608708
4267B608708k68298j85710k86065k64914j61771l47620N3836m8613P7067n7472
$$ 2608708 2340410 2154700 1868635 1603721 1441950 1094330 1148166 1099553 1176620 1119148
4257A119148l48849r479r677o8731K08770j33001K2255m3790P5491j35583j12479
$$ 1119148 770299 760820 751143 682412 891182 758181 780436 736646 812137 676554 564075
4246E64075K35235J59143Q2618k60260J44474K09712R4376j84139r3639J72165
$$ 564075 799310 958453 1041071 780811 925285 1134997 1229373 1045234 951595 1123760
4236A123760k25482M596N8841Q213m975J11583l4908p1717k08209j58598K6370
$$ 1123760 898278 902874 961715 969928 964953 1076536 1041628 969911 761702 603104 629474
4225F29474P2261L5194j90979L3544L2558j17631j23671K2845Q2004K0181J41039
$$ 629474 701735 736929 545950 579494 612052 494421 370750 393595 475599 495780 636819
4214F36819K13792K01960j8796j82857j1618J34011M2354O2777J68190j26429
$$ 636819 850611 1052571 1033775 850918 839300 973311 1015665 1078442 1246632 1120203
4204A120203O2160j47212o5621M7017P7927j11843j32000O0831m3972j53189p229
$$ 1120203 1182363 1035151 969530 1016547 1094474 982631 850631 911462 867490 714301 707072
4193G07072J70696J34583n1195j40214p8048k53037R3903J0777p5063N9831j36239
$$ 707072 877768 1012351 961156 820942 742894 489857 583760 594537 519474 579305 443066
4182D43066J107M5729J4874O456M1392J66189L3725L6516o5581J64526K47619
$$ 443066 444173 489902 504776 511232 552624 718813 752538 789054 723473 887999 1135618
4171A135618O703R2914j36917L7851j44678o1963O1536R8211N5406m985l4092
$$ 1135618 1142321 1235235 1098318 1136169 991491 929528 991064 1089275 1144681 1139696 1105604
4160A105604r991J43372j65986J06014R7128k83999k32620R4820M8791p8799j51886
$$ 1105604 1095613 1238985 1072999 1179013 1276141 992142 759522 854342 903133 824334 672448
4149F72448O5896M3329Q5369j3390J2090l5305k1961J00271J8190p7002R2942
$$ 672448 738344 781673 867042 853652 865742 830437 808476 908747 926937 849935 942877
4138I42877K2412l1428N2954J44756n4010j7604L28751N3434j80298J6634J77569
$$ 942877 965289 933861 986815 1131571 1077561 1059957 1388708 1442142 1261844 1278478 1456047
4127A456047N5493m040j10228n5490M8210j6976O3773m1672n1622J50123j99315
$$ 1456047 1511540 1507500 1397272 1341782 1389992 1373016 1436789 1395117 1343495 1493618 1294303
4116A294303J28353L1940j80997m0870j42707J85645n8667R725K0041O4161j8899
$$ 1294303 1422656 1454596 1273599 1232729 1090022 1275667 1217000 1226725 1246766 1310927 1292028
4105A292028p083n1931J00219J56494L4901j04089K1809J17319l2101R328N3115
$$ 1292028 1284945 1233014 1333233 1489727 1524628 1420539 1442348 1559667 1527566 1536894 1590009
4094A590009L00684j25104J44404R997Q7219k62501j2606K02583k0457k07739
$$ 1590009 1890693 1765589 1909993 1919990 2007209 1744708 1732102 1934685 1914228 1706489
4084A706489J08343k36213m2159J57082K7000m0469K48548j04183M6385J6326
$$ 1706489 1814832 1578619 1536460 1693542 1720542 1680073 1928621 1824438 1870823 1887149
4074A887149r1352r6185j12968O27J5887J15659J02739r5953j221K50950O0432
$$ 1887149 1795797 1699612 1586644 1587271 1603158 1718817 1821556 1725603 1724382 1975332 2035764
4063B035764K25260j75510J08567j25199N0774R0517J14072o9707Q4489n8476
$$ 2035764 2261024 2085514 2194081 2068882 2119656 2210173 2324245 2254538 2339027 2280551
4053B280551O252J92998J2163R3668j0300l48706K041K06820Q3605j81669L4370
$$ 2280551 2286803 2479801 2491964 2585632 2575332 2226626 2228667 2435487 2519092 2337423 2371793
4042B371793J53337j77467k8709N5253l04153K09183K19659l4392P847O2025J98805
$$ 2371793 2525130 2347663 2318954 2374207 2070054 2279237 2498896 2464504 2472351 2534376 2733181
4031B733181K8599l1631Q5241j66988P0174J81932J28649k13926L7744J83301
$$ 2733181 2761780 2730149 2815390 2648402 2718576 2900508 3029157 2815231 2852975 3036276
4021C036276l4638M770j3102J42292N443j0016J90088P1364q4542j46681j36792
$$ 3036276 3001638 3006408 2993306 3135598 3141041 3131025 3321113 3392477 3307935 3161254 3024462
4010C024462J7389r6423K56759J39736j00121r4357J72318K79133j77888P2961
$$ 3024462 3041851 2945428 3202187 3341923 3241802 3147445 3319763 3598896 3421008 3493969
4000C493969O1357j99572J11192R1955K29596j26858J6150K45850K38253j66929
$$ 3493969 3555326 3355754 3466946 3558901 3788497 3661639 3677789 3923639 4161892 3994963
3990C994963P1057M40306J47369K2472J85738M4467L52898K69072j0634L55749
$$ 3994963 4066020 4506326 4653695 4676167 4861905 4906372 5259270 5528342 5517708 5873457
3980E873457K59402N8285N3502j3692J08140l03397m6105K26453J42733J51902
$$ 5873457 6132859 6191144 6244646 6230954 6339094 6035697 5989592 6216045 6358778 6510680
3970F510680J22781J02062J69956N8123j2368J17158j727J3368j20444K22735
$$ 6510680 6633461 6735523 6905479 6963602 6951234 7068392 7066665 7080033 6959589 7182324
3960G182324j8452J64954J34327J22750J01829J56433K94803L30044N78238N14201
$$ 7182324 7163872 7328826 7463153 7585903 7687732 7844165 8138968 8469012 9047250 9561451
3950I561451L63581Q1671n31948m96216l59911l34934k04253o2190o9700J8680
$$ 9561451 9925032 10006703 9474755 8978539 8618628 8283694 8079441 8017251 7947551 7966231
3940G966231j73456j03535K2350n2662k6612l2857j52779p4468K0814j4480j34557
$$ 7966231 7792775 7689240 7711590 7658928 7632316 7599459 7446680 7372212 7393026 7378546 7243989
3929G243989m02414k56026p6048k30902J299J34135K45324J84994k21141J84242
$$ 7243989 6841575 6585549 6509501 6278599 6279898 6414033 6659357 6844351 6623210 6807452
3919F807452k02229j41773j33573j39317j70821j91084j6938o019j26077k1269
$$ 6807452 6605223 6463450 6329877 6190560 6019739 5828655 5811717 5805698 5679621 5658352
3909E658352j1177n5150J07423m2171j98291o838j33182N191P0163N0907l6994
$$ 5658352 5647175 5592025 5699448 5657277 5458986 5452148 5318966 5324157 5394320 5445227 5408233
3898E408233n359j34891n9609K18354K7078k161K12716j6463J05628j1347k06135
$$ 5408233 5402874 5267983 5208374 5426728 5453806 5451645 5664361 5647898 5753526 5742179 5536044
3887E536044J03858m6485K2752j584P3284Q1135R9508j87318n5787O3054K54009
$$ 5536044 5639902 5593417 5616169 5614585 5687869 5769004 5868512 5681194 5625407 5688461 5942470
3876E942470J927P5357J22027k5201J35399J42974O9185P1933K88378m5104j74958
$$ 5942470 5944397 6019754 6141781 6116580 6251979 6394953 6464138 6536071 6824449 6779345 6604387
3865F604387J17887K110K4602o6995n4407J8798q5642J31171K71693Q7716j4834
$$ 6604387 6722274 6724384 6748986 6681991 6627584 6646382 6560740 6691911 6963604 7051320 7036486
3854G036486k61338n3878O5681j33342O9763p861J50124J7723M1689J19924K71832
$$ 7036486 6775148 6721270 6786951 6653609 6723372 6715511 6865635 6883358 6925047 7044971 7316803
3843G316803Q0693k43725l5748J37951L72791m0255j21511K25370j41881j9793
$$ 7316803 7397496 7153771 7118023 7255974 7628765 7588510 7466999 7692369 7550488 7530695
3833G530695P1744j4240K4381P6238r0991j25118L1370K5381J89533j01274j31306
$$ 7530695 7602439 7588199 7612580 7688818 7597827 7472709 7504079 7529460 7718993 7617719 7486413
3822G486413L04064K2702j43388m7572k9902O0030J54525m0483q2091j40457J78296
$$ 7486413 7790477 7813179 7669791 7622219 7592317 7652347 7806872 7766389 7684298 7543841 7722137
3811G722137L60067o5443J17688J35853j07136l68219R3252J26145l0732J41662
$$ 7722137 8082204 8016761 8134449 8270302 8163166 7794947 7888199 8014344 7983612 8125274
3801H125274J40270K08350p7801m8341J24471l5037o9836p9769k3981R1623K61380
$$ 8125274 8265544 8473894 8396093 8347752 8472223 8437186 8367350 8287581 8263600 8355223 8616603
3790H616603r4121K0462Q2082j21380j83364R2673K9885L8991K01504p9905n2419
$$ 8616603 8522482 8542944 8625026 8503646 8320282 8412955 8442840 8481831 8683335 8603430 8551011
3779H551011O5015q7125J05608N8329k10026O1499M4097J97630N9352j86983N1038
$$ 8551011 8616026 8528901 8634509 8692838 8482812 8544311 8588408 8786038 8845390 8658407 8709445
3768H709445k071k2602J17400l2882m4991J98935n1839j46814J41595J15376Q4237
$$ 8709445 8707374 8684772 8802172 8769290 8724299 8923234 8871395 8724581 8866176 8981552 9065789
3757I065789k08922j09784K83681R0154J21517J67570j71733K17249O7126o7O8391
$$ 9065789 8856867 8747083 9030764 9120918 9242435 9410005 9238272 9455521 9522647 9522580 9590971
3746I590971K23196J49926K10975J15592J43833k5302J46338q3289k4028J40932
$$ 9590971 9814167 9964093 10175068 10290660 10434493 10409191 10555529 10472240 10448212 10589144
3736A0589144K18860J62222m100Q4331J30990K14939J45913L21585q6464l4867
$$ 10589144 10808004 10970226 10966126 11050457 11181447 11396386 11542299 11863884 11777420 11742553
3726A1742553R4012O438P0302K32648j59805K00233J09160K50181K09919L31575
$$ 11742553 11836565 11843003 11913305 12145953 11986148 12186381 12295541 12545722 12755641 13087216
3716A3087216J11404K24967M30393K02547K02794O08587N03293M82078N21767
$$ 13087216 13198620 13423587 13853980 14056527 14259321 14867908 15371201 15853279 16375046
3707A6375046N91968P46720P81206Q37182J069550J006375J343547J367693J601673
$$ 16375046 16967014 17713734 18494940 19332122 20401672 21408047 22751594 24119287 25720960
3698B5720960K023449K017149K585230L110225L238419K640095K095150O07311
$$ 25720960 27744409 29761558 32346788 35457013 38695432 41335527 43430677 44037988
3690D4037988j655797l569009m072635l508007k767766k209582j677419j589010
$$ 44037988 42382191 38813182 34740547 31232540 28464774 26255192 24577773 22988763
3682B2988763j187910j203560r75848q97100n65917n89181n44456m57160n90771
$$ 22988763 21800853 20597293 19621445 18724345 18158428 17569247 17024791 16567631 15976860
3673A5976860l17213k60340m22302m33541j25898j53146l54125k088r6727N0629
$$ 15976860 15659647 15399307 14977005 14543464 14417566 14264420 13910295 13908207 13811480 13862109
3663A3862109j26831j41197j75786n6996M8601p1752j20633k14797j7087J05098
$$ 13862109 13735278 13594081 13418295 13361299 13409900 13338148 13217515 13002718 12985631 13090729
3653A3090729R0470L1512l134l01084j23269J95586J15752J04481Q0406P769L0497
$$ 13090729 13181199 13212711 13209577 12908493 12785224 12980810 13096562 13201043 13281449 13289218 13319715
3642A3319715j4861j77739j03839M141K91074J40124J195k99048j94094L44811
$$ 13319715 13304854 13127115 13023276 13027417 13318491 13458615 13459810 13160762 12966668 13311479
3632A3311479n7727j1602k06487j04369J80311J39885J96423o2073q1164N3097
$$ 13311479 13253752 13242150 13035663 12931294 13111605 13251490 13447913 13385840 13304676 13357773
3622A3357773j58111M4593J32715k0950L51969O5530j50003j6260r4128P6616
$$ 13357773 13199662 13244255 13376970 13356020 13707989 13773519 13623516 13607256 13513128 13589744
3612A3589744K67171K91935K0015K0817J15527M1253k9251K30320K77725j64143
$$ 13589744 13856915 14148850 14168865 14189682 14305209 14346462 14317211 14547531 14825256 14661113
3602A4661113n6752L0047K30771K90481J16950J09689R9609L40359J79348L22026
$$ 14661113 14604361 14634408 14865179 15155660 15272610 15382299 15481908 15822267 16001615 16323641
3592A6323641K28688N17866J97350L05480j38396m2079O1452j63129j29270j40769
$$ 16323641 16552329 17070195 17267545 17573025 17434629 17392550 17454002 17290873 17161603 17020834
3582A7020834N0757n2111J50128K4139Q7605M91106J18464J67465J05075J30408
$$ 17020834 17071591 17019480 17169608 17193747 17281352 17772458 17890922 18058387 18163462 18293870
3572A8293870J43057K82382K55068K05423J76638J28440L76914K65322K60746
$$ 18293870 18436927 18719309 18974377 19179800 19356438 19484878 19861792 20127114 20387860
3563B0387860N02968P17815L40166P75910Q07856N65535O52975K97051k85418
$$ 20387860 20890828 21608643 21948809 22724719 23532575 24098110 24751085 25048136 24762718
3554B4762718m52646l17612r3704j92920j45667O6599j95126J52023K78589J36149
$$ 24762718 24310072 23992460 23898756 23705836 23560169 23626768 23431642 23583665 23862254 23998403
3544B3998403L03887J69389K70326R6353K36357L1513J33599K01963M46736J35034
$$ 23998403 24302290 24471679 24742005 24838358 25074715 25106228 25239827 25441790 25888526 26023560
3534B6023560L52752M13497M47170M83333M96594M91096M59113N14263N64385
$$ 26023560 26376312 26789809 27236979 27720312 28216906 28708002 29167115 29681378 30245763
3525C0245763P03542L67011N02353K98465M20032J30755J60098M98648M95339
$$ 30245763 30949305 31316316 31818669 32117134 32537166 32667921 32828019 33326667 33822006
3516C3822006M97966M80620L70511N29251O88956P42331L75807K99968N29823
$$ 33822006 34319972 34800592 35171103 35700354 36389310 37131641 37507448 37807416 38337239
3507C8337239N79866L58465M96147O66902O56015N44498N97622Q15788N66668
$$ 38337239 38917105 39275570 39771717 40438619 41094634 41639132 42236754 43052542 43619210
3498D3619210O25215O44692O77369O47427Q92638Q68585R52864J083428J078991
$$ 43619210 44244425 44889117 45566486 46213913 47106551 47975136 48928000 50011428 51090419
3489E1090419Q67650J127136J050637J251992J198921J061184J147348J146136
$$ 51090419 51958069 53085205 54135842 55387834 56586755 57647939 58795287 59941423
3481E9941423J356214J409218J264364J020238J055953R85347J051309J068172
$$ 59941423 61297637 62706855 63971219 64991457 66047410 67032757 68084066 69152238
3473F9152238J272059R87590J086189J122201J237078J084880J035133J181590
$$ 69152238 70424297 71411887 72498076 73620277 74857355 75942235 76977368 78158958
3465G8158958J207602J509173J339859J394433J479736J833254J732472J767661
$$ 78158958 79366560 80875733 82215592 83610025 85089761 86923015 88655487 90423148
3457I0423148K012146K263057K321901K294077K871963L054610L283967L429263
$$ 90423148 92435294 94698351 97020252 99314329 102186292 105240902 108524869 111954132
3449A11954132L679815M139313M260037M763528N269709N606511N986241O378616
$$ 111954132 115633947 119773260 124033297 128796825 134066534 139673045 145659286 152037902
3441A52037902O922733P229547P790423Q210570Q427676Q498510Q519248Q364331
$$ 152037902 158960635 166190182 173980605 182191175 190618851 199117361 207636609 216000940
3433B16000940Q318078Q003763P071375N766879M320048J691131p52168l400481
$$ 216000940 224319018 232322781 239394156 245161035 249481083 251172214 250420046 247019565
3425B47019565o240438p839315r012113r817352r397287q808548q432869p423168
$$ 247019565 240779127 232939812 223927699 214110347 204713060 195904512 187471643 180048475
3417A80048475o932304o543711o020801n481995n127551m746003m344685l978847
$$ 180048475 173116171 166572460 160551659 155069664 149942113 145196110 140851425 136872578
3409A36872578l946646l124888k923781l091801k538352k659414k274359k181396
$$ 136872578 132925932 129801044 126877263 123785462 121247110 118587696 116313337 114131941
3401A14131941k051539j820966j872139j778601j739872j672812j509243j567129
$$ 114131941 112080402 110259436 108387297 106608696 104868824 103196012 101686769 100119640
3393A00119640j390776j302245j594153j822288k234497k504342k457739k095795
$$ 100119640 98728864 97426619 95832466 94010178 91775681 89271339 86813600 84717805
3385H4717805k187431k163760k128987k188754j907748j881843j578640j527722
$$ 84717805 82530374 80366614 78237627 76048873 74141125 72259282 70680642 69152920
3377F9152920j493814j226427j406616j253359j156996q46967j077103j186817
$$ 69152920 67659106 66432679 65026063 63772704 62615708 61768741 60691638 59504821
3369E9504821q70306n38688o42390n52226m73590j46081j5723L38205K09466K93153
$$ 59504821 58634515 58095827 57453437 56901211 56427621 56281540 56265817 56604022 56813488 57106641
3359E7106641O64104n8652j143103j709844j623447j695357j497750j279230j164868
$$ 57106641 57770745 57712093 56568990 54859146 53235699 51540342 50042592 48763362 47598494
3350D7598494r07999r78910p14318o81952q88448n75897p01884q29438m14714
$$ 47598494 46690495 45711585 44997267 44315315 43426867 42850970 42149086 41319648 40904934
3341D0904934k18761q32012m71004l61110k12682k23540m71128l61899k81089
$$ 40904934 40686173 39854161 39383157 39022047 38809365 38585825 38114697 37752798 37471709
3332C7471709l35052R6893l095O6272K73329J33818j18689k49178n79047r06246
$$ 37471709 37136657 37233550 37230455 37296727 37570056 37703874 37585185 37336007 36756960 35850714
3322C5850714j004461p34070o28164o62472m08096k46276o08573m05185m26508
$$ 35850714 34846253 34112183 33484019 32821547 32413451 32167175 31558602 31153417 30726909
3313C0726909k71825l39980l37728k12873l34273k90308k35356k61933k51446
$$ 30726909 30455084 30115104 29777376 29564503 29230230 28939922 28704566 28442633 28191187
3304B8191187k54265m32694k71097j88766l51008l06211j35524j10640k65087
$$ 28191187 27936922 27504228 27233131 27044365 26693357 26387146 26251622 26140982 25875895
3295B5875895k93424q9713m33533J5783o4138k35465k29207m3406m5447q1164
$$ 25875895 25582471 25492758 25059225 25075008 25010870 24775405 24546198 24502792 24457345 24376181
3285B4376181j63460r2029Q7187l6642j1099J40939j19099q870r9927j85380J78162
$$ 24376181 24212721 24120692 24207879 24171237 24160138 24301077 24181978 24173108 24073181 23887801 24065963
3274B4065963j23566j93905K3121J02755j50426j20970l06182k69171j01884k96892
$$ 24065963 23942397 23748492 23771613 23874368 23723942 23602972 23296790 23027619 22925735 22628843
3264B2628843j50239m22374K6194p5745k97478q5735R1492n78341j18831q5342
$$ 22628843 22478604 22056230 22082424 22006679 21709201 21623466 21714958 21136617 21017786 20932444
3254B0932444m74495M0782p4850o8180q7714q9311j15404j70111n0948r3418J9941
$$ 20932444 20457949 20498731 20423881 20355701 20267987 20178676 20063272 19893161 19842213 19748795 19768736
3243A9768736l2405N4917n4401k30210o5154r2284j25663j07688j01070j20529
$$ 19768736 19736331 19791248 19736847 19506637 19441483 19349199 19223536 19115848 19014778 18894249
3233A8894249l7934m9347j24510l58804j09248q0489j92247m45673j88208j91963
$$ 18894249 18856315 18806968 18682458 18323654 18214406 18133917 17941670 17495997 17307789 17115826
3223A7115826m15900N5735M2722j24868m94549n0162K99k21773P8619j11531Q6202
$$ 17115826 16699926 16755661 16798383 16673515 16178966 16128804 16129103 15907330 15985949 15874418 15960620
3212A5960620j22453p2040P2545M3887n2091K5247M6829m1169P4140K21569J47438
$$ 15960620 15838167 15766127 15838672 15882559 15830468 15855715 15902544 15861375 15935515 16157084 16304522
3201A6304522k9323j46039N4585J11736J6040J7658K0869l633p4317j62384J45051
$$ 16304522 16275199 16129160 16183745 16295481 16311521 16329179 16350048 16346415 16272098 16109714 16254765
3190A6254765O5966j20685q2597N3782K24950K25316n0396R3165R4418J17616
$$ 16254765 16320731 16200046 16117449 16171231 16396181 16621497 16571101 16664266 16758684 16876300
3180A6876300K72500M7849R1284L09761L49049R5825J05886L57493K32644K28689
$$ 16876300 17148800 17196649 17287933 17597694 17946743 18042568 18148454 18505947 18738591 18967280
3170A8967280L91016M15020M08907K15245K60323M62824M67124J31497N368J62928
$$ 18967280 19358296 19773316 20182223 20397468 20657791 21120615 21587739 21719236 21724604 21887532
3160B1887532M08767J41286J53675J1979O3432K98494J91339L79963L33739K75658
$$ 21887532 22296299 22437585 22591260 22603239 22666671 22965165 23156504 23536467 23870206 24145864
3150B4145864M09282M55338K77663N17040L96500L58612L58201K47881L48862
$$ 24145864 24555146 25010484 25288147 25805187 26201687 26560299 26918500 27166381 27515243
3141B7515243L45450O86463P98190O41030O22482P63652Q57294O62309R50439
$$ 27515243 27860693 28547156 29345346 29986376 30608858 31372510 32229804 32892113 33842552
3132C3842552P14809Q14401J033519J018094Q68029Q09400J015938P95983J050468
$$ 33842552 34557361 35371762 36405281 37423375 38291404 39100804 40116742 40912725 41963193
3123D1963193J066718J251974J207891J120384J143842J213107J014328Q41360
$$ 41963193 43029911 44281885 45489776 46610160 47754002 48967109 49981437 50822797
3115E0822797Q96954R43887N30919N38061O36586N84824O90406N74770P39381
$$ 50822797 51719751 52663638 53194557 53732618 54369204 54954028 55644434 56219204 56958585
3106E6958585J001013R94019J217710J166299J269683J531587J886779J932258
$$ 56958585 57959598 58953617 60171327 61337626 62607309 64138896 66025675 67957933
3098F7957933J942125K263210K239515K318833K141668K533602K766723K564117
$$ 67957933 69900058 72163268 74402783 76721616 78863284 81396886 84163609 86727726
3090H6727726K128471J927204J295803M10714m50648j226322j709618k356412
$$ 86727726 88856197 90783401 92079204 92489918 92039270 90812948 89103330 86746918
3082H6746918k034669j489092j477268q58068m83378k43911R7023K97071M42692
$$ 86746918 84712249 83223157 81745889 80887821 80404443 80160532 80257555 80554626 80997318
3073H0997318R40371J107128J109775J055035J248208J691986J466968J374125
$$ 80997318 81937689 83044817 84154592 85209627 86457835 88149821 89616789 90990914
3065I0990914J347113J172368Q63347M05270j85849o35615j004889j456975j745432
$$ 90990914 92338027 93510395 94373742 94779012 94593163 93957548 92952659 91495684 89750252
3056H9750252k055527k390473k509396k804252k541404k261866j737522j694728
$$ 89750252 87694725 85304252 82794856 79990604 77449200 75187334 73449812 71755084
3048G1755084j302503j098439o61898n27913o59908k84562n08118k08399m95650
$$ 71755084 70452581 69354142 68692244 68164331 67504423 67219861 66711743 66503344 66007694
3039F6007694p00678q63248j062548j334736j089850j438881k013439j765695
$$ 66007694 65307016 64443768 63381220 62046484 60956634 59517753 57504314 55738619
3031E5738619k302797k264096k166490k278781k020101j914305j925686j550616
$$ 55738619 53435822 51171726 49005236 46726455 44706354 42792049 40866363 39315747
3023C9315747j629067j394647j304414j045413j196367j165045r21774p67492
$$ 39315747 37686680 36292033 34987619 33942206 32745839 31580794 30659020 29891528
3015B9891528o12991q40358p19351p22000p63082n62422n83888n60775q09006
$$ 29891528 29278537 28438179 27718828 26996828 26233746 25671324 25087436 24526661 23717655
3006B3717655q31545o93763o13505p45877p14371m99564p75750o73567n47165
$$ 23717655 22886110 22192347 21578842 20832965 20118594 19619030 18843280 18169713 17622548
2997A7622548m60869o48174l87590k85925m32699m13596k68573m01105m87972
$$ 17622548 17161679 16513505 16125915 15839990 15407291 14993695 14725122 14324017 13836045
2988A3836045j73819k27004j70106k36684l33020o0887m68113j89485K2373j97468
$$ 13836045 13662226 13435222 13265116 13028432 12695412 12634525 12166412 11976927 11999300 11801832
2978A1801832j74197K1428m45054j75037q1818j04062j78308j32644j88622o900
$$ 11801832 11627635 11649063 11204009 11028972 10947154 10843092 10664784 10532140 10343518 10336618
2968A0336618l62826j14502o9950m84151k02391l11937l44995l60499k77341j31102
$$ 10336618 9973792 9859290 9789340 9305189 9102798 8790861 8445866 8085367 7808026 7676924
2958G676924k22549j89387j73644j88274Q3313q8985p4591k64963P2932P6424
$$ 7676924 7454375 7264988 7091344 6903070 6986383 6897398 6822807 6557844 6630776 6707200
2948F707200j43724K09981j45686j60413q4837p9402m5732j98305o6612j8820
$$ 6707200 6563476 6773457 6627771 6467358 6382521 6303119 6257387 6059082 5992470 5973650
2938E973650j30711r0229q8321k27900n9696q8098J9935k36838j35953j1769j56053
$$ 5973650 5842939 5752710 5664389 5436489 5376793 5288695 5308630 5071792 4935839 4924070 4768017
2927D768017l5523k34792j65513j89948R192R1579l00997j71071l05097r7229
$$ 4768017 4732494 4497702 4332189 4142241 4151433 4243012 3942015 3770944 3465847 3368618
2917C368618l8367M9063m2882R9984j38147L7691J18299k728j42058J8084r4694
$$ 3368618 3330251 3379314 3336432 3436416 3298269 3335960 3454259 3451531 3309473 3327557 3232863
2906C232863k0949j54787m0810L32497j36350k2182j69460J88974o3467n7045
$$ 3232863 3211914 3057127 3016317 3348814 3212464 3190282 3020822 3209796 3146329 3089284
2896C089284N7852r5202k06256r3298m2175J3573Q0737r4547j7545k47934k9795
$$ 3089284 3147136 3051934 2845678 2752380 2710205 2723778 2804515 2709968 2692423 2444489 2414694
2885B414694L1556j37801Q3886k05708j73293K18125J19141j06607m6365O7094
$$ 2414694 2446250 2308449 2392335 2186627 2013334 2231459 2350600 2243993 2197628 2264722
2875B264722l1952P1806k18493p1906K08134P1691M9706O880j30658J15372j41616
$$ 2264722 2232770 2304576 2086083 2014177 2222311 2294002 2343708 2350588 2219930 2335302 2193686
2864B193686J10198J5121L7875J0459j5192j50580m4394M501Q0875l8449k08364
$$ 2193686 2303884 2319005 2356880 2367339 2352147 2201567 2157173 2161674 2242549 2204100 1995736
2853A995736M4825j88669J06013j40331l5589q180R8635k99615j29190K21861
$$ 1995736 2040561 1851892 1957905 1817574 1781985 1773805 1872440 1572825 1443635 1665496
2843A665496K3281p5647j8385J24893k2154K116K3900Q3062J76686J71688j15589
$$ 1665496 1688777 1613130 1594745 1719638 1697484 1699600 1723500 1806562 1983248 2154936 2039347
2832B039347k55302Q2435J38793k5986l38058J53730J23418J15136p8750j31451
$$ 2039347 1784045 1866480 2005273 1979287 1641229 1794959 1918377 2033513 1954763 1823312
2822A823312j34676P7267L774p6712Q565L828L0164J8681q3102l6574j59246r7400
$$ 1823312 1688636 1765903 1769677 1692965 1701530 1705358 1735522 1754203 1671101 1634527 1475281 1377881
2810A377881N9281K1671j8070m8635L4562J13027R6673j91167M0735J25335N0569
$$ 1377881 1437162 1458833 1440763 1392128 1426690 1539717 1636390 1445223 1485958 1611293 1661862
2799A661862k48917M4445K4514j18266J61838J95068n3522q7443r7750N7962P8800
$$ 1661862 1412945 1457390 1481904 1363638 1525476 1720544 1667022 1579579 1481829 1539791 1618591
2788A618591Q5308j30615K3565J10911j03923Q7295l1182k37918K3789l6626Q886
$$ 1618591 1703899 1573284 1596849 1707760 1603837 1691132 1659950 1422032 1445821 1409195 1418081
2777A418081R1496j04106L5319j08465m7529j234k6231j90754N5743j04092J08705
$$ 1418081 1509577 1405471 1440790 1332325 1284796 1283562 1257331 1066577 1122320 1018228 1126933
2766A126933L5699r1302P2622J41436o2364m7337o6714L85J18445j43843P3063
$$ 1126933 1162632 1071330 1143952 1285388 1223024 1175687 1108973 1109358 1227803 1083960 1157023
2755A157023p5805K77941k00528R012R6176J17155j35628j59016J4430J0162k2358
$$ 1157023 1081218 1359159 1158631 1167643 1263819 1380974 1245346 1086330 1100760 1110922 1088564
2744A088564P9495q4197j18281l05231k31381L70310k35621J59959J16260l0128
$$ 1088564 1168059 1083862 965581 660350 428969 799279 563658 723617 839877 809749
2734H09749q7383o9021J92886m9842r4462r7406P6353l2150o5743J80983k2792
$$ 809749 722366 653345 846231 796389 701927 604521 680874 648724 582981 763964 741172
2723G41172R3826L9987j24283J28924O3224j88083N2393K05673j60458Q1126p3650
$$ 741172 834998 874985 750702 879626 942850 754767 807160 1012833 852375 933501 859851
2712H59851j9482n8325q6279P5616M2627l5235K96011j70767k25714K15287k3324
$$ 859851 840369 782044 695765 771381 814008 778773 1074784 904017 678303 893590 870266
2701H70266k8599j03605r6172k00950J68688O9975L9058j26578q4153K94711j91667
$$ 870266 841667 738062 641890 440940 609628 679603 718661 592083 507930 802641 610974
2690F10974k65299k08700J47660K06392M1751P657j9695K21727J2729p1422o5098
$$ 610974 345675 136975 284635 491027 532778 540435 520740 742467 755196 683774 618676
2679F18676j292n6045J11544J14579j18675m4355O7464k7615l6847j84770M5859
$$ 618676 617384 561339 672883 787462 668787 624432 691896 664281 627434 442664 488523
2668D88523k7737k4836K259R0133l40725J9942J36759k4196R9201k16994j28084
$$ 488523 460786 435950 438209 528342 187617 207559 344318 320122 419323 202329 74245
2657G4245L6673L5296M5342o9279j07808J10851J66389K7228j19501j07768L03945
$$ 74245 110918 146214 191556 122277 14469 125320 291709 318937 199436 91668 395613
2646C95613Q5324k4736q619k80710J79497K71044j5285n877O7615j53605o5820
$$ 395613 480937 456201 447582 166872 346369 617413 602128 596251 663866 510261 444441
2635D44441m2259j26263J8498L6245r1688P062q7801o1716j41903K7602O5564
$$ 444441 402182 275919 294417 330662 238974 246036 158235 96519 -45384 -17782 47782
2624D7782n6970O8716K23019j09448m98j95828j2733J70797n0778r4993l48l8506
$$ 47782 -9188 59528 282547 173099 172601 -23227 -35960 134837 84059 -10934 -11282 -49788
2612d9788J01157N3332J5112M3184K09030K24343k33892o6467O0713o6020j31590
$$ -49788 51369 104701 119813 162997 372027 596370 362478 296011 356724 290704 159114
2601A59114L86r9501P4156K46349O8469J0868o3760l10368p9549o1929J4738o8694
$$ 159114 159500 59999 134155 380504 448973 459841 396081 85713 6164 -55765 -41027 -109721
2589a09721P1464j13274j0047L5586q4251N2107P9349j13485J8399m428j77977
$$ -109721 -38257 -151531 -161578 -125992 -210243 -158136 -78787 -192272 -173873 -178301 -356278
2578c56278J76041R5831M4709j5613M407L57961N9987q0043r3668q5279k303P1804
$$ -356278 -180237 -84406 -39697 -55310 -50903 307058 367045 287002 193334 108055 105752 177556
2566A77556N895n723N8751Q1011L798k23732J80863k0104Q8019p9472P0846R6599
$$ 177556 183451 177728 236479 317490 321288 97556 278419 258315 346334 266862 337708 434307
2554D34307k37564j23511j4178n7058K7547p4557j61343J65696J20406j63635
$$ 434307 196743 73232 59054 1996 29543 -45014 -206357 -40661 79745 -83890
2544h3890k804J76118j43076m186o6301j04349M3185j85697J41961J32185R9635
$$ -83890 -86694 89424 -53652 -57838 -124139 -228488 -185303 -371000 -229039 -96854 2781
2533B781K05809r9107R5738Q7754j27612j42414J3885n2894O4031j1550q9348
$$ 2781 208590 109483 205221 292975 165363 22949 36834 -16060 47971 36421 -52927
2522e2927J16243K8297j29208j53242r8059L683J7934J32612j58482L5420K07489
$$ -52927 63316 91613 -37595 -190837 -288896 -285213 -267279 -134667 -293149 -257729 -50240
2511e0240j35641k3343L1022p8248J48284K5539j47498J20347j77416N6255J33447
$$ -50240 -185881 -209224 -178202 -256450 -108166 -82627 -230125 -109778 -287194 -230939 -97492
2500i7492O5291Q4340o5812q4837J8396J42444Q5503k8956K91850j77943j72661
$$ -97492 -32201 52139 -13673 -98510 -80114 62330 147833 118877 410727 232784 60123
2489F0123P4035l2466l8499r1246L1474J86883n6972k43661J7292N3382l7447
$$ 60123 134158 101692 63193 -28053 3421 190304 133332 -110329 -93037 -39655 -77102
2478g7102K75456M0680k01798k2336J938k33390j74398O3600J5747j15207N2846
$$ -77102 198354 239034 37236 14900 16838 -216552 -390950 -327350 -311603 -426810 -373964
2467c73964n746j20987Q1939J27791J00504N0195J20951k8969r1039J15648k03309
$$ -373964 -379710 -500697 -418758 -290967 -190463 -140268 -19317 -48286 -139325 -23677 -226986
2456b26986M788Q2919N8693J35739N7038J04008R2996N5445j58889j4036l616
$$ -226986 -222198 -139279 -80586 55153 112191 216199 309195 364640 205751 191715 188099
2445A88099k20203p6435l2142J06588R904j68546R6419q1318L9086o687J6589
$$ 188099 -32104 -108539 -140681 -34093 -24189 -192735 -96316 -177634 -138548 -145235 -128646
2434a28646j4863M7514l33870K79533P3393k474n5176J5727J8809J58128J61621
$$ -128646 -143509 -95995 -429865 -150332 -76939 -79413 -134589 -118862 -100053 58075 219696
2423B19696N7172K3022K49588J13479o1702k35079P7206O7562k8263M3747k06172
$$ 219696 276868 299890 549478 662957 601255 366176 443382 510944 482681 526428 320256
2412C20256L6024K39153r0241j90774j08184r7644R2010j54520J53234j18316
$$ 320256 356280 595433 505192 314418 206234 108590 200600 46080 199314 80998
2402H0998j05912O0972p2588j01619j89179k3120J23130J70826K29279j7192p9371
$$ 80998 -24914 36058 -36530 -138149 -327328 -350448 -227318 -56492 172787 155595 76224
2391G6224J18049M0530J2864P4593l3934L1107n8983J3158P3638K07761N3328
$$ 76224 194273 234803 247667 322260 288326 319433 260450 273608 347246 555007 608335
2380F08335M0849N4612p1476r6946k5460J73974p6550r2124O3032M0901O9257
$$ 608335 649184 703796 632320 535374 509914 683888 607338 515214 578246 619147 688404
2369F88404J06864K14254l00983k22964j33511J91939L8351r0988M186J36142
$$ 688404 795268 1009522 708539 485575 352064 544003 582354 491366 495552 631694
2359F31694o0598O7703J13941j9299j13772J56586R8193N5809Q8240N5967L0157
$$ 631694 571096 638799 752740 733441 619669 776255 874448 930257 1018497 1074464 1104621
2348A104621J03698n4413j0475J82037O639K78229O5794K5691J83759k7463j19356
$$ 1104621 1208319 1153906 1143431 1325468 1332107 1610336 1676130 1701821 1885580 1858117 1738761
2337A738761j26114K14065K27119J2762j47585l8160O8499M5474j66912q7497
$$ 1738761 1612647 1826712 2053831 2066593 1919008 1880848 1949347 1994821 1827909 1740412
2327A740412J50249Q7852J42926j06383r1625K9874L11228r5670j34174J55247
$$ 1740412 1890661 1978513 2121439 2015056 1923431 1953305 2264533 2168863 2034689 2189936
2317B189936L30907J41021J77456K99065J94260M08683M21596J80241M15371N31160
$$ 2189936 2520843 2661864 2839320 3138385 3332645 3741328 4162924 4343165 4758536 5289696
2307E289696M70287O30777N69638N18579O25485P72268N39960R01807J147529
$$ 5289696 5759983 6390760 6960398 7478977 8104462 8876730 9416690 10318497 11466026
2298A1466026J250985J298093J539876K173881K517214L005331L188618L428915
$$ 11466026 12717011 14015104 15554980 17728861 20246075 23251406 26440024 29868939
2290B9868939K250735N43967j528511m562801m757567l646623k750908j925362
$$ 29868939 32119674 32663641 31135130 26572329 21814762 18168139 15417231 13491869
2282A3491869j564674j397671j188374p51649p15032o13316p36362m93507l69084
$$ 13491869 11927195 10529524 9341150 8589501 7874469 7261153 6524791 6031284 5662200
2273E662200l67838n20771m51934m32472m38891m15102j20054j05709l49575k88945
$$ 5662200 5294362 4773591 4321657 3889185 3450294 3035192 2915138 2809429 2459854 2170909
2263B170909n5458k57804q8902j38255k72844j08037R7709P94J50144k16838l55641
$$ 2170909 2115451 1857647 1768745 1630490 1357646 1249609 1347318 1348112 1498256 1281418 925777
2252I25777q0657J76334J93679O5022o9843r1015l8434L2m4041k53327L2915J2120
$$ 925777 845120 1021454 1215133 1280155 1210312 1119297 1080863 1080895 1036854 783527 816442 828562
2240H28562K1198j38478P6511k2623K6793l34898P0680Q8529k81641R5285K07371
$$ 828562 849760 711282 787793 765170 791963 457065 527745 616274 334633 429918 637289
2229F37289P1969J12224j46578l46794K4658O7843M7607n0979J77582j91704j5146
$$ 637289 709258 821482 674904 328110 352768 420611 468218 417239 594821 403117 387971
2218C87971j22004K3218k7393j79641P0013J1552j10308J76348K60394j00382
$$ 387971 265967 289185 261792 82151 152164 163716 53408 229756 490150 389768
2208C89768p8002k0393o7444j31283O7878J1960J60204k08684j62540p5037o6179
$$ 389768 311766 291373 223929 92646 160524 172484 332688 124004 -38536 -113573 -179752
2197a79752J06400J48397l0943J10611K9209J24513j65922J64983k04065Q5493
$$ -179752 -73352 75045 44102 154713 183922 308435 142513 307496 103431 188924
2187A88924j14316k93311K94517J55561j2686p7219k3389R1111k4230q6244k918
$$ 188924 74608 -218703 75814 231375 218689 141470 118081 209192 184962 98718 95800
2176I5800j02141P2669j03224n3895m104O0013L4708L4678l9038K5531q1026q1259
$$ 95800 -6341 66328 -36896 -90791 -94895 -34882 -174 34504 -4534 20997 -60029 -141288
2164a41288p9993J80519J14020k27898j17596K87414K51213j71646j08728r6553
$$ -141288 -221281 -40762 73258 -154640 -272236 15178 266391 94745 -13983 -110536
2154a10536P1303j66564k5518J57944l7676k848O762Q4129l8248m2965l65682
$$ -110536 -39233 -205797 -231315 -73371 -111047 -113895 -107133 -23004 -61252 -104217 -469899
2143d69899J8971J82274k4801K25429R626j61894J27463r9976k778r6070J75646
$$ -469899 -450928 -268654 -293455 -68026 -58400 -220294 -92831 -192807 -195585 -291655 -116009
2132a16009K9347J36946m6735m5237O4540p0940K76854m9808k17979l8694L3863
$$ -116009 -86662 50284 3549 -41688 22852 -48088 228766 178958 -39021 -77715 -43852
2121d3852J724L8093O4506P6144j12938j61872J02404j27544j11958J69929P6388
$$ -43852 -42128 -4035 60471 136615 23677 -138195 -35791 -163335 -275293 -105364 -28976
2110b8976k10762K73359L7823k89519j58451J21072J49213m6942k9536r6225P9199
$$ -28976 -239738 33621 71444 -218075 -376526 -255454 -106241 -153183 -182719 -278944 -199745
2099a99745J94839L0956o5558J19664k38799J10852k31951j20705J64596N4881
$$ -199745 -4906 26050 -39508 80156 -158643 -47791 -279742 -400447 -235851 -180970
2089a80970J5388J77377m7841k45954J42537J03226k63484k4679O2245J9687Q8017
$$ -180970 -165582 11795 -36046 -282000 -139463 -36237 -299721 -324400 -262155 -242468 -154451
2078a54451O4413k5247L2540o9887J10044l8303j62768k7746j88540R8813K96813
$$ -154451 -90038 -115285 -82745 -152632 -42588 -80891 -243659 -271405 -459945 -361132 -64319
2067f4319j14515J9349J41515K8122j97223n7598M692J02501J57049j42138Q2270
$$ -64319 -178834 -159485 -17970 10152 -187071 -244669 -239977 -137476 19573 -122565 -40295
2056d0295m7069r4630p8249N1879R3986j7745o9155l8071p994R2842o797j42042
$$ -40295 -87364 -181994 -260243 -208364 -114378 -132123 -201278 -239349 -247343 -154501 -161298 -303340
2044c03340l967J7222K74294o6050k4777N2860j52652K77731J04689j34621q3469
$$ -303340 -307307 -290085 -15791 -81841 -106618 -53758 -206410 71321 176010 41389 -42080
2033d2080K8951n9846n4102O3831k09437n5057J62328j4999l6104K16800K36787
$$ -42080 -13129 -72975 -127077 -63246 -272683 -327740 -165412 -180411 -216515 285 237072
2022B37072j06241j89251j84299J21349N1848J38406j37986j45734K36539J56741
$$ 237072 130831 -58420 -242719 -121370 -69522 68884 -69102 -214836 21703 178444
2012A78444j04370k11273N2735R6659N5651k2877j40959M8189Q040j5099l377
$$ 178444 74074 -137199 -84464 12195 67846 44969 -95990 -47801 -39761 -54860 -58237
2001e8237r1746n6060Q2262J46178J9131O1436j2323k74580M8547j2357K18291
$$ -58237 -149983 -206043 -123781 22397 41528 102964 90641 -183939 -135392 -147749 70542
1990G0542j62132j00658N6756p63K0751j6868j22455L8427p226J06666Q0397k5878
$$ 70542 -91590 -192248 -135492 -136255 -115504 -132372 -254827 -216400 -223626 -116960 -36563 -62441
1978f2441J17811j32676p7889j50980J47092J90626M3175k4505j72863L1697p4319
$$ -62441 55370 -77306 -155195 -306175 -159083 31543 74718 50213 -122650 -90953 -165272
1967a65272n6794K853j50980L71203k80843J6641J66274J06079j91349j59955
$$ -165272 -222066 -219213 -370193 1010 -279833 -263192 -96918 9161 -182188 -342143
1957c42143J60839j19415J95345m7433k45073K51508p1146p3512J69035j35205
$$ -342143 -181304 -300719 -105374 -152807 -397880 -146372 -217518 -291030 -121995 -257200
1947b57200K04817K49563l36994m3459O1420r9823K28977N5477O3975j23440O379
$$ -257200 -52383 197180 -139814 -183273 -121853 -221676 7301 62778 126753 3313 9692
1936I692p7920r8666R3084j12400K3764Q3366j7368J1881O7948K41049j89174
$$ 9692 -68228 -166894 -73810 -186210 -162446 -79080 -96448 -84567 -16619 224430 35256
1925C5256N339n1597j09121L6376N5412p7283m0555k8668o9154j2398j06441J71005
$$ 35256 40595 -11002 -120123 -83747 -28335 -105618 -146173 -174841 -243995 -256393 -362834 -191829
1913a91829m1448r4668J00174K46675p3517k16109j26743J77424J0316j1830K01464
$$ -191829 -233277 -327945 -227771 18904 -54613 -270722 -397465 -220041 -209725 -221555 -20091
1902b0091q5093O0250M6684p3379r463J9058q2941K03682J2282k69487M18067
$$ -20091 -105184 -44934 1750 -71629 -81092 -62034 -144975 58707 70989 -198498 219569
1891B19569j14601r3981Q5879j02026n8460r220p8436M4604j52669n6576P6369
$$ 219569 104968 10987 96866 -5160 -63620 -72840 -151276 -106672 -259341 -315917 -239548
1880b39548q9109m9830K02871K9483J16564J12414l8851q6732j53875o2550J60116
$$ -239548 -328657 -378487 -175616 -146133 -29569 82845 43994 -42738 -196613 -259163 -99047
1869i9047K15841j8022j33064L6600J2368J7715K0073l4442m9842J59762N7541
$$ -99047 116794 98772 -34292 2308 14676 32391 52464 18022 -31820 127942 185483
1858A85483J87326j10125k12086N1884j08624k2178J03507J09726j44769j65721
$$ 185483 372809 262684 50598 102482 -6142 -28320 75187 184913 40144 -125577
1848a25577n6521J06836p2666O0238j15718J48647k0102k57976L5401J87968R4453
$$ -125577 -182098 -75262 -147928 -87690 -203408 -54761 -74863 -332839 -297438 -109470 -15017
1837a5017j96313o8602Q5559k43665K34807J31961o2273L0518n6864o0547j9250
$$ -15017 -211330 -279932 -194373 -438038 -203231 -71270 -133543 -103025 -159889 -220436 -239686
1826b39686J16936Q5566R8061J43471n0247j5083J0667k432l33441j23469J95892
$$ -239686 -122750 -37184 60877 204348 154101 139018 149685 147253 -186188 -309657 -113765
1815a13765Q1443j65038K16692m4636k0491P6949j1670j70483O1210M6517r910
$$ -113765 -32322 -197360 19332 -25304 -45795 31154 19484 -150999 -89789 -43272 -53182
1804e3182J9538l80918P7608R7474N9278r8049R2554r550k5938K0477K27895J795
$$ -53182 -33644 -414562 -336954 -239480 -180202 -278251 -185697 -195247 -221185 -200708 27187 28982
1792B8982j4552J06826k39927J49157o6495Q2227N6000p9550j52380J58913j32876
$$ 28982 14430 121256 -118671 30486 -36009 46218 102218 22668 -129712 29201 -103675
1781a03675j84196K15373J01905j14640j60925J15853J09255J35590l0714K5405
$$ -103675 -287871 -72498 29407 -85233 -246158 -130305 -21050 114540 83826 109231
1771A09231o9857p357q935M0485J26430k59963k97774J10151Q8468j23721p8434
$$ 109231 39374 32017 23082 63567 189997 -69966 -367740 -257589 -169121 -292842 -371276
1760c71276R5869J9062l5293k637J85647r1212Q5657l7580k4548R8902J38694
$$ -371276 -275407 -256345 -291638 -294275 -108628 -199840 -114183 -151763 -176311 -77409 61285
1749F1285K3554J1821M7693r338k04589Q3271l2987n9821J4985O3251m7673m2430
$$ 61285 84839 96660 144353 135015 -69574 13697 -19290 -79111 -64126 -875 -48548 -90978
1737i0978K19330r4764j81684m5534j1453P6662P1675j93405j3245J25460J84510
$$ -90978 128352 33588 -148096 -193630 -205083 -128421 -56746 -250151 -263396 -137936 46574
1726D6574j42837l01774K15487L6036l7892K5587P936n0082m7640K48903j04079
$$ 46574 -96263 -398037 -182550 -146514 -184406 -158819 -150883 -200965 -248605 298 -103781
1715a03781j6136J12315J42892j32446o6790n161m890O6664O7563n6994j86687
$$ -103781 -119917 -7602 135290 2844 -63946 -69107 -73997 -7333 60230 3236 -183451
1704a83451m3485K19756r4066j53191M6233Q3556j88885K08473J63417j14870
$$ -183451 -226936 -7180 -101246 -254437 -208204 -124648 -313533 -105060 58357 -56513
1694e6513o7935N3542j15051r1006J88546k02983q397K5688J74167j36433n8745
$$ -56513 -124448 -70906 -185957 -276963 -88417 -291400 -299797 -274109 -99942 -236375 -295120
1683b95120J25300K1768K5282K12611l0743j89993L8479K1582k03904L6427J53178
$$ -295120 -169820 -148052 -122770 89841 59098 -130895 -92416 -70834 -274738 -238311 -85133
1672h5133k8787K02890j01278j15207O6837o9265m758K16205q0988j99059M360
$$ -85133 -113920 88970 -12308 -127515 -60678 -129943 -134701 81504 516 -198543 -194183
$$ [...]
##END NTUPLES=NMR SPECTRUM
##END=
