##TITLE=1H_CG-1181-a2
 CDCl3
 8 sc, 
 1.12.2023
##JCAMPDX= 6.0         $$ Bruker NMR JCAMP-DX V2.0
##DATA TYPE= NMR SPECTRUM
##DATA CLASS= NTUPLES
##ORIGIN= UXNMR, Bruker Analytische Messtechnik GmbH
##OWNER= root
$$ XWIN-NMR		Version 3.5
$$ Fri Dec  1 14:41:34 2023 Russian Standard Time (UT+4h)  she@DPX200
##.OBSERVE FREQUENCY= 200.1313
##.OBSERVE NUCLEUS= ^1H
##.ACQUISITION MODE= SIMULTANEOUS
##.ACQUISITION SCHEME= undefined
##.AVERAGES= 8
##.DIGITISER RES= 18
##SPECTROMETER/DATA SYSTEM= spect
##.PULSE SEQUENCE= zg30
##.SOLVENT NAME= CDCl3
##.SHIFT REFERENCE= (INTERNAL, CDCl3, 0, 15.4208)
##AUDIT TRAIL= $$ (NUMBER, WHEN, WHO, WHERE, WHAT)
$$ ##TITLE= Audit trail, XWIN-NMR		Version 3.5
$$ ##JCAMPDX= 5.01
$$ ##ORIGIN= Bruker BioSpin GmbH
$$ ##OWNER= she
$$ F:/spectra/data/she/nmr/H-F/1/pdata/1/auditp.txt
$$ ##AUDIT TRAIL=  $$ (NUMBER, WHEN, WHO, WHERE, WHAT)
(   1,<2023-12-01 14:40:25.71 +0400>,<she>,<DPX200>,
      <created by zg, POWCHK disabled, PULCHK disabled
       configuration hash MD5:
       00 E9 B6 7A A2 85 ED C7 34 08 36 98 17 FE 4E 26
       data hash MD5: 16K
       25 2F 3F 01 C1 D4 C9 94 20 2C 40 AD 4C C5 69 6C>)
(   2,<2023-12-01 14:40:28.18 +0400>,<she>,<DPX200>,
      <Start of raw data processing
       efp BC_mod = 2 LB = 0.24 FT_mod = 6 PKNL = 1 PHC0 = -24594.37 PHC1 = 17.45271 SI = 16K 
       data hash MD5: 16K
       E6 E3 B8 18 AC 82 08 BB 31 13 67 C8 81 B2 15 BF>)
(   3,<2023-12-01 14:40:53.29 +0400>,<she>,<DPX200>,
      <pk PHC0 = 4.944969 PHC1 = -9.599998 
       data hash MD5: 16K
       0F 28 FD 5A 98 93 BA E7 9A B3 DB 5F 86 3E B1 0B>)
(   4,<2023-12-01 14:40:56.73 +0400>,<she>,<DPX200>,
      <abs ABSG = 5 
       data hash MD5: 16K
       FA 08 B7 27 25 0B 63 B5 6D 9B FD 29 C3 4B 44 C1>)
$$ ##END=
$$ 
$$ hash MD5
$$ A4 DA 50 5A FE 47 0B 63 8D CF D1 37 72 01 55 B3
##$RELAX= 
##$RELAX= 
##$RELAX= 
##$RELAX= 
##$RELAX= 
##$RELAX= 
$$ Bruker specific parameters
$$ --------------------------
##$DU= <F:/spectra>
##$EXPNO= 1
##$NAME= <H-F>
##$PROCNO= 1
##$TYPE= <nmr>
##$USER= <she>
##$AMP= (0..31)
100 100 100 100 100 100 100 100 100 100 100 100 100 100 100 100 100 100 
100 100 100 100 100 100 100 100 100 100 100 100 100 100 
##$AQSEQ= 0
##$AQ_mod= 1
##$AUNM= <au_zg>
##$AUTOPOS= <>
##$BF1= 200.13
##$BF2= 200.13
##$BF3= 200.13
##$BF4= 200.13
##$BF5= 200.13
##$BF6= 200.13
##$BF7= 200.13
##$BF8= 200.13
##$BYTORDA= 1
##$CFDGTYP= 0
##$CFRGTYP= 5
##$CHEMSTR= <none>
##$CNST= (0..31)
1 1 145 1 1 1 1 1 1 1 1 1 1 1 1 1 1 1 1 1 1 1 1 1 1 1 1 1 1 1 1 1 
##$CPDPRG= <>
##$CPDPRG1= <>
##$CPDPRG2= <>
##$CPDPRG3= <>
##$CPDPRG4= <mlev>
##$CPDPRG5= <mlev>
##$CPDPRG6= <mlev>
##$CPDPRG7= <mlev>
##$CPDPRG8= <mlev>
##$CPDPRGB= <>
##$CPDPRGT= <>
##$D= (0..31)
0 1.2 0 0 0 0 0 0 0 0.06 0 0.03 0 0 0 0 0.0002 0 0 0 0 0 0 0 0 0 0 0 0 
0 0 0 
##$DATE= 1701427225
##$DBL= (0..7)
120 120 120 120 120 120 120 120 
##$DBP= (0..7)
150 150 150 150 150 150 150 150 
##$DBP07= 0
##$DBPNAM0= <>
##$DBPNAM1= <>
##$DBPNAM2= <>
##$DBPNAM3= <>
##$DBPNAM4= <>
$$ [...]
##$SUBNAM3= <"">
##$SUBNAM4= <"">
##$SUBNAM5= <"">
##$SUBNAM6= <"">
##$SUBNAM7= <"">
##$SUBNAM8= <"">
##$SUBNAM9= <"">
##$SW= 18.0517328524113
##$SWIBOX= (0..15)
0 0 2 0 0 0 0 0 0 0 0 0 0 0 0 0 
##$SW_h= 3612.71676300578
##$TD= 16384
##$TD0= 1
##$TE= 0
##$TE2= 300
##$TE3= 300
##$TEG= 300
##$TL= (0..7)
0 120 120 120 120 120 120 120 
##$TP= (0..7)
150 150 150 150 150 150 150 150 
##$TP07= 0
##$TPNAME0= <>
##$TPNAME1= <>
##$TPNAME2= <>
##$TPNAME3= <>
##$TPNAME4= <>
##$TPNAME5= <>
##$TPNAME6= <>
##$TPNAME7= <>
##$TPOAL= (0..7)
0.5 0.5 0.5 0.5 0.5 0.5 0.5 0.5 
##$TPOFFS= (0..7)
0 0 0 0 0 0 0 0 
##$TUNHIN= 0
##$TUNHOUT= 0
##$TUNXOUT= 0
##$USERA1= <user>
##$USERA2= <user>
##$USERA3= <user>
##$USERA4= <user>
##$USERA5= <user>
##$V9= 5
##$VALIST= <valist>
##$VCLIST= <CCCCCCCCCCCCCCC>
##$VD= 0
##$VDLIST= <DDDDDDDDDDDDDDD>
##$VPLIST= <PPPPPPPPPPPPPPP>
##$VTLIST= <TTTTTTTTTTTTTTT>
##$WBST= 1024
##$WBSW= 4
##$XGAIN= (0..3)
0 0 0 0 
##$XL= 0
##$YL= 0
##$YMAX_a= 322951
##$YMIN_a= -399604
##$ZGOPTNS= <>
##$ZL1= 120
##$ZL2= 120
##$ZL3= 120
##$ZL4= 120
##$ABSF1= 15.4472
##$ABSF2= -2.60465
##$ABSG= 5
##$ABSL= 3
##$ALPHA= 0
##$AQORDER= 0
##$ASSFAC= 0
##$ASSFACI= 0
##$ASSFACX= 0
##$ASSWID= 0
##$AUNMP= <proc_1d>
##$AZFE= 0.1
##$AZFW= 0.1
##$BCFW= 0
##$BC_mod= 2
##$BYTORDP= 0
##$COROFFS= 0
##$CY= -3
##$DATMOD= 1
##$DC= 0
##$DFILT= <>
##$DTYPP= 0
##$F1P= 0
##$F2P= 0
##$FCOR= 1
##$FTSIZE= 16384
##$FT_mod= 6
##$GAMMA= 0
##$GB= 0
##$INTBC= 1
##$INTSCL= 3.70164e-10
##$ISEN= 128
##$LB= 0.24
##$LEV0= 0
##$LPBIN= 0
##$MAXI= 10000
##$MC2= 0
##$MEAN= 0
##$ME_mod= 0
##$MI= 1.114404
##$NCOEF= 0
##$NC_proc= -6
##$NLEV= 6
##$NOISF1= 3.799351
##$NOISF2= 2.8
##$NSP= 0
##$NTH_PI= 0
##$NZP= 0
##$OFFSET= 15.42076
##$PC= 1
##$PHC0= -24589.42
##$PHC1= 7.852711
##$PH_mod= 1
##$PKNL= yes
##$PPARMOD= 0
##$PSCAL= 0
##$PSIGN= 0
##$REVERSE= no
##$SF= 200.13002020225
##$SI= 16384
##$SIGF1= 3
##$SIGF2= 2
##$SINO= 5.538805
##$SIOLD= 16384
##$SREGLST= <1H.CDCl3>
##$SSB= 0
##$STSI= 16384
##$STSR= 0
##$SW_p= 3612.71676300578
##$SYMM= 0
##$S_DEV= 0
##$TDeff= 16384
##$TDoff= 0
##$TI= <>
##$TILT= no
##$TM1= 0
##$TM2= 0
##$TOPLEV= 0
##$USERP1= <user>
##$USERP2= <user>
##$USERP3= <user>
##$USERP4= <user>
##$USERP5= <user>
##$WDW= 1
##$XDIM= 16384
##$YMAX_p= 471341866
##$YMIN_p= -357948
$$ End of Bruker specific parameters
$$ ---------------------------------
##NTUPLES= NMR SPECTRUM
##VAR_NAME=  FREQUENCY,     SPECTRUM/REAL,   SPECTRUM/IMAG
##SYMBOL=    X,             R,               I
##VAR_TYPE=  INDEPENDENT,   DEPENDENT,       DEPENDENT
##VAR_FORM=  AFFN,          ASDF,            ASDF
##VAR_DIM=   16384,         16384,           16384
##UNITS=     HZ,            ARBITRARY UNITS, ARBITRARY UNITS
##FACTOR=    0.220516191357247, 1,           1
##FIRST=     3086.15704129899, 0,            0
##LAST=      -526.55972170679, 0,            0
##MIN=       -526.55972170679, -357948,      0
##MAX=       3086.15704129899, 471341866,    0
$$ Real data points
##PAGE= N=1
##DATA TABLE= (X++(R..R)), XYDATA
$$ [...]
7701I016Q729R599m0334j2930K3560O5183J4081m3844L251o8m5116Q6206m8227
7688B9106j09930O3782o94l5428n0728k7045l4982J42415N2167q9209M0344N6060
7676C5858j18325j8015j5872J719N3959P0779q8197Q26K4745j05952P4639l1555
7664a15391L454M3489N365j62O1251L2809K6655j08467R2423K0290q5950M1307
7652A7073j5737j26224l5613R7908k6912Q1357O7851m5719K3175q3486M8370k6843
7640b4800J5636l1330l8914l7287J03858M1242n0204Q9242n3728l5722o6907L3028
7628e5886R3663j09886o6333k9171o11m8784J0579M8209J203J47795P1225n9348
7616B655p1687P1582j30092K3732p9479P5818K3664l9542n850J68294m0334k7706
$$ plain form
7701 9016 17745 27344 -12990 -25920 -2360 62823 76904 33060 36311 36243 -8873 77333 29106
7688 29106 -80824 -17042 -17736 -53164 -103892 -130937 -165919 -23504 28663 -60546 -20202 35858
7676 35858 -82467 -100482 -116354 -114635 -60676 10103 -78094 -77268 -52523 -158475 -83836 -115391
7664 -115391 -111937 -68448 -63083 -63245 -1994 30815 57470 -50997 41426 61716 -24234 17073
7652 17073 1336 -124888 -160501 -62593 -89505 -8148 59703 13984 37159 -46327 2043 -24800
7640 -24800 -9164 -40494 -79408 -116695 -12837 28405 -21799 67443 13715 -22007 -88914 -55886
7628 -55886 37777 -72109 -138442 -167613 -168224 -217008 -206429 -158220 -157017 -9222 62003 2655
7616 2655 -69032 2550 -127542 -103810 -183289 -107471 -83807 -123349 -129199 39095 -1239 -28945
7604b8945q4642K021N5252k5925O099n2027O9461M3917N7946m7251j40428P8577
7592f5945J5792j08472K3941Q5814M8298L3060J9226k9457j5892m6825K0484n1520
7580g1496L9585K150J2103L352K1450m0042p1397l7051P3895K2049j0183N2987
7568b598m81L1654j02174j9924n213m4696O0945K8816L9410N7193p5476k0621
7556e3165P6339l4833J5128m7620k029j03376O9778M6391k2296q098n2248L1747
7544h4282M9946J9367o8347M333R0895j1482k3588Q0239L1421J7891j07807o0815
7532f2229L5133k6369L5993Q9985j1561n067p5371o1776j34970Q0874K6357o2259
7520a71260J28067P7831Q3669j21971N1877n9505q3333M3154P4041j02315j3999
$$ plain form
7604 -28945 -113587 -111566 -56314 -82239 -76140 -128167 -58706 -14789 43157 -4094 -144522 -65945
7592 -65945 -50153 -158625 -134684 -48870 -572 32488 51714 22257 6365 -40460 -19976 -71496
7580 -71496 -31911 -29761 -17658 -14306 7144 -32898 -104295 -141346 -67451 -45402 -55585 -2598
7568 -2598 -3079 28575 -73599 -93523 -98736 -143432 -82487 -53671 -14261 42932 -32544 -53165
7556 -53165 23174 -11659 3469 -44151 -46180 -149556 -79778 -33387 -55683 -63781 -116029 -84282
7544 -84282 -34336 -14969 -83316 -78983 11912 430 -23158 57081 88502 106393 -1414 -62229
7532 -62229 -27096 -53465 -17472 72513 60952 55885 -19486 -81262 -216232 -135358 -109001 -171260
7520 -171260 -43193 34638 118307 -3664 48213 -11292 -94625 -51471 22570 -79745 -93744
7509i3744J52409q0629P883R9453n0915o6654J0429M038J4628n997M2704k5638
7497G967j16247k2574J2743K9032J09783K0228n5585O7084J5587l7960k5335j01773
7485i7050p3039P4935J30496L7151p3315k2097m0493n7683P321L6068k1654L7792
7473f1568M6573j37453J07784K2056M4176l4618l0006l2739k5589k4768J5219
7462a10933J05456K1893L1721o408J7296M6516K9201n1741o0005o5028O859J31789
7450I6616l2369L9753m1549k3422m2672l852M4060j22341J00706N2975l4994J1051
7438D3962M096l3530m9607n045J5313n8608K5394m5125J6636l4773J1395L4455
7426g5437J0017J2196m8502K931O208P7192M8471l3935o063m494J7712o0038k8156
$$ plain form
7509 -93744 58665 -21964 -14081 85372 34457 -32197 -21768 -17730 -3102 -9099 33605 7967
7497 7967 -108280 -130854 -118111 -89079 20704 40932 -14653 52431 68018 30058 4723 -97050
7485 -97050 -170089 -95154 35342 72493 -822 -22919 -63412 -121095 -113774 -77706 -99360 -61568
7473 -61568 -14995 -152448 -44664 -22608 21568 -13050 -43056 -75795 -101384 -126152 -110933
7462 -110933 -5477 16416 48137 41729 59025 105541 134742 83001 22996 -42032 -35173 96616
7450 96616 64247 104000 62451 39029 -3643 -7495 36565 -85776 14930 67905 32911 43962
7438 43962 48058 14528 -35079 -40124 -24811 -83419 -58025 -103150 -86514 -121287 -109892 -75437
7426 -75437 -65420 -53224 -101726 -98795 -92587 -15395 33076 -859 -6922 -11416 6296 -53742 -81898
7413h1898Q1404P1889M497n6844l5064P7487P8538q6396q2260M8400j4306K9119
7401C4566P7357o0859k4944N9345n965L001l9436n1781l0256q7948J1505L8168
7389g7247P4715L2052l2466q2827l5186Q7048j7697O0440M540O8482R098m5624
7377D5328O0113j38385K735j3436r120j1432j721J5301q1717k7061K5867R9104
7365c4424J4690l7288P5034K2907o0764n9522m7610L0524O8492m4438M2766O0048
7353C0415q479N0182l4680j07442N671P1794Q9392k3246m0969j00165m9398J20905
7341C980j5261J3358l0079k8429j7819Q7830J8362k8744j0445k7287o2316k4613
7329a21463L2627k5387O5492P6562o911n8759q9539J16051j6460q0981P4869j1891
$$ plain form
7413 -81898 -494 71395 75892 19048 -16016 61471 140009 53613 -28647 19753 5447 34566
7401 34566 111923 51064 26120 85465 79500 82501 43065 -8716 -38972 -126920 -115415 -77247
7389 -77247 -2532 29520 -2946 -85773 -120959 -33911 -51608 8832 13372 81854 90952 45328
7377 45328 105441 -32944 -30209 -43645 -52765 -64197 -65918 -50617 -132334 -159395 -133528 -34424
7365 -34424 -19734 -57022 18012 40919 -19845 -79367 -126977 -96453 -27961 -72399 -29633 30415
7353 30415 21936 72118 37438 -70004 -64333 7461 96853 73607 32638 -67527 -116925 3980
7341 3980 -11281 2077 -28002 -56431 -74250 13580 31942 3198 -7247 -34534 -96850 -121463
7329 -121463 -88836 -114223 -48731 27831 20920 -37839 -127378 -11327 -27787 -108768 -33899 -45790
7317d5790r675k3797J9066q0354j8093M4550N5744l3899M3167J1268K360j873
7305c7326k379q496j8409J7335M916r7968L6439J25153k314K9157K624r5906n4557
7292a01731k8436J6581l725L9975J82475p0936L6146K4122j4032k1813j05521
7281d6895m5620j7188N5528M4688L0488k2757K5012M5889J9119j1530n5889j4884
7269E961n6720K4254M512n362J9272o1623L9696k6482M380m503o7524J1885R499
7256a02755J08760L9124j00075L9909j1450O422O7370M0273j08085o8958J0007
7245g9458m9040J03226j4000l8306O715M1781J4148r6417M0187J03514r3565R6758
7233C5543Q6106j68137k1613P5000l0250m1403k383J1289K8825O3700J0511j09713
$$ plain form
7317 -45790 -55465 -79262 -60196 -140550 -158643 -114093 -58349 -92248 -49081 -37813 -35453 -37326
7305 -37326 -39705 -48201 -66610 -49275 -44359 -142327 -105888 19265 16951 46108 48732 -47174 -101731
7292 -101731 -130167 -113586 -117311 -77336 105139 34203 70349 94471 80439 58626 -46895
7281 -46895 -92515 -109703 -54175 -9487 21001 -1756 23256 69145 88264 76734 20845 5961
7269 5961 -50759 -26505 -21993 -27355 -8083 -69706 -30010 -56492 -52112 -56615 -124139 -112254 -102755
7256 -102755 6005 45129 -54946 -15037 -26487 -20065 47305 87578 -20507 -89465 -79458
7245 -79458 -128498 -25272 -39272 -77578 -70863 -29082 -14934 -111351 -71164 32350 -61215 35543
7233 35543 121649 -46488 -68101 6899 -23351 -64754 -67137 -55848 -27023 36677 47188 -62525
7221f2525k5339P7783n2586J8397N0134J6621j1982J9306L0253o5809p2658q1338
7209a59743M0572O2320J7030n0140j3388p147N8922O7623n922r7436k5151K7112
7197h5348O0816J0313j35483K9023Q1791M4362o4999P1759J6860j6652l2684o5088
7185h5330J36321k6755l2751j0684l5964M3178O8240k9701o0596L8708N3917L9509
7173I8092l9354K1409j11951p5490J32148j6461q3980l9152l524P2338N8898k8146
7161a5173Q092J06380L5390o0601M5117o5495j00152o6830J20668J6880p4097
7150d9821J32979q6257m3057k4148j7957M0260K1744N2440N0015p2486o7666P5264
7138A1310K0670R558K3888L5504J3431k4765M3196q7818j2938N3851q8198J00180
$$ plain form
7221 -62525 -87864 -10081 -62667 -44270 5864 22485 10503 29809 60062 -5747 -78405 -159743
7209 -159743 -119171 -56851 -39821 -89961 -103349 -110496 -51574 16049 10127 -87309 -112460 -85348
7197 -85348 -24532 -14219 -149702 -120679 -38888 5474 -59525 12234 29094 12442 -20242 -85330
7185 -85330 50991 24236 -8515 -19199 -55163 -11985 56255 26554 -34042 4666 58583 98092
7173 98092 58738 80147 -31804 -107294 24854 8393 -75587 -114739 -118263 -45925 12973 -15173
7161 -15173 -7081 99299 134689 74088 119205 53710 -46442 -113272 7396 24276 -49821
7150 -49821 83158 -3099 -46156 -70304 -88261 -48001 -26257 26183 76198 3712 -63954 11310
7138 11310 31980 41538 65426 100930 114361 89596 132792 44974 32036 85887 -2311 97869
7126I7869L1616j51067L5604m878J02674o367p4830l1075P844m4555m2480P6167
7114c478m2242j3510j2099j8899P3682L4504m2480l2211m1658J16277J29792L8027
7102A85705K1746p8954j15312R3071K5479p6528k5593Q4538l5815j28397L621
7091d6439j607o9962J48370P0905m7197m3159p2516l7221J34512J19748r8918
7080E6516q924K6351N6511J7512p3866J8782M5012o0331p4884o6462N0367Q0551
7068F7135r892K5064j99046J8216J30416J3507M7635K0545J1417n3891q3536R8549
7056H6119K0703r3359j8576K1808q5747K8559N2070r028Q9855N8360j15006j56632
7044a20874J30734O6002j8010J6951j3636O0966J5252n0535j4364Q1759m9j07933
$$ plain form
7126 97869 129485 -21582 14022 9144 111818 105451 30621 -454 7390 -37165 -79645 -3478
7114 -3478 -45720 -59230 -71329 -90228 -16546 17958 -24522 -56733 -98391 17886 147678 185705
7102 185705 207451 128497 13185 106256 131735 55207 29614 114152 78337 -50060 -46439
7091 -46439 -48046 -118008 30362 101267 54070 10911 -61605 -98826 35686 155434 56516
7080 56516 47592 73943 130454 147966 74100 92882 137894 77563 2679 -63783 -13416 67135
7068 67135 57243 82307 -116739 -98523 31893 45400 93035 113580 124997 71106 -12430 86119
7056 86119 106822 13463 -5113 16695 -69052 -40493 11577 2549 92404 150764 35758 -120874
7044 -120874 9860 75862 57852 74803 61167 122133 137385 86850 72486 154245 154196 46263
7032D6263P6348l281j0824n8797l4584j25287J16652O3252M9446O3709j12678
7021G0219p0412J60306Q5522l5970k3066Q584o2048p8662K2751J2400N952j392
7009I4184J3881J8583J5054l8207l3540k548o8331q4689R5829l0502J2586L4629
6997B6929k8339j2447L6L0780k5421J01343k1297m2889P0709l5976O6722k24l2372
6984I7554m0966p1444j5879p3517M615J08100j7202l3018K8202Q3522m1814R1340
6972A19493J6623k2105k7081j28006L6435J37160l0536m081N4839j1926J4847
6961A55662r9087Q2364o3665j12829L6030K977j7807R7214l578J5749K3596j825
6949A14801Q680n6859J0757P7858K9571m25N6913p9603R9410N1591j28363Q6512
$$ plain form
7032 46263 122611 119330 108506 49709 15125 -110162 6490 69742 119188 182897 70219
7021 70219 -193 160113 245635 209665 186599 195183 133135 54473 77224 89624 95576 94184
7009 94184 108065 126648 141702 103495 69955 67407 -924 -85613 10216 -20286 -7700 26929
6997 26929 -1410 -13857 -13821 16959 -8462 92881 71584 28695 99404 63428 130150 129926 97554
6984 97554 56588 -14856 -30735 -104252 -99637 8463 -8739 -41757 -13555 69967 28153 119493
6972 119493 136116 114011 86930 -41076 -4641 132519 101983 97902 152741 140815 155662
6961 155662 56575 138939 75274 -37555 -1525 1452 -16355 80859 77281 93030 116626 114801
6949 114801 123481 66622 77379 155237 184808 184383 241296 161693 261103 312694 184331 270843
6937B70843j129R6646n331j40030m0058r5657K6492j1736J4192l4119M1221j5072
6925A06262O0499m6933M9776M8839n0406M9977J1907j3497O329r937n1773m2618
6913A18425k125k4640L0614n5847n202J41142q8823o2769R4763J55832j05761
6902A95609j48389M6348M9666K4060N2510o0485j20366O4151N3125p704M3623
6891A92148O1736j1009l3099j35416J25042P9880p8129l102q9632Q6781k992j5602
6879A76606k7461O0383R975K4436l5342K2710r4453L4204m7767J20189j2550p0103
6867A60827j6724l2587N5738j8745k573q356R5464j7810l1631O6387n4869j11509
6855H3612N1039J1409j4852o0588Q0565k0652l9605N4249J45382n7818M6989M6235
$$ plain form
6937 270843 269714 366360 361029 220999 180941 85284 111776 100040 114232 80113 121334 106262
6925 106262 166761 119828 169604 218443 168037 218014 229921 216424 222753 212816 161043 118425
6913 118425 116300 91660 122274 66427 61225 202367 113544 50775 145538 301370 195609
6902 195609 47220 93568 143234 167294 219804 159319 38953 103104 156229 148525 192148
6891 192148 253884 242875 209776 74360 199402 279282 201153 198051 108419 195200 192208 176606
6879 176606 149145 209528 219503 243939 208597 231307 136854 171058 123291 243480 230930 160827
6867 160827 144103 111516 167254 148509 145936 137580 233044 215234 183603 249990 195121 83612
6855 83612 134651 146060 131208 70620 151185 130533 90928 145177 290559 232741 279730 325965
6843C25965m2327j39253K0387K9760l2458O4226J0074J6291q381j2796q3510J01105
6831B49083K4802N7017o8614j26654P1349Q4391p3444j2303M251J5398O802N7356
6819B89434Q38n8821m1877m8787n0622N3729Q4700o3120J7067p3918J05700R8108
6807C12431q1049l7663o495k7422M5918K0133J26918k3263k3447O8015p040l9536
6795C27500O348q4119N890R7100k4269q82n2537j63344l3069K1326J00067L4679
6783B34690J0586L5486K755Q1695j370p785k299L9895M577l23n0136n2168J29871
6770D25474k0685k3032K2477J45933m6981j74025k2403P737O9435j2551j5903
6759C55476m8661L5170R5411P772L8311l2438N6226R8803L291l5829k0519k0708
$$ plain form
6843 325965 283638 144385 164772 194532 162074 226300 236374 252665 244284 231488 147978 249083
6831 249083 273885 330902 262288 135634 206983 291374 217930 205627 209878 225276 232078 289434
6819 289434 290272 231451 189574 140787 90165 143894 228594 165474 182541 108623 214323 312431
6807 312431 231382 193719 187224 159802 205720 225853 352771 329508 306061 374076 367036 327500
6795 327500 333848 249729 255619 352719 328450 327568 275031 111687 78618 99944 200011 234690
6783 234690 245276 280762 283517 365212 363842 356057 353758 393653 398230 397907 347771 295603 425474
6770 425474 404789 381757 404234 550167 503186 329161 306758 314495 383930 371379 355476
6759 355476 306815 341985 437396 445168 483479 451041 507267 606070 609361 573532 553013 532305
6747E32305k6861R8317j0263Q9974j4009m1072m7116L1732K8156L0632r1398J8285
6735E98682J7660n914n163J8220M9823n4588p068K2015P3036J7335M8330r450
6723G62918q144J06993J24053P4528K1133O1814p062r2327q2301o6092m5371L998
6711H54140N3493o9860k6546o9264m316Q4659k3498L6139J3714j33112j01041
6700F14508J62640Q7029L0226K9025L3724j11564M7055M5272n3939M0924M9174
6689I74074J2625n6904q9477l0264l1143N37Q336j0016m196p8166P8743j4846
6677G59303m3356l2564J8159J6154k471k6802k3473M1454P387N8534r0868L9619
6665G21076j0469J5016k0859j416K8031M026R9138n2597M6157j0014k5010l0988
$$ plain form
6747 532305 505444 603761 593498 683472 669463 628391 581275 613007 641163 671795 580397 598682
6735 598682 616342 610428 605265 623485 673308 618720 611652 633667 706703 724038 772368 762918
6723 762918 754774 861767 985820 1060348 1081481 1143295 1136233 1043906 961605 895513 850142 854140
6711 854140 907633 837773 811227 741963 737647 822306 798808 834947 848661 715549 614508
6700 614508 777148 864177 894403 923428 957152 845588 892643 937915 883976 924900 974074
6689 974074 986699 929795 840318 810054 778911 779448 787784 777768 773572 695406 774149 759303
6677 759303 715947 683383 701542 717696 715225 688423 664950 706404 713791 772325 681457 721076
6665 721076 710607 725623 704764 703348 731379 735405 834543 781946 828103 818089 793079 762091
6653G62091m303m7985O4813l2141l1530N2195P2284q5195N6477J18430M4750j9860
6641I50026p2331M8040N9055m5196o8694K7117L673j0553k2626J13189j0890j12532
6629H58278k3149L8415J10988J7313j38055Q9651j9875R7803Q3279M6216J33659
6618A294523o1561M0646p5422o2131l1329N2292J7617p7813L037Q7635N2922N5391
6606A295807O4624O6502J7883r433j28539J3093O8725L4928N6899m2961r259k6417
6594A401852O4274L9782J0738o7417n0499L2484J6670N5482O9916J06133j12456
6583A566959m8980J07319L0216J0406J42079Q195j43724p8738K35535l149n2828
6572A773290J04308O2355m898k9276p0494M6983J91134J02154M933o0807J12823
$$ plain form
6653 762091 757788 709803 774616 742475 710945 763140 835424 750229 806706 925136 969886 950026
6641 950026 877695 925735 984790 939594 870900 898017 901690 891137 868511 981700 970810 858278
6629 858278 835129 873544 984532 1001845 863790 953441 933566 1031369 1114648 1160864 1294523
6618 1294523 1232962 1273608 1198186 1136055 1104726 1157018 1174635 1096822 1099859 1187494 1240416 1295807
6606 1295807 1360431 1426933 1444816 1435383 1306844 1319937 1388662 1423590 1480489 1437528 1428269 1401852
6594 1401852 1466126 1505908 1516646 1449229 1398730 1431214 1447884 1503366 1573282 1679415 1566959
6583 1566959 1517979 1625298 1655514 1665920 1807999 1816194 1672470 1593732 1829267 1826118 1773290
6572 1773290 1877598 1939953 1935055 1905779 1835285 1882268 2073402 2175556 2180489 2119682 2232505
6561B232505K6520n838j0643j4325K9117l8962N441O6601l4531Q4686m7803N5611
6549B348379K620O9845J17149Q3329k6255l2989O3832P1009n582j9129J00115
6538B772323K2296J24156N4730K1345Q3204l3081L3379L9519Q6508R5081N7936
6527C357396Q2590O8029J45698O8712N1949M8330K9730J68166J25848O4499P7660
6516D288607N8079m6786Q7377L590P8331P4162J0495J40640J38405J1987O0331
6505D905218J61836J45038J64586K10464J74866N7072J18158J17679P1163J23306
6495F249386R8854J4828Q3038J17778R8376J58450J90043O5776J13044K32876
6485G422449J98565J32739J51835J12874J37489J42393J44381J29677J25257K85978
$$ plain form
6561 2232505 2259025 2253187 2242544 2228219 2257336 2218374 2223815 2290416 2255885 2340571 2292768 2348379
6549 2348379 2350999 2420844 2537993 2621322 2595067 2562078 2625910 2696919 2691337 2672208 2772323
6538 2772323 2794619 2918775 2973505 2994850 3078054 3044973 3078352 3117871 3204379 3299460 3357396
6527 3357396 3439986 3508015 3653713 3722425 3774374 3822704 3852434 4020600 4146448 4210947 4288607
6516 4288607 4346686 4299900 4387277 4390867 4469198 4543360 4553855 4694495 4832900 4844887 4905218
6505 4905218 5067054 5212092 5376678 5587142 5762008 5819080 5937238 6054917 6126080 6249386
6495 6249386 6348240 6363068 6446106 6563884 6662260 6820710 7010753 7076529 7189573 7422449
6485 7422449 7621014 7753753 7905588 8018462 8155951 8298344 8442725 8572402 8697659 8983637
6475H983637K07390K34507K26177K98991L73356K65090K56024L07098L31745L00849
6465A1784864K97995J85736L33616L02614M03374L84696K97878L51656L46716
6456A4689145M49093M90026O37139P08695P75931P21942R31466R77382R93797
6447B1374616J233726J383257J528377J704084K191486K569295K978548L523381
6439C8486770M250571N085347N911949O568219O238710L969248K49598l049364
6431F7711048n060803n406473m936942l901890k675127j873605j026635l00467
6423D2529106M0332O00615J206394J785961K486541L164398L939714M914238O312685
6414F6979984P965353R793135J1700042J3479755J2694837Q372252L26026p943208
$$ plain form
6475 8983637 9191027 9425534 9651711 9950702 10324058 10589148 10845172 11152270 11484015 11784864
6465 11784864 12082859 12268595 12602211 12904825 13308199 13692895 13990773 14342429 14689145
6456 14689145 15138238 15628264 16265403 16974098 17750029 18471971 19403437 20380819 21374616
6447 21374616 22608342 23991599 25519976 27224060 29415546 31984841 34963389 38486770
6439 38486770 42737341 47822688 53734637 60302856 66541566 70510814 70760412 67711048
6431 67711048 62650245 57243772 52306830 48404940 45729813 43856208 42829573 42529106
6423 42529106 42569438 43170053 44376447 46162408 48648949 51813347 55753061 60667299 66979984
6414 66979984 74945337 84738472 96438514 109918269 122613106 130985358 131311384 123368176
6406A23368176j3239355j4594949j3158104j0807103q209164o107969m749870
6399E2501662l541573k586580j787151j294069q60305p2599M96842J184438J812078
6390D5852743K571237L552148M482743N543384O347883O048296L593936q05726
6382G7186644n070371p559405q239983p591614o358272n196397m048366l225186
6374B9897050k739350k284890j867388j658368j440802j192965r86904q50600
6366A6875783r56689o75503o19539m85359l68405n70294l58465l54577l51576
6357A2135376l05129k65484l22237k40126l36622l71061l77709m42240l42180
6348I132588k44039k80450k16160k32182k16878j15344o3004j89255p1539o7601
$$ plain form
6406 123368176 110128821 95533872 82375768 71568665 63359501 57251532 52501662
6399 52501662 48960089 46373509 44586358 43292289 42431984 42359385 42856227 44040665 45852743
6390 45852743 48423980 51976128 56458871 62002255 68350138 74398434 77992370 77186644
6382 77186644 72116273 64556868 56316885 48725271 42366999 37170602 33122236 29897050
6374 29897050 27157700 24872810 23005422 21347054 19906252 18713287 17726383 16875783
6366 16875783 15919094 15243591 14624052 14138693 13770288 13199994 12841529 12486952 12135376
6357 12135376 11830247 11564763 11242526 11002400 10665778 10294717 9917008 9474768 9132588
6348 9132588 8888549 8608099 8391939 8159757 7942879 7827535 7764531 7575276 7503737 7436136
6338G436136j78574q3207j14556r3313n267k362p1363k5341M4453J21630J53928
6327G182164J28454J83822J72157J85199J15536L60326K15622p0920k88289l15736
6317G868335l22634k50447j08594j57469J2386j92979r9901j32348l9818J00420
6307F676951N4139M3459K9911M1882o3567P9802L1156P6636M1965K24495L00819
6296G537648L54946L13028K46460M53837O10605L58544K43837L66298J16928j0394
6286A0591737m0069j17935r2402j84451j6404J63338K82182K44348M54888O34919
6276A1920151P51067R13492P88619O32186K46384j72884m54742o08429n82952
6267A3432892m06950m22514j62256k9745K26389M60366O46879P04492M86525Q56
$$ plain form
6338 7436136 7257562 7174355 7059799 6966486 6961219 6958857 6887494 6862153 6906606 7028236 7182164
6327 7182164 7310618 7494440 7666597 7851796 7967332 8327658 8543280 8472360 8184071 7868335
6317 7868335 7545701 7295254 7186660 7029191 7041577 6848598 6748697 6616349 6576531 6676951
6307 6676951 6731090 6774549 6804460 6846342 6782775 6862577 6893733 6970369 7012334 7236829 7537648
6296 7537648 7892594 8205622 8452082 8905919 9516524 9875068 10118905 10485203 10602131 10591737
6286 10591737 10551668 10433733 10341331 10156880 10140476 10303814 10585996 10830344 11285232 11920151
6276 11920151 12671218 13584710 14373329 15005515 15251899 15079015 14624273 14015844 13432892
6267 13432892 13025942 12603428 12441172 12411427 12637816 13098182 13745061 14449553 14936078 14936934
6257A4936934j75535N9532K75646M74385N78855Q83573J211559J409573J796063
6248B1450585J884931J434028O46724n64203j617168k042449k210150j849531
6240A7132767j465294j198695p87728n94076m59716l28808j87312M7509m976K70877
6230A2424548M28442O42173Q12032O98995K53735j8492K48688N11955N13729L95113
6220A6910918N2996n01863r82040j083945j123832j112084p94223n80979n89887
6211A0195061l85440k73555l39813k76278k27909k07191k9266q3361l8031j45384
6201H188833m2669J38713o7653j1435J99754J69572J71997m5856k92126k36604
6191H172526j85679p748r6561m5759M6310J47384J59565m6471K1798Q2631Q2317
$$ plain form
6257 14936934 14761399 14820931 15096577 15570962 16149817 17033390 18244949 19654522 21450585
6248 21450585 23335516 24769544 25416268 24852065 23234897 21192448 18982298 17132767
6240 17132767 15667473 14468778 13681050 13086974 12627258 12298450 12111138 12158647 12153671 12424548
6230 12424548 12852990 13495163 14307195 15006190 15259925 15241433 15490121 16002076 16515805 16910918
6220 16910918 16963914 16462051 15480011 14396066 13272234 12160150 11365927 10784948 10195061
6211 10195061 9809621 9536066 9196253 8919975 8692066 8484875 8455609 8372248 8334217 8188833
6201 8188833 8146164 8284877 8217224 8205789 8405543 8575115 8747112 8701256 8409130 8172526
6191 8172526 7986847 7979099 7882538 7836779 7883089 8030473 8190038 8143567 8165365 8247996 8330313
6180H330313J88504J12775K79475J28718J18942N2399j6051L8140J24619J16564
6170I474398J49583Q6315J26549Q2893J80072K04986K99140J64543J54138L09199
6160A1231816L40966L09749K91307L32500L06755L35238K61328K02445L09598
6151A3921702L85061M62181L79372M14844N49753N01061N18079M07247M21987
6142A7961287O03177O62479P37698P16079Q58714J071786J205287J361860J488608
6133B6666975J736567K093703K451512K921554L612309M652004N841695O964815
6125E6941134Q499802R466400P693933J943114l897223o440776o061328m720078
6117F3424978k550837o43193J055625K719685M685979O068347N198566J556706
$$ plain form
6180 8330313 8518817 8631592 8911067 9039785 9158727 9211126 9195075 9233215 9357834 9474398
6170 9474398 9623981 9710296 9836845 9919738 10099810 10304796 10603936 10768479 10922617 11231816
6160 11231816 11572782 11882531 12173838 12506338 12813093 13148331 13409659 13612104 13921702
6151 13921702 14306763 14768944 15148316 15563160 16112913 16613974 17132053 17539300 17961287
6142 17961287 18564464 19226943 19964641 20680720 21539434 22611220 23816507 25178367 26666975
6133 26666975 28403542 30497245 32948757 35870311 39482620 44134624 49976319 56941134
6125 56941134 65440936 74907336 82601269 84544383 80647160 74206384 68145056 63424978
6117 63424978 60874141 60230948 61286573 64006258 68692237 74760584 79959150 81515856
6109H1515856j444502j027874J035772L359158N389490N582243K884556j463405
6101I5831294n436366o699586n751675l491318j080621J379515L115247K066032
6093G9932522k127532n126028m891365l459794j365668Q26949K888372N020223
6085G1697679O782893P567498M573404k808517r239739j1076145j0248202q538894
6077D8709977o735932n072232l957626l159824k482348k042984j729568j681109
6069B1848354j492454j337179j134195r63185p92186o68776p01029p43525n79903
6060A3435922m38665n04367n34007n05920m43033l91254l79179m39678l96826
6051I402993l18634j74162k51383l81131l08267j77910j94443k13169r9451k34490
$$ plain form
6109 81515856 80071354 79043480 80079252 83438410 88827900 94410143 97294699 95831294
6101 95831294 90394928 83695342 77943667 74452349 73371728 74751243 77866490 79932522
6093 79932522 77804990 72678962 67787597 64327803 62962135 63789084 66677456 71697679
6085 71697679 78480572 86048070 90621474 87812957 78573218 67497073 57248871 48709977
6077 48709977 41974045 36901813 32944187 29784363 27302015 25259031 23529463 21848354
6069 21848354 20355900 19018721 17884526 16921341 16129155 15460379 14759350 14015825 13435922
6060 13435922 12997257 12492890 11958883 11452963 11009930 10618676 10239497 9799819 9402993
6051 9402993 9084359 8910197 8658814 8277683 7969416 7791506 7597063 7383894 7284443 7049953
6041G049953k09167j10377j60980j30469j71094q2456j39506n4432q3507j06510
6031E801455j13771k10480j96054Q295K2604j23950j82537j56090q2627j22120
6021D644725N9960q5329J9721j2139k7898j5469K1361m8213m4097j9022k6782
6010D466818n2355m2561j2201k5549N1014N5559m281o3550N075L7262K2826O6576
5998D504633L8639j16562n9549j1332j17499J24359N4557j3495j7763q5176m7945
5987D252867n8912P6688M0161N5905M5510q9099O2260L2698J09227K644q3099
5976D446850P0448O2882M1760P6081j8379J99873N434k8518J23753L6478M1047
5965E057709M1609N5346R7933N5112N2697M5787L2387O4923J07571J17096J08492
$$ plain form
6041 7049953 6840786 6730409 6569429 6438960 6267866 6185410 6045904 5991472 5907965 5801455
6031 5801455 5687684 5477204 5281150 5289445 5312049 5188099 5005562 4849472 4766845 4644725
6021 4644725 4704685 4619356 4639077 4626938 4599040 4583571 4604932 4556719 4512622 4493600 4466818
6010 4466818 4414463 4371902 4359701 4334152 4385166 4440725 4436444 4372894 4377969 4415231 4438057 4504633
5998 4504633 4543272 4426710 4367161 4355829 4238330 4362689 4417246 4403751 4385988 4300812 4252867
5987 4252867 4193955 4270643 4310804 4366709 4412219 4323120 4385380 4418078 4527305 4529949 4446850
5976 4446850 4517298 4580180 4621940 4698021 4679642 4879515 4884949 4856431 4980184 5016662 5057709
5965 5057709 5099318 5154664 5252597 5307709 5360406 5406193 5438580 5503503 5611074 5728170 5836662
5954E836662K46376K5244O7523N6864J48416J13504K2374J22474J72482K31330
5944G043249J98572P8690K08236N4999J60450J10063J09436K82430K32563L15390
5934H794078L88654K60665K50962K33427R4666J44535N6638o0828R6453P8363
5924A0337613J86445J24855L16189J84471J60348K53696K92915K58177K10724
5915A2325433K49006K81880L93957L08041J91221L72403M23417M49959L70955
5906A5366272L79528M49856N22060O56765N86989Q28354P58670J013950R87425
5897B1549869J098445J337420J598550J747815J824971K167179K634493L281950
5889C7240692L819873M419890N357258O551473P614761Q165092P090477L356555
$$ plain form
5954 5836662 6083038 6108282 6175805 6232669 6381085 6494589 6516963 6639437 6811919 7043249
5944 7043249 7241821 7320511 7528747 7583746 7744196 7854259 7963695 8246125 8478688 8794078
5934 8794078 9182732 9443397 9694359 9927786 10022452 10166987 10223625 10162797 10259250 10337613
5924 10337613 10524058 10648913 10965102 11149573 11309921 11563617 11856532 12114709 12325433
5915 12325433 12574439 12856319 13250276 13558317 13749538 14121941 14545358 14995317 15366272
5906 15366272 15745800 16195656 16717716 17374481 17961470 18789824 19548494 20562444 21549869
5897 21549869 22648314 23985734 25584284 27332099 29157070 31324249 33958742 37240692
5889 37240692 41060565 45480455 50837713 57389186 65003947 73169039 80259516 83616071
5881H3616071j915490n785136p284506o970079n781519m313563l133820k215665
5873D6216293j378547o79117K1032M82077J111106J882558K778584L522965M410011
5864E8366962N647574P252526R132006J1335057J3510690J4821335J2426752M782102
5856A37275004n456037j3100772j5634280j4635853j2190229r700492p534343
5849E9022998n728275m532627l230863k506145j941434j199293o55934p2954N73314
5840C9728787J075748J610299K447239L128598M083544M946445N395555M638117
5832F7054332J788918k451473n994994p314474p292927o300672m988948l873669
5824C0626093l185726k696425k127620j849997j467446j285103j170206r26988
$$ plain form
5881 83616071 81700581 75915445 68630939 61660860 55879341 51565778 48431958 46216293
5873 46216293 44837746 44158629 44179661 44661738 45772844 47655402 50433986 53956951 58366962
5864 58366962 64014536 71267062 80399068 91734125 105244815 120066150 132492902 137275004
5856 137275004 131818967 118718195 103083915 88448062 76257833 66557341 59022998
5849 59022998 53294723 48762096 45531233 43025088 41083654 39884361 39228427 39155473 39728787
5840 39728787 40804535 42414834 44862073 47990671 52074215 57020660 62416215 67054332
5832 67054332 68843250 66391777 60396783 53082309 45789382 39488710 34499762 30626093
5824 30626093 27440367 24743942 22616322 20766325 19298879 18013776 16843570 15916582
5816A5916582q51238p20342o28833p24804n17356n58207l74806m71493m34438
5807A0635065l44404l23600l25013m12926k60625k51678k57694k76002l08323
5798G874800j36986j43279k62920j68329j44252j75058j41982k18037r747j16685
5788F357525j13237R235j28744k0605m3389j11681p1868l905q984k5945l3803
5777E804599r4884l7885J2785j41730j35933K6985R4991j5453K3919j6051M8444
5766E569787m0246K3381L0278K3147r0585n9901p4461k6111J17370J3548q2524
5755E403683j6553Q6725R2862O9589P1884o5901j23689k5200K7805p5353M9742
5744E495594J49778M3137p640l1121L7097r3195j17016o8671m9253k1527k5823
$$ plain form
5816 15916582 15065344 14345002 13716169 12991365 12474009 11915802 11540996 11069503 10635065
5807 10635065 10290661 9967061 9642048 9229122 8968497 8716819 8459125 8183123 7874800
5798 7874800 7737814 7594535 7331615 7163286 7019034 6843976 6701994 6483957 6474210 6357525
5788 6357525 6244288 6253523 6124779 6104174 6060785 5949104 5877236 5873331 5864347 5838402 5804599
5777 5804599 5709715 5671830 5684615 5542885 5406952 5433937 5528928 5513475 5537394 5521343 5569787
5766 5569787 5529541 5552922 5583200 5606347 5515762 5455861 5381400 5355289 5472659 5486207 5403683
5755 5403683 5387130 5473855 5566717 5636306 5708190 5642289 5518600 5493400 5521205 5445852 5495594
5744 5495594 5645372 5688509 5680869 5649748 5686845 5593650 5476634 5407963 5358710 5337183 5311360
5733E311360j2190R9772l0501Q9090R4585J09022K9493K4004J03264J81649J41733
5722F141281l4346q5586j09681K9054L3220P1118K01486J52198J00866K30806
5712F730416J60944K62488K90770L45685L31238M57744N98831O80516P67000J002202
5702A1627834J181868J221378J131743N78943O4977n36430r13946j005016r16712
5693A2434639p40784m96263l88898k56306j86371l8892l4256O5755L29695L12173
5683A1000492L91052M76816P85317Q58152J093227J379412J656127K087193K307952
5674B2035740K241843J412447j10261j440215k150451k315073j935127j535168
5666A6203735j287825j074420o82012n02635m48357l16793j29477j46297J4786
$$ plain form
5733 5311360 5299170 5398942 5368441 5457531 5552116 5661138 5690631 5714635 5817899 5999548 6141281
5722 6141281 6106935 6021349 5911668 5940722 5973942 6045060 6246546 6398744 6499610 6730416
5712 6730416 6891360 7153848 7444618 7790303 8121541 8579285 9178116 9858632 10625632 11627834
5702 11627834 12809702 14031080 15162823 15741766 15806743 15270313 14356367 13351351 12434639
5693 12434639 11693855 11197592 10808694 10552388 10366017 10327125 10292869 10358624 10688319 11000492
5683 11000492 11391544 11868360 12653677 13511829 14605056 15984468 17640595 19727788 22035740
5674 22035740 24277583 25690030 25579769 24139554 21989103 19674030 17738903 16203735
5666 16203735 14915910 13841490 13159478 12656843 12208486 11891693 11762216 11615919 11630705
5657A1630705m6386r5752O3336J89968L17953O03674O10891O97185Q52663Q06439
5647A5630676N58415J68250n63798q97679q69021q18044o61595n95329n63842
5638A1388033l65118k28380k75521j97619k55434j53101L2747n663M9561j13808
5628I875697m0225N3163l8922N5087Q5870J26038J42000K22499Q9536J80556L22976
5617A1074275L64371J01772L62578K06429J86104K10066J25140L63459K77243
5608A3271437J96820K73360L10298L28771L66944M20473K77147L89764N53377
5599A6388391M43764N15781N04900N71411N82889P27984Q35796Q44277Q63365
5590B2278558R51627J207486J324878J594392J833662K068711K326073K932753
$$ plain form
5657 11630705 11584319 11488567 11551903 11741871 12059824 12663498 13274389 13971574 14824237 15630676
5647 15630676 16189091 16357341 15793543 14895864 14026843 13208799 12547204 11951875 11388033
5638 11388033 11022915 10794535 10519014 10321395 10065961 9912860 9945607 9939944 9989505 9875697
5628 9875697 9835472 9888635 9849713 9904800 9990670 10116708 10258708 10481207 10570743 10751299 11074275
5617 11074275 11438646 11540418 11902996 12109425 12295529 12505595 12630735 12994194 13271437
5608 13271437 13468257 13741617 14051915 14380686 14747630 15168103 15445250 15835014 16388391
5599 16388391 16832155 17347936 17852836 18424247 19007136 19735120 20570916 21415193 22278558
5590 22278558 23230185 24437671 25762549 27356941 29190603 31259314 33585387 36518140
5582C6518140L547207M242028N271164O611766Q054674R638274J0332597Q018521
5574I2234371J398630n264187p682904p081051n138284k928550n60294J464506
5566F6442237L346795M952941M910554J774909j898459k780107j301120Q05657
5558G6253407L220352N532907O621776N142524R40605l786003o386187n995037
5550H1544344l940076j568995P89061J104980k035840m980563n507738m379164
5542F1026009k767957r95438P82755K730484M325516N729173O093220L134993
5534H0058755k893559q074993r692334q760744p258080n821251m450140l472125
5526B9635529k819369k266236k005989j751590j490647j148918j030282r04130
$$ plain form
5582 36518140 40065347 44307375 49578539 56190305 64244979 73883253 84215850 92234371
5574 92234371 93633001 88368814 80685910 73604859 68466575 65538025 64977731 66442237
5566 66442237 69789032 74741973 79652527 81427436 79528977 76748870 75447750 76253407
5558 76253407 79473759 85006666 91628442 96770966 97711571 93925568 87539381 81544344
5550 81544344 77604268 76035273 76824334 77929314 75893474 70912911 65405173 61026009
5542 61026009 58258052 57262614 58045369 60775853 65101369 70830542 76923762 80058755
5534 80058755 77165196 69090203 59397869 50637125 43379045 37557794 33107654 29635529
5526 29635529 26816160 24549924 22543935 20792345 19301698 18152780 17122498 16218368
5518A6218368o58809p76671p07142n09858n77486n28456m55985m25261l94590
5509A1184110m71495m22016n24802m16054n28817l26823l60832l02672l43123
5500G487476k98477k36663j70158j94015j25167j52320j31573j99488k46857n3488
5490E679270r6317j45998j59637j32588k07155j93841j45048j93583j55982p0130
5480D178991r2342p889j35595j51056j35310q2410q9408p3291n7276r8196j41974
5469C114244o5951n6096p8093J1646L1923p8305j11210o4847K1208l4091p0974
5458B619454L3346p8759m9624j03404n1811m304L746n0808P361R704n6519j78639
5446B099743N8304l3090r525j7583j07349o0129l7853n8334K6546M2803k5231
$$ plain form
5518 16218368 15559559 14782888 14075746 13565888 12988402 12459946 12003961 11578700 11184110
5509 11184110 10712615 10290599 9765797 9349743 8820926 8494103 8133271 7830599 7487476
5500 7487476 7188999 6952336 6782178 6588163 6462996 6310676 6179103 5979615 5732758 5679270
5490 5679270 5582953 5436955 5277318 5144730 4937575 4743734 4598686 4405103 4249121 4178991
5480 4178991 4086649 4078760 3943165 3792109 3656799 3574389 3484981 3411690 3354414 3256218 3114244
5469 3114244 3048293 2992197 2914104 2925750 2957673 2879368 2768158 2703311 2724519 2690428 2619454
5458 2619454 2652800 2574041 2524417 2421013 2369202 2364898 2368644 2317836 2325197 2334901 2278382 2099743
5446 2099743 2158047 2124957 2115432 2097849 1990500 1930371 1892518 1834184 1860730 1903533 1878302
5435A878302k2381j01334q4917m0779p4421M9914p192O5782m717j33218j7700
5424A507339J8338l7514k8682L0488j17523L9322r8361p5542L0158Q841j15611
5413A161253p4254j3434M2147N4428J9153K2380J6052j9366N771j1976K890k3101
5401A181943o3613N2923J9621j42512M4268Q7174J3079n1631K8319l5991Q280
5390A141860n0659J78697K9123n8464Q726O792l744o6405O8660j043n2435q607
5378A192501q519L8496P4451R696K8244q493l5263n0923O454m0942P9308M2830
5366A327840r951K8034o3758J9048o5667j11244r6557M8917n7511N7948r813q234
5354A059052o459Q3203J71429o8403L1011J34321O9364L3483j1663n0389j05181
$$ plain form
5435 1878302 1855921 1754587 1669670 1628891 1554470 1604384 1597192 1662974 1658257 1525039 1507339
5424 1507339 1525677 1488163 1459481 1489969 1372446 1411768 1313407 1237865 1268023 1276864 1161253
5413 1161253 1086999 1073565 1115712 1170140 1189293 1211673 1227725 1208359 1214130 1202154 1205044 1181943
5401 1181943 1118330 1171253 1190874 1048362 1092630 1179804 1192883 1141252 1169571 1133580 1141860
5390 1141860 1091201 1269898 1299021 1240557 1249283 1256075 1252331 1185926 1254586 1253543 1201108 1192501
5378 1192501 1183982 1222478 1296929 1306625 1334869 1326376 1291113 1240190 1246644 1205702 1285010 1327840
5366 1327840 1317889 1345923 1282165 1301213 1235546 1124302 1027745 1076662 1019151 1077099 1067286 1059052
5354 1059052 1052593 1135796 1307225 1238822 1269833 1404154 1473518 1507001 1495338 1444949 1339768
5343A339768M4855k042n351L2417p9780O7609R1161O14L6308K6402k2149O9882
5331A599694j18961N481j39275j51416p3589J7463K1680l6739p2180m7720n4954
5320I49484k0773k7400Q881O3176n8953K1688O008N5517J278n685j5809N7191
5308A034603L9930k8398r1606l942J51255o436N4671J26625O6388p0240p407l5139
5296A230304N9688k8199m0429j01376j27117L8287O4903p6477p5197M2910o7918
5285I19379l8485J09275p15Q4195M3963j1986J33856l6777n7995m9864o26O1666
5273A155886n2505p038N6812R7257M6002k7218m9901l5806o7507L187m5629L1561
5261A105101n4535j1077J6680p8997N8432k1427M0712K9897R2817O0389J995J60431
$$ plain form
5343 1339768 1384623 1382581 1377230 1409647 1329867 1397476 1488637 1489251 1525559 1551961 1529812 1599694
5331 1599694 1480733 1486214 1346939 1195523 1121934 1139397 1161077 1124338 1052158 1004438 949484
5320 949484 928711 901311 910192 973368 914415 936103 942111 997628 998906 993221 977412 1034603
5308 1034603 1074533 1046135 954529 950587 1101842 1095406 1150077 1276702 1343090 1272850 1265443 1230304
5296 1230304 1289992 1261793 1221364 1119988 992871 1031158 1096061 1019584 944387 987297 919379
5285 919379 880894 990169 989454 1073649 1117612 1105626 1239482 1202705 1144710 1094846 1094220 1155886
5273 1155886 1103381 1096343 1153155 1250412 1296414 1269196 1219295 1183489 1115982 1119169 1073540 1105101
5261 1105101 1050566 1039489 1056169 977172 1035604 1014177 1054889 1084786 1177603 1237992 1239987 1400418
5249A400418K2914l8481k6862m9617r1628P6946N1788l881j3375L5588m6332L7986
5237A355464L3322l2714J16416M1027Q6390J7805n794R4899J45610K1234j1627
5226A862032J5884m2639P4281L9491n1392M1134k9441O9643J7252l3243o6456
5215A896546o0967J5643r5973m9455O194q7733p8384J7743l259m2504q2449l1176
5203A404226Q151J1063Q9657o1198k1976j96K8071j4467q196Q9247M3762j43257
5191A424887j8680L4021M4729j15958L6252O4544p2251l4270q90J30005O9869
5180A562258K7751O4055m0205L5688M91j0528n7216N4382J46754j14175M3912
5169A713167O517N8507K5154L4772j131M3395O4519K9799l8199k9456J06779n7321
$$ plain form
5249 1400418 1423332 1384851 1357989 1308372 1216744 1293690 1345478 1341597 1328222 1363810 1317478 1355464
5237 1355464 1388786 1356072 1472488 1513515 1599905 1617710 1611916 1706815 1852425 1873659 1862032
5226 1862032 1877916 1835277 1909558 1949049 1897657 1938791 1909350 1978993 1996245 1963002 1896546
5215 1896546 1835579 1851222 1755249 1705794 1711988 1624255 1545871 1563614 1560355 1517851 1435402 1404226
5203 1404226 1412377 1423440 1513097 1451899 1429923 1429727 1457798 1443331 1435135 1524382 1568144 1424887
5191 1424887 1406207 1440228 1484957 1368999 1405251 1469795 1397544 1363274 1362384 1492389 1562258
5180 1562258 1590009 1654064 1613859 1649547 1650038 1639510 1582294 1636676 1783430 1669255 1713167
5169 1713167 1719684 1778191 1803345 1838117 1836986 1880381 1944900 1974699 1936500 1907044 2013823 1956502
5157A956502J24499m8647k233k2834M838J2850K4620j43319R055J5232k0969J07391
5145B016985M1151L0521K256O20Q7055O7005L3435p797O3300M1678L861J75767
5133B555837l70K01400J31780J12157J66250J37272O6037L29971L92822K05599
5123D298755L63400M16027K77156j60787k96338k37807j85014k39906k5972L0675
5113D240189J9512k302p1955P2056o2815M6031o635K64547J63868K23492K84695
5102E170683K84242J94440m8936k67652k50791j61723L0694j09496n5607K22084
5092E007938J8816o2464N4143J9094P3954J73823J29822J69337N5004O0986J39544
5081E839997K42933K43447J65695J58573K21037K30142J09177K24695K79847K42152
$$ plain form
5157 1956502 2081001 2032354 2030121 2007287 2012125 2024975 2049595 1906276 1915331 1930563 1909594 2016985
5145 2016985 2058136 2088657 2090913 2091533 2178588 2245593 2279028 2271231 2334531 2376209 2380070 2555837
5133 2555837 2555467 2756867 2888647 3000804 3167054 3304326 3370363 3700334 4093156 4298755
5123 4298755 4662155 5078182 5355338 5194551 4898213 4660406 4475392 4235486 4209514 4240189
5113 4240189 4259701 4257399 4185444 4257500 4194685 4240716 4234081 4498628 4662496 4885988 5170683
5102 5170683 5454925 5649365 5600429 5332777 5081986 4920263 4950957 4841461 4785854 5007938
5092 5007938 5026754 4964290 5018433 5037527 5111481 5285304 5415126 5584463 5639467 5700453 5839997
5081 5839997 6082930 6326377 6492072 6650645 6871682 7101824 7211001 7435696 7715543 7957695
5071G957695K51662L45948L25161K62272L48836M66802L64526L95025L89631O32423
5061A1739981N69350O64550P43375Q64412J117583J598450J760112K148480K742365
5052B3948658L184159J580082j387978j924076j406934o34368l9926P57773J437478
5043B5514868J949762K753053L510191M359196N766651P731195J0030113J2683615
5035G4298644J6571660J8876919J0141152q791643j8835960j8046041j4710387
5028E9504344j1317348q080479n500677m034874l393638k925144k609809k188271
5020A9454104j832472j564300j185371j055649q65671p74627p64654n88163o11729
5011A0211468m57696l24675l96021m33353l49043l17466l67158l63136l62999
$$ plain form
5071 7957695 8209357 8555305 8880466 9142738 9491574 9958376 10322902 10717927 11107558 11739981
5061 11739981 12309331 12973881 13717256 14581668 15699251 17297701 19057813 21206293 23948658
5052 23948658 27132817 28712899 27324921 25400845 23993911 23359543 23319617 24077390 25514868
5043 25514868 27464630 30217683 33727874 38087070 43853721 51584916 61615029 74298644
5035 74298644 90870304 109747223 119888375 111096732 92260772 74214731 59504344
5028 59504344 48186996 40106517 34605840 30570966 27177328 24252184 21642375 19454104
5020 19454104 17621632 16057332 14871961 13816312 12950641 12176014 11411360 10823197 10211468
5011 10211468 9753772 9429097 9033076 8599723 8250680 7933214 7566056 7202920 6839921
5002F839921l01905k91987k52452k07535j34708k63284k52937p0591p9736k78539
4992D706247j97220j86313j44455o9441q2641j22082k8358j96365o2928j15218
4982C501226J0509j71319l8422j01968l9831O705j58402k05685M8312M9634n1613
4971B849146j00107j28662r034L4685j3977o134q4883j01191r9749N7832p9890
4960B318036j52711Q946N7489r3315n1551n9934P6701Q8804L545k9512O0930L8759
4948B266187N1837P3154n972k8352l8354l526J30891K8344j36389L058l7915J53584
4936B456547n5960K8509l6722L3548L8024O2545M543O0093l2027l8421L3314j13193
4924B440800j34708L3230m4776L5927j04846m050r2380L1929R4041o0154K817
$$ plain form
5002 6839921 6538016 6246029 5993577 5786042 5651334 5388050 5135113 5064522 4984786 4706247
4992 4706247 4509027 4322714 4178259 4108818 4026177 3904095 3875737 3679372 3616444 3501226
4982 3501226 3511735 3340416 3301994 3200026 3160195 3166900 3008498 2802813 2851125 2900759 2849146
4971 2849146 2749039 2620377 2611343 2646028 2632051 2625917 2541034 2439843 2340094 2397926 2318036
4960 2318036 2165325 2174271 2231760 2138445 2086894 2026960 2103661 2192465 2196010 2166498 2227428 2266187
4948 2266187 2318024 2391178 2385206 2356854 2318500 2314974 2445865 2474209 2337820 2340878 2302963 2456547
4936 2456547 2400587 2429096 2392374 2425922 2463946 2526491 2531034 2591127 2559100 2520679 2553993 2440800
4924 2440800 2306092 2339322 2294546 2330473 2225627 2221577 2129197 2161126 2255167 2195013 2197830
4913B197830P9279J9225P2037j5030m1139M1365J42022J60441J15356K87214L33107
4902C391707J86535L42237K57345j31254l84767k87868j61390k14240j72151q1821
4892B744333l4184o555P6355M4164p1962r0842q5100m3298m2529p4759N3098n8603
4880B410118L4933J49907O514Q3860M2086K0211K3264k7271j4288J05801k8893
4869B806242q4407J9063K0622n9510O1684k3782Q807N6358k1569j2802J3734j5195
4857B769245q056J02072p2211J97572j09844r9484J22351n8179J24254K08047
4847C175767j9997J5615P0376q7381l1225P6179Q8937J01032p771J7650J00414
4836C499596M9690R0355J03333o8838Q4985L9071N9031j03817O8250J50423L0040
$$ plain form
4913 2197830 2277109 2296334 2368371 2353341 2312202 2353567 2495589 2656030 2771386 3058600 3391707
4902 3391707 3578242 3920479 4177824 4046570 3661803 3373935 3212545 2998305 2826154 2744333
4892 2744333 2710149 2703594 2779949 2824113 2752151 2661309 2576209 2532911 2490382 2415623 2468721 2410118
4880 2410118 2445051 2594958 2601472 2685332 2727418 2747629 2770893 2743622 2729334 2835135 2806242
4869 2806242 2721835 2740898 2761520 2702010 2763694 2739912 2748719 2805077 2783508 2770706 2784440 2769245
4857 2769245 2761189 2863261 2791050 2988622 2878778 2779294 2901645 2843466 2967720 3175767
4847 3175767 3155770 3171385 3241761 3154380 3123155 3199334 3288271 3389303 3381532 3399182 3499596
4836 3499596 3549286 3639641 3742974 3674136 3759121 3798192 3857223 3753406 3821656 3972079 4002119
4825D002119Q6596N6455M3210J04227J69620J46876Q9272k7815K7764J44849L2307
4814D875480J91896K06468j7070R7730J85877K86575J12863k8961K52612K99822
4804F463292J47741J35386J89033J49346Q2374N2195L03600J79693K84829J68123
4794H155612J98421K00944M6117P2396L00771K92406J58880J50925J28026J40435
4784I844933K10511J27259K4671R3544J29946J29590J68958K91584L65833J73502
4774A1560331L04550K45130J72005K3519J15715J79959K82544L04500M00466L03603
4764A3892322L11675K93834K95561L26800L75921N69485O26631N93136P20737
4755A8006102Q48136Q25450P19337Q96319Q58969P58890Q03098Q29183Q11600
$$ plain form
4825 4002119 4088715 4145170 4188380 4292607 4462227 4609103 4698375 4670560 4698324 4843173 4875480
4814 4875480 5067376 5273844 5256774 5354504 5540381 5826956 5939819 5910858 6163470 6463292
4804 6463292 6611033 6746419 6935452 7084798 7167172 7219367 7522967 7702660 7987489 8155612
4794 8155612 8354033 8554977 8601094 8673490 8974261 9266667 9425547 9576472 9704498 9844933
4784 9844933 10055444 10182703 10207374 10300918 10430864 10560454 10729412 11020996 11386829 11560331
4774 11560331 11864881 12110011 12282016 12305535 12421250 12601209 12883753 13188253 13588719 13892322
4764 13892322 14203997 14497831 14793392 15120192 15496113 16065598 16692229 17285365 18006102
4755 18006102 18854238 19679688 20399025 21295344 22154313 22913203 23716301 24545484 25357084
4746B5357084Q47059R99829R26724J033149J003705R43152J073596J075083R69741
4737C4229122J034617J035116J209133J320800J416046J501427J680255J718829
4729D5145345K071089K556079K836961L361384M299362N008974N941921P187373
4721G8408488R012682J1178854J3844716J6841385K1663619K9054628L7756011
4714B17760383M7620246O3389585Q0302652O2269000j9803268p7995148p7401833
4707B96141617o3798422m9277932l5287028k4183833j7904988j3222189j0414219
4700H2053006q299112p348073o077826n002427l946316l517195l003834k896865
4692D1961358k454339k450823k043438j701181j538617j708872j388189j351396
$$ plain form
4746 25357084 26204143 27203972 28130696 29163845 30167550 31110702 32184298 33259381 34229122
4737 34229122 35263739 36298855 37507988 38828788 40244834 41746261 43426516 45145345
4729 45145345 47216434 49772513 52609474 55970858 60270220 65279194 71221115 78408488
4721 78408488 87421170 98600024 112444740 129286125 150949744 180004372 217760383
4714 217760383 265380629 328770214 409072866 471341866 451538598 373543450 296141617
4707 296141617 232343195 183065263 147778235 123594402 105689414 92467225 82053006
4700 82053006 73753894 66405821 60327995 55325568 51379252 47862057 44858223 41961358
4692 41961358 39507019 37056196 35012758 33311577 31772960 30064088 28675899 27324503
4684B7324503j246744j180608j143394j200803j199465j202767r82886r38473
4676A8229363o05568o16050n96260p38371o39551p53407o39755m82666m22565
4667A2735170n28105l45905m36058k53568k52859k84107m11781l59556k35141
4658I628090m02606m87614k44959k70157j75465j98507j00197J184K5715j31845
4648G643639l52456l96982j72402j63848j58470j56588k65162k58307j91638j69447
4638E358339k65636k06112k05876j61565j48440k7642j7254p381j00895j09855
4628D107683l3443r4225J0528k7994o3085k01042j44849P9178m5931j22258K3069
4617C487631n6395L1556Q924o2738j7973N981o7995Q719o4060j06106l7234j1606
$$ plain form
4684 27324503 26077759 24897151 23753757 22552954 21353489 20150722 19167836 18229363
4676 18229363 17623795 17007745 16411485 15673114 15033563 14280156 13640401 13157735 12735170
4667 12735170 12207065 11861160 11425102 11171534 10918675 10634568 10222787 9863231 9628090
4658 9628090 9225484 8737870 8492911 8222754 8047289 7848782 7748585 7749769 7775484 7643639
4648 7643639 7291183 6894201 6721799 6557951 6399481 6242893 5977731 5719424 5527786 5358339
4638 5358339 5092703 4886591 4680715 4519150 4370710 4343068 4325814 4318433 4217538 4107683
4628 4107683 4074240 3980015 3990543 3962549 3899464 3698422 3553573 3632751 3586820 3464562 3487631
4617 3487631 3431236 3462792 3471716 3408978 3391005 3396986 3328991 3337710 3273650 3167544 3130310 3118704
4605C118704L7833l4887j23024j26311J08942n1261J66961J22017K21969K77517
4595C718460K89696n7911l86847l73388l33844l27281j01548j46893k54661l6851
4585A988932l7399j4319p8209J5726O9042j88609q7157Q0081J8895r6040j42059
4574A528884R3527J15110j08571P8511o8863j3908k8736l1155j02689O971N0440
4563A519521j35500Q114L8390l0938p807j2800j0269j50795q7653R256L9048j26247
4551A052320j27277N4675j74023O4489J96473n8392N3755P1668L8647j6221l652
4540A152462p8532n1371k9790j6925n7144J0278m7524J8106p8325K5742K4134
4529H71111n4747N8450K1609k785p6793k6902N0915J8900m0175P4695L6451K2525
$$ plain form
4605 3118704 3156537 3121650 2998626 2872315 2981257 2929996 3096957 3218974 3440943 3718460
4595 3718460 4008156 3950245 3563398 3190010 2856166 2528885 2427337 2280444 2025783 1988932
4585 1988932 1951533 1937214 1859005 1874731 1943773 1755164 1668007 1748088 1766983 1670943 1528884
4574 1528884 1622411 1737521 1628950 1707461 1638598 1624690 1595954 1564799 1462110 1469081 1519521
4563 1519521 1384021 1392135 1430525 1399587 1391780 1378980 1368711 1217916 1130263 1139519 1178567 1052320
4551 1052320 925043 979718 805695 870184 1066657 1008265 1062020 1133688 1172335 1156114 1152462
4540 1152462 1073930 1022559 992769 975844 918700 928978 881454 899560 821235 846977 871111
4529 871111 816364 874814 896423 893638 816845 789943 840858 859758 819583 894278 930729 953254
4517I53254M9380m0624j8449J72869n1350n5214L9804j01910k9566n6882J47679
4506A008991L1168J358J14117M9541m5222o269k646j22827o4232n5515m4329N5667
4494I19802Q2263l5151L702k9801j15504K3656J73843L1585r5940o7711R6992
4483I87736J9694m2321M1000p8077r5228P3066m0497L5721P2572l3132j3843l7014
4471H89677j7233J74757R9988m7257j30106K069N7624J35345M9485j4243l7600
4460A162506j99474J5188j0198Q6048N6042j59040k4829J54499K3282l9752J0239
4449A074511M7341J36066m7384R708m53m6942m247k0678k3079k5633N087N813
4437A110110n5714K0644j2009J902J0882L7412O7228O6710N2512K26533J07416
$$ plain form
4517 953254 1002634 962010 943561 1116430 1065080 1009866 1049670 947760 918194 861312 1008991
4506 1008991 1040159 1041517 1155634 1205175 1159953 1153684 1151038 1028211 963979 908464 864135 919802
4494 919802 1002065 966914 970616 940815 825311 848967 1022810 1054395 958455 890744 987736
4483 987736 1007430 965109 1006109 928032 832804 905870 865373 901094 973666 940534 926691 889677
4471 889677 872444 1047201 1147189 1099932 969826 971895 1029519 1164864 1214349 1200106 1162506
4460 1162506 963032 978220 968022 1054070 1110112 951072 926243 1080742 1104024 1064272 1074511
4449 1074511 1121852 1257918 1210534 1220242 1219789 1172847 1168600 1147922 1124843 1099210 1104297 1110110
4437 1110110 1054396 1075040 1063031 1064933 1075815 1113227 1180455 1247165 1299677 1526210 1633626
4426A633626J40999K58027O3616L8499K2514j13144j32904k27068j98508m7532
4416A438125p6970m4732K7204k1904m7134l0260J05601M6044o8915j58759N9298
4405A227598J36819k0081j0173O4616K7782K26885J48486Q3730K10192J55894
4395B251748L74974M15194J19773l26266m47003l78437k30921r9032j43701m9763
4385A486566p4591j02557j23520k4334r2143m4926K9602o5503L7019j2630K9584
4374A042567J2877k5908L3179J40182P9207J52762M1314K18889K92048k2555j66259
4363A798303j42532j94751n3408k8553j26799q4182j89912p4093p5865n7085m0309
4352G30814j17194j2219R3066j6581m6456N5812j05607R4217M0569m4168L7836
$$ plain form
4426 1633626 1774625 2032652 2096268 2134767 2157281 2044137 1911233 1684165 1485657 1438125
4416 1438125 1361155 1316423 1343627 1321723 1274589 1244329 1349930 1395974 1327059 1168300 1227598
4405 1227598 1364417 1344336 1334163 1398779 1426561 1653446 1801932 1885662 2095854 2251748
4395 2251748 2626722 3041916 3161689 2835423 2388420 2009983 1779062 1680030 1536329 1486566
4385 1486566 1411975 1309418 1185898 1161564 1069421 1024495 1054097 988594 1025613 1012983 1042567
4374 1042567 1055444 1029536 1062715 1202897 1282104 1434866 1476180 1695069 1987117 1964562 1798303
4363 1798303 1655771 1461020 1407612 1379059 1252260 1168078 978166 904073 828208 771123 730814
4352 730814 613620 601401 694467 677886 631430 687242 581635 675852 716421 672253 710089
4341G10089j27528m8322R6328q4396p8024J68835P3242j75852J40319k3720K2959
4330F73930j7260j4598K8480M3916J16201R4715J33948P2175J59319J46554j61941
4319A275439j80171q8576k20662J1142m9277j10969k0977o1977j8220J9771j1269
4308E44254n7380p7126J4267J8807l6318n2022K3081P8694J6068j6573J1126O4327
4296E31205j08083q5600Q5660M8969r8032P8937n9704K2723m5541j25566J19496
4285C64464J16278j6970k4316N4938o4198k2728J17351L296m2465N2325n1787
4274D86188Q9948k2188m7515n1735J7052k3444J4894o320k419l7701l4996O4582
4262D46346L0728o2455J9668N9363o5138K5172j0569l1612J31547k2306n3085
$$ plain form
4341 710089 582561 534239 630567 546171 468147 636982 710224 534372 674691 650971 673930
4330 673930 656670 642072 670552 714468 830669 925384 1059332 1131507 1290826 1437380 1275439
4319 1275439 1095268 1006692 786030 797172 747895 636926 615949 553972 535752 555523 544254
4308 544254 486874 409748 424015 442822 406504 354482 377563 456257 472325 455752 466878 531205
4296 531205 423122 337522 423182 472151 374119 453056 393352 416075 370534 244968 364464
4285 364464 480742 463772 439456 494394 430196 407468 524819 528115 485650 537975 486188
4274 486188 576136 553948 506433 454698 471750 448306 463200 456880 454461 416760 381764 446346
4262 446346 477074 414619 434287 493650 428512 453684 443115 411503 543050 520744 467659
4251D67659M8062K4303N0813j19661p6530N4553Q2542P2645o2666R7619J04644
4240G43983q0860r8611m1790J28677J41542l2761n470j47999K0906J30580n9023
4229F99174n1859N16L9620p4753J9659R2521m3092N3972R3937q5884p1385m9353
4217F23073l6579Q9446j01123P2289M5284M1650P3414l929j0645J4658n6465n5041
4205F96032K1796j8462j3513O0964j8451o8404Q1996J5107Q8722k3759q0847q0084
4193F61097M6931n7670K1674M5918l4650l7092Q3914M3874P4363M608r1298j0784
4181G50885R6662q68j02494K908N86O9692L6293m1895O609J14736n2150K2795
4169I03759L0352J20398o4702L015n860j9272K1893O967O450K5013R1269k984
$$ plain form
4251 467659 515721 540024 590837 471176 394646 449199 531741 604386 541720 639339 743983
4240 743983 663123 564512 522722 651399 792941 760180 754710 606711 627617 758197 699174
4229 699174 647315 647831 687451 612698 632357 724878 681786 735758 829695 743811 672426 623073
4217 623073 586494 675940 574817 647106 692390 734040 807454 803525 792880 807538 751073 696032
4205 696032 717828 699366 685853 746817 728366 659962 741958 757065 845787 822028 741181 661097
4193 661097 708028 650358 672032 717950 683300 646208 730122 773996 848359 852967 761669 750885
4181 750885 847547 846679 744185 747093 747679 817371 853664 811769 818378 933114 880964 903759
4169 903759 934111 1054509 989807 992822 986962 967690 989583 996550 1003000 1028013 1119282 1116298
4157A116298p3581j3416N7461n7441p3552K5992p7522p096J11141k2352N9701
4146A045633J1981M9137k4704M7035L0978m2985J0223o3429l9032P6500L4725
4135A136062j4559o6118l6009J1826Q6894m035k4566k0003K7431l9180r2846P4835
4123A039732L8196l4927N301r8767L7804J04685j9631L0762L9017R1874J0193
4112A244239J3776l510l4103K8378J9862l2738l8384J9866J42204K2179j08632
4101A273137o0718R7237j7813j16892K5717N8208n0180N774N6321m6958j6645
4090A207188J3354J0849N2226M3625R7065j09087L0406P6148J2384J8370j02936
4079A349592O0668p7159O450K3015N048p3822M9729L5044m7687j00138J45888
$$ plain form
4157 1116298 1042717 1029301 1086762 1029321 955769 981761 904239 897143 1008284 985932 1045633
4146 1045633 1057614 1106751 1082047 1129082 1160060 1117075 1127298 1063869 1024837 1101337 1136062
4135 1136062 1121503 1055385 1019376 1031202 1118096 1114061 1089495 1069492 1096923 1057743 964897 1039732
4123 1039732 1077928 1043001 1048302 949535 987339 1092024 1072393 1103155 1142172 1234046 1244239
4112 1244239 1258015 1254505 1220402 1248780 1268642 1235904 1197520 1217386 1359590 1381769 1273137
4101 1273137 1212419 1309656 1291843 1174951 1200668 1258876 1208696 1214470 1270791 1223833 1207188
4090 1207188 1220542 1231391 1283617 1327242 1424307 1315220 1345626 1421774 1434158 1452528 1349592
4079 1349592 1410260 1333101 1339551 1362566 1367614 1293792 1343521 1378565 1330878 1230740 1376628
4068A376628J18830J036j55330l2307J01680j1667N3989R0296n4095k4771N1516
4057A515805l5922k0343n102m6809L5910N6491P99j2038J78602R2132k2648L9774
4045A776651o0158k098k4862L4274K8350o6563r4278n3929K0760Q4926m7680Q9039
4033A684432m3339J659O7946M0307L1945r2972l9424O0331L9340L9731n1946p6139
4021A661871M5289m5965N6685J16938K9516j2448M5838l6878j09418N0926l2478
4010A769876N3411m9423N7741k1775k4526q697P4433J25879L0623r5399j22004
3999A790139J15815R1253L2812n3309j3336p0626P4074P4987q2222l4226L0684
3988A956045K2624J7390J12996n9554P1428J1076J02602L9270j78145j2386J38562
$$ plain form
4068 1376628 1495458 1496494 1341164 1308857 1410537 1398870 1452859 1543155 1489060 1464289 1515805
4057 1515805 1479883 1459540 1454438 1407629 1443539 1500030 1500829 1488791 1667393 1759525 1736877 1776651
4045 1776651 1716493 1714395 1689533 1723807 1752157 1685594 1591316 1537387 1558147 1643073 1595393 1684432
4033 1684432 1641093 1642752 1710698 1751005 1782950 1689978 1650554 1710885 1750225 1789956 1738010 1661871
4021 1661871 1707160 1661195 1717880 1834818 1864334 1851886 1897724 1860846 1751428 1802354 1769876
4010 1769876 1823287 1773864 1831605 1809830 1785304 1776607 1851040 1976919 2007542 1912143 1790139
3999 1790139 1905954 1997207 2030019 1976710 1963374 1892748 1966822 2041809 1959587 1925361 1956045
3988 1956045 1978669 1996059 2109055 2049501 2120929 2132005 2234607 2273877 2095732 2083346 2221908
3977B221908p914L0269k3622K6145J2009O642M6257J15229J7952L0020J17925
3966B592820J0756n7758n3038R3271k9235P6681j4273K5382o192P0291L5673m139
3954B740239N9150J3920J30859J5402j34518M0180L3851k3807q7718O2190P1948
3943B921696p2418l8813K1980J29974Q9363J0445O136M5250J3865K360N1361n8415
3931C122784M7807J0762L679o6418J5284K5120P4196L9700R4231p097p3399M879
3919C291528L6764K4742n957j42180K4365J01881k7175M5048M7598N6167N7254
3908C510035M4210k7186j3277j9015R1595N7728M8802J6332K4038m8186N1835
3897C736911J4286j33674Q686R3212Q7308N2291L9757k5636K178O5323K0799M8079
$$ plain form
3977 2221908 2213994 2244263 2220641 2246786 2258795 2265437 2311694 2426923 2444875 2474895 2592820
3966 2592820 2603576 2545818 2492780 2586051 2556816 2633497 2619224 2644606 2638414 2708705 2744378 2740239
3954 2740239 2799389 2813309 2944168 2959570 2825052 2865232 2899083 2875276 2787558 2849748 2921696
3943 2921696 2849278 2810465 2832445 2962419 3051782 3062227 3068363 3113613 3127478 3129838 3181199 3122784
3931 3122784 3170591 3181353 3185032 3118614 3133898 3159018 3233214 3272914 3367145 3360048 3286649 3291528
3919 3291528 3328292 3353034 3347077 3204897 3229262 3331143 3303968 3349016 3396614 3452781 3510035
3908 3510035 3554245 3527059 3513782 3494767 3586362 3644090 3692892 3709224 3733262 3685076 3736911
3897 3736911 3751197 3617523 3626209 3719421 3806729 3859020 3898777 3873141 3875319 3940642 3961441 4009520
3885D009520n1741M2694M8584M5607n263m2472N2925N3524m5975L474j01692j164
3873D008021J56960p161k3382O4880M6206P9941k2988q3753k4440J566O6228M0996
3861D303074P1752j4507J2802l219K02796O4070N223O4328J7800N9331J08123
3850D891573J8864O6485Q4533K1873Q1535K35588k6195l2282Q0385N679J40142
3839E568180J30105K06602j1430J37426J75877J55660J62212K48579L31658K92900
3829G397769N29112L75735L78971P77586Q20902R31075J102746J396892J871640
3820A5582428K266392K773418L346558L160573J525963j278990l142168l585135
3812B0649039l163023k579610j936507j431912j066115r19566p02807m75766l59833
$$ plain form
3885 4009520 3957779 4000473 4049057 4094664 4089401 4046929 4099854 4153378 4107403 4110877 4009185 4008021
3873 4008021 4164981 4157820 4134438 4199318 4245524 4325465 4302477 4218724 4194284 4195850 4262078 4303074
3861 4303074 4374826 4360319 4373121 4369902 4572698 4636768 4641991 4706319 4724119 4783450 4891573
3850 4891573 4910437 4976922 5061455 5083328 5164863 5400451 5374256 5341974 5422359 5428038 5568180
3839 5568180 5698285 5904887 5893457 6030883 6206760 6362420 6524632 6773211 7104869 7397769
3829 7397769 7926881 8302616 8681587 9459173 10280075 11211150 12313896 13710788 15582428
3820 15582428 17848820 20622238 23968796 27129369 28655332 27376342 24234174 20649039
3812 20649039 17486016 14906406 12969899 11537987 10471872 9552306 8849499 8373733 8013900
3803H013900l59906m86896k85746k08662j12424k26934j98112r7307j64488j13972
3793E759453m0758K075j59035p8539m4522p5589j63447r6152k8679j93051k2526
3782D859230O1190j24005J2229N2008j72366r3963j2532r6132L6944O8133m1472
3771D549264j23932m9022J06256k1307J01169L8324m0978R3305p9251m6547J2859
3760D540140L546K8182j00754K2604J9408r6900R855j2245m1500K9357q5536p93
3748D315364q844Q1785P0179Q705N3425n683r0952J26623O5808m7500l6597L1097
3736D563410P0425K0340L557M3382l854m722k5636L9769j36951J00464J18795
3725D788979q7288J4595J72960l4879L5020M0891n430r3347M3750K38332K852
$$ plain form
3803 8013900 7653994 7167098 6881352 6672690 6560266 6333332 6135220 6037913 5873425 5759453
3793 5759453 5718695 5720770 5561735 5483196 5438674 5363085 5199638 5103486 5074807 4881756 4859230
3782 4859230 4920420 4796415 4808644 4860652 4688286 4594323 4581791 4485659 4522603 4590736 4549264
3771 4549264 4425332 4376310 4482566 4461259 4562428 4600752 4559774 4653079 4573828 4527281 4540140
3760 4540140 4543686 4571868 4471114 4493718 4513126 4416226 4426081 4413836 4372336 4401693 4316157 4315364
3748 4315364 4306520 4388305 4458484 4467189 4520614 4514931 4423979 4550602 4616410 4568910 4532313 4563410
3736 4563410 4633835 4654175 4657732 4701114 4697260 4692538 4666902 4706671 4569720 4670184 4788979
3725 4788979 4701691 4716286 4889246 4854367 4889387 4930278 4924848 4831501 4875251 5113583 5116435
3714E116435k6381J5832m0996p3314O3565J43680R5610N7837M7347O6666J90068
3703E656349O8635R864n8646M5537N6554J14414O0579N3135R9762M5709Q2686
3692F234578J55063N7063P4582J52504K88571J36851L04054L19664M67318L91591
3682H581839N36882P42374P98827L82125m7694l50281n06730m14782l82561k95121
3672I044878j51847M3576P8345J69147J81566L09021O40052P75481N41145r6863
3662A1534501n01920n61616m98517k67143j68858m5670J04752R3309O3363J99149
3652I951350K69208M10962M34664O49790Q13253R02575Q80907K25258n47022p90250
3642A3200695n56090m24435k86450j11650j8868K02288M23077P36496Q36270J219755
$$ plain form
3714 5116435 5090054 5105886 5064890 4991576 5055141 5198821 5294431 5352268 5399615 5466281 5656349
3703 5656349 5724984 5734848 5676202 5721739 5778293 5892707 5953286 6006421 6106183 6151892 6234578
3692 6234578 6389641 6446704 6521286 6673790 6962361 7099212 7403266 7722930 8190248 8581839
3682 8581839 9118721 9861095 10659922 11042047 10994353 10644072 10137342 9722560 9339999 9044878
3672 9044878 8893031 8936607 9014952 9184099 9365665 9674686 10314738 11090219 11631364 11534501
3662 11534501 11032581 10470965 9972448 9705305 9536447 9490777 9595529 9688838 9752201 9951350
3652 9951350 10220558 10631520 11066184 11715974 12529227 13431802 14312709 14537967 13990945 13200695
3642 13200695 12644605 12220170 11933720 11822070 11803202 12005490 12428567 13165063 14001333 15221088
3632A5221088J136927J5078r76083j114125q86588q14369n92297l38490j65735
3623A1485406o2211j9102O7219K10133J76917J38531K72750L79871N13762M50714
3613A3613990L26518J41225j97637k79637j96291j46753q825R8714Q7388L67988
3603A3806680L20465N68736N10620O74523L21416m91044n62851n31479l08708
3594A4308358M082r4998l5948O128J20102P9954j2805K49430K67203J60134M2378
3583A5094018J82891K91206L01645K33998L37800K41731K92609K57158K42243
3574A7475299R0724L18142M02730K83991K61114L06245K73857L79400L38674K94821
3564B0424997L76982N18921L94137M03818L20278M14306M12038N04589N21527
$$ plain form
3632 15221088 16358015 16373093 15397010 14282885 13396297 12581928 11989631 11651141 11485406
3623 11485406 11423195 11404093 11471312 11681445 11858362 11996893 12269643 12649514 13163276 13613990
3613 13613990 13940508 14081733 13884096 13604459 13408168 13261415 13252590 13351304 13438692 13806680
3603 13806680 14127145 14695881 15206501 15881024 16202440 15711396 15148545 14617066 14308358
3594 14308358 14312440 14217442 14181494 14187622 14307724 14387678 14374873 14624303 14891506 15051640 15094018
3583 15094018 15276909 15568115 15869760 16103758 16441558 16683289 16975898 17233056 17475299
3574 17475299 17566023 17884165 18286895 18570886 18832000 19138245 19412102 19791502 20130176 20424997
3564 20424997 20801979 21320900 21715037 22118855 22439133 22853439 23265477 23770066 24291593
3555B4291593N06848N18893N14041N48129N54968N83215Q75329P59275O47314
3546B9799605P63102Q90808J007612J084293J173757J332112J512048J655213
3538C9218550J922883K004856K198689K242122K456440K579389K508642K710321
3530E7841892K767390K550132K231208J753828J070008N8033j013583j916030
3522F5342878k730018l074312l166485k975798k670475k520535k158601j821811
3514D4224843j658846j509287j308268j192862j054403j044462q62792r59466
3506C4634457q16638q17076p53782p19124o88737n25930n84207o15299m49029
3497B8664635m94333n43706o72021n23638n38802o06710n36718n28771o91596
$$ plain form
3555 24291593 24798441 25317334 25831375 26379504 26934472 27517687 28393016 29152291 29799605
3546 29799605 30562707 31453515 32461127 33545420 34719177 36051289 37563337 39218550
3538 39218550 41141433 43146289 45344978 47587100 50043540 52622929 55131571 57841892
3530 57841892 60609282 63159414 65390622 67144450 68214458 68272491 67258908 65342878
3522 65342878 62612860 59538548 56372063 53396265 50725790 48205255 46046654 44224843
3514 44224843 42565997 41056710 39748442 38555580 37501177 36456715 35593923 34634457
3506 34634457 33817819 33000743 32246961 31527837 30839100 30313170 29728963 29113664 28664635
3497 28664635 28170302 27626596 26954575 26430937 25892135 25285425 24748707 24219936 23528340
3488B3528340o71659o13449m73650m55860l98721m40586k93112l78113n16584
3479A9286606m98170l94959m55434m90633l62398l70751k85148l66498l46896
3470A5715719k48972k18601k35891k44618k58824k33897k02383k54408j17855
3461A3700270j69327j78604j39183j89432r8085j11259P355r0661q3438p8029
3451A2569607k2294J46506J0494j40260l84762l45251j72641k99285l02292j02665
3441A0957157j45186j98855j15977j56763j76326r3676j32919k8342q3251j31638
3431I694224l2206j07252j13205j452K3699K1035q4588j23035j05146j45133j651
3420I025290r0226P142M5045M3036L5997o1629k63229k47334j81782j26465j06805
$$ plain form
3488 23528340 22856681 22243232 21769582 21313722 20915001 20474415 20181303 19803190 19286606
3479 19286606 18788436 18393477 17938043 17447410 17085012 16714261 16429113 16062615 15715719
3470 15715719 15466747 15248146 15012255 14767637 14508813 14274916 14072533 13818125 13700270
3461 13700270 13530943 13352339 13213156 13023724 12925639 12814380 12821735 12731074 12647636 12569607
3451 12569607 12547313 12693819 12704313 12564053 12179291 11834040 11661399 11362114 11059822 10957157
3441 10957157 10811971 10613116 10497139 10340376 10164050 10070374 9937455 9909113 9825862 9694224
3431 9694224 9662018 9554766 9441561 9440109 9463808 9484843 9400255 9277220 9172074 9026941 9025290
3420 9025290 8935064 8942206 8987251 9030287 9066284 9004655 8741426 8494092 8312310 8185845 8079040
3409H079040o8254n1647m8918j42745j30828r1886p69O3174P4402j07319l2954
3398G541296l5156k17194m5337p7694q9325J0071m3516L2519j38762p6382j3211
3387F847309o6073N4617Q5735j23833k542m2950J7373j90354n1705L320k8895
3376F502002J2512p247n6458k5839K0706n4683l2287l9229L9810O2197q2227l2733
3364F306524p1603j654k0361r2681P8175o0250K6786o1107J2882o734m9829o9148
3352E991000M09j13905o9039O0278r3958m4589l8937n2963K7155M4997l0979q1898
3340E597571k2671m0494l5141q0803j4585o2491P3649K2047M7899q4564q2432
3329E317985L4290Q34l4672j3277r908n6560n4355m6159q9365p8829J0891n8438
$$ plain form
3409 8079040 8010786 7959139 7910221 7767476 7636648 7544762 7543993 7607167 7681569 7574250 7541296
3398 7541296 7506140 7288946 7243609 7165915 7076590 7086661 7043145 7075664 6936902 6860520 6847309
3387 6847309 6781236 6835853 6921588 6797755 6795213 6752263 6769636 6579282 6527577 6530897 6502002
3376 6502002 6514514 6507267 6450809 6424970 6445676 6390993 6358706 6319477 6359287 6421484 6339257 6306524
3364 6306524 6234921 6233267 6212906 6120225 6198400 6138150 6164936 6103829 6116711 6109977 6060148 5991000
3352 5991000 5991409 5877504 5808465 5868743 5774785 5730196 5691259 5638296 5665451 5710448 5679469 5597571
3340 5597571 5574900 5534406 5499265 5418462 5403877 5341386 5415035 5437082 5484981 5400417 5317985
3329 5317985 5352275 5353109 5318437 5305160 5295252 5238692 5184337 5138178 5048813 4969984 4980875 4922437
3317D922437J4499P892j16608J0544l2688J4591N9089j74161R834P8170L2913
3306D826512M1250K2403M3258J21158m7640l9309J21164K405k3856m7464n9697
3295D960184l6392J2547q9362J19952N5864n8222j0967L7084J35754N1993O3353
3284E241788J44136P7221Q0483m3687o2339J02369R3595Q1656O2064L325N4936
3273E835547N3554L5841Q3260Q3852N3489K0902k578P8613P3327O486J22311K2328
3261F466932N3851P9422Q1058J50053K118N7072M0184N4178R8683O6982J88672
3250G339205J77352N7929K25975J04811J05197J01561O4135J22424J12729J94349
3240H605667J23077O644Q0443N3673J72610Q0041J13146J73705L3688J28837J49387
$$ plain form
3317 4922437 4936936 4944828 4828220 4838764 4806076 4820667 4879756 4705595 4715429 4793599 4826512
3306 4826512 4867762 4890165 4933423 5054581 5006941 4967632 5088796 5091201 5067345 5019881 4960184
3295 4960184 4923792 4936339 4846977 4966929 5022793 4964571 4953604 4990688 5126442 5178435 5241788
3284 5241788 5385924 5463145 5543628 5499941 5437602 5539971 5633566 5715222 5777286 5780611 5835547
3273 5835547 5889101 5924942 6008202 6092054 6145543 6166445 6163867 6242480 6315807 6322293 6444604 6466932
3261 6466932 6520783 6600205 6681263 6831316 6833434 6890506 6930690 6984868 7083551 7150533 7339205
3250 7339205 7516557 7574486 7800461 7905272 8010469 8112030 8176165 8298589 8411318 8605667
3240 8605667 8728744 8735388 8815831 8869504 9042114 9122155 9235301 9409006 9442694 9571531 9720918
3229I720918L28966J61949L89469K75068J03760K69113K50353K21066L04274M03336
3219A2428272K83943M18262M07258L24681L84919L09258L28195K38733L5730J5889
3209A5175140K00635J8667M9839J16786J18490J08907K18602K12806L27651K99219
3199A6846742K23892N10997N69059N05037N76587O55402Q39410P41769P34311
3190B2203206Q19640Q76486Q41889O54363M47803J96743j65595o33242q54837
3181B4386456q55193q05341o66629n63300k65435k42273j40606N5858J87731K93903
3171B1385171L11088M38461M36814N27471K88881L53347M15584M98286N17209
3162B5172312L81944K93960O2332j07160j66125m28155n34759m87338o21408q25559
$$ plain form
3229 9720918 10049884 10211833 10601302 10876370 10980130 11249243 11499596 11720662 12024936 12428272
3219 12428272 12712215 13130477 13537735 13862416 14247335 14556593 14884788 15123521 15159251 15175140
3209 15175140 15375775 15394442 15444281 15561067 15679557 15788464 16007066 16219872 16547523 16846742
3199 16846742 17070634 17581631 18150690 18655727 19232314 19887716 20727126 21468895 22203206
3190 22203206 23022846 23899332 24741221 25395584 25843387 26040130 25874535 25241293 24386456
3181 24386456 23531263 22725922 22059293 21495993 21230558 20988285 20847679 20903537 21091268 21385171
3171 21385171 21696259 22134720 22571534 23099005 23387886 23741233 24156817 24655103 25172312
3162 25172312 25554256 25848216 25910548 25803388 25637263 25209108 24674349 24187011 23565603 22740044
3152B2740044p53036q97202p85747n35160o56768m95930l02172k20588n7314n5435
3142A7980692J8995P5327m9037k4246j45531k73381j77613k31333k47805l00564
3132A6625504n48306n23166n75411o55207p15580o83702o26732n72762n90378
3123A1134260n08546l10612l88238m18475k04991l26053k95672k44714k01203
3114H235756j30318l27507j99028p1873q1759k53260k18995j67436j01732k21227
3104F462621k19628k23811j61116j98241r6480p3988k41546k07314j16679m7415
3094D876403j12252j80958j36862j23905j5881n7852j76302l6880j39169o8620
3084C827722R608j22444j13329m8357j26191m4012l8681m8827N4057p8990L8622
$$ plain form
3152 22740044 21987008 21089806 20304059 19768899 19112131 18616201 18314029 18093441 18036127 17980692
3142 17980692 17999687 18075014 18025977 18001731 17856200 17582819 17405206 17173873 16926068 16625504
3132 16625504 16077198 15554032 14978621 14323414 13607834 12924132 12297400 11724638 11134260
3123 11134260 10625714 10315102 9926864 9508389 9303398 8977345 8681673 8436959 8235756
3114 8235756 8105438 7777931 7578903 7507030 7425271 7172011 6953016 6785580 6683848 6462621
3104 6462621 6242993 6019182 5858066 5659825 5563345 5489357 5247811 5040497 4923818 4876403
3094 4876403 4764151 4583193 4446331 4322426 4306545 4248693 4072391 4035511 3896342 3827722
3084 3827722 3837330 3714886 3601557 3553200 3427009 3382997 3344316 3295489 3349546 3270556 3309178
3073C309178q2697R400j44919j29668q2714L1388m6681q4572l9343p1188n9648
3062B608536o0308L5091r0127L471m0679j23753j47282n2355j5484L4663q851
3051B142922Q2537j85734k3815q0882r1146j07444Q8551P9319n4393l6180O1450
3040A875185J2270k6818k7054j60682j38595J10196l0830r7416n7053K395p1483
3029A390115K0291J7621j06379k1423O7111K4894n9489n0121K350q1722k11472
3018I91776R317P1280N1481j6489o969K5053Q638j33049L5873j01291R6634R9070
3006A131324n8411j41439q0292q202m7318M4329J32834o3891j48599p7264N144
2995F88215J33251P8856l9823K831j706j07494J3059R7939j3188K0961j1161M9347
$$ plain form
3073 3309178 3226481 3235881 3090962 2961294 2878580 2909968 2863287 2778715 2739372 2668184 2608536
3062 2608536 2548228 2583319 2493192 2496663 2455984 2332231 2184949 2132594 2117110 2151773 2142922
3051 2142922 2225459 2039725 2015910 1935028 1843882 1736438 1824989 1904308 1849915 1813735 1875185
3040 1875185 1887455 1860637 1833583 1672901 1534306 1644502 1613672 1516256 1459203 1461598 1390115
3029 1390115 1410406 1428027 1321648 1300225 1367336 1392230 1332741 1282620 1284970 1203248 991776
3018 991776 1001093 1072373 1123854 1107365 1100396 1125449 1134087 1001038 1036911 935620 1032254 1131324
3006 1131324 1072913 931474 851182 842980 795662 839991 972825 908934 760335 683071 688215
2995 688215 821466 900322 860499 863330 861624 754130 767189 865128 851940 872901 861740 911087
2983I11087n9736q1402l0483P109M2959j5708k7279k9848j3368n6642J5420K1695
2971F83804l0873r188Q349J8851p7377k8519N655j3624N1238L1307m1400q7613
2959E10610j4406J09361k62J17727j11211l1054j2092O991N3046p2803N135k6374
2947E34668L7517l1332K2142p3814n1961j2655O8767l6157Q1061j6696L0670N0194
2935F02404k6495p296j360O284j43670k1155R883N1276j3401l4012J5631N3035
2923D91124O2969N7134P1806j54935m6533o2062Q9235K4595N430l1528m4556k896
2911D59783R547Q5086l0132l3384M4516n8030j25803P0761j4494P8747N3078j03095
2899D36580J023K0341l5280j5755N0666O3065l5029n2107K059r7082j27185J05438
$$ plain form
2983 911087 851351 769949 739466 746575 789534 773826 746547 716699 703331 646689 662109 683804
2971 683804 652931 643743 652092 670943 593566 565047 570702 557078 608316 639623 598223 510610
2959 510610 496204 605565 605303 723030 611819 580765 568673 575664 628710 555907 561042 534668
2947 534668 572185 540853 562995 489181 437220 424565 493332 457175 538236 521540 552210 602404
2935 602404 575909 568613 567253 573537 429867 408712 418595 469871 456470 422458 438089 491124
2923 491124 554093 611227 683033 528098 481565 419503 508738 533333 538763 507235 462679 459783
2911 459783 469330 554416 524284 490900 535416 477386 351583 422344 407850 486597 539675 436580
2899 436580 437603 457944 422664 406909 457575 520640 485611 433504 435563 338481 211296 316734
2887C16734k6668R3102J150j35677Q4920J41604l4074J7572j8066j15967O1658
2876C86288K0206R529o3595J44678K7803j27201o4537M3039n6243k8744j2128
2865B79095L1864J9028l3030K554O9822L6695q2866Q043L2805J12601j9936j32870
2853C23805r3981l5411q2217L8085m6859Q0658J08026o687J06235l6578j32262
2842B22814J9596J1785l8993k8899n0440L4977Q6916k94m4522N8214k3588k0547
2830B27019l5819J2527l6422j7124l833M1415l9766L2310K5158j17702p88P0409
2818A57384K3369O33j00842J8475L2945N3599k2250l656J2137L2204K6066p4894
2806A55170j4250l1676J41775n1402K0012m715p6745N17O9840R5245m3472j3518
$$ plain form
2887 316734 290066 383168 384318 248641 333561 475165 441091 458663 440597 324630 386288
2876 386288 406494 416023 352428 497106 524909 397708 333171 376210 319967 291223 279095
2865 279095 310959 329987 296957 299511 369333 406028 323162 331205 364010 476611 456675 323805
2853 323805 229824 194413 112196 150281 103422 184080 292106 285419 391654 355076 222814
2842 222814 242410 254195 215202 186303 135863 170840 257756 257462 212940 271154 247566 227019
2830 227019 191200 203727 167305 150181 146348 187763 147997 180307 205465 87763 86975 157384
2818 157384 180753 181386 80544 99019 131964 185563 163313 159657 171794 203998 230064 155170
2806 155170 140920 109244 251019 199617 219629 214914 138169 138686 208526 303771 260299 246781
2794B46781j03002k5112J32482k107j02693j70882L6731L9704K580J44050j694
2783A96838r8057L5230n6088M7540K7653m0396J7109J9490o6112M8054Q6610q403
2771B09468r6969J7640L6162o8548R646k2290k2128m6929n0791J5555Q282L2678
2759B1776k2343J21025o2740J0223j4854p2024M0768L5965m5635L0564k9235J41251
2747A54741j3693j22027L1338N6515M5255k7673n5053p3436J43929p6957M3667
2736A06606j10801O8154j7795p3561j4511M0240M638q8251j5477L4904j7162k5680
2724a08696O3662q7941O9170O2956J0515N6755K357j44025N8193J32738n1204
2713F4480l3940Q8037M5691j75118R962O6574q7427m7177M1362o4978M3724R4468
$$ plain form
2794 246781 143779 118667 251149 249042 146349 -24533 12198 51902 54482 198532 196838
2783 196838 98781 134011 77923 125463 153116 112720 129829 149319 83207 131261 217871 209468
2771 209468 112499 130139 166301 97753 107399 85109 62981 16052 -34739 -19184 -10902 21776
2759 21776 -567 120458 57718 67941 53087 -18937 21831 57796 12161 42725 13490 154741
2747 154741 141048 19021 50359 106874 152129 124456 69403 -4033 139896 62939 106606
2736 106606 -4195 63959 46164 -27397 -41908 -1668 2970 -85281 -100758 -65854 -83016 -108696
2724 -108696 -45034 -132975 -63805 -849 9666 66421 68778 -75247 -17054 115684 64480
2713 64480 30540 118577 164268 -10850 -888 65686 -21741 -68918 -27556 -92534 -48810 45658
2701D5658L936l7844J12189l1093l430R373m6546p4127O5185n0237k630K2394
2689A2828j27J8431k1953j2408l7194P1865l7658O7021l2800O7033K771O936j10079
2676e334p6918P3792j3292J9082N8806N3043k3881L4359q0441r5742P0178m6805
2664c3153N6219M1138k488k2004l0583J2270k7431P6348M7885J65692m4734j51523
2652H7636K3225K8500n1604j22067M335L3175r394J0228j00654J31963N9454m4688
2640E0109n7979p511K1734j340j11019r3378J55027R2942j26787L8787J81068
2629A41653k6342m0480n1360K6258Q937N3422N8013j8513n2691n4719l0364P1823
2617H5637j23869L4407M8629o3908n380m4475J09412l3852O529J7155p0829K361
$$ plain form
2701 45658 49594 11750 123939 92846 89416 98789 52243 -21884 43301 -6936 -9566 12828
2689 12828 12701 31132 9179 -3229 -40423 31442 -6216 60805 28005 95038 97809 104745 -5334
2676 -5334 -82252 -8460 -21752 -2670 56136 109179 85298 119657 39216 -56526 13652 -33153
2664 -33153 23066 64204 61716 39712 9129 21399 -6032 70316 118201 283893 239159 87636
2652 87636 110861 139361 87757 -34310 -29975 3200 -6194 4034 -96620 35343 94797 50109
2640 50109 -7870 -15381 6353 5013 -106006 -199384 -44357 48585 -78202 -39415 141653
2629 141653 115311 74831 23471 49729 58666 112088 170101 151588 98897 44178 13814 85637
2617 85637 -38232 -3825 44804 -19104 -24484 -68959 40453 6601 13130 30285 -40544 -38183
2605c8183k9790P75K0129L5909L6581M1115l922m4937M4989K8199j5838L3425
2593A08452M6546o2729k1067k3227n0504K8312m8601J1205j8201l3390l0594L6137
2581e7661p972k5695p0736P9343K634J0565J03446j5752Q900M247j9320O8872
2569H0871L9337m2327N5667m5829m8729o8756L2509K2022J6423M2305j766p6298
2557E429L3149J6461k0964L7962J2701j08607J44570J2257p2132p9769p3760M3894
2545d8809O4973J54068j01900K3040Q0644p2981j6607j361R204L5877j59686j4722
2533d8260J47915M6083p2141o041k2759K8324M1360N2491M835k5302J49372N0724
2521C46601r8313l4054k0659K8691j7181q805n660K9064k8900l7913k0033L1404
$$ plain form
2605 -38183 -67973 -67198 -47069 -11160 25421 66536 62614 17677 62666 90865 75027 108452
2593 108452 154998 92269 71202 47975 -2529 25783 -22818 -11613 -29814 -63204 -93798 -57661
2581 -57661 -65633 -91328 -162064 -82721 -80087 -69522 33924 18172 27072 31319 11999 80871
2569 80871 120208 77881 133548 87719 38990 -29766 2743 24765 41188 83493 81727 5429
2557 5429 38578 55039 34075 72037 84738 -23869 120701 132958 60826 -18943 -92703 -48809
2545 -48809 16164 170232 68332 91372 172016 99035 82428 81067 90271 126148 -33538 -48260
2533 -48260 99655 145738 73597 67556 44797 73121 114481 166972 171807 146505 295877 346601
2521 346601 248288 214234 193575 222266 205085 196280 190620 219684 190784 152871 132838 164242
2509A64242K1741j0517J0253L1253p8567N9602j576J7141J09808m7834K8359o3100
2497B40805q422n5736N0186N7048k3314N9633l8995L1344O0324n3336n0262J4571
2485B83846O275l2953K7540M6359n0983L1815Q4359N7838k7564m446O1697n2821
2473D30962j36352J45594J05218M0243l4607j4062M8193K5766P4594m315j06144
2462E75090l4721J10117J28440M8399n3150J518N7124k7366n0767Q4379k2587
2451H16476O321J0101j06619J1J47977k1206m6533J84479J5522m8042P6672k5064
2439A010095k1174M2123N9206N2807J15661M5152P8012n8296J67028P4122O3913
2428A628649M7162Q1167O8569J62098O9615N4754j4485J12376Q7610N9492k3800
$$ plain form
2509 164242 185983 175466 185719 216972 138405 198007 196431 213572 323380 275546 303905 240805
2497 240805 232383 176647 226833 283881 260567 320200 281205 312549 372873 319537 269275 283846
2485 283846 290121 257168 284708 331067 280084 311899 396258 454096 426532 422086 483783 430962
2473 430962 294610 440204 545422 585665 551058 536996 585189 610955 685549 681234 575090
2462 575090 540369 650486 778926 827325 774175 775693 832817 805451 754684 839063 816476
2451 816476 822797 832898 726279 726290 874267 853061 806528 991007 1006529 958487 1035159 1010095
2439 1010095 988921 1031044 1090250 1143057 1258718 1303870 1381882 1323586 1490614 1564736 1628649
2428 1628649 1675811 1756978 1825547 1987645 2057260 2112014 2097529 2209905 2297515 2357007 2333207
2417B333207L3742J63237M6920K25879P1968R6588K33119M0221J78039K34429
2407C657349J37192K66184M10491L75986L58186K27266K76439K85879N82047O73165
2397G250184Q75646J082534J507458J905403K655439L259897M260464N795316
2389B8592341P383989K926505n485969p120908n747238m600515l279846k200211
2381A0468148j591071j253908q87686n20729n55168m02178l38637j10150l06610
2372D502011l53169l39947l30921l93678k15664r3173j40310k03791j87138k01299
2362B042921r4866j2773j5049j50374j10654m8543k15304p3007j6636k5890l1939
2351A247886j12729r4899J1678l5642j92877m0340J7570L277j03858K1261n6984
$$ plain form
2417 2333207 2366949 2530186 2577106 2802985 2874953 2971541 3204660 3244881 3422920 3657349
2407 3657349 3794541 4060725 4471216 4847202 5205388 5432654 5709093 5994972 6577019 7250184
2397 7250184 8125830 9208364 10715822 12621225 15276664 18536561 22797025 28592341
2389 28592341 35976330 38902835 33416866 26295958 20548720 15948205 12668359 10468148
2381 10468148 8877077 7623169 6735483 6214754 5659586 5257408 4918771 4808621 4502011
2372 4502011 4148842 3808895 3477974 3084296 2868632 2775459 2635149 2431358 2244220 2042921
2362 2042921 1948055 1935282 1920233 1769859 1659205 1610662 1395358 1322351 1305715 1279825 1247886
2351 1247886 1135157 1040258 1051936 1016294 823417 783077 800647 803924 700066 721327 664343
2340F64343J96082j78261l5177k4725j59887l2580M5769k2556J1403k3112N4956
2329D96255j1687j15125j2761q0899K9144k682O7905p082P9668j2517j43508m3782
2317B42929n9438l6699r908M7771J15921K2041p692l8029j5471J5566l1568q0468
2305A64955o0239J0716o3337N1261j089n0456N133n7154n3525O2499J63130k6172
2293A45722k2340l1010Q1443p303n7968N1045P9009j03842J6979j3609O9755n7942
2281A49939j2992k3385J05321k28617q8836Q0343j7416K387K4127K2534Q5987
2270I9392q2393r9830O0786M9097P1018J743k9669l6755k9371r018M9553J256
2258D5809j8510j14519k1173q4073M4170L6238J92366J4286p5782n8816r6453
$$ plain form
2340 664343 860425 682164 646987 622262 462375 429795 475564 453008 464411 441299 496255
2329 496255 484568 369443 356682 275783 304927 302245 370150 363068 442736 430219 286711 242929
2317 242929 183491 146792 136884 184655 300576 322617 314925 276896 261425 276991 245423 164955
2305 164955 104716 115432 52095 103356 102267 51811 56944 -210 -53735 8764 171894 145722
2293 145722 123382 92372 173815 166512 108544 159589 238598 134756 151735 138126 207881 149939
2281 149939 136947 113562 218883 -9734 -98570 -18227 -35643 -33256 -9129 13405 99392
2270 99392 16999 -82831 -22045 27052 98070 99813 70144 33389 4018 -5000 44553 45809
2258 45809 27299 -87220 -108393 -192466 -148296 -112058 80308 94594 18812 -40004 -136457
2247a36457J61461P517q3937j3514m1252k4299J01649j6614n7217m7518k8660
2236a78841P4210N8386m7716P8454l2102M5844q7254N9247o8391P583J61050m3148
2224B7322q0717l5133p8071M2208K3836J7150M0884l0401O6096m0184J8996N4321
2212B6307o2523o0100M2772j9386k6253j2221j9711j7548l5351O2124J73348K5802
2200G7260m7786k3176n5079J473j5747l84L730K5646L2791l3030k6722M1390J7381
2187b253o3238j6041n249J25834J1528k4978n0955M1491o6484n102L5617j12983
2175a32813L0756J98443j48579o2358M2449l2601n5026J01306J1155j493j4630
2164f3391j1419P6787j6578j9359l2543o9739j5399K9360j4655l779J30176p0721
$$ plain form
2247 -136457 25004 32521 -51416 -64930 -106182 -130481 -28832 -45446 -102663 -150181 -178841
2236 -178841 -104631 -46245 -93961 -15507 -47609 -1765 -89019 -29772 -98163 -90580 70470 27322
2224 27322 -53395 -88528 -166599 -124391 -100555 -83405 -42521 -72922 -6826 -47010 -28014 26307
2212 26307 -36216 -96316 -53544 -72930 -99183 -111404 -131115 -148663 -184014 -121890 51458 77260
2200 77260 29474 6298 -48781 -47308 -63055 -63439 -59709 -34063 -1272 -34302 -61024 -19634 -2253
2187 -2253 -65491 -81532 -86781 39053 50581 25603 -25352 16139 -50345 -55447 -19830 -132813
2175 -132813 -102057 96386 -52193 -114551 -72102 -104703 -159729 -58423 -47268 -48761 -63391
2164 -63391 -74810 1977 -14601 -33960 -66503 -136242 -151641 -122281 -136936 -140715 -10539 -81260
2152h1260L8213M6669J0278L7808l142j57039M3446J08650j6110J4363n4850o5908
2140g8882j0254j9547M7876M9277o3645L5626q0402l745k5556K7283l3853K1520
2128a34302O7889J14177l948k4474n8989J6416J718Q9395m5698j011J01564K284
2116A25021j14204k9034Q1524r4488r1998n4337J35710O9059J5465k1893M0959
2105F1784k1031m7863k7367N168r0147k480k3416K1167R8750j9601R3685n3614
2093d965q2630N2546R4188n7978r7409l4431q938N7716L9980N4689q1838K0636
2081d8434j4643k9271J57809o8270q4756k9495Q8097j08701k2310Q1678q0742
2070a59038N3937K7459j1743M7766P871M4283l9873n0810J6996P3174j34128L3891
$$ plain form
2152 -81260 -43047 3622 13900 51708 48566 -108473 -65027 43623 27513 41876 -12974 -78882
2140 -78882 -89136 -108683 -60807 -11530 -75175 -39549 -119951 -123696 -149252 -121969 -155822 -134302
2128 -134302 -66413 47764 43816 19342 -39647 -23231 -21513 67882 22184 21173 122737 125021
2116 125021 10817 -18217 63307 -31181 -123179 -177516 -41806 27253 42718 20825 61784
2105 61784 40753 -7110 -34477 -29309 -119456 -121936 -145352 -124185 -25435 -45036 48649 -4965
2093 -4965 -87595 -35049 59139 1161 -96248 -130679 -139617 -81901 -41921 12768 -69070 -48434
2081 -48434 -63077 -92348 65461 -2809 -87565 -117060 -28963 -137664 -159974 -78296 -159038
2070 -159038 -105101 -77642 -89385 -41619 -33748 10535 -29338 -80148 -63152 10022 -124106 -90215
2058i0215J93001q2413p6787q3511L6483p8247n8383L7477J10638K3898K8506
2047c9553N0939k8202r8583J6094J01797O8055o5230l3561p6904K6971K8827o5328
2035a14678N0063n3096L5957O3474K2676j6739n8707j04003K2272Q5427L0061
2024c7293n4644Q3465L6586N603k6939L7811q594j11911j13941M1576J25O377
2012a41779K0994J14801l9150m3433O3523m5524M4815r7865m891J64134l9336
2001c711N913J8762J6240m240k3869m6276k3437l2221N0720n151p6954L7399K3036
1988f3789M6708M1024m9841m0105M6935j01791q039M8186M1766k7057N070n7219
1976a18152K987L2686r6669o583M3863L7944j14264M7169Q7373n2378J4270k6296
$$ plain form
2058 -90215 102786 20373 -56414 -139925 -103442 -181689 -240072 -202595 -91957 -68059 -39553
2047 -39553 11386 -16816 -115399 -99305 2492 70547 5317 -28244 -105148 -78177 -49350 -114678
2035 -114678 -64615 -117711 -81754 -18280 4396 -12343 -71050 -175053 -152781 -67354 -37293
2024 -37293 -91937 -8472 28114 33717 6778 44589 35995 -75916 -189857 -148281 -148156 -141779
2012 -141779 -120785 -5984 -45134 -88567 -25044 -70568 -25753 -123618 -128509 35625 -3711
2001 -3711 2202 20964 37204 32964 9095 -37181 -60618 -92839 -42119 -47270 -124224 -86825 -63789
1988 -63789 -17081 23943 -25898 -66003 -19068 -120859 -128898 -80712 -38946 -66003 -60933 -118152
1976 -118152 -115165 -82479 -179148 -185731 -141868 -103924 -218188 -171019 -83646 -136024 -121754 -148050
1964a48050N5120J8374k2696N0537M9986j04000J00288L2891j6210j27767j4179
1953a25706L367m4358K2072p7998R6550K1889L4334o5013m8648P3066O4194m9714
1941i5965p4364J36K7518j7841N5643N1938j02256N385m7901K5385J33635M0750
1929B063j9965j4136l4242m954j8845J08691K4863N0981m1171k37195J08047N8412
1917a7451m9022m180o7128l5065O1949R2439o628J02258o233j68139l1060l5456
1905a63716K4349R0230l6164j5794J6341J14489L1504p0686m4870o714L0794J12965
1893H2728M3487j06618J0071j7380J3632m8231l8477q075Q432r997O9641m1437
1881d2224k0797r902J06794Q1135m3971j5444m0412O7011j01524j3221p5463j8192
$$ plain form
1964 -148050 -92930 -74556 -97252 -46715 3271 -100729 -441 32450 16240 -111527 -125706
1953 -125706 -122339 -166697 -144625 -222623 -126073 -104184 -69850 -134863 -183511 -110445 -46251 -95965
1941 -95965 -170329 -170193 -142675 -160516 -104873 -52935 -155191 -149806 -197707 -172322 -38687 2063
1929 2063 -17902 -32038 -66280 -71234 -90079 18612 43475 94456 53285 -183910 -75863 -17451
1917 -17451 -66473 -70653 -137781 -172846 -110897 -18458 -25086 77172 70939 -97200 -128260 -163716
1905 -163716 -139367 -49137 -85301 -101095 -84754 29735 61239 -9447 -54317 -61031 -30237 82728
1893 82728 126215 19597 29668 12288 25920 -22311 -60788 -68863 -60431 -70428 -787 -42224
1881 -42224 -63021 -72923 33871 115006 71035 55591 15179 82190 -19334 -32555 -108018 -126210
1869a26210O7441O5492J5318Q865R4767m0636q7290J5078n90O901k4177j150j65438
1856a71629J21907K4467p9252n847J11137M6683o2141O8288m8660o7955m8307
1845a11309N5098n0038m650j4596N1699J05577M1749J5980k3039r2637P534o7268
1833h5900j6759L6457P5464o2321l0134o5484r908P5709j03523J05351K4501k4686
1821h1233n5489j1737P9085n3554j969M7821k650O1116l3354m6493J8338N9693
1809b0426j5246O200n9322K8350m7636k7512N7862K3110k3763j15214R1985L1260
1797g0352q451r5994L3403N5582n2031k1763J31971J4028p3182O985N8511l9013
1785f0306N4739M0167n3330r2861N2961j4379j8378L2895M4879l3685n4412L1503
$$ plain form
1869 -126210 -58769 6723 22041 30906 125673 85037 -2253 12825 12235 19136 -5041 -6191 -171629
1856 -171629 -49722 -25255 -104507 -110354 783 47466 -14675 53613 4953 -63002 -111309
1845 -111309 -56211 -106249 -110899 -125495 -73796 31781 73530 89510 66471 -26166 -18632 -85900
1833 -85900 -102659 -66202 9262 -53059 -83193 -148677 -158585 -82876 -186399 -81048 -56547 -81233
1821 -81233 -136722 -148459 -69374 -122928 -124897 -77076 -79726 -18610 -51964 -98457 -80119 -20426
1809 -20426 -35672 -29472 -88794 -60444 -108080 -135592 -77730 -54620 -78383 -193597 -101612 -70352
1797 -70352 -78803 -174797 -141394 -85812 -137843 -159606 -27635 -13607 -86789 -79804 -21293 -60306
1785 -60306 -5567 34600 -18730 -111591 -58630 -73009 -91387 -58492 -13613 -47298 -101710 -70207
1773g0207R3970k3561l2130k8370j7470k582k4938K7422Q7352l5861o8132p3244
1761a67751K2307N5570K8830J01903l1910r5249J37551M1772k3326k4956q0608
1750c5867o682J8345p6714R74J18229l5680L2452m8180j457p5467N2758m3190
1738a00479O584N1156l4774M50j2472k9151k6898K9752k5123j5946J8378n0314
1726a88837k2288O9153R7039L8309J9482q4809L254k1000P5197j9194L8810K2176
1714B7292K4111o529r6338L8463q602n5547J7359q432j4544l5611j0318K627P2858
1701e3211J02026k8154r027M6977k594q2484K0049l2584k4573n9352O9128n9009
1689a12808M1728O046K8453P9153p3776j0255q0286J4275N1769J8782J9066m5641
$$ plain form
1773 -70207 23763 202 -31928 -60298 -77768 -80350 -105288 -77866 9486 -26375 -94507 -167751
1761 -167751 -145444 -89874 -61044 40859 8949 -86300 51251 93023 69697 44741 -35867
1750 -35867 -42549 -24204 -100918 -99944 18285 -17395 15057 -33123 -34580 -110047 -57289 -100479
1738 -100479 -93895 -42739 -77513 -77063 -89535 -118686 -145584 -115832 -140955 -156901 -138523 -188837
1726 -188837 -211125 -141972 -44933 -6624 12858 -71951 -68697 -89697 -14500 -33694 5116 27292
1714 27292 51403 44874 -51464 -13001 -21603 -77150 -59791 -68223 -82767 -118378 -128696 -126069 -53211
1701 -53211 48815 20661 11634 58611 56017 -26467 -6418 -39002 -63575 -122927 -53799 -112808
1689 -112808 -71080 -65034 -36581 42572 -31204 -41459 -121745 -107470 -55701 -36919 -17853 -63494
1677f3494q7984N4993k2435j1089j6488J1257l934l4819j18828P6442J32463J7240
1665f6676M9662r2940o0485N0475K5295P8263J00738j5072k2728J6691p5220m5522
1653e7519L4260r6832P1635J17328r7963j0222k0687j2166m2711l475Q0297l3353
1641g1408j09129N176J72973J0984l0729N8450r7733j0579j3736m1104O896J72123
1629E2184k5636L8829L4315q4677k9240M5285q5856O226O4049K1273M181l6768
1617D165j3435P199l4942r5170J82207q6864q7927K8264P6717q2815N9154Q6431
1605D2984j40348o8246J31444j6459j28021R8626L8299r9424J09596p0590j31026
1594b33165L7845Q9546O6867m6945l0163O197L7113J4100n496J72678o1801j17232
$$ plain form
1677 -63494 -151478 -96485 -118920 -130009 -146497 -135240 -139174 -173993 -292821 -216379 -83916 -66676
1665 -66676 -17014 -109954 -170439 -119964 -94669 -16406 84332 69260 46532 63223 -11997 -57519
1653 -57519 -23259 -120091 -48456 68872 -29091 -39313 -60000 -72166 -114877 -118352 -38055 -71408
1641 -71408 -180537 -175361 -2388 8596 -22133 36317 -61416 -71995 -85731 -126835 -119939 52184
1629 52184 26548 65377 99692 15015 -14225 31060 -54796 -48570 15479 36752 40933 4165
1617 4165 -9270 -2071 -37013 -132183 50024 -36840 -124767 -96503 -19786 -102601 -43447 42984
1605 42984 -97364 -165610 -34166 -50625 -178646 -80020 -41721 -141145 -31549 -102139 -233165
1594 -233165 -195320 -105774 -38907 -85852 -116015 -109818 -72705 -58605 -64101 108577 46776 -70456
1582g0456j8015N4551l8973K633N1535O1610P6567j55639o9936n7344M6812P0015
1570d6640m4063k9003m8532P2870L5043r243L8236M3307p7980K2493K431M9499
1558H418j03088P9707J8370j15991k2110P0285J9983k3045l2535J21699N9915
$$ plain form
1582 -70456 -88471 -33920 -72893 -70260 -18725 42885 119452 -36187 -106123 -163467 -116655 -46640
1570 -46640 -90703 -119706 -168238 -95368 -60325 -69568 -31332 11975 -66005 -43512 -41081 8418
1558 8418 -94670 -14963 3407 -112584 -134694 -64409 -44426 -67471 -100006 21693 81608
$$ [...]
##END NTUPLES=NMR SPECTRUM
##END=
