##TITLE=1H_CG-1181-a1
 CDCl3
 8 sc, 
 1.12.2023
##JCAMPDX= 6.0         $$ Bruker NMR JCAMP-DX V2.0
##DATA TYPE= NMR SPECTRUM
##DATA CLASS= NTUPLES
##ORIGIN= UXNMR, Bruker Analytische Messtechnik GmbH
##OWNER= root
$$ XWIN-NMR		Version 3.5
$$ Fri Dec  1 14:33:44 2023 Russian Standard Time (UT+4h)  she@DPX200
##.OBSERVE FREQUENCY= 200.1313
##.OBSERVE NUCLEUS= ^1H
##.ACQUISITION MODE= SIMULTANEOUS
##.ACQUISITION SCHEME= undefined
##.AVERAGES= 8
##.DIGITISER RES= 18
##SPECTROMETER/DATA SYSTEM= spect
##.PULSE SEQUENCE= zg30
##.SOLVENT NAME= CDCl3
##.SHIFT REFERENCE= (INTERNAL, CDCl3, 0, 15.4472)
##AUDIT TRAIL= $$ (NUMBER, WHEN, WHO, WHERE, WHAT)
$$ ##TITLE= Audit trail, XWIN-NMR		Version 3.5
$$ ##JCAMPDX= 5.01
$$ ##ORIGIN= Bruker BioSpin GmbH
$$ ##OWNER= she
$$ F:/spectra/data/she/nmr/H-F/1/pdata/1/auditp.txt
$$ ##AUDIT TRAIL=  $$ (NUMBER, WHEN, WHO, WHERE, WHAT)
(   1,<2023-12-01 14:32:30.59 +0400>,<she>,<DPX200>,
      <created by zg, POWCHK disabled, PULCHK disabled
       configuration hash MD5:
       00 E9 B6 7A A2 85 ED C7 34 08 36 98 17 FE 4E 26
       data hash MD5: 16K
       73 1C 88 F0 72 8C F1 6B 15 17 27 9B 5C 64 48 B5>)
(   2,<2023-12-01 14:32:33.28 +0400>,<she>,<DPX200>,
      <Start of raw data processing
       efp BC_mod = 2 LB = 0.24 FT_mod = 6 PKNL = 1 PHC0 = -24589.9 PHC1 = 9.252712 SI = 16K 
       data hash MD5: 16K
       2C 4D 68 B0 79 FA CB BC 7E EA E1 33 2A A9 1C 95>)
(   3,<2023-12-01 14:32:56.09 +0400>,<she>,<DPX200>,
      <pk PHC0 = -4.466021 PHC1 = 8.200003 
       data hash MD5: 16K
       99 87 D5 20 67 5B 6E 38 59 0A E7 BE 64 84 D1 7C>)
(   4,<2023-12-01 14:32:59.81 +0400>,<she>,<DPX200>,
      <abs ABSG = 5 
       data hash MD5: 16K
       DB 7B 9A 33 71 D5 C0 D2 33 78 64 68 66 DC B5 F2>)
$$ ##END=
$$ 
$$ hash MD5
$$ 31 35 49 77 54 B6 42 58 79 94 C5 B4 CD B4 06 3E
##$RELAX= 
##$RELAX= 
##$RELAX= 
##$RELAX= 
##$RELAX= 
##$RELAX= 
$$ Bruker specific parameters
$$ --------------------------
##$DU= <F:/spectra>
##$EXPNO= 1
##$NAME= <H-F>
##$PROCNO= 1
##$TYPE= <nmr>
##$USER= <she>
##$AMP= (0..31)
100 100 100 100 100 100 100 100 100 100 100 100 100 100 100 100 100 100 
100 100 100 100 100 100 100 100 100 100 100 100 100 100 
##$AQSEQ= 0
##$AQ_mod= 1
##$AUNM= <au_zg>
##$AUTOPOS= <>
##$BF1= 200.13
##$BF2= 200.13
##$BF3= 200.13
##$BF4= 200.13
##$BF5= 200.13
##$BF6= 200.13
##$BF7= 200.13
##$BF8= 200.13
##$BYTORDA= 1
##$CFDGTYP= 0
##$CFRGTYP= 5
##$CHEMSTR= <none>
##$CNST= (0..31)
1 1 145 1 1 1 1 1 1 1 1 1 1 1 1 1 1 1 1 1 1 1 1 1 1 1 1 1 1 1 1 1 
##$CPDPRG= <>
##$CPDPRG1= <>
##$CPDPRG2= <>
##$CPDPRG3= <>
##$CPDPRG4= <mlev>
##$CPDPRG5= <mlev>
##$CPDPRG6= <mlev>
##$CPDPRG7= <mlev>
##$CPDPRG8= <mlev>
##$CPDPRGB= <>
##$CPDPRGT= <>
##$D= (0..31)
0 1.2 0 0 0 0 0 0 0 0.06 0 0.03 0 0 0 0 0.0002 0 0 0 0 0 0 0 0 0 0 0 0 
0 0 0 
##$DATE= 1701426750
##$DBL= (0..7)
120 120 120 120 120 120 120 120 
##$DBP= (0..7)
150 150 150 150 150 150 150 150 
##$DBP07= 0
##$DBPNAM0= <>
##$DBPNAM1= <>
##$DBPNAM2= <>
##$DBPNAM3= <>
##$DBPNAM4= <>
$$ [...]
##$SUBNAM3= <"">
##$SUBNAM4= <"">
##$SUBNAM5= <"">
##$SUBNAM6= <"">
##$SUBNAM7= <"">
##$SUBNAM8= <"">
##$SUBNAM9= <"">
##$SW= 18.0517328524113
##$SWIBOX= (0..15)
0 0 2 0 0 0 0 0 0 0 0 0 0 0 0 0 
##$SW_h= 3612.71676300578
##$TD= 16384
##$TD0= 1
##$TE= 0
##$TE2= 300
##$TE3= 300
##$TEG= 300
##$TL= (0..7)
0 120 120 120 120 120 120 120 
##$TP= (0..7)
150 150 150 150 150 150 150 150 
##$TP07= 0
##$TPNAME0= <>
##$TPNAME1= <>
##$TPNAME2= <>
##$TPNAME3= <>
##$TPNAME4= <>
##$TPNAME5= <>
##$TPNAME6= <>
##$TPNAME7= <>
##$TPOAL= (0..7)
0.5 0.5 0.5 0.5 0.5 0.5 0.5 0.5 
##$TPOFFS= (0..7)
0 0 0 0 0 0 0 0 
##$TUNHIN= 0
##$TUNHOUT= 0
##$TUNXOUT= 0
##$USERA1= <user>
##$USERA2= <user>
##$USERA3= <user>
##$USERA4= <user>
##$USERA5= <user>
##$V9= 5
##$VALIST= <valist>
##$VCLIST= <CCCCCCCCCCCCCCC>
##$VD= 0
##$VDLIST= <DDDDDDDDDDDDDDD>
##$VPLIST= <PPPPPPPPPPPPPPP>
##$VTLIST= <TTTTTTTTTTTTTTT>
##$WBST= 1024
##$WBSW= 4
##$XGAIN= (0..3)
0 0 0 0 
##$XL= 0
##$YL= 0
##$YMAX_a= 116488
##$YMIN_a= -91215
##$ZGOPTNS= <>
##$ZL1= 120
##$ZL2= 120
##$ZL3= 120
##$ZL4= 120
##$ABSF1= 15.43067
##$ABSF2= -2.62118
##$ABSG= 5
##$ABSL= 3
##$ALPHA= 0
##$AQORDER= 0
##$ASSFAC= 0
##$ASSFACI= 0
##$ASSFACX= 0
##$ASSWID= 0
##$AUNMP= <proc_1d>
##$AZFE= 0.1
##$AZFW= 0.1
##$BCFW= 0
##$BC_mod= 2
##$BYTORDP= 0
##$COROFFS= 0
##$CY= -3
##$DATMOD= 1
##$DC= 0
##$DFILT= <>
##$DTYPP= 0
##$F1P= 0
##$F2P= 0
##$FCOR= 1
##$FTSIZE= 16384
##$FT_mod= 6
##$GAMMA= 0
##$GB= 0
##$INTBC= 1
##$INTSCL= 3.70164e-10
##$ISEN= 128
##$LB= 0.24
##$LEV0= 0
##$LPBIN= 0
##$MAXI= 10000
##$MC2= 0
##$MEAN= 0
##$ME_mod= 0
##$MI= 1.114404
##$NCOEF= 0
##$NC_proc= -8
##$NLEV= 6
##$NOISF1= 3.799351
##$NOISF2= 2.8
##$NSP= 0
##$NTH_PI= 0
##$NZP= 0
##$OFFSET= 15.4472
##$PC= 1
##$PHC0= -24594.37
##$PHC1= 17.45271
##$PH_mod= 1
##$PKNL= yes
##$PPARMOD= 0
##$PSCAL= 0
##$PSIGN= 0
##$REVERSE= no
##$SF= 200.130014910158
##$SI= 16384
##$SIGF1= 3
##$SIGF2= 2
##$SINO= 5.538805
##$SIOLD= 16384
##$SREGLST= <1H.CDCl3>
##$SSB= 0
##$STSI= 16384
##$STSR= 0
##$SW_p= 3612.71676300578
##$SYMM= 0
##$S_DEV= 0
##$TDeff= 16384
##$TDoff= 0
##$TI= <>
##$TILT= no
##$TM1= 0
##$TM2= 0
##$TOPLEV= 0
##$USERP1= <user>
##$USERP2= <user>
##$USERP3= <user>
##$USERP4= <user>
##$USERP5= <user>
##$WDW= 1
##$XDIM= 16384
##$YMAX_p= 277370411
##$YMIN_p= -1177834
$$ End of Bruker specific parameters
$$ ---------------------------------
##NTUPLES= NMR SPECTRUM
##VAR_NAME=  FREQUENCY,     SPECTRUM/REAL,   SPECTRUM/IMAG
##SYMBOL=    X,             R,               I
##VAR_TYPE=  INDEPENDENT,   DEPENDENT,       DEPENDENT
##VAR_FORM=  AFFN,          ASDF,            ASDF
##VAR_DIM=   16384,         16384,           16384
##UNITS=     HZ,            ARBITRARY UNITS, ARBITRARY UNITS
##FACTOR=    0.220516191357247, 1,           1
##FIRST=     3091.44833059142, 0,            0
##LAST=      -521.268432414365, 0,           0
##MIN=       -521.268432414365, -1177834,    0
##MAX=       3091.44833059142, 277370411,    0
$$ Real data points
##PAGE= N=1
##DATA TABLE= (X++(R..R)), XYDATA
$$ [...]
8684 1117677 926587 1047071 1027361 1189387 1251392 932599 898227 1097968 1051486 1125018
8674 1125018 1030821 735479 919703 638885 816382 708161 749668 983373 919637 592350
8664 592350 890711 1038827 986525 883024 1323219 803786 641423 656316 677498 1205436
8654 1205436 1061209 701168 897680 1023937 811810 560861 837522 1498357 1860390 1949649
8644 1949649 1471706 1542872 1965617 2041247 2194512 2038061 1753733 1827987 2185164 2207416
8634 2207416 1969916 2198882 2513132 2236298 2120454 1950349 1730896 1551859 1184588 1082146
8624 1082146 745336 868449 725034 909417 1156703 1287877 1485077 1127545 606158 737464
8614 737464 842366 696484 865281 1233496 1276686 1289930 1046655 1223698 1392100 1807214
8604 1807214 1506121 1482318 1475017 1401991 1386753 1024115 1332546 1450306 1145291 1349581
8594 1349581 1425236 1112877 1071384 1196802 1208765 1143876 972605 960885 823352 700767
8584 700767 992380 813298 1350882 799069 710917 417536 -91215 149242 392638 420647
8574 420647 687039 735796 272744 252485 354083 539614 552684 652885 337276 347965
8564 347965 402279 555613 379608 405147 381153 636601 833619 960731 1169232 1075099
8554 1075099 1102412 603392 696763 879101 659998 701813 652024 592539 532461 294161 499583
8543 499583 34154 -114740 589078 681723 360363 13583 -90662 343640 553341 204407
8533 204407 399068 637132 598792 70256 957 121121 191858 367342 309731 692834
8523 692834 781692 601382 382652 558039 899651 578589 307133 549656 34742 -197429
8513 -197429 298547 192814 271368 460541 489479 467402 240283 -3276 -144 -104116 182499
8502 182499 68416 384468 933274 517398 317953 -60131 196642 153076 -130986 10546
8492 10546 -85980 -375516 154499 305084 112963 -12736 -97798 294299 295556 55603 111255
8481 111255 89256 238489 77259 570121 504262 130833 39518 -138128 64804 171500
8471 171500 -50847 67233 470832 588110 52617 250417 356145 581308 522573 70345
8461 70345 412787 675385 893476 1096066 986442 646948 739234 390877 1145896 1406185
8451 1406185 1294714 1463042 1664597 1390229 1839977 2162628 2298907 2547056 2973442 3596412
8441 3596412 3848984 4494342 5141192 5927227 6088274 6274253 6384859 6225232 5532739 4887135
8431 4887135 4667191 4249003 4027717 3011667 2562125 2308148 2390301 2305326 2155949 1825288
8421 1825288 1781877 1518752 1414534 1707279 1296021 1345942 1708188 1530162 1551053 1452679
8411 1452679 1497754 1712294 1552189 2028112 2166317 2536540 2577596 3016225 3529250 3990588
8401 3990588 3881275 4754214 5370523 5284552 5042776 5094407 4589593 3751157 3564484 3287698
8391 3287698 2790278 1942155 1724896 1492528 1049888 794032 1207426 1105430 807129 1029847
8381 1029847 670278 440851 867582 735557 809441 838731 427958 258382 784612 572543
8371 572543 -205470 -25730 150402 110719 291168 460759 1041057 1159147 1216106 1443760
8361 1443760 988754 795620 476039 85722 362187 272193 263759 -53361 -272786 -301971
8351 -301971 -415755 -155820 37807 149206 -263313 -545923 -294924 -110559 -447730 -479189
8341 -479189 -345391 -254067 -376611 -52936 287797 -356799 -214339 -177414 80399 292595
8331 292595 -51660 -437495 -277039 -47647 -487005 -566813 -240669 -240884 -406552 -259450
8321 -259450 -480565 -445482 -692600 -552345 -223229 -599737 -639564 -70860 182541 -359291
8311 -359291 -520282 -342124 -289726 -361708 -608412 -1140615 -718182 -222662 -348684 -279605
8301 -279605 -247588 -423573 -497493 -237395 -11988 -158444 -292759 -711219 -350176 55677
8291 55677 -361988 -464185 -336705 -159831 -187993 -395022 -485836 -197894 -204259 -378372 -446839
8280 -446839 -382804 -139946 -73559 30878 -78801 -448718 -566134 -387122 -80956 -433051
8270 -433051 -104485 -31370 108820 272140 133675 -256643 -207686 -162231 175351 -99174
8260 -99174 -782789 -641004 -487649 -475784 33799 357399 -73156 -229101 -76671 -454702
8250 -454702 -284533 -72142 -183598 -592002 -517527 -387807 -558024 -93757 163266 218132
8240 218132 -464812 -351043 -194261 -272601 -444400 -431918 -288299 -250835 -222391 -11743
8230 -11743 -139441 -676008 -822933 -703464 -60660 88529 -308719 -457508 -389160 -213102
8220 -213102 -444680 -177891 -236553 -346892 -177951 -283476 -209294 378673 114165 -282439
8210 -282439 -626010 -573528 -829552 -439587 -288493 -609565 -339139 -317845 -404070 -363616
8200 -363616 -353384 -264650 126760 160096 61827 84217 112892 1451448 890824 -1177834
8190 -1177834 -599109 -59789 -35889 -448747 -439245 -495585 -497830 -604690 -263640 -214186 -181073
8179 -181073 -402307 -782658 -454009 85083 -229591 -389125 -246906 -523322 -490182 -283502
8169 -283502 -450996 -314167 -293013 -491833 -803754 -440102 -471513 -470985 -628167 -590797 -428588
8158 -428588 -754402 -312183 70084 125085 -551212 -202570 145006 124329 -366821 -333112
8148 -333112 -274270 -134481 23471 184178 -92911 -53482 -343273 -408523 -89792 -235383
8138 -235383 -467423 -807341 -787096 -321641 -66330 -297657 -82548 -370510 -329122 -360415
8128 -360415 -489748 -301792 -499045 -765743 -771151 -515930 -363890 -132479 -129777 -26468
8118 -26468 -179087 141368 -139060 76576 473751 -94614 -423586 -454008 -1034104 -794033
8108 -794033 -233574 -550469 -293296 -31949 227612 -447671 -326398 -180747 -428740 -485827
8098 -485827 -489320 -821705 -876381 -701749 -437232 -396730 -229587 -112907 -245781 -240315 -477714
8087 -477714 -267999 -249618 -687821 -607405 -548104 -642190 -194781 -49760 107180 56404 -206102
8076 -206102 -210335 -67999 -310660 -285560 -4448 -116061 24020 47354 102019 -33919 -617543
8065 -617543 -778905 -673004 -339578 -533993 -249961 235727 276527 281070 253792 59627
8055 59627 -493842 -139476 -50797 -110931 183356 289294 -55484 -178601 -95244 -256015
8045 -256015 135165 -8035 -348392 -503253 -364727 -589633 -536190 -328905 -331353 -467260
8035 -467260 -581628 -371998 -539751 -731061 -567509 -409524 -839027 -655311 -487329 -603647
8025 -603647 -393536 -191399 -589387 -333932 37401 350812 -35081 -142910 -272664 -505933
8015 -505933 -797459 -594923 -262509 254087 492083 -37236 -262699 -721796 -332354 -317979
8005 -317979 -567263 -261755 -388320 -502567 -345154 -174071 -159130 -339435 -508054 -380671
7995 -380671 -475062 -465101 -218547 -667648 -208170 178364 198745 -229280 -598078 -357815
7985 -357815 -160432 240801 55654 -238012 -172190 -385912 -326567 -192033 -131445 -463420
7975 -463420 -354243 -261934 -279146 -603169 -716287 -288470 -673575 -328832 -246307 -626939
7965 -626939 -476029 -368088 -502057 -618709 -551918 -690204 -218696 -43274 -223513 -443913
7955 -443913 -448252 130956 145281 48939 -310436 -343847 -108852 -361519 -492195 -428477 -320716
7944 -320716 -520043 -105213 26259 -232358 -337925 -746541 -622394 -172491 -381251 -609603
7934 -609603 -353356 -619 -54115 -159781 -173137 -213814 -80027 -415773 -1048967 -666411
7924 -666411 -615248 -724254 -501014 -355353 -47613 -625847 -563811 -500694 -115467 392692
7914 392692 263579 -212864 -504694 -718783 -432312 -147239 -239693 -743774 -822907 -621001
7904 -621001 -237341 -102514 -235931 -409615 -641229 -397898 -234365 -120281 -210718 -597681
7894 -597681 -674608 -579468 -735007 -471777 -369031 -140144 -298353 -302363 -373289 -164014 -402826
7883 -402826 -673733 -383161 238401 381183 284129 445522 302932 -174747 8412 -109011
7873 -109011 -253758 -293483 -348939 -399746 -399019 -335915 -424857 20698 -249477 -573408 -199067
7862 -199067 -463864 -529263 -376784 -357042 -21130 -66181 -66645 6812 -319244 -222526 -255829
7851 -255829 -219627 -54100 -269884 -316712 -314916 110868 -47067 -224917 7135 -321379
7841 -321379 -178681 -276985 -515654 -126729 -488890 -470791 -504073 -271631 -357288 -148417
7831 -148417 -156957 -156451 -675159 -809648 -708660 -248135 88955 194618 -131282 -420441 -21946
7820 -21946 -403479 -274713 154592 312515 -105493 -426742 -721682 -124213 -404302 -71940
7810 -71940 72084 -594839 -467487 -400348 -58044 464921 339704 1148099 602106 -474901
7800 -474901 -255727 -381097 -346423 -643562 -451128 -448803 -420069 84714 147656 176531 -186683
7789 -186683 -267726 77776 223470 -241740 -646525 -263621 -467570 -400955 -421289 -396700
7779 -396700 -355054 -320213 -518190 -157047 -180410 306198 327193 144844 77382 -220254 -209702
7768 -209702 -56165 201345 62081 105324 350739 38719 -711527 -1009290 -175191 -243648
7758 -243648 -432891 -386202 -379019 -38525 -195332 -215147 -369622 -157824 49383 -102100
7748 -102100 -174700 -231142 -603173 -224799 -486326 -552613 -568290 -231989 38016 -26931 194086
7737 194086 73929 77476 113961 -178884 -131425 -273625 -240982 199202 56236 181868 -176006
7726 -176006 -559696 -446188 -531319 -230259 12631 -98987 107926 169874 -8290 -99289
7716 -99289 26661 -120750 -250126 -108610 -385785 -366381 -270623 114080 -49626 -49029 121373
7705 121373 -298522 -372670 -45411 -306284 -287225 -435737 -766365 -131751 -175809 -156626
7695 -156626 171249 276142 297181 -11919 -216515 -240082 -6472 131149 223888 -26579
7685 -26579 63436 -99790 -68413 -347181 -280096 -242623 -277043 -237446 -469494 -161921 -105646
7674 -105646 -67618 50528 363615 119025 -213231 -85225 -35889 -186269 -228791 -404993
7664 -404993 -189222 -103246 -301076 -298868 -289843 -303090 -664237 -761443 -336479 8154 -561334
7653 -561334 -474032 -133692 -35695 -77378 -555333 -530738 -927915 -522593 -575284 -680416 -604860
7642 -604860 -807623 -772377 -268244 -231776 -459114 -381183 -634044 -426106 -866892 -935876
7632 -935876 -455097 147336 231 -465054 -146917 248824 142718 -280574 -293271 -625980
7622 -625980 -230571 -87969 -31283 -83546 -77855 -7975 57514 282878 -86178 -477069 -260432
7611 -260432 131430 206915 7988 33283 -219078 -6883 -115517 -210233 -124759 -415998
7601 -415998 -490991 -377048 134529 -263042 27567 143399 -113926 -143605 -190941 219025
7591 219025 42 -212820 -206248 -245140 -547668 -648385 -792159 -621951 -147339 -183150
7581 -183150 -134911 95305 -277391 -226803 -166029 -296339 -105856 -78730 186322 -241293
7571 -241293 -275199 38189 -212729 -197945 -345529 -594325 -337723 -248885 -357082 -277649
7561 -277649 -163827 -161026 -189449 35147 155091 -127389 -114175 -64369 -113116 -190256 913
7550 913 -266787 -344193 -50719 -648849 -227770 -233945 -637084 -643942 -577424 -288995 -349762
7539 -349762 -577621 -736353 -406009 -426066 88254 -236382 -383325 19515 -107505 -48856
7529 -48856 -163577 4768 -88720 -307789 -336860 -348839 -182284 -299297 -19149 133380
7519 133380 -187886 -351857 -311757 -256806 -319959 -306285 -268969 -623353 -600444 -519597 -265138
7508 -265138 -65586 -61892 -454683 -522944 -446053 -591451 -590586 -287675 -457484 -193139 -218397
7497 -218397 -587835 -541643 -902254 -567366 -411554 -542234 -275515 6551 -46877 -72913
7487 -72913 -323696 -68950 -243086 -213917 -247131 139040 324508 157160 134132 -307672
7477 -307672 -122715 99854 117566 -41322 -194615 -190545 -143878 -489840 -688568 -637066 -517843
7466 -517843 -509843 -591247 -433572 174902 -346493 -557538 -267156 -286707 -122728 -44451 -111852
7455 -111852 -409298 -279073 -463162 -314574 -470592 -609081 -536943 -338632 -113017 -314483
7445 -314483 -512596 -211872 -215987 -217039 -503580 -384677 -157239 -3225 -169430 -321182
7435 -321182 -541133 -245600 -87265 -123781 -85025 -209961 -211776 -100080 -25976 -414147 -527744
7424 -527744 -581215 -255413 -50082 167310 207979 79694 -127802 128600 214490 161776
7414 161776 88746 -205090 -276142 -48740 -422498 -131029 -103674 -532207 -612435 -691516 -353614
7403 -353614 -385790 -155337 -20461 65267 -51168 -479578 -544915 -36581 33495 200323
7393 200323 -273592 -547865 -352330 -268679 -67932 121116 -206742 -554497 -467811 -738787
7383 -738787 -545470 -565742 -721854 -723738 -409435 -274601 -128742 -330919 -182711 -144487
7373 -144487 -301811 -669454 -469454 -97633 259271 -120103 -210316 -205081 -96236 -166578
7363 -166578 -354414 -7612 -35604 283408 288012 -416551 -276508 -233168 -139771 -46425 -447497
7352 -447497 -681561 -256904 -302992 35787 642890 428761 130112 -409206 -24047 -93670
7342 -93670 -429993 -395237 -349246 -325368 -343262 -456618 1733 67255 68096 117966 -69218
7331 -69218 108095 198301 84161 116244 -363440 -500071 -214688 -304050 -759302 -322624
7321 -322624 -426455 -441325 -6930 165421 -79756 -215626 -135482 -155902 -63296 -378605
7311 -378605 -452796 -13491 -49118 -453548 -164725 -75030 -306665 -420688 -313694 -106666
7301 -106666 -270681 -631062 -649473 -54747 -502679 -388910 -225869 -70016 -134302 -137164
7291 -137164 -240813 -172321 -102821 -155015 -336640 -551118 -191773 -197281 -236797 -568240 -288379
7280 -288379 64455 -219829 -504338 -212245 -112241 -78283 67909 184439 229455 63681
7270 63681 -22499 324265 427065 323178 142618 7668 -299638 -634727 -412136 -96079
7260 -96079 -216061 -18588 31490 177286 -232862 -234421 -104113 -232741 -385687 -346709 -27612
7249 -27612 -35381 -521346 -7981 321098 -282182 -374307 -455672 -649546 -362357 -87195 -318203
7238 -318203 -57737 -239166 -352126 -351171 -237506 -281287 23424 111070 -218897 -351193 -351871
7227 -351871 -84102 -23444 212662 355287 153459 138574 95152 -127037 506616 51145
7217 51145 -108608 -648026 -825037 -410919 -290839 -165462 -229 -245980 -428473 -249685
7207 -249685 281943 65646 -103429 -92801 -329889 -453002 -587083 -122808 -95368 154158
7197 154158 -112283 285378 126101 42055 93801 145243 -49869 -384275 -582975 -450515
7187 -450515 -209515 -281638 -372267 -329154 -342000 -483828 -263817 -47919 154001 163533 -218940
7176 -218940 -517435 -526621 -161775 109968 -375905 -419439 -263195 -498139 -154257 -255724
7166 -255724 -681357 -665169 -310215 -561609 -618952 -783001 -869738 -775946 -648349 -409560
7156 -409560 -341241 93128 244729 109461 -52584 90288 129219 294416 91049 -119620
7146 -119620 -396530 -112469 24062 -137735 181033 271244 64355 -66523 -60685 -168946
7136 -168946 138105 -62939 -402052 -467661 -520456 -16715 -457687 -529485 -276735 -272291 -203450
7125 -203450 -688204 -86301 -20425 -160075 -251161 -325381 -275886 -171027 -540561 -935708
7115 -935708 -582064 -474882 -169365 -182556 -97124 -7321 -138249 -284840 154493 252820
7105 252820 -74720 -245848 -192826 -308888 -216348 -99705 -22867 -144838 -515364 -266848
7095 -266848 86266 182419 114661 75902 650655 421944 141510 112880 23681 -222793 -264315
7084 -264315 -273581 -295769 -203472 -410925 -221165 -496587 -601378 -367323 -378713 -502684 -111007
7073 -111007 -193381 -456093 -486856 -302821 -416399 -395293 -490715 -225505 7631 -306594
7063 -306594 -480999 -404344 44041 398189 153569 183545 -40321 58128 -19540 -145902
7053 -145902 27524 84435 -155167 223695 159329 -20077 -14456 -25649 -159467 -485329 -122134
7042 -122134 90831 142948 -48754 -124867 -341057 -153237 -212947 -453881 -136972 -313586
7032 -313586 -294407 -297208 -554422 -30895 -78937 -331073 -274475 -362343 -293330 139974 -201621
7021 -201621 -150050 -108394 -11544 146173 293723 379903 109613 -313777 -312153 -130788 -242021
7010 -242021 -267581 -36218 -88870 -117425 -217328 -65235 158985 210486 331410 174324 -36210
6999 -36210 -18606 -100784 -104902 -164330 -726199 -540025 -234907 -544318 70882 -30142 -399219
6988 -399219 -394978 -505250 -242674 -200151 -228973 24910 169286 -50421 120321 -349072
6978 -349072 -493878 -625965 -577596 -301209 45346 66487 -104050 29729 -41958 -262355
6968 -262355 -143991 -136634 -228431 -78660 -191292 137344 32315 -250545 27340 -189938
6958 -189938 -174763 -58536 -20076 4628 -118574 -164927 -67704 -265562 -108186 -449710 -389670
6947 -389670 131318 -248080 -116132 -322572 -489904 -211191 82970 -112723 72825 186446
6937 186446 53582 212990 597891 -98361 -305178 -38502 164728 -4236 -183931 -40174
6927 -40174 247149 85433 -457477 -134463 5382 -4743 -400049 -732822 -411389 -238330
6917 -238330 37611 420235 480035 340175 673886 768119 399425 333473 -106097 -140393
6907 -140393 254549 131067 6730 -32358 -96392 -256970 -377685 -381657 -21127 -190532
6897 -190532 -317048 -48955 158886 -44849 -103450 -353753 -446318 -371740 -220025 -18584
6887 -18584 148404 269827 -246247 -10351 -317264 -196637 -360028 -323783 -108926 167088
6877 167088 19556 -153370 -632550 -311520 46285 -355012 -273684 -61910 -173136 -246116
6867 -246116 215021 300358 156142 207171 -225713 -96262 -38632 51274 104048 -44297 -17700
6856 -17700 -26827 -80056 -252347 -382100 -308920 -124104 -11422 -153137 16873 45340 -386846
6845 -386846 -367728 -349686 -498126 -426967 -260705 -547758 -804808 -244477 -165570 -182334 -79571
6834 -79571 -15549 -113230 -427131 -620672 -884777 -854867 -183856 -142526 -438749 -138068 26253
6823 26253 -304021 -456231 -150164 77749 83388 54452 -71845 -32860 -38983 -216252 63446
6812 63446 299384 211662 -36714 190634 531514 431680 25094 311474 91921 -62367
6802 -62367 -233143 -176327 -238947 63449 31835 -480979 -566425 -634462 -71241 14493 -140167
6791 -140167 -455754 -89171 241819 -16986 -55979 -175017 192158 -128012 -393683 -336859
6781 -336859 -26289 -312495 -207817 -133735 -17898 -96747 134825 201530 -72077 128355
6771 128355 227922 237266 276931 -228354 -246290 -219920 247194 -9285 -149829 -306281 -241635
6760 -241635 208853 64098 221944 -76126 -201992 -469459 -427687 -312761 -225726 58240
6750 58240 -276596 -549234 -484588 -383794 -511015 -366172 -272933 -66569 16690 66136 228714
6739 228714 -25688 -42054 -48293 338484 -14504 -26238 -51228 -213295 -218969 12071 195985
6728 195985 232382 180006 100218 -143121 -194341 -15516 -31543 -233611 -251964 104912 309254
6717 309254 519356 119910 -99847 -155986 -226757 -210539 -332401 -327751 -204335 -295514 -351268
6706 -351268 -78940 -242455 -85073 -69351 -145525 39632 32903 59943 -97820 -302143 -191512
6695 -191512 -339028 -451818 -579796 -284193 -237463 161888 36766 -65863 201368 391616
6685 391616 301996 335909 -68407 -481420 -278901 133406 96473 -12609 -312896 -359269
6675 -359269 -337487 -182563 -56582 -284515 -125792 -177378 -325101 -423547 -707392 -276939
6665 -276939 -337700 -133770 157870 -28783 554043 245247 119604 -273103 -385863 -99220
6655 -99220 -309 -502994 -272916 -189881 -466472 -154211 149794 323430 221843 53862
6645 53862 76286 -198683 -521263 -357602 181078 309388 373883 264822 152253 28745
6635 28745 268469 389230 28343 6575 107722 108258 -354964 -89663 -179957 203638 275232
6624 275232 313474 122131 248616 276252 142224 376805 548470 492865 376590 428914
6614 428914 261898 168072 400345 336633 379356 622146 973185 1092554 795457 520888
6604 520888 940014 1019044 1264169 1152973 975270 1212985 1323549 1009139 714934 1212832
6594 1212832 1109253 885129 849242 1046690 407608 376221 355018 705247 949183 1198514
6584 1198514 1417654 1479151 1064709 1125442 1286072 894596 1220955 1385308 971755 1004531
6574 1004531 578914 189436 141449 393013 628109 583651 553567 597764 481900 502670
6564 502670 333309 -21167 208796 766592 576762 501520 307719 749068 893681 956045
6554 956045 667189 1034102 644097 329559 397735 389502 624791 685637 731139 604116 493582
6543 493582 163866 82622 245878 500832 298483 552784 726928 570487 301376 488725
6533 488725 355927 628520 677527 606680 863039 356700 445300 504600 541594 324546 176163
6522 176163 465901 250773 553253 930545 713625 815285 955343 1423087 1539892 808532
6512 808532 909086 617830 837775 1064330 1091249 1188483 940023 867662 887072 759708
6502 759708 664193 1267696 1361803 1251569 1357142 1019813 850439 1232041 1834136 1826615
6492 1826615 1780171 1487989 1291074 1236044 1240836 1250803 1413808 1660523 1918930 1535732 1082229
6481 1082229 1331476 1658232 1380163 1637364 1922067 1930767 1604465 1923414 2296218 2478209
6471 2478209 2465822 2906003 3498518 3862346 3626984 3820243 4235535 4229565 4379890 4809719
6461 4809719 5101262 5596002 5388321 5550487 5338980 4802977 4091004 4192533 4197865 3643895
6451 3643895 3102451 3372271 3272823 3387393 3958105 4250608 4671318 4794501 5783564 6203329
6441 6203329 6965053 7521389 8107647 8075081 8814989 9779248 10473987 10168448 9512588 8557774
6431 8557774 7699066 6499721 5437384 5242126 4789127 4337187 4429362 4448479 3717766 3742155
6421 3742155 3965490 3816294 3783022 3980219 4450103 4821512 5241291 5689468 6318476 6652544
6411 6652544 6399022 7079773 7124146 6520464 5867003 5390657 4931617 4414818 4201532 3834066
6401 3834066 3868955 3575592 3717466 3914435 3827717 3294471 3546146 3618706 3161979 2980233
6391 2980233 3419191 3355119 3415664 3395432 3553330 3771762 3766763 3750466 4124872 3980506 3779957
6380 3779957 3823641 4085517 4272120 4531953 4632259 4515615 4467132 5028313 5482031 6022592
6370 6022592 6856486 7491121 8301774 9225603 9685196 9537906 9222015 8591883 8633825 7960513
6360 7960513 7438238 6813849 6808829 6886528 6705944 7244971 7426486 7311524 7548807 7474424
6350 7474424 7537127 7456085 7581810 7770885 8071937 8814972 9242463 9613058 10420029 11195595
6340 11195595 12045567 12979105 14142769 16330901 19299055 22647793 25243350 27109624
6332 27109624 27338754 25644494 23138114 20670294 19378721 18910592 18144359 17399858 16851068
6323 16851068 16473767 16544226 16874019 16697872 17077946 17088752 17414310 18285001 18676959 19157511
6313 19157511 20071075 20969263 21946948 23607409 25000693 27104406 29777911 33492875 37588056
6304 37588056 42586617 49425111 58135489 66889176 74666209 79702894 80196042 77701150
6296 77701150 72540516 65484827 58212368 52765823 48027610 43954929 41361122 39615062
6288 39615062 38601201 38019582 38167648 38271115 38423604 39375538 41390157 43579808 46508020
6279 46508020 50981451 57197971 64785964 74955562 87683243 102714054 117811554 129051759
6271 129051759 132455489 127059615 115748841 100775192 86281578 74139686 64434608
6264 64434608 56757861 50787218 46155128 42747891 40264708 38206413 37199406 36474460
6256 36474460 36213542 36278851 36682112 37833254 39942454 42888089 47100254 52891762 59537416
6247 59537416 66169022 71159332 72607905 68941009 62344047 54972926 47221094 40574949
6239 40574949 35273001 31118403 27680137 24869047 22628174 20124912 18445523 17189076
6231 17189076 16021699 15012258 14062568 13156325 12475550 12040479 11293409 11108605 10526184
6222 10526184 9963286 9110112 8287277 7780562 7684657 7244240 7005977 6619248 6288635 6060419
6212 6060419 5893455 5614753 5290442 5107646 4831144 5035994 4820452 4928332 4489185 4125759
6202 4125759 4142138 3987667 4313226 4572088 4200051 3498161 3234230 3312615 3349294 3240061
6192 3240061 3222631 3178928 2778218 2853847 3002015 3022948 2724163 2845012 2907331 2819089 2714674
6181 2714674 2715139 2985313 2809901 2339516 2455382 2389342 2467235 2142961 2049477 2097418 2118077
6170 2118077 2367204 2547232 2858518 2365888 2391041 2627934 2410320 2194991 2098200 2378079
6160 2378079 2108701 2157488 2663322 2986340 2832373 2789551 3018219 3266049 3101079 3874750
6150 3874750 4482015 5249484 5853293 6248671 5959812 5234802 4415769 3791801 3934562 4034383
6140 4034383 4152807 3974388 4038518 4641411 5222229 5280391 5083264 4704234 5096514 5676552
6130 5676552 6128734 6265917 6249167 5932621 5470652 5259439 4986360 4400314 4352261 4532692
6120 4532692 4929811 5276194 5005906 4327866 4212417 3842340 3395790 3413514 3446245 4114090
6110 4114090 5086857 5816475 6125705 5580392 5130234 4317188 3450888 3308129 3271835 2718453
6100 2718453 2526035 2488880 2310654 2259523 1435387 1440949 1498955 1350065 1613343 1652911 1493620
6089 1493620 1386590 1414015 1331574 1128031 1085023 1552256 1489699 1273125 1251209 1170768 1164574
6078 1164574 1289965 1316706 1373751 1330331 1376742 1051571 1169971 1181793 1068636 1043809 918165
6067 918165 979659 1279068 802511 777380 685764 637584 735886 756518 832626 963780 1146985
6056 1146985 959862 1132877 879685 756810 691936 939600 1493605 1734273 999914 773487
6046 773487 930637 1065617 1345724 1212672 1503981 1847452 1459808 1183446 1217308 1336611
6036 1336611 1378766 1240174 723077 1243484 1025998 635226 650382 863528 1277832 753457
6026 753457 594606 740314 868050 1242492 1138586 956356 916390 1474280 1615485 1926265
6016 1926265 1848832 1786230 1753267 1073862 1110438 970199 1074861 891526 856394 973926
6006 973926 945758 1032665 1300027 1126660 849412 1210935 1292693 1029835 587357 254698
5996 254698 46464 707734 1046018 862907 728145 1275740 1598098 1247777 1413528 1638171
5986 1638171 1772105 1623939 1557368 1668544 1715800 2065046 1935683 1927404 1675578 1011312
5976 1011312 1326942 945231 1210654 1289762 1102263 1090081 948225 618555 1214938 1485390
5966 1485390 1254734 1407009 1540025 1539581 2060788 1994036 2092589 2218807 1894002 2329877
5956 2329877 2186003 2026222 2217895 1805614 1695472 2204709 2258729 2398888 2155934 1984099
5946 1984099 2460504 2727569 3089422 3096845 2997413 3019649 3225640 3301221 3568180 4221092
5936 4221092 4694684 5500262 6153931 7330373 8912561 9891763 10371115 10172186 9285015
5927 9285015 8460053 7288234 6057713 5062722 4552395 4369539 4392882 4191005 4019410
5918 4019410 4194990 4193801 4788788 4965857 5336056 6086016 6422995 6704428 7404251 7600877
5908 7600877 7201737 6485999 5959814 5760402 5218481 4714187 4474196 4153447 3809217 3973851
5898 3973851 3956755 3971873 3761955 4300107 4052276 4144858 4552822 4523516 4985846 6111072
5888 6111072 7041189 8547233 9850683 10295380 9930818 9377157 8385122 7800461 7441525
5879 7441525 7348437 6804085 5835132 5088423 4420806 4392957 4358026 4412639 4152665 3832219
5869 3832219 3534493 3501148 3524781 3869235 4052703 4460224 4950010 4876465 5350543 5741122
5859 5741122 5824109 5304471 4710713 4664594 4333494 4126406 4230038 3890895 3309054 2908281
5849 2908281 3036356 3133473 2878710 2690494 2898381 2536713 2369562 2621186 2011156 2060674
5839 2060674 2300734 2746499 2891093 2638790 2405688 2449067 2178930 2059551 2010761 2279955
5829 2279955 2102023 1813278 1831967 2002187 2066534 2004877 1895280 2255552 1832901 1939392
5819 1939392 2270639 2177516 1885304 2394059 2895874 2664767 2598506 2376817 2307793 2500402
5809 2500402 2995543 2742681 3150641 2871097 2276996 2805380 2835564 3017574 3136766 3179098
5799 3179098 3337810 3120092 3448755 3504729 3635938 3724958 4194103 4532352 4436207 4520854
5789 4520854 4708075 4539910 4462903 5270417 5714899 5847912 5329557 5273033 5165292 5464993
5779 5464993 5588182 5497187 5161108 5410765 6069115 6289389 6464634 6747264 6992867 6813855
5769 6813855 6592790 6927249 7236345 7465890 7588062 7677654 8041802 8320835 8384475 8537654
5759 8537654 9120304 9246723 9393653 9266679 9438601 9338356 9960898 10408935 10797406 11191329
5749 11191329 11716960 11798884 12171172 12866710 13151132 13581193 14025742 14347334 14899334 15272085
5739 15272085 15553074 16549888 17304031 18487974 20108379 21579416 23633040 26026908 28839953
5730 28839953 32593499 37995513 44035732 51398088 60622458 69100667 74756273 75836788
5722 75836788 71830670 64949260 57462442 50762484 46011786 42070520 38805420 36773287
5714 36773287 35344090 33792846 32846194 33563751 34316018 35062091 36316667 38519882 41838802
5705 41838802 45609965 50602453 58498671 68983322 83202411 100570594 118125210 130655818
5697 130655818 133007009 125222381 109951196 93056300 78426074 66770942 58125832
5690 58125832 51245145 45532024 41390190 38087572 35883739 34338789 32971791 31660126
5682 31660126 30855693 30531828 30949690 31924216 32920745 35166748 38829687 43396362 49467436
5673 49467436 56012457 61125675 63410712 61436311 55522232 48172091 41077432 34691716
5665 34691716 30028938 26506812 23660020 21438306 19204215 17837232 16106192 15178995
5657 15178995 14326243 13429237 12619466 11980905 11713837 10784805 9852244 9383312 9027045
5648 9027045 8906595 8812541 7950961 7634472 7451575 7110582 6561439 6396465 6362179 6208151
5638 6208151 6024317 6190853 6265706 6080479 5855524 5830916 6166782 5895742 5477863 5679690
5628 5679690 5956503 6054760 5930261 5666700 5170859 4748938 5092765 5171890 4928388 4829725
5618 4829725 4683487 4570508 5107582 5157227 5319493 5327216 5168051 5479623 5714865 6442831
5608 6442831 7157932 8190181 9065395 9395653 9065048 8782353 7985190 7243805 6994971
5599 6994971 6652012 6670404 7211272 7604569 7497886 7455419 7353840 7017966 6637501 6384142
5589 6384142 6476483 6578083 6921047 7550581 8149825 8108651 7483451 7270889 6895245 6571970
5579 6571970 6773158 6896438 7085362 7227055 6672240 6161930 6067132 5872725 5564183 5785407
5569 5785407 5733539 5972678 6269606 6333113 6184882 5535078 5096502 4737022 4226455 3762997
5559 3762997 3297942 2965632 2940636 2730487 2428657 2346417 1977837 1845610 2202816 2379067
5549 2379067 2344676 2036697 1816847 1784353 1788428 1758388 1909130 1780319 1774004 1726817 1578576
5538 1578576 1377711 1433872 1660319 1696251 1573465 1375426 1127482 1313175 1472297 1075228
5528 1075228 1386990 1653245 1962973 1619705 1781750 2284886 2344895 2557223 2534009 2790678
5518 2790678 2707583 1986436 1946811 2014848 1685137 1486502 1494483 1349619 1466000 1664169
5508 1664169 1316684 1433973 1348341 1668512 1500946 1458785 1627304 1794999 1909425 2055660
5498 2055660 2611011 2547086 2352682 2160274 2288998 1945873 1344517 1624701 1728079 1724601
5488 1724601 1692200 1583723 1470510 1130213 1166567 1139454 1249043 1092489 521884 451139
5478 451139 543747 510023 843719 432247 669470 1264709 1347975 1626799 1267743 1028384
5468 1028384 1006842 1300263 1212622 960212 879644 677778 658817 738920 631417 685836 896681
5457 896681 659751 579673 669691 589831 573976 472852 490253 777943 646566 1047925 1065497
5446 1065497 979199 978088 968973 991702 1158864 1306442 786647 912771 929141 1268327 1573406
5435 1573406 915008 914135 1006993 1204922 888063 958491 1109289 1263836 1134664 691183
5425 691183 714754 889043 834438 315533 573784 521923 284193 454794 509335 656593
5415 656593 438398 110635 570558 751773 724190 567940 593270 627131 784759 731209
5405 731209 949727 493838 481127 934406 700920 886743 1224941 1147761 669678 501161
5395 501161 362467 713323 993995 706609 634893 500308 681360 1043030 1320516 1028410
5385 1028410 986670 476421 709554 906973 940183 861547 1000592 1013579 1175135 1136741
5375 1136741 891775 1141291 1121773 926684 635856 1031298 1100209 854464 767646 723549
5365 723549 587303 690115 772973 824926 961966 1115608 1388128 2176051 2129811 1642583
5355 1642583 1144384 948249 1032676 975844 567768 541458 638084 787939 423546 86655
5345 86655 165382 84043 85329 6000 164545 216387 314211 342856 256462 379449 74505
5334 74505 153371 467790 399895 254927 397468 477786 549547 93823 218856 278987 307154
5323 307154 49251 192972 128984 -102123 -118920 38223 359690 178984 -145204 -250598
5313 -250598 190251 577486 562803 339027 412060 636309 401697 -120701 -88532 -278802
5303 -278802 121182 -30321 191309 -83770 -3925 229958 175903 -167578 -407036 5405
5293 5405 431265 489102 353078 564710 269237 517569 511186 469329 293707 350199 -16008
5282 -16008 -157388 101863 431658 254767 49010 204978 63377 182173 226091 -90072
5272 -90072 45652 377171 292966 317349 199491 208280 78775 213719 121307 3502 179349
5261 179349 619314 532137 460094 386107 853618 844380 850464 1299285 686513 517026 588163
5250 588163 615841 590047 559700 511478 169984 341374 690257 642999 333869 475173 586963
5239 586963 952466 1087299 725389 799313 849980 890571 741023 589287 421907 954305
5229 954305 608955 381463 498895 738198 975478 925091 1149442 684532 395858 657890
5219 657890 778705 1008169 952417 786147 836547 930003 949229 666809 886133 1026898
5209 1026898 1062390 1042702 934985 1070752 1299375 1174625 899185 1168893 1181441 875241
5199 875241 959176 1256349 1022260 1397573 1485738 1188531 1245686 806420 693395 878358
5189 878358 767178 933267 1511215 1617783 1569292 1351463 1113014 1546969 1700536 1851160
5179 1851160 1990479 2004848 2114479 2542708 2545375 2131562 2524599 2341399 2347995 1985756
5169 1985756 1865596 1619561 1505031 1686060 2177357 2190291 2031197 2172338 2276470 2251618
5159 2251618 1973418 1573383 1562498 2243421 2475202 2679310 2678756 2773955 2616875 2413076
5149 2413076 2533375 2986444 3050438 2810502 2440207 2402015 2363746 2705819 2869130 2699195
5139 2699195 3365752 3781696 3944720 3988819 4155093 3929659 3927396 3514228 3844216 4222503
5129 4222503 4001819 4339562 5110838 4997247 5342047 6222655 7046135 8328549 9970858
5120 9970858 11565560 12628406 12459040 11262673 9335792 7699427 6949394 6497848 5898006
5111 5898006 5009538 5202946 5629293 5764525 5620797 5766637 6023610 6533024 6537827 6407786
5101 6407786 6433140 6565619 6461368 6882895 6927389 6663173 6804694 7352375 7762630 7772216
5091 7772216 7927243 8099545 8357489 8287194 8521623 9117057 9761644 10351407 10397472 10951541
5081 10951541 11288885 11644477 11891666 12388465 13271709 13809350 13966128 14475919 14686438
5072 14686438 15254200 15842621 16751201 17833186 18890025 19503718 20021493 20789587 21608325
5063 21608325 21811410 22599842 23298898 24118145 25662149 27029548 28834361 30591448 33555965
5054 33555965 37285473 41425435 46589664 54360578 64717971 80215615 103595823 138287527
5046 138287527 185726663 238695300 276553680 272498498 232485320 180707669 136438844
5039 136438844 106280717 85402437 70957371 60152687 51996644 45615022 40893692
5032 40893692 36700065 33464178 30695624 28069676 25855764 24760394 23164694 21075996
5024 21075996 19056433 17745912 16463076 15456786 14893674 14598784 13649363 12949831 11961892
5015 11961892 11332969 11003961 10369545 9839630 8908462 8448900 8169180 7897871 7229682
5006 7229682 6835404 6669795 6424068 6124240 5915049 5399956 5594484 5479364 5073331 4968195
4996 4968195 4971859 4632087 4163631 4035673 3845315 3518505 3382480 3531717 3471099 3673013
4986 3673013 3275089 2904415 2683722 2578267 2690100 3003361 2709671 2890994 3037663 2815246
4976 2815246 2935843 2552351 2478505 2725123 2607106 2713387 2701453 2874972 3000966 3156331
4966 3156331 2914642 2428850 2661299 2388997 2071207 2288462 2409205 2737486 2290222 2271955
4956 2271955 2354628 1862050 1718745 1672442 1370193 1399952 1514159 1527389 1780973 1624650
4946 1624650 1162873 891999 1193390 1595918 1883552 1589888 1438903 1439873 1592514 1080856
4936 1080856 1121455 858125 804444 779425 1088572 1033387 876737 1475351 1359741 1198808
4926 1198808 1219260 1208020 1318442 1108640 773313 865636 1096338 736186 641566 637422 1145474
4915 1145474 776767 803904 905047 524933 756165 560735 935507 773449 644670 514633
4905 514633 411867 539142 993746 365286 398261 861785 759198 506951 421462 586976
4895 586976 1067205 740746 595384 490422 846387 1202814 1132000 709986 416819 646119
4885 646119 591796 691017 830554 792872 240651 700480 926333 858809 778876 699608 579633
4874 579633 657895 534206 766556 718163 560501 850385 1031376 493823 365165 645491
4864 645491 1027630 936508 897655 906529 1210807 1061816 867197 716021 756918 1098953 1165959
4853 1165959 619048 576434 920128 827671 446658 425339 390437 754737 1269847 1016173
4843 1016173 767666 820070 778094 811217 895470 376758 587872 1191801 1170436 573858
4833 573858 828794 815283 406239 267752 469010 490552 271612 632240 966229 694493
4823 694493 607588 531944 577367 504495 490468 828525 1153977 638839 584876 907807 811885
4812 811885 1030500 1269386 808223 843894 544747 282637 224931 -24790 110391 429010
4802 429010 746864 1276631 1309497 1466280 1697673 1895582 1232011 1061431 1375000 721373
4792 721373 1025533 1713680 1395674 1100453 1000033 1197102 1503648 1293468 1045496 1325233
4782 1325233 1118737 1031481 1221184 1516573 1070326 1033260 1494582 1307906 1129763 1330647
4772 1330647 1229013 895389 1607646 1329548 1097820 1198064 1441925 1634170 1370774 1573743
4762 1573743 2002991 1807117 2036668 2065583 1891090 2123190 2300277 2186930 2139087 1908498
4752 1908498 2199261 2039905 2102054 2295678 2572275 2633394 2242586 2257955 2564696 2664862
4742 2664862 2964421 3100015 3145878 3113599 3383276 3160698 3324385 3564380 3927142 4514094
4732 4514094 4728841 5055823 5262442 5532125 6273507 7535301 9133828 10977023 13417325
4723 13417325 17332235 22924497 28556362 30743670 28623837 23368587 17832189 12975432
4715 12975432 10394109 8845103 7852492 6745984 6021820 5516618 5006665 4762500 4270080
4706 4270080 4215893 3814545 3963128 4170900 3633949 3185321 2769613 2302227 2512435 2691735
4696 2691735 2189464 1980133 2056438 2513965 2222013 1727278 2152566 2654543 2556306 2266832
4686 2266832 1866326 1672156 1742313 2161865 1674100 1438950 1920409 2321634 2363306 1982455
4676 1982455 2095896 2307964 2393639 2432450 2123770 2294501 2463876 1886912 2353966 2507343
4666 2507343 2105923 2083218 1992344 2490280 2100297 2168408 2274727 2190089 1894105 1891227 1925668
4655 1925668 1596690 1456824 1266815 1448296 1424225 1689773 1718523 1676025 2289882 2096186
4645 2096186 1607524 1727870 1538387 2056408 2190417 2292667 2735387 3287180 3185151 3376400
4635 3376400 3075762 2757947 2830691 2605149 2055753 2356687 2012462 1673388 1654828 1751608
4625 1751608 1505643 1363487 1746865 1115018 1019821 1049462 1277164 1755182 1735598 1838820
4615 1838820 1977947 1982554 1934198 1511399 1453426 1123138 1460965 1316327 1297832 1549600
4605 1549600 1623071 1669341 1054415 980803 1112139 1300941 1482683 1187653 889331 508446
4595 508446 498321 873702 870802 957531 908031 940145 817768 800558 967351 712630 662483
4584 662483 982460 537062 841577 1000803 1128275 1389111 1353741 1083846 987546 503227
4574 503227 399550 192980 607344 974589 749055 1000225 1018479 686054 509187 663386
4564 663386 611511 586112 437154 303529 435220 617524 690735 578357 988192 1240660
4554 1240660 1283314 1585038 1539193 1407356 1357550 1115475 849606 477020 334954 431266
4544 431266 553542 492185 245273 502895 534436 642598 689719 814236 316814 933032
4534 933032 686142 803242 482850 204427 683935 766459 212355 329385 409877 499891
4524 499891 729625 497362 878489 932829 432759 636360 795513 613809 640369 746667
4514 746667 766701 869013 849885 836326 851331 656363 454307 635775 815281 811702 518621
4503 518621 345092 424038 365832 392512 423362 419204 903072 1078739 800840 618591 626990
4492 626990 499141 340173 494139 544930 563475 642255 782339 971935 827052 600185
4482 600185 864426 1177430 1098884 947094 779343 872859 777875 562985 1114660 1033669
4472 1033669 1361112 1438052 1629954 1454580 1084737 1334849 1402141 1119542 1468993 1483353
4462 1483353 1243897 1320358 1352780 1228449 998299 1066316 1278992 1206435 1410620 1500597
4452 1500597 1186741 820062 1271307 1263456 1323165 1032358 963729 1516553 1829678 1820010 1981043
4441 1981043 1584205 1432060 1707747 1548670 1889075 1839146 2159757 2398178 2573404 2440913
4431 2440913 2256058 2236644 2644274 2791006 2881184 2698206 2575735 2487621 2611367 2800060
4421 2800060 2963382 2778066 2524499 2557428 2386409 2839675 3479529 4308290 5220223 6154657
4411 6154657 6908161 6810528 5870449 4591152 3821548 3424104 3523393 3524729 3194529 3145288
4401 3145288 2470357 2533516 2547640 2479961 2456696 2674688 2884895 3134383 2465136 2060936
4391 2060936 2150934 2202892 1956267 2161024 1819619 1464079 1567523 1785018 1581564 1413364
4381 1413364 2226887 2452770 2308584 2391333 2026180 1714975 2232404 2349964 2115936 2162669
4371 2162669 2251579 1629476 1262030 1464480 2074436 1827732 1672749 1747928 1652699 1757937
4361 1757937 2034192 2449000 2074628 1954802 2011927 2683992 3363223 3733033 4954111 6087760
4351 6087760 7218482 7155628 6440342 5815601 4811944 3875535 3254013 3069012 2948573
4342 2948573 2666698 2174582 1905816 2017987 1681052 1603028 1018534 804129 998788 1415735
4332 1415735 1296325 1545068 1451883 1510918 1746648 1637099 1622277 2126199 2105446 2479812
4322 2479812 3378557 4056628 4052463 3346068 2702933 2090912 1866164 1709329 1216930 1317377
4312 1317377 1353526 977763 1117756 1433695 1427668 1250150 1026675 786909 786153 943108 894696
4301 894696 815226 973256 729911 300603 251873 536348 707152 764182 777430 770394 468526
4290 468526 711462 657790 700760 580147 562446 540460 548980 727789 608098 408245 210273
4279 210273 470850 859788 581182 315939 346928 831844 1159890 779909 690907 154086
4269 154086 -103893 255185 253722 528585 891373 1047780 905990 946872 484327 154761
4259 154761 335875 701910 938025 1025167 964041 557727 606353 848463 739922 755678
4249 755678 707914 593360 1069782 731218 445323 835073 874840 808140 1078578 966227
4239 966227 567549 475844 846499 908845 929071 1125178 1131359 1119513 916808 945505 894633
4228 894633 728961 946210 947148 1020930 992681 749371 782496 702228 873453 962088 1242226
4217 1242226 958746 900970 976769 1480328 1183022 865554 852364 1136777 1186280 1353557
4207 1353557 1561851 1491130 1713824 1257859 1238374 1331151 1197026 1101325 1362662 1458742
4197 1458742 1316828 1093978 655872 1275988 1388207 932230 1100787 856351 1196794 1513699
4187 1513699 1689287 726645 1259067 1367641 890423 1323988 1437955 1684486 1396261 1633649
4177 1633649 1313463 1520754 1472873 1224425 1511689 1480989 1515912 1437388 1474124 1569727 1093095
4166 1093095 1556766 1813000 1961667 1658955 1088151 1399850 1409865 1339555 1090360 1248737
4156 1248737 1300419 1630516 1918666 1461215 1451523 1484076 1665435 2291864 2437126 1864383
4146 1864383 1642094 1796918 1648916 1626781 2014474 2060407 2040650 1813216 1842077 1864550
4136 1864550 1741781 1474705 1785846 2065127 1287266 1463896 1723221 1820294 1665288 1820354
4126 1820354 1812484 1504649 1840794 2228246 2233731 2444895 2200889 1780835 1555053 1539174
4116 1539174 1807861 2043006 1971999 2070403 2011090 1967014 1781057 2230689 2101983 2097255 2271502
4105 2271502 2219973 2408335 2236387 2066097 2375903 2201536 2084416 2105836 2409824 2133226
4095 2133226 2186058 2613651 2142548 2240035 2178086 2387798 2681347 2389669 2229331 2443265
4085 2443265 2234314 2065842 2008251 2141192 2475343 2549829 2488325 2634983 2704101 2807690
4075 2807690 2673690 2716546 2831211 2889943 2658252 2530634 2435410 2454426 2594294 2503617
4065 2503617 2362656 2415358 2143349 2584798 2749226 2747627 2609749 2395415 2572791 2354698
4055 2354698 2508820 2647670 2239302 2348333 2673224 2674122 2895773 2752925 2727267 2483391
4045 2483391 2666698 2857602 2758717 2865245 2804162 2856584 2767576 2761836 2620253 2455164 2943392
4034 2943392 2850792 2893621 2692955 2479120 2302006 2343892 2787587 2724695 2778117 3053576
4024 3053576 3193723 3057404 2848961 2660248 2916965 2741848 2705038 2968345 2940647 3424317
4014 3424317 3222245 3349036 2946117 3028081 2778330 2632299 3127973 3249301 4075568 3629898
4004 3629898 3845708 3396776 3572216 3787446 3606422 3598789 3814853 4205994 3882577 3904777
3994 3904777 4178530 4185950 4207723 4135585 4086805 4218138 4443431 4124547 4214008 4543806 4972648
3983 4972648 4965397 4723686 4598732 4453717 4565307 4736510 4597105 4692109 4643518 5144267
3973 5144267 5118402 4873148 4527043 4817971 4964332 4588048 4970550 4847125 5156223 5415965
3963 5415965 5663987 5662597 5786200 5596122 5741304 5747336 6059613 5693105 5605125 5771029
3953 5771029 6284264 6561881 6493586 6654283 6353251 6204689 6348536 6360233 6580849 6678515
3943 6678515 6689781 6631112 6515461 6241220 6385841 6717114 6898674 7043673 7082678 7226888
3933 7226888 7597231 7803258 7902256 7708861 7895599 7882113 7479047 7348926 7551204 7760065
3923 7760065 7984524 8058671 8455467 8362273 8378289 8123914 7973222 8120725 8251860 8530134
3913 8530134 8153785 8121013 8003350 8035610 8130873 8510673 8314391 7929243 7966180 8038131
3903 8038131 7786549 7668769 7953422 8525295 8548556 8280531 8340610 8738146 8417970 8181821
3893 8181821 8257695 8389028 8538196 8436831 8362477 8538035 8235469 8413055 8589931 8445315
3883 8445315 8766020 8914180 8764263 8993061 8731029 8856034 8802722 8938586 8547570 8492475
3873 8492475 8209016 8470923 9195492 9253628 9478312 9259461 8476620 8528028 8829933 8939918
3863 8939918 9158738 8758507 8984252 9074517 8755766 8663794 8834466 9149322 8965362 8683559
3853 8683559 8603206 8675837 8646852 8243810 8339621 8555151 8801665 8342865 8706274 8456907
3843 8456907 8561596 8481146 8341957 8366200 8136765 8515702 8022087 7793700 8452648 8898321
3833 8898321 9071423 8976445 8875930 8615666 8834053 9041218 8995689 8795344 8826137 9319382
3823 9319382 9412764 9300020 9663823 9538571 9400809 9505204 9522904 9671666 9725698 9798672
3813 9798672 9707450 9848804 9710968 9873386 10096168 10368771 10139978 10393309 10522363 10529305
3803 10529305 10652667 10386695 10994418 11162738 10906590 11013827 11208036 11132894 11418943 11498702
3793 11498702 11405151 11307954 11892351 11765951 11938609 11916902 12544636 13282209 13075917 13191027
3783 13191027 13768841 13393244 13393562 14120409 14429517 14515198 15046796 15225706 15381703 16063324
3773 16063324 16088280 16035742 16167254 16423150 16913580 17861846 18574637 18902432 19549971 20805544
3763 20805544 21859378 23322231 25203372 27979068 31362078 35969946 41917904 49347470
3755 49347470 57742967 65616916 69544514 67593706 61426348 53346266 45509514 39675566
3747 39675566 35565628 32013861 29010248 26708173 25184576 24016449 22307146 21392058
3739 21392058 20709308 20079680 19189872 18350120 18123065 18006188 17488509 17275864 17224750 16531837
3729 16531837 16228226 16143063 16304755 16277745 15924741 15559679 15547016 15847459 15486955 15718658
3719 15718658 15084693 15024939 15216691 15086209 15172303 15390841 15568881 15853646 15579486 15510279
3709 15510279 15972223 16111129 15775957 15796875 15648432 15540683 16077990 15826862 15737945 16114723
3699 16114723 16501419 16544816 16786198 16818334 17205378 17717079 17370437 17845869 18676571 19179903
3689 19179903 20041021 21344373 23259915 25671349 28750520 32398578 35516537 36171445
3681 36171445 34428072 31903407 28775381 26189321 24736188 23450867 22769396 22478137
3673 22478137 22317790 21569240 21761497 21928938 21885661 21937828 22386002 23499133 24389953 25244195
3663 25244195 26752505 28146997 29319523 29775726 29411207 29249299 29534500 30489288 32650265
3654 32650265 35241347 40132672 46768399 53267092 57795211 58144687 53313778 46507332
3646 46507332 40987928 36581171 33488553 30892346 29537295 28539127 27767427 26771909 26643257
3637 26643257 26440154 26264682 25893881 25316096 25170467 25149533 25281850 25324052 25215305 25194862
3627 25194862 25667561 26060349 26968670 27499661 28114498 29488348 31997854 34557525 37677030
3618 37677030 40321401 41771801 41425791 39576306 36305303 33690162 32234231 31141101
3610 31141101 30436597 29342314 28878930 28608431 28449459 28185488 28324412 28449090 28730287
3601 28730287 28387823 28336208 28338247 28666144 28853069 29071697 29541003 29979156 30246319 30275892
3591 30275892 30553055 30859008 31379349 31446647 31695981 32394396 32916403 33597977 34378368 34568988
3581 34568988 35234263 34984400 35659599 36695479 37353765 38244019 38574936 38696494 39140367
3572 39140367 39542000 40223373 40521511 41072197 42195046 42946021 43342644 44187028 44918539
3563 44918539 45611933 46639430 47659433 48802408 50124659 51001167 51726288 52910953 54024260
3554 54024260 54910937 55875849 56868835 57940715 58891817 59774251 61097021 62042465 63623417
3545 63623417 64431025 65601357 66847740 68143682 70017822 71615858 73059034 74888616
3537 74888616 76612324 78220365 79584243 81348863 83243582 84864133 87102361 89273688
3529 89273688 91259728 93664780 96100961 98360648 100681632 103239617 106731986 110279885
3521 110279885 113621238 118170201 122638902 127909093 133237591 139289432 147012337 155123111
3513 155123111 164042489 173837001 184826327 196452439 209034685 222478313 236047601
3506 236047601 248867226 261068582 270740551 276495773 277370411 272503409 263595985 250505596
3498 250505596 235911117 221564287 209108284 197892606 187599345 178853806 171148058
3491 171148058 164429029 158302733 152688851 147738410 142740849 138777292 134966213 131404246
3483 131404246 128107998 124808956 122182660 119667191 117531088 115773413 113774559 111551785
3475 111551785 109574735 107473319 105665217 103969274 102282498 100089315 97856354 95800034
3467 95800034 93946464 91699757 89042109 87045814 85048644 83114203 80950651 78862807
3459 78862807 76744689 74772886 72995114 71615411 70256150 68285893 66648793 65048990
3451 65048990 63813835 61936359 60409517 59875184 59083798 58013249 57592787 56775322 55852813
3442 55852813 54542237 53447212 52426668 51752781 51024407 49978003 49399058 48966021 48423352
3433 48423352 48187511 47387619 46741202 45617635 44696038 44110460 43155037 42764097 42543577
3424 42543577 41932092 41217733 40508450 40398976 40130351 39798962 39451590 38986805 38868655
3415 38868655 38186786 37528192 37269964 36880556 36375157 36444866 35952149 35522445 34931057 34686167
3405 34686167 34700744 34155128 34107245 33814051 33272986 33067892 32565390 32192775 31901633 31328501
3395 31328501 31005860 31235865 30890227 30330613 29888152 29874730 29678110 29418050 29374653 28874147
3385 28874147 28272791 28184909 28266448 28180122 27761973 27412671 27434828 27159645 27067730 26947218
3375 26947218 27036301 26731603 26536642 26164293 25715137 25443246 25280573 25360359 25352274 25516919
3365 25516919 25357144 25264286 25293156 25362823 25035059 24609127 24398750 24780864 24675061 24172966
3355 24172966 23922353 24054126 24225152 23854233 23996126 23953144 23845360 23741447 23671777 23640491
3345 23640491 23777369 24088898 23845906 23346686 23340912 22933030 22711106 22657420 22599827 22751060
3335 22751060 22718931 22261504 22387972 21910582 21564823 21517914 21536853 21882717 21607446 21432745
3325 21432745 21061352 20815429 20835446 20536820 20021534 20134571 19929827 20010735 19680829 19605274
3315 19605274 19712986 19866806 20103907 20007655 19874334 19379479 18862543 18909096 18854030 18593147
3305 18593147 19105556 19130076 18637894 18350459 17932060 17932551 18218949 17892563 17510128 17556695
3295 17556695 17301697 16935942 16884450 16620989 16602976 16679102 16733157 16499300 16112544 16692257
3285 16692257 16789603 16400193 16616115 16577025 16194441 16393883 16578773 16936253 17091037 16590172
3275 16590172 16268459 16571071 16655579 16573524 16667734 16755156 17019550 16904422 16591293 16818853
3265 16818853 17060745 17199252 17129308 17098341 17091184 17082960 17138905 17149846 17107438 17629927 17614357
3254 17614357 17955981 17962461 18097925 18162172 18586004 18767788 18702862 18678124 18618243 18926133
3244 18926133 19021596 19575813 19904452 19911767 20523860 20698409 20718864 21492264 21872283 22200078
3234 22200078 22346874 22710849 22469576 22644849 23113846 23189904 23403639 23427794 23021244 23018545
3224 23018545 23131423 23274281 24092620 24662287 25065218 25472738 25630279 26062074 26292224
3215 26292224 26503362 26754312 27380026 28132866 28858559 29471967 29976933 30508176 31416362
3206 31416362 31998650 32574613 33500989 34461144 35769239 37060929 38224499 39225998 40176043
3197 40176043 41658304 42771820 43752525 45475870 46951942 48012028 49391212 50096495
3189 50096495 50617746 51192675 51454526 51516674 51996475 52526824 53055942 53527241 54114311 54164715
3179 54164715 55159620 56547494 57380395 58748071 60736307 63230472 65517147 67620485
3171 67620485 70548644 73728519 77267843 81262380 85280674 89377592 93668475 97237789
3163 97237789 99544946 100759231 100284206 97541885 93827573 89850741 85690904 82279390
3155 82279390 79631781 77824827 76992794 76610242 76623293 77206300 78027115 79286087 81116204
3146 81116204 82796320 84666379 87042094 89741351 92390368 94684478 97393104 100290078
3138 100290078 102934632 104321009 105766223 105472976 104220229 102666934 100450711 97272894
3130 97272894 93556965 89666700 85419920 81297730 78047591 75089506 73007628 71209028
3122 71209028 69664666 69182758 68674012 68526676 68726141 69390569 69718255 70744418 71027893
3113 71027893 70724288 70743008 70375381 69515331 68027437 66410825 63998403 61090348 58095855
3104 58095855 54983812 52477258 49896767 47097686 44740111 43173311 41490057 39598889
3096 39598889 38351862 37132769 35595501 34204520 33805646 32504444 31747689 31584939 30822095
3087 30822095 29828134 29592726 29142863 28364815 27699336 26834024 26078523 25524630 24674778
3078 24674778 23434963 22998653 22106528 21177656 20799211 20232627 19752596 19627597 19101150
3069 19101150 18372577 18165739 18154860 17656761 16928428 16197792 15968047 15833302 15475298 14981286
3059 14981286 14595602 14261846 13509044 13818935 13719121 13363265 13708498 13818200 13454998 13053873
3049 13053873 12764121 12785031 12761356 12592677 12267361 12301902 11974777 11460169 11209427 10920040
3039 10920040 11425544 10869983 10264980 10239302 9704572 9395266 9309371 9266596 9255594 8783818
3029 8783818 8273864 8649077 8737248 8729266 8419772 8558079 8392618 8164653 7702102 7252050
3019 7252050 7534239 7385225 7743653 7423675 7199347 7170280 6991161 6662615 6873375 6460106
3009 6460106 6715535 6862994 6609368 6556057 6489107 6239604 6205058 6115570 5521980 5187551
2999 5187551 5266131 5191196 5058137 5068532 5025905 5221484 5035429 4760967 4929175 5181041
2989 5181041 4996781 5031436 4462206 4446649 4541413 4939032 4648384 4186106 3997251 3827089
2979 3827089 4264200 4294508 3574716 3493147 3861293 3599627 3306719 3506142 4015633 4021160
2969 4021160 3433002 3337503 3448970 3401157 3586339 3309784 3567606 3460222 3472104 3463403
2959 3463403 3561114 3697022 3902932 3909543 3309790 3087574 3266668 3247381 3463589 3357354
2949 3357354 3048880 3056482 3488162 2961013 3093655 2925716 2615719 3030778 3104128 3021886
2939 3021886 3178683 2891083 2704912 2808798 2798250 3329581 3478077 3023182 3018037 3065903
2929 3065903 2989704 2911595 2790282 3174610 3205642 3061955 2907559 2395699 2387246 2639155
2919 2639155 2505038 2674145 2644464 2661503 2411712 2552886 2670351 2584626 2361378 2764438
2909 2764438 2430649 2550625 2761987 2773358 2630919 2662318 2832545 2826430 3002102 3320605
2899 3320605 2802528 2499712 2492358 2059985 1973481 2081472 2187933 2339695 2385094 2306513
2889 2306513 2311731 2475133 2689415 2361597 2805120 2623656 2497650 2897723 2698699 2007812
2879 2007812 2224761 2641695 2513669 1978574 1783779 2065928 1942207 1799530 1888985 2014298
2869 2014298 2292066 2248276 2216992 2477705 2524318 2012524 2230148 2437554 2035959 2568049
2859 2568049 2545227 2389554 1901905 2250875 2132499 1949507 2354740 2444951 2355329 2327348
2849 2327348 2278764 1981046 1668232 1609397 1681293 1817550 2037823 1847066 1840713 2033274
2839 2033274 2159949 1878610 1924307 1529381 1554853 1710286 1660186 1823098 1512234 1977744
2829 1977744 1745280 1533740 1376055 1619318 1529532 1241754 1466935 1767455 1599714 1094343
2819 1094343 1611301 1764729 1537130 1353873 1503635 1988507 1795305 1352232 1556245 1335044
2809 1335044 1355359 1395180 1410671 1431676 1486694 1543252 1430594 1309628 1217851 1101657 1424700
2798 1424700 1360890 847422 734800 964183 877885 1207579 1376853 1177784 1031493 470563
2788 470563 427241 981786 1152339 1345761 1378397 1277977 1129621 1113418 1212167 943900
2778 943900 873917 911897 987802 1407844 1333694 1187528 1332817 1101935 1218896 1516311
2768 1516311 1339455 1293708 1385349 1503439 1476393 1515028 909080 668144 500921 644377
2758 644377 424801 556886 865103 1038115 1232824 907809 516042 364697 1003569 906841
2748 906841 535223 445189 833486 361766 579666 1131995 1068938 1025371 1156419 945150
2738 945150 1026239 1193143 782148 663864 914184 586784 707346 732338 1040408 884794
2728 884794 752877 1192703 893932 423418 555788 986658 684107 877873 918010 752562
2718 752562 776403 663273 724642 771178 830001 812655 1096914 867696 460335 662929 886277
2707 886277 888996 600182 560793 988974 659316 564097 420521 684323 808701 228346
2697 228346 171337 446950 509105 266681 382182 543225 712779 440911 293641 594268
2687 594268 525185 327553 428195 137109 -198964 279065 614417 728925 827826 680684
2677 680684 856378 520071 491701 927268 896384 826091 910661 686579 883586 678974
2667 678974 983122 1240398 853969 938889 863537 650663 401677 547456 561908 358206
2657 358206 544721 525778 459691 604640 258999 466620 471041 -9071 127006 -70138
2647 -70138 352923 813487 499733 251764 56729 -216396 -44882 353282 565205 306020
2637 306020 426834 201812 314133 712379 553174 623868 601854 937289 897251 395561
2627 395561 563844 421840 292299 171927 251064 167606 117837 124993 134401 267692 625328
2616 625328 552870 398826 490027 -90279 -170616 261264 481218 316428 321056 253164 373453
2605 373453 98192 291017 493024 112751 51958 148604 -1488 75488 -118520 -72565
2595 -72565 130498 146482 177444 -128173 -394468 -365696 -47165 376425 310826 298946 308697
2584 308697 387162 83819 186937 105411 -68829 326030 63174 -195100 -106238 274111
2574 274111 422856 373004 259489 390218 316226 363466 227389 667492 347689 133623
2564 133623 -51133 318633 611430 504710 580168 561753 839815 247083 -65535 -105027
2554 -105027 104939 303441 299809 275583 826174 713532 468319 476553 189508 -154173 12574
2543 12574 235636 105276 -24593 205756 -284686 -543427 -204930 -14907 -299860 92108
2533 92108 383286 -6573 -213534 148978 25875 196885 -203626 44305 34190 -273578
2523 -273578 -203613 -292820 41154 343346 198065 -173519 -109368 378834 614186 514373
2513 514373 102398 9484 -193580 -6508 136592 -78069 83299 -471600 -222613 -179743
2503 -179743 302578 405866 380384 354068 229699 194964 263729 200156 36590 291239 500585
2492 500585 415024 453663 327665 503305 331908 505124 65748 457809 675457 539654
2482 539654 529009 840998 631900 345040 361772 271760 -191012 101133 758508 178884
2472 178884 433477 622360 666836 916793 582540 238870 562356 452549 763048 1189760
2462 1189760 669982 316634 133014 251598 824572 681176 483607 6240 -106593 166725
2452 166725 584309 713263 568107 864266 886935 1220850 993356 914740 932265 1121992
2442 1121992 805259 738305 994656 1173737 965010 486957 809507 1267629 1161185 1129734
2432 1129734 1050070 1332820 1374340 1164609 1113408 870704 1357791 1148855 1368500 1482399
2422 1482399 1567703 1699968 1908639 1961347 2105985 2231771 2527438 2588083 2443653 2307183
2412 2307183 2246490 2442413 2654490 2809735 2494104 2733290 3136667 2963813 3210567 3064329
2402 3064329 3284500 3859192 4287692 4668233 5042824 5042225 4956504 5220195 5473565 5457889
2392 5457889 5507508 5689570 5920469 6557868 7275455 7753433 7553290 7798393 8201642 8579814
2382 8579814 9488385 10899060 11960675 12822519 13123043 12947484 13100651 14176009 15314539
2373 15314539 16815186 18980272 21899804 26966950 34407298 45424721 63092497 86866079
2365 86866079 112458836 124113417 112034849 88926349 65587021 49931088 39910704
2358 39910704 32669090 27408563 23428513 20672270 18511660 16881228 15550476 14673258
2350 14673258 14494191 13911036 12914880 12112722 10857144 9897855 8870921 7863241 7372984
2341 7372984 6923220 6674003 6470800 5865893 6001379 5447940 5209431 5224846 5058858 4442781
2331 4442781 4112613 3972486 3430713 3611850 3591334 3511376 3582468 2858927 2633029 2811011
2321 2811011 3031832 2540413 2957046 3396570 2825723 2301942 1981782 1631531 1455363 1484472
2311 1484472 1677103 1555348 1599633 1309530 1087495 1667647 1648292 1550134 1368304 1388536
2301 1388536 1132050 1410524 1298415 1393987 941578 947327 1091712 1218958 1294385 1044066
2291 1044066 1015695 777404 547847 576530 419158 753467 723304 389765 800460 1186734
2281 1186734 1119943 912069 1092084 732603 655581 713882 1174181 1185041 1066843 829455
2271 829455 394578 617179 691562 939824 1012774 510509 344883 -43096 179820 798146
2261 798146 707720 496490 575773 702664 381457 363278 485309 687508 282145 491030
2251 491030 483481 242531 321736 390620 510521 87102 -73949 233531 323369 91131 125781
2240 125781 100854 180600 105305 396500 427254 356485 34019 42393 139570 56415 -117907
2229 -117907 400632 565616 117479 139919 120399 54216 91261 86700 279251 252456 -113125
2218 -113125 73046 45832 247376 466624 371614 199790 126525 -27961 -187484 -8853
2208 -8853 519039 742631 489344 721418 695272 244304 225366 425819 237330 337024 27168
2197 27168 235943 208250 220807 25608 2086 -44407 4618 190157 -211446 -145307 -76276
2186 -76276 103116 266106 -364018 -298182 -277979 -686309 -494504 -498295 -470652 -640543 -471071
2175 -471071 -563930 -437206 -54186 -419729 -280688 -345532 -487773 -561055 -409764 -123401
2165 -123401 -30984 10111 -243969 -43532 206314 2627 -445852 -127963 75816 -34972
2155 -34972 49924 424160 361340 48117 -101838 21584 399033 -14486 -123372 84712
2145 84712 593414 227003 -219818 -208442 -94611 -224965 -418451 181268 376365 454747
2135 454747 -98439 -70427 -222995 155515 295718 -13622 -170790 41426 155595 173624
2125 173624 178365 -14042 185559 447205 165326 179188 285532 238763 -291920 141535
2115 141535 53993 327668 -108437 209049 691313 339133 -62137 54032 -94312 -64505
2105 -64505 -116091 305056 530091 347472 -108042 -205731 343393 70972 467317 474695 420212
2094 420212 -48539 122638 270727 161081 166228 368672 232232 182147 227826 347028
2084 347028 -118353 9124 271111 473525 -32248 -358472 -380723 6370 285154 216796
2074 216796 231144 250505 -10537 10876 -41196 -52728 -288053 -334233 188815 86992 87855
2063 87855 -97523 -53006 -210545 -329942 -95502 -30233 -59198 -205289 -4968 210043
2053 210043 100070 -13229 -233437 -140038 326402 80218 259147 328513 469248 149803
2043 149803 -207786 -214791 -338493 -390966 -270587 -211307 -329925 -305021 -313324 -576264 -84319
2032 -84319 96655 -67398 -269093 -347250 -366006 -355166 -359823 -110042 -10051 -547302 -211551
2021 -211551 175544 89584 75329 11517 77635 -170540 -220666 146599 -300192 -342832 -413052
2010 -413052 -187375 -272307 102520 323367 102198 122095 -12075 44557 278451 175994
2000 175994 170623 79151 3650 346100 -66400 -240657 -233474 -43287 129529 101383 76967
1989 76967 -144328 -440909 -335208 82189 -47290 -219385 -284385 -196088 -88647 -105598
1979 -105598 -13745 -228495 -542514 -706050 -353374 -271090 -544381 -629712 -487828 -695339
1969 -695339 -856115 -432024 -128949 -472606 -465595 -353570 -558103 -488045 -148665 -387839
1959 -387839 -652543 -606687 -140496 67971 -47380 204652 289324 -61083 -409991 176221
1949 176221 224745 -222852 -431304 -686531 -459350 -111155 -73659 25969 -37461 -194354
1939 -194354 -372010 -412006 -304839 -123451 -238159 -323995 -244163 -202670 65711 212806
1929 212806 55805 -256025 -168039 -97644 -7847 -187046 -478687 -132887 33911 142284
1919 142284 129186 95146 116649 -97994 -140834 -18086 110863 -363803 -467691 13406
1909 13406 -238620 44106 -297269 -355845 -492426 -144816 95294 41877 -132917 -107914
1899 -107914 -390523 -353391 -137573 220735 -31198 -15964 -105486 242120 245273 -135783 336971
1888 336971 357512 241160 241538 -232356 -193677 -14350 -55297 -329144 -59945 -219466 -352773
1877 -352773 -218107 -368091 -198922 -6106 -29124 -223676 115187 163360 -156290 274752
1867 274752 230807 -176367 251059 -69287 188166 276762 73416 -323780 -575037 -488181
1857 -488181 -261655 -474284 -664317 -465267 -7695 -413228 -177858 -52390 344313 139151
1847 139151 277312 163147 444999 -239912 -327179 -171375 -68953 -105644 -240201 -116846
1837 -116846 112709 22415 57666 -23307 -282364 335941 10718 34336 290595 148740
1827 148740 -228908 -197935 -402577 -553426 -678590 -745788 -829265 -695899 -656331 -99306
1817 -99306 -51237 -136911 -655895 -901649 -909578 -1095701 -975158 -551663 -439968 -316100 -160091
1806 -160091 -339146 -286843 -296932 -383700 -93686 269977 268672 250891 517251 474294 88331
1795 88331 931 -274110 -370011 -9964 -274680 -98048 327502 -257603 -481950 -804534
1785 -804534 -345357 -369703 -380614 -224445 -341020 -133369 -297325 -184708 179098 73975
1775 73975 111969 31664 -162824 -296061 -89736 -16621 110114 254904 117677 -157451
1765 -157451 85050 -119882 -165334 -147519 -377013 -377822 -793744 -615197 -553930 -313773 -263144
1754 -263144 -255490 -233085 -527114 -113558 -133803 -111628 -426790 -510019 -226381 -193892 -614538
1743 -614538 -606699 -161517 252384 189729 12596 29009 131875 -34653 107997 138375 -45148
1732 -45148 151587 -151894 127985 106878 -260293 -616510 -214485 -50253 521595 292095
1722 292095 -135811 -761919 -501413 -382275 -489087 -885771 -244903 -169709 -93043 78817
1712 78817 50223 122711 -240323 -365044 -393926 -219547 -110250 -23389 99556 -472563 -470101
1701 -470101 -178440 -55713 188657 -164327 -489487 -468909 -141910 -86031 -12727 -13796 88824
1690 88824 118203 -54269 -476112 -656671 -200466 -137974 18923 -341908 -360458 -21250
1680 -21250 -362481 -365732 -402163 -353644 -467652 -446611 -428960 -593882 -288136 69877 -203956
1669 -203956 -317546 -164798 -271505 -548109 -43954 -104267 -601322 -333198 -229823 -336127
1659 -336127 -75522 -137133 -158443 -273387 -158830 212591 631767 588235 77271 119462
1649 119462 -200584 -291738 -122443 -298087 337629 399018 396335 -107573 -632444 -243537
1639 -243537 107361 225847 -113370 -148994 125200 256174 290170 -112961 -228515 -471981
1629 -471981 -156313 -194162 -306666 -137468 -176714 -221536 -233273 -184232 -181980 -289810 -143423
1618 -143423 -75197 207403 103448 148199 442672 256290 163725 -33746 142505 236751
1608 236751 -284762 -517100 -229158 -321572 -229329 -17816 -257085 -14205 178978 147716
1598 147716 -91827 -298149 -507810 -556055 -61925 -68977 72465 87103 -344422 62428
1588 62428 349881 350629 -32120 -70884 -264278 -584758 -298004 -412758 -308119 -215137 -96421
1577 -96421 -8200 -122151 -97488 -437092 -534701 -142947 -531446 -221899 -183494 -346519 -500580
1566 -500580 -404210 121391 209359 42579 -52447 -362657 -22180 131607 375579 350824
1556 350824 99826 -358146 -697167 -726039 -375784 87167 125861 200447 -314364 -76620
1546 -76620 208816 136785 61283 -230552 -485162 -151847 -465247 -620174 -356296 -178750
1536 -178750 -117443 -163680 137543 168333 29516 15553 19008 -470718 -148443 166938 112246
1525 112246 195165 189545 354102 51288 -567360 -157433 133968 -20993 41351 342883
1515 342883 149665 -51261 47966 140832 200259 97303 72160 -143891 -27501 -272271
1505 -272271 -471119 -712740 -635431 -281646 -34001 -56367 44485 40950 -39084 62126 204283
1494 204283 148925 92320 -220267 -611906 -293912 -137854 -449431 -481979 -360989 -508969
1484 -508969 -283693 -174102 185431 279444 302040 -13518 -641849 -284767 42391 145988
1474 145988 183950 666 119361 167251 237541 232419 7877 15256 125591 408456 138784
1463 138784 291627 311502 -226769 -202811 -171258 -526641 -799930 -424799 -257460 -703024
1453 -703024 -667850 -395568 -308661 -50812 173 207612 -84864 2730 161702 -104405
1443 -104405 -77733 239762 370818 -3756 -58615 -207608 -449893 -194898 -496532 -490757
1433 -490757 -329013 -153770 -203804 -201850 -313558 -191393 -137600 -314131 -441785 -30169
1423 -30169 -145008 -423672 -156023 -20185 414884 42517 -121019 -200108 -254076 -71565
1413 -71565 -72432 -263015 -457784 -716373 -721957 -392720 -146092 80746 172216 -155264 -340327
1402 -340327 -329851 210752 -5769 179641 167950 -77515 -259343 -288831 -234244 -281272 -348679
1391 -348679 -440300 -227297 285798 362273 243797 -45088 -199703 145092 287960 -233777
1381 -233777 -425542 -421863 -297148 64000 -20655 -245067 169205 128347 -291864 -685998
1371 -685998 -436017 -543874 -581986 597 -56384 -84568 -139616 -357264 -292941 -260274 -458559
1360 -458559 -126825 -314436 -86743 -112299 -186247 -178967 223765 158554 80555 45847 -109775
1349 -109775 -35507 -1006 -119863 -45558 -285857 87706 146430 -134426 -92036 144049 663127
1338 663127 391102 375378 -131279 -686061 -457365 -177838 -38596 -12455 -96307 -458017
1328 -458017 -255350 47403 61360 103715 364046 141554 264989 483134 217958 -422945
1318 -422945 -463627 -466388 -300179 321587 83389 -163955 -243789 -106609 -129877 -22861 -105700
1307 -105700 40796 207538 283270 76760 -32187 -23835 149493 145987 110391 102417 -88301
1296 -88301 84070 121954 -162807 -126726 -250999 -302964 79125 315777 35991 -236447
1286 -236447 -372650 -548075 -115720 62598 93529 -408304 -438529 -258867 -334513 57469
1276 57469 92271 258036 -79179 -454754 -530767 -335266 -64110 -126069 -219970 -381764 -479404
1265 -479404 -604517 -425872 -261649 -169203 59034 -324145 -246055 -20652 52645 -74763
1255 -74763 -751689 -572155 -260552 -114387 154837 -219934 -44472 -31018 247921 17732
1245 17732 -42161 -190416 -60441 272973 73812 76312 -427792 -663590 -343018 -489601
1235 -489601 -452054 -448891 -538288 -408337 -415072 -407439 -213188 139274 60448 -159429 -338559
1224 -338559 -350162 -261452 -230524 -287289 -101949 114019 345922 206137 -477318 -849916
1214 -849916 -671416 -288043 106355 159623 124445 -247541 -394805 -330515 -351128 -212192
1204 -212192 -381347 -605592 -151365 -243968 77899 -125882 -152925 -132165 -169100 -155455 -336980
1193 -336980 -169770 -295136 -134383 -260945 -975568 -661376 -238511 109146 20257 208879
1183 208879 -73650 -310500 -125416 192324 73253 28959 -242666 -481246 -283593 -288637
1173 -288637 -376490 -365777 -4208 -228020 -518564 -147761 -107701 -293543 -43825 32008
1163 32008 227503 278373 -52095 -339206 -46154 -173498 -220145 -47123 32736 916 391032
1152 391032 334075 -39438 -241411 -454894 -89248 -7977 -269573 -377504 -39161 -45136
1142 -45136 -81804 254776 111836 239059 -183808 -380578 -132169 26168 -74484 -456691
1132 -456691 -451248 -147374 -177527 -406229 -136773 195094 55548 498873 536838 392889
1122 392889 321813 154350 -180553 -190805 -78332 -3880 70565 384624 -2037 -192425
1112 -192425 -303237 -263884 -334283 -480460 -486258 -399387 -446418 -474721 -202735 -260752 42761
1101 42761 92703 9890 278436 11845 26576 -162492 -359453 -98076 -356118 -223602
1091 -223602 -525664 -431336 -322607 -283647 -508249 -235899 -52664 -215003 -118583 -2450
1081 -2450 91606 -67534 128743 503309 265258 -10315 324893 286308 649986 143693
1071 143693 88702 265638 -27189 -266859 -310923 -100318 -189324 -321279 92022 11242
1061 11242 -288634 71900 -222140 -514201 -571808 -607078 -577806 -228607 -252323 -360346 89007
1050 89007 -66252 57591 365147 -106 -225342 -511016 -534085 -264365 12206 83205
1040 83205 130411 198244 150491 -10002 -88928 309938 205405 12757 -76682 -343100 -316380
1029 -316380 -338775 -307208 -263458 317691 375679 9109 -119421 171128 105973 120446 142869
1018 142869 94975 -185416 -276146 -322728 -164272 -447495 -376621 -265072 -137916 -38824 363162
1007 363162 310723 403900 426545 283499 108000 -127718 -117256 -227812 -132127 -380706 -357667
996 -357667 -402530 -89376 -325353 -196512 -74888 -240810 189298 151303 -384739 -193022
986 -193022 -83493 -204945 -79076 -259270 -196821 -87265 -370211 -260830 209940 152336
976 152336 -20547 -246759 32251 -76349 -194188 164659 26498 -26195 43297 236998
966 236998 -33959 131327 109421 -542381 -347478 36167 -217539 -154619 -157577 -78171 -77356
955 -77356 34630 291816 267669 -198666 -495095 -114421 -44338 -460227 -320408 -75280
945 -75280 -440510 -237990 -44600 -430269 -526083 -287271 63489 68276 102821 -226791 -77936
934 -77936 68523 -13820 204186 -20758 -292833 -353500 -53401 -212310 -91211 158027
924 158027 73884 -350756 -130674 -102560 -320004 2408 73662 179067 111635 92319 -430537
913 -430537 -489366 -158847 -266257 4007 -201143 -88424 121247 -77456 -243523 26096
903 26096 -89843 -328651 265220 107099 13400 184413 235984 363915 464371 109905
893 109905 42104 136717 -180934 -109221 353276 330663 303170 94211 -94896 -322232 -434571
882 -434571 -382780 -267174 6880 423183 709794 60877 53272 223083 -20209 190059
872 190059 -40278 -162120 -205177 -117329 -159624 140513 117236 351438 449578 95487 -243104
861 -243104 -295593 -95645 78413 92671 25308 -14512 -286291 41306 53716 345624 -8403
850 -8403 -19837 166522 17856 204215 2318 -305560 -328270 -426312 -162365 82384 126246
839 126246 -36461 -351072 298266 222940 479606 551684 371119 476834 423214 43594
829 43594 -169156 42415 78523 355919 280571 265088 163538 -8841 134031 70437 618778
818 618778 274623 -398530 165227 189187 23165 46764 49642 -136763 -306297 154062 363639
807 363639 -75772 130740 630249 574434 84644 113417 419813 511084 -105088 -547014
797 -547014 -273572 -159733 -268729 -264679 -261928 96137 109851 348597 184716 234520 310749
786 310749 82278 -279765 -93591 -53465 -232728 12994 -249019 -334991 115847 165624
776 165624 188244 -101024 311811 442895 -75158 165135 221486 -22546 177399 617982
766 617982 624362 235251 -125681 -331418 12258 -255372 -122315 -157600 -201419 -159656 -468802
755 -468802 -108934 60579 148255 -6193 476652 394266 381862 -67716 -256661 -126921
745 -126921 -371353 -1678 370608 154270 314209 127173 25040 -99281 -54080 -266408
735 -266408 -319771 -152818 89426 447504 420265 161744 272029 407498 166269 256164
725 256164 117744 243742 75014 -207197 -220600 -103684 210087 552418 539739 326175
715 326175 -121105 -437559 -635025 -285447 -48449 -652637 -381008 68558 -115130 25856
705 25856 247331 189175 306508 203759 42871 -217289 -270464 -85907 -7317 -280693 -509467
694 -509467 -239935 -291799 -201987 209523 223869 83295 35038 54436 -210373 -22936 305013
683 305013 709156 716919 145479 423281 -206298 -357591 -221397 -250557 -27636 -39081 -65445
672 -65445 -47982 557227 569438 585604 498658 365903 9779 -314142 -220464 247347 331530
661 331530 171503 -72305 115948 109540 97912 -148688 -279366 105900 -125807 99324
651 99324 437823 583744 160853 -21429 40049 128974 65066 -140949 301290 532041 427321
640 427321 -2709 -202096 -239906 -45248 -108733 -34715 23644 -297553 89724 331610 56226
629 56226 68141 223127 374644 473288 136963 191521 116840 -137835 133908 -75071 -46437
618 -46437 291151 -59878 78277 382207 388501 333017 302258 416110 879329 827377 542529
607 542529 613878 660979 807107 549185 215320 207298 317907 416609 126609 -73955 108282
596 108282 384303 240517 729689 427361 263659 371446 41935 548833 405775 87449
586 87449 97436 4702 -80576 -78586 -267766 -307026 -323272 -244578 106143 172047 -173414 -317768
574 -317768 -348806 -359846 -484232 -415819 -210097 -170719 219428 350719 406568 261652 218435
563 218435 94356 118565 237111 85814 157280 335004 646093 345279 86339 -48118
553 -48118 286291 322814 212064 16262 -137434 -108992 -139751 34806 -83256 -225348 -72754
542 -72754 265250 257943 123880 11404 137623 105109 301983 480480 160575 387186 23643
531 23643 31383 77953 -134225 212072 -79169 176834 241374 16721 -50324 211001 -83324
520 -83324 76248 61104 -172094 -6896 432115 439645 180847 540061 742411 198891 119281
509 119281 77010 305065 412111 412690 260992 239308 185247 157283 264957 210624 260853
498 260853 243085 468006 213951 185755 182341 91551 118333 110668 127490 -390160 -126420
487 -126420 301765 299729 446145 591199 716007 89046 186473 14726 17240 152861 82037
476 82037 297824 570215 320882 137628 -99039 -94650 197654 193474 80079 154696 799484
465 799484 638530 322847 173054 333494 622713 367877 224931 147885 14566 -311249
455 -311249 -116311 229119 -7955 208154 402361 223147 110902 10611 407397 184368
445 184368 -25208 104859 553007 186231 -447989 -102994 127817 748146 735469 215433
435 215433 115767 -155585 -406778 -119180 301889 396611 487624 12633 -24390 -180572 -106927
424 -106927 -181617 335560 242772 243620 -207642 44022 -85457 -92744 414562 640073 691022
413 691022 723673 323482 -207443 72508 21081 115201 308065 167613 379261 361895 149305
402 149305 437007 97539 440122 509451 326241 439283 142602 -92388 52692 383322
392 383322 62056 -135964 327413 254364 399340 313929 649818 815191 583277 533375
382 533375 358446 -95644 3211 430740 490817 461905 283792 169006 124478 17730 303955
371 303955 -215043 22174 665639 1006749 688857 493234 332187 408323 251600 544444
361 544444 939272 1036804 420024 257341 225156 66296 189679 349057 502781 370478
351 370478 346279 283420 102673 37973 -201519 -149196 177721 322454 576900 689185 420369
340 420369 249815 -14303 57475 178868 294027 201306 490221 665406 639545 721487 818602
329 818602 403381 246922 399606 384271 491113 480141 601749 453036 258862 -307059
319 -307059 -245204 207456 612350 223964 133327 76437 46154 446961 640399 274857 -100470
308 -100470 92307 2261 87646 307421 102363 -89678 -17815 148341 312910 328759 135270
297 135270 335626 313253 466986 332584 634057 762130 518605 290928 386111 186505
287 186505 -4175 -248557 48804 342964 84076 -136356 383335 600325 703069 625002
277 625002 542574 420406 310691 365218 282864 796978 791660 270571 223130 245025 -150132
266 -150132 -329995 11792 204716 202825 67410 207726 390919 247390 164292 268016
256 268016 766096 720742 556384 835692 332814 54047 306140 354858 737691 343329
246 343329 150230 -12805 188101 236670 325628 497465 624723 497692 250324 291740
236 291740 564544 347132 404824 468077 278555 564348 289550 471934 148869 331071
226 331071 473819 744666 307439 374376 507174 381488 400962 658390 602274 143154
216 143154 -272681 11001 840917 545301 304394 405692 259419 329664 379406 224972
206 224972 237556 517254 686649 296559 146661 103715 271914 223442 423090 183563
196 183563 164137 296986 445430 82749 485433 192757 211951 389356 309992 440469
186 440469 320079 89238 27294 -257919 204057 340860 110329 236727 458247 474710
176 474710 602781 896841 510640 509742 886813 891386 583635 527926 252896 234897 115486
165 115486 333952 436321 523665 397114 562053 343065 311409 209406 -89735 301217
155 301217 174558 -3154 126316 202854 220655 255411 499789 520972 328585 395164 301821
144 301821 445197 479191 370418 484676 180637 378477 446695 472849 727293 629904 444844
133 444844 193812 495048 486579 260798 657908 440208 659391 448741 584094 470635
123 470635 409566 231752 -162937 145455 -47919 721530 847031 657003 432926 374071
113 374071 358639 317835 167372 193875 61225 4516 403705 556248 421812 454975 511237
102 511237 225496 165442 280338 256396 501046 880662 546933 324355 267229 447896
92 447896 531436 347094 548200 581154 358919 -58022 165917 230664 474315 599037 269118
81 269118 -105924 1372 442069 732333 715640 274588 464530 474416 511823 358546 348152
70 348152 403404 378756 83566 269192 306424 240121 254151 39450 105773 336511 582074
59 582074 559125 468623 590866 683735 604847 184522 252708 499411 442749 381614 164258
48 164258 411579 581524 483021 504233 268905 258030 35425 231384 405463 439145 444097
37 444097 318230 566688 590505 671210 676174 414712 691244 787280 524028 303161 273434
26 273434 169382 -4990 119653 171592 328445 152396 255957 314667 419797 465690 360790
15 360790 642096 938483 588064 429385 288910 165817 474334 519135 446793 488226 476415
4 476415 521353 263363 307517 379554
0 379554
$$ Imaginary data points
##PAGE= N=2
##DATA TABLE= (X++(I..I)), XYDATA
16383 -1674033 -1571754 -1498290 -1392075 -1308137 -1516797 -1172149 -1114557 -1040811 -844452 -1055328
16373 -1055328 -1002127 -1036640 -1245065 -1087360 -889945 -885207 -872524 -896937 -771444 -1014270
16363 -1014270 -713971 -605240 -862073 -735424 -618493 -332728 -421123 -295575 -164201 -488957
16353 -488957 -573389 -625643 -496664 -314571 -394209 -250256 -153150 16376 -80894 -250320
16343 -250320 -160980 -68948 163102 178031 209653 -133174 -263443 8468 -31869 247954
16333 247954 321551 -73426 93693 294905 398751 515656 395849 296253 94271 121467
16323 121467 436766 648902 541639 730797 770337 858312 522444 569413 667047 663447 711727
16312 711727 698019 947763 1011693 1198288 1124964 1116729 970482 953379 1214625 826879 1008718
16301 1008718 1130705 1238970 1310721 1470711 1453867 1578752 1531725 1188797 1083777 1373779
16291 1373779 1282695 1176622 1260869 1242480 1582483 1591629 1477606 1793626 1710303 1354265
16281 1354265 1224933 1339396 1815166 1509840 1406112 1452575 1645006 1726801 1667652 1543929
16271 1543929 1826701 1709443 1624358 1841147 2074951 2050946 2224406 2255663 2346016 2462795
16261 2462795 2303318 2232114 2304601 2509802 2231693 2138689 2271799 1979471 2287748 2417236
16251 2417236 2235363 2413878 2281809 2104134 2172477 1948806 2191062 2200891 2190847 2274840
16241 2274840 2477341 2275570 2364004 2230485 1963966 2167501 2284978 2291546 2695231 3066405
16231 3066405 2802058 2718741 2293602 2149016 2417063 2700668 2591081 2444654 2373873 2500371
16221 2500371 2308219 2473538 2738374 2881809 2828865 2589148 2707654 3041360 3013299 3024729
16211 3024729 3237964 3115236 2637856 2699665 3080841 3452699 3400958 3088347 2683950 2906391
16201 2906391 3019069 2929637 3282247 3346181 2856516 2941023 3242285 3398677 3032743 3094233
16191 3094233 3151107 2885301 3030771 2910490 3191844 3115074 3338273 3583212 3590020 3526825
16181 3526825 3309404 2833445 2694226 2952173 3042107 3172368 3458027 3435955 3049412 2789355
16171 2789355 3124540 3304931 3628025 3773936 3437744 3326211 3426211 3238110 3079396
16162 3079396 3291935 3435170 3347306 3448405 3215377 3238205 3514766 3476894 3454418 3427629
16152 3427629 3410413 3876119 3791361 3086847 2897625 3046627 2973321 2881765 3116290 3307689
16142 3307689 3815607 3360266 3535681 3213571 2937111 2985034 3086812 3269977 3329658 3546308
16132 3546308 3725286 3636359 3781693 3882526 3890057 3679624 3608925 3485235 3457686 3622855
16122 3622855 3846342 3910660 4077858 3755097 3568664 3739960 3419595 3625784 3777964 3714055
16112 3714055 3375930 3634517 3546066 3630526 3663659 3938732 3741029 3396492 3531003 3614889
16102 3614889 3536711 3586904 3526608 3348904 3561575 3732720 3677626 3791391 4094928 3720416
16092 3720416 3944299 3992672 3535525 3407292 3523330 3539147 3527615 3800109 3564090 3619812
16082 3619812 3526971 3609384 3524449 3731136 3755155 3560992 3337463 3228123 3113231 3308211
16072 3308211 3376063 3767406 3690949 3456845 4084399 4306691 4069135 3601021 3658097 4072841
16062 4072841 4122161 4209272 4224170 3927667 4035108 3750006 3704887 3786203 3784967 3749373 3754641
16051 3754641 3518792 3758645 3760704 3614466 3683498 3687215 3560275 3120120 3289837 3752050
16041 3752050 3896468 3962205 3588512 3663305 3986879 4026153 4107941 3827016 3291006 3415598
16031 3415598 3172668 3264341 3358698 3275658 3802525 3825323 3979641 3654065 3270625 2849637
16021 2849637 3152431 3468940 3569964 4045171 3812518 4125748 3684812 3217995 3292509 3323889
16011 3323889 3734032 4196277 4489813 4139126 3780182 3679676 3925978 3546702 3472569 3899294
16001 3899294 3865396 3879028 4066927 3720176 3973627 4037028 4055876 4110279 3974234 4216815
15991 4216815 4132670 3963906 4207975 4078817 3700583 3457573 3742242 3242081 3391480 3755768
15981 3755768 3670347 3778741 3613572 3686301 3299267 3492385 3886474 3593213 3267045 3555217
15971 3555217 3766334 3885591 4110885 4278488 4090925 4071158 4050470 4017642 3627547 3855137
15961 3855137 3830964 3700676 3562667 4115464 4325138 4173322 4338037 4147344 4154319 3916826
15951 3916826 3746731 3881058 3874971 3468140 3473038 3301368 3471043 3725053 3891799 4047337
15941 4047337 3819061 3435468 3429638 3403814 3474017 3830441 3818697 3760783 3911846 3773002
15931 3773002 3225926 3260430 3682275 3948902 3720730 3689768 3714410 4016554 3858108 4034075
15921 4034075 3839192 3364943 3962414 4158291 3953558 3674801 3967051 3788486 3420646
15912 3420646 3819105 4392950 3948062 3909692 4270174 3899943 4171022 3755822 3610815 3670830
15902 3670830 3682252 3864396 4157312 4055371 3585947 3892403 3890210 3976497 3872376 3802587
15892 3802587 3666014 3338279 3437133 3971754 4078507 4066243 3668632 3401109 3865646 3949709
15882 3949709 3871095 3799943 3805860 3591749 3706108 3785180 3523641 3375111 3264949 3488896
15872 3488896 3461261 3669089 3598352 3625037 3870735 4372664 4275056 3730448 3672629 4031087
15862 4031087 4020532 4046822 4149793 3485101 3577184 3757271 4023670 4028006 3912359 3741873
15852 3741873 4007481 4187685 4114936 3695057 3847549 3540385 3621657 3819187 3797119 3958290
15842 3958290 3838388 3694202 3505518 3422006 3741503 4457731 3970863 4050621 4416750 4180137
15832 4180137 3861934 3820744 3850426 3554554 3584189 3889207 3588577 3803553 3853448 4066141
15822 4066141 3688588 3564864 3791468 3865849 3572489 3554925 3932072 4060319 4156110 4219121
15812 4219121 4323868 3916811 3528182 3198443 3296761 3497428 3513486 3392871 3481356 3298366
15802 3298366 3511968 3624087 3271714 3187643 3218207 3631420 3775520 3828654 3823836 3751786
15792 3751786 3894133 4227141 4344388 4445463 4209594 4423679 4382140 3686943 3664782 3487167
15782 3487167 3390180 3965834 3604610 3556663 3882557 3937039 3953792 4130816 4116894 3900796
15772 3900796 4025487 4052290 4089654 4262947 3997412 4023149 3943739 3640014 3318277 3740944
15762 3740944 3759842 3391353 3463908 3278186 3893013 3847208 3642268 3569733 4064794 4298817
15752 4298817 4509390 4111255 3803991 4039460 3879837 3636336 3662350 3540624 3792095 3861492
15742 3861492 3852284 3639625 3640377 3915536 3805338 3681714 3926754 3691022 3615566 3757452
15732 3757452 3681206 3701761 3998404 3983501 3725682 3942004 3834325 3720375 3718207 3803423
15722 3803423 4020104 4201098 4082938 3850562 3847859 4207026 4079494 4043103 3948406 3782368
15712 3782368 3933423 3867544 4110989 3919608 3887682 3429788 3487029 3493102 3674867 4040187
15702 4040187 3893163 4133884 4181280 4217720 4244265 4352515 3945241 4236516 3722319 3718612
15692 3718612 3597139 3607985 3816341 3624427 3843531 3799187 3765246 3857708 3699837 3916062
15682 3916062 4195624 4110551 3731632 3734302 3732777 3982880 3981661 3872785 4111983 4045505 3879131
15671 3879131 3591744 3529824 3518895 3979539 3940851 3598506 3789709 3884819 3705932 3704694
15661 3704694 3712392 3972556 3690150 3854499 4011732 3754419 3673835 3720543 3757701 3918698
15651 3918698 3899741 3755225 3624863 3877032 4017774 3759742 3731802 3814165 3755468 3982116
15641 3982116 3704163 4218727 4419803 4156329 4119903 3775134 4047765 4140211 4137246 3850566
15631 3850566 4025202 4083479 3822995 3368598 3518911 4182432 3763694 3726915 3974281 3698152
15621 3698152 3698323 3583684 3661764 3827559 3988080 4052704 3944305 3839018 3861541 3648982
15611 3648982 3609913 3909406 4278492 4017862 3459410 3523389 3710930 3937416 4256552 3994091
15601 3994091 4207271 4440249 4001272 3602928 3816045 4018351 3761935 3752124 3852610 3799770
15591 3799770 3654587 3803716 3768267 4135425 3859601 3518325 3765233 4114662 3910164 3563365
15581 3563365 3779646 3631847 3696734 3841665 4161123 3945873 3796091 3778968 3660258 3645695
15571 3645695 3555304 3456484 3895566 4116214 3818965 3701384 4331622 4191628 4079782 4352195
15561 4352195 4358352 4508988 4455986 3984668 3865903 4089838 3540820 3298398 3552665 4189700
15551 4189700 4055943 3998035 4025512 4090574 3956276 3942261 4104298 4113694 4173520 4254984 4433418
15540 4433418 3687664 3559283 3517801 3501484 4110334 4372419 4013228 4051861 4143411 4261978
15530 4261978 4567659 4825870 4336474 4195747 3872129 3970590 4038334 3779757 3684903 3452790
15520 3452790 4028244 4213654 4021597 3684683 3750008 3905825 4264926 4032603 3699964 4041218
15510 4041218 4123597 3965135 4081908 4005116 3635037 3857733 4081523 3460696 3648953 3808789
15500 3808789 4099846 4085080 3865120 3803806 3698544 3916756 4004339 4177016 4228586 4065202
15490 4065202 4102167 4036652 4326788 3832571 3847098 3857471 3609485 3677130 3984789 4076228
15480 4076228 4161989 4328762 4269224 4476387 4257353 3643505 3855858 3943759 3790192 3534896
15470 3534896 3665713 4174967 4406831 4391491 4343992 4192051 4333034 4136515 3887788 4332287
15460 4332287 3916378 3873730 3563359 3560429 3410222 3817076 3592369 3740374 3873650 3676154
15450 3676154 3678679 4113123 4587390 4532076 4155603 4305151 4380682 4014829 3967853 3898972
15440 3898972 3722265 3601424 4180271 4138181 4133134 4271289 4127174 4226120 4381531 4235825
15430 4235825 3923474 3697328 4132119 4152613 3753912 4022827 3890100 3872252 4414272 4156110
15420 4156110 4170531 4275935 4184195 3974211 4024942 3959542 3867785 3745031 3716985 4028442
15410 4028442 4333157 4112891 4061423 4019726 3988764 4069201 3785263 3982244 4356023 4210965
15400 4210965 4293179 3849473 3803932 3851555 3894708 4179117 4015822 4163814 4195884 4171832
15390 4171832 3829649 3995246 3907013 3776360 3414621 3839029 4230073 3959912 4321210 4421428
15380 4421428 4068283 3896563 3812884 3815683 3783553 4031732 4063992 4090614 3959088 3679088
15370 3679088 4123392 3898490 3349723 3535924 3902217 4362438 4536915 4197033 4265043 4472847
15360 4472847 3852907 4111176 4150932 4503709 3987894 3872290 3916117 3905380 4022285 3914410
15350 3914410 3979962 3951949 4177248 4252158 4037668 4238038 3928112 3702864 4237355 4138942
15340 4138942 3850492 3958458 3912000 3821179 3944980 3804780 4235777 4222858 4406614 4061842
15330 4061842 4044273 3961111 4221942 4072647 3949337 4236416 4162878 4276612 4606671 4290486
15320 4290486 4158415 4404220 4574008 4556435 4696315 4408861 4229231 4320189 4080251 3988077
15310 3988077 4104327 4263950 4160005 4341399 4484282 3745611 3471680 4138014 4199404 4487951
15300 4487951 4121393 3888903 3836608 3734811 3817286 4141445 4386802 4166420 4148751 4153666
15290 4153666 4035163 4039123 4069283 3974486 4080691 4225725 4390849 4090913 4219980 4094588
15280 4094588 4133948 3899618 3853600 3913771 4072034 3659219 3568708 3786541 4033053 4197993
15270 4197993 3998729 4315573 4447532 4562396 4407020 4241439 3786341 3998085 4083576 3871607
15260 3871607 3736481 3399950 3609094 3648418 3712487 3750230 3205757 3652182 4021738 3965901
15250 3965901 3781488 4083483 4195099 4027790 4100537 3776212 3737790 4261905 4352076 3918055
15240 3918055 3991253 4434531 4451110 4416065 3990095 3813639 4053057 3994526 4560588 4368328
15230 4368328 4220438 4196284 4497711 4372625 3947740 4191510 3923407 3809021 3740313 4039864
15220 4039864 4197917 4418584 4168984 4089054 3992236 4015832 4353722 3885462 3940344 4019940
15210 4019940 3927605 3729478 3773160 4048450 4117388 4203710 4585487 4375516 3974928 4227371
15200 4227371 4325128 4855710 4434035 4317811 4048259 4006814 4298482 4419955 4006006 4103937
15190 4103937 4151418 3916163 3779915 3751280 4115118 4109115 4080511 3834795 3703511 3650412
15180 3650412 4089192 4399349 4288684 4219167 4139602 4119763 4223434 4232113 4448594 4326815
15170 4326815 4154415 4256405 4539054 3946668 3782118 3925960 3932959 4102033 3877839 3970585
15160 3970585 4296727 4462273 4711741 4555576 4628246 4197324 4057468 4185271 4059518 3975894
15150 3975894 3818849 3613066 4116568 3962130 4109805 4212686 4131965 4445062 4516187 4611937
15140 4611937 4882030 4643830 4381469 4490719 4129262 4138325 3819278 3971623 4137706 3828158
15130 3828158 3621907 3781246 4324419 4334679 4515498 4309896 3910594 3773531 3633203 3784590
15120 3784590 4085451 4284106 4349475 4149079 4348293 4500659 4434050 4084714 3793656 4038945
15110 4038945 4062655 4189952 4062769 3875709 3612325 4063787 4014152 4116917 4062812 4360513
15100 4360513 4426703 4578211 4477231 4464331 4426241 4076962 4193702 4148118 4298632 4369142
15090 4369142 4180660 4275276 4277472 4113648 3869643 4015185 4002069 4170898 4385238 4010232
15080 4010232 3584014 3826374 4477425 4117736 3908459 4242262 4400436 4601067 4678776 4636680
15070 4636680 4351567 3697869 3556889 3705187 3560743 4000070 4285475 4427324 4736829
15061 4736829 4543524 3810387 3780910 4638480 4688277 4367790 4100270 3767264 3968604 4135264
15051 4135264 4140499 3906578 3855074 4088731 4193954 3851486 4065531 4206721 4480733 4289471
15041 4289471 4153476 4493211 4489533 4424430 4495709 4185457 4100972 4140422 4487511 4760199
15031 4760199 4440198 4445981 4524637 4827224 4615555 4774317 4442461 4116340 3989311 4236102
15021 4236102 4368076 4456955 4563580 4581296 4606414 4725658 4693141 4841134 4422622 4370287
15011 4370287 4188028 4102675 4131042 4730996 4580278 4697364 4609887 4524381 4426428 4076776
15001 4076776 4139205 4340242 4288979 4235308 4086839 3958773 3757566 3681056 4162514 4728931
14991 4728931 4628616 4350414 4531972 4391673 4763951 4710415 4122652 4108148 4615421 4410615
14981 4410615 4421185 4323384 4201406 4156926 4152561 4264703 4331979 4360763 4327205 4491957 4195919
14970 4195919 4075602 4064111 3901683 3955011 4057656 3955228 3850678 4190272 4338244 4200379
14960 4200379 4429132 4420400 4332795 4359199 4539588 4409716 4299932 4091563 4201031 4514468
14950 4514468 4508554 4082555 4168737 4207633 3960289 4173800 4414845 4512161 4462631 3930939
14940 3930939 3757793 4535274 4694447 4741125 4049612 4076184 3936187 4205110 4290964 4330977
14930 4330977 4201804 4287230 4461867 4105609 4386322 4719080 4819689 4764022 4184325 4359199
14920 4359199 4227648 4166227 4552750 4414958 4279080 4644697 4384060 4331545 4416557 4271224
14910 4271224 4115288 4059744 3992412 4376246 4500863 4581505 4811290 4710847 4413442 4229771
14900 4229771 4588964 4139728 4123745 4287436 4314568 4005921 3724574 3902007 4177180 4200041
14890 4200041 4277769 4470676 4099595 4299627 4114988 4019339 4311425 4334641 4332014 4397434
14880 4397434 4589647 4638067 4867448 4834332 4690344 4397935 3967788 4088444 4623256 4375262
14870 4375262 3748353 4032210 4349154 4440629 4254882 4521345 4457240 4484384 4559716 4997420
14860 4997420 4790699 4596591 4838741 4711701 4654916 4542214 4841210 4710499 4630796 4507654
14850 4507654 4577125 4375928 4621597 4518435 4487936 4786216 4458859 4337536 4500266 4140724
14840 4140724 4349939 4675237 4655637 4460954 4383141 4306861 4658165 4603722 4630812 4340909
14830 4340909 4357942 4853850 4659642 4581061 4116644 4170878 4467882 4340481 4560123 4492492
14820 4492492 4432687 4509422 4502039 4337948 4587596 4170860 4185236 4267164 4435194 4370296 4062270
14809 4062270 4439842 4957562 4679439 4704836 4867357 5121206 4675223 4258873 4218588 4420028
14799 4420028 4368780 4568144 5008543 4430899 4493861 4498985 4801496 4866983 4368396 4276028
14789 4276028 4467741 4481040 4552276 4333546 4409412 4457048 4414178 4295055 4503081 4658059
14779 4658059 4582422 4425301 4238602 4417975 4545176 4567554 4464116 4560194 4807784 4971271
14769 4971271 4998453 4240988 3966012 4134603 4185977 4308709 4364414 4486382 4563099 4858025
14759 4858025 5019269 4547355 4174629 4052493 4200404 4197420 4413129 4688733 4631841 4471546
14749 4471546 4707193 4712703 4438978 4587233 4540969 4639045 4551470 4714624 4773555 4340614
14739 4340614 4543008 4704594 4663960 4241065 4367933 4214551 4305500 4268064 4299201 4268889
14729 4268889 4165331 4521987 4630819 4564880 4374202 4517004 4671379 4404644 4368546 4246952
14719 4246952 4116536 4339510 4388126 4614556 4619784 4787978 4497167 4304775 4466351 4188298
14709 4188298 4026238 4195248 4295290 4118910 4102549 4053062 4599520 4660627 4639326 4481680
14699 4481680 4245764 4427297 4445500 4460092 4470635 4305677 3880628 4083017 3729384 3707742
14689 3707742 3755722 3862914 3852986 4039431 4503289 4880300 4921066 4772711 4679014 4182149
14679 4182149 4264095 4447293 4804352 5042388 5220218 5373578 4956195 4672621 4516935 4103087
14669 4103087 4565331 4765953 4408007 4405707 4445123 4677408 4945355 4248610 4233398 4826050
$$ [...]
##END NTUPLES=NMR SPECTRUM
##END=
