##TITLE=1H_CG-1181-a
 CDCl3
 8 sc, 
 30.11.2023
##JCAMPDX= 6.0         $$ Bruker NMR JCAMP-DX V2.0
##DATA TYPE= NMR SPECTRUM
##DATA CLASS= NTUPLES
##ORIGIN= UXNMR, Bruker Analytische Messtechnik GmbH
##OWNER= root
$$ XWIN-NMR		Version 3.5
$$ Thu Nov 30 12:29:42 2023 Russian Standard Time (UT+4h)  she@DPX200
##.OBSERVE FREQUENCY= 200.1313
##.OBSERVE NUCLEUS= ^1H
##.ACQUISITION MODE= SIMULTANEOUS
##.ACQUISITION SCHEME= undefined
##.AVERAGES= 8
##.DIGITISER RES= 18
##SPECTROMETER/DATA SYSTEM= spect
##.PULSE SEQUENCE= zg30
##.SOLVENT NAME= CDCl3
##.SHIFT REFERENCE= (INTERNAL, CDCl3, 0, 15.4208)
##AUDIT TRAIL= $$ (NUMBER, WHEN, WHO, WHERE, WHAT)
$$ ##TITLE= Audit trail, XWIN-NMR		Version 3.5
$$ ##JCAMPDX= 5.01
$$ ##ORIGIN= Bruker BioSpin GmbH
$$ ##OWNER= she
$$ F:/spectra/data/she/nmr/H-F/1/pdata/1/auditp.txt
$$ ##AUDIT TRAIL=  $$ (NUMBER, WHEN, WHO, WHERE, WHAT)
(   1,<2023-11-30 12:28:13.23 +0400>,<she>,<DPX200>,
      <created by zg, POWCHK disabled, PULCHK disabled
       configuration hash MD5:
       00 E9 B6 7A A2 85 ED C7 34 08 36 98 17 FE 4E 26
       data hash MD5: 16K
       16 0C 3C 3C B7 C2 F0 22 A9 B3 B9 0A A3 71 D2 79>)
(   2,<2023-11-30 12:28:15.73 +0400>,<she>,<DPX200>,
      <Start of raw data processing
       efp BC_mod = 2 LB = 0.24 FT_mod = 6 PKNL = 1 PHC0 = -24588.13 PHC1 = 6.252711 SI = 16K 
       data hash MD5: 16K
       35 C5 A6 BD D0 93 6C 24 BA DB C3 1E 77 01 7E C3>)
(   3,<2023-11-30 12:28:38.31 +0400>,<she>,<DPX200>,
      <pk PHC0 = -2.648905 PHC1 = 3.799999 
       data hash MD5: 16K
       2D 70 36 94 2F 9C 51 2A 87 70 31 71 12 CE 94 3D>)
(   4,<2023-11-30 12:28:43.67 +0400>,<she>,<DPX200>,
      <abs ABSG = 5 
       data hash MD5: 16K
       14 80 E9 18 40 E2 5F DD 8B F6 C7 83 A1 11 7C BB>)
$$ ##END=
$$ 
$$ hash MD5
$$ 74 66 AF 58 13 F7 E2 C6 24 0D 6B FA A3 4E C0 47
##$RELAX= 
##$RELAX= 
##$RELAX= 
##$RELAX= 
##$RELAX= 
##$RELAX= 
$$ Bruker specific parameters
$$ --------------------------
##$DU= <F:/spectra>
##$EXPNO= 1
##$NAME= <H-F>
##$PROCNO= 1
##$TYPE= <nmr>
##$USER= <she>
##$AMP= (0..31)
100 100 100 100 100 100 100 100 100 100 100 100 100 100 100 100 100 100 
100 100 100 100 100 100 100 100 100 100 100 100 100 100 
##$AQSEQ= 0
##$AQ_mod= 1
##$AUNM= <au_zg>
##$AUTOPOS= <>
##$BF1= 200.13
##$BF2= 200.13
##$BF3= 200.13
##$BF4= 200.13
##$BF5= 200.13
##$BF6= 200.13
##$BF7= 200.13
##$BF8= 200.13
##$BYTORDA= 1
##$CFDGTYP= 0
##$CFRGTYP= 5
##$CHEMSTR= <none>
##$CNST= (0..31)
1 1 145 1 1 1 1 1 1 1 1 1 1 1 1 1 1 1 1 1 1 1 1 1 1 1 1 1 1 1 1 1 
##$CPDPRG= <>
##$CPDPRG1= <>
##$CPDPRG2= <>
##$CPDPRG3= <>
##$CPDPRG4= <mlev>
##$CPDPRG5= <mlev>
##$CPDPRG6= <mlev>
##$CPDPRG7= <mlev>
##$CPDPRG8= <mlev>
##$CPDPRGB= <>
##$CPDPRGT= <>
##$D= (0..31)
0 1.2 0 0 0 0 0 0 0 0.06 0 0.03 0 0 0 0 0.0002 0 0 0 0 0 0 0 0 0 0 0 0 
0 0 0 
##$DATE= 1701332892
##$DBL= (0..7)
120 120 120 120 120 120 120 120 
##$DBP= (0..7)
150 150 150 150 150 150 150 150 
##$DBP07= 0
##$DBPNAM0= <>
##$DBPNAM1= <>
##$DBPNAM2= <>
##$DBPNAM3= <>
##$DBPNAM4= <>
$$ [...]
##$SUBNAM3= <"">
##$SUBNAM4= <"">
##$SUBNAM5= <"">
##$SUBNAM6= <"">
##$SUBNAM7= <"">
##$SUBNAM8= <"">
##$SUBNAM9= <"">
##$SW= 18.0517328524113
##$SWIBOX= (0..15)
0 0 2 0 0 0 0 0 0 0 0 0 0 0 0 0 
##$SW_h= 3612.71676300578
##$TD= 16384
##$TD0= 1
##$TE= 0
##$TE2= 300
##$TE3= 300
##$TEG= 300
##$TL= (0..7)
0 120 120 120 120 120 120 120 
##$TP= (0..7)
150 150 150 150 150 150 150 150 
##$TP07= 0
##$TPNAME0= <>
##$TPNAME1= <>
##$TPNAME2= <>
##$TPNAME3= <>
##$TPNAME4= <>
##$TPNAME5= <>
##$TPNAME6= <>
##$TPNAME7= <>
##$TPOAL= (0..7)
0.5 0.5 0.5 0.5 0.5 0.5 0.5 0.5 
##$TPOFFS= (0..7)
0 0 0 0 0 0 0 0 
##$TUNHIN= 0
##$TUNHOUT= 0
##$TUNXOUT= 0
##$USERA1= <user>
##$USERA2= <user>
##$USERA3= <user>
##$USERA4= <user>
##$USERA5= <user>
##$V9= 5
##$VALIST= <valist>
##$VCLIST= <CCCCCCCCCCCCCCC>
##$VD= 0
##$VDLIST= <DDDDDDDDDDDDDDD>
##$VPLIST= <PPPPPPPPPPPPPPP>
##$VTLIST= <TTTTTTTTTTTTTTT>
##$WBST= 1024
##$WBSW= 4
##$XGAIN= (0..3)
0 0 0 0 
##$XL= 0
##$YL= 0
##$YMAX_a= 433381
##$YMIN_a= -451445
##$ZGOPTNS= <>
##$ZL1= 120
##$ZL2= 120
##$ZL3= 120
##$ZL4= 120
##$ABSF1= 15.40753
##$ABSF2= -2.644318
##$ABSG= 5
##$ABSL= 3
##$ALPHA= 0
##$AQORDER= 0
##$ASSFAC= 0
##$ASSFACI= 0
##$ASSFACX= 0
##$ASSWID= 0
##$AUNMP= <proc_1d>
##$AZFE= 0.1
##$AZFW= 0.1
##$BCFW= 0
##$BC_mod= 2
##$BYTORDP= 0
##$COROFFS= 0
##$CY= -3
##$DATMOD= 1
##$DC= 0
##$DFILT= <>
##$DTYPP= 0
##$F1P= 0
##$F2P= 0
##$FCOR= 1
##$FTSIZE= 16384
##$FT_mod= 6
##$GAMMA= 0
##$GB= 0
##$INTBC= 1
##$INTSCL= 3.70164e-10
##$ISEN= 128
##$LB= 0.24
##$LEV0= 0
##$LPBIN= 0
##$MAXI= 10000
##$MC2= 0
##$MEAN= 0
##$ME_mod= 0
##$MI= 1.114404
##$NCOEF= 0
##$NC_proc= -6
##$NLEV= 6
##$NOISF1= 3.799351
##$NOISF2= 2.8
##$NSP= 0
##$NTH_PI= 0
##$NZP= 0
##$OFFSET= 15.42076
##$PC= 1
##$PHC0= -24590.78
##$PHC1= 10.05271
##$PH_mod= 1
##$PKNL= yes
##$PPARMOD= 0
##$PSCAL= 0
##$PSIGN= 0
##$REVERSE= no
##$SF= 200.130020201347
##$SI= 16384
##$SIGF1= 3
##$SIGF2= 2
##$SINO= 5.538805
##$SIOLD= 16384
##$SREGLST= <1H.CDCl3>
##$SSB= 0
##$STSI= 16384
##$STSR= 0
##$SW_p= 3612.71676300578
##$SYMM= 0
##$S_DEV= 0
##$TDeff= 16384
##$TDoff= 0
##$TI= <>
##$TILT= no
##$TM1= 0
##$TM2= 0
##$TOPLEV= 0
##$USERP1= <user>
##$USERP2= <user>
##$USERP3= <user>
##$USERP4= <user>
##$USERP5= <user>
##$WDW= 1
##$XDIM= 16384
##$YMAX_p= 464835120
##$YMIN_p= -397346
$$ End of Bruker specific parameters
$$ ---------------------------------
##NTUPLES= NMR SPECTRUM
##VAR_NAME=  FREQUENCY,     SPECTRUM/REAL,   SPECTRUM/IMAG
##SYMBOL=    X,             R,               I
##VAR_TYPE=  INDEPENDENT,   DEPENDENT,       DEPENDENT
##VAR_FORM=  AFFN,          ASDF,            ASDF
##VAR_DIM=   16384,         16384,           16384
##UNITS=     HZ,            ARBITRARY UNITS, ARBITRARY UNITS
##FACTOR=    0.220516191357247, 1,           1
##FIRST=     3086.15704128507, 0,            0
##LAST=      -526.559721720715, 0,           0
##MIN=       -526.559721720715, -397346,     0
##MAX=       3086.15704128507, 464835120,    0
$$ Real data points
##PAGE= N=1
##DATA TABLE= (X++(R..R)), XYDATA
$$ [...]
7652a28860q9350N7410J11762L0088J8678m0275j9131p6790m6539p028Q4472j8414
7640a23977n47L7430k6955P7911j4006K3135j24696J9512J09106Q522l1375m1496
7628h7436j41178P0402M6748j07994N3087Q728n0299M0826m0134l0731J11721
7617a26260j0911L2099P4926m8185L9446O3605j15183Q532m6774l5249O3787n1674
7605a51841M729M5726L2765j4065n2550O3275J1264N9717j08348m9035R4544j11130
7593a74949q943l2888Q6758J9318j647K6071J01908Q648J7676Q8717j14019j36869
7581a20219J1006m6218L9728l7787J39422n4185j42466Q3604q927R5614L1336
7570i092n9885n1490J40633P5122q9156m6536n2203j6726K1988q1873l7656O7628
$$ y = [-128860, -218210, -160800, -49038, -18950, -272, -40547, -59678, -136468, -183007, -190035, -105563, -123977, -124524, -87094, -114049, -36138, -50144, -27009, -151705, -132193, -23087, -14565, -45940, -87436, -228614, -158212, -111464, -219458, -166371, -157643, -207942, -167116, -207250, -237981, -126260, -137171, -105072, -30146, -78331, -38885, 24720, -90463, -81931, -128705, -163954, -100167, -151841, -147112, -101386, -68621, -82686, -135236, -71961, -60697, -980, -109328, -158363, -63819, -174949, -183892, -216780, -130022, -110704, -112351, -86280, 15628, 24276, 41952, 130669, 16650, -120219, -109213, -155431, -115703, -153490, -14068, -68253, -210719, -127115, -136042, -40428, -9092, -68977, -120467, 20166, 95288, 6132, -40404, -92607, -109333, -87345, -169218, -206874, -139246]
7558a39246J21974J6360o844j27421J54182l4264j14008N5491L6341k2045p4121
7547a33601l3299l8223J12782M1754m7693N723j6833M0016k522N305O949m8676
7535a08318l6129J06608K7151Q6074M9550m4353k2110j81302r0830Q7335R5664
7524c0660j38642N6391J8590P0392j06389P649Q5522K5007q871k9285o4981J2954
7512a02323n9030K0416J45417j01778N9702J349Q3241j7268j3421j0524j50410
7501a44629q5069J22098M9983m8847Q2083k8523o1886N7805K6391j48438Q1738
7490i7294J6621K3300N3795l0744o486l3445K3170k0267j0347n7443J57l8598
7478a77581J39002R9075n3142L616m9218j09336J2325M5539N4733R112Q7544j8209
$$ y = [-139246, -17272, -912, -7756, -135177, 19005, -15259, -129267, -73776, -37435, -59480, -133601, -166900, -205123, -92341, -50587, -98280, -92557, -109390, -69374, -71896, -66591, -59642, -108318, -144447, -37839, -10688, 75386, 124936, 80583, 58473, -122829, -213659, -126324, -30660, -169302, -112911, -94321, -23929, -130318, -122669, -37147, -12140, -21011, -50296, -115277, -102323, -161353, -140937, 4480, -97298, -37596, -36247, 46994, 29726, 16305, 5781, -144629, -229698, -107600, -57617, -106464, -24381, -52904, -114790, -56985, -30594, -179032, -97294, -80673, -57373, -3578, -34322, -40808, -74253, -51083, -71350, -81697, -139140, -138983, -177581, -38579, 60496, 7354, 10970, -38248, -147584, -135259, -89720, -34987, -25875, 61669, 43460]
7466D3460p9922K366n8416L2781p7132l2920p3055O1368k230J3928N5740L7515
7454g6517o6258K0971L6986K1417L6517l67k1248k0923k6683M6829O224m6059
7442h9111R922m0567P9537k7203K3922K6858j4520O2348J18098o7010j59177M5722
7430c1181P8167q3812K6313r8255j5790O7810N539j07550m1681J31215J4073o3249
7418a18401J6199m4551Q5142M7622k6271j5931o1337O4121O5233k8001j659n1210
7406f9044m4786N3504k480J830O0619l9662n6171R9542P6388n6374q8297k7050
7394i1981Q4189J30986j00396j1367J5114j26449L7765Q9229n931j34500J7636
7383i5705J4313O431p1051k5027Q8362J19468j47065j4179J35338q2395N8244
$$ y = [43460, -36462, -34096, -92512, -59731, -136863, -169783, -242838, -181470, -183700, -169772, -114032, -76517, -142775, -121804, -84818, -63401, -26884, -27251, -48499, -69422, -96105, -49276, -43052, -89111, -79189, -119756, -40219, -67422, -43500, -16642, -31162, 31186, 149284, 82274, -76903, -31181, 46986, -36826, -10513, -108768, -124558, -56748, -51209, -158759, -200440, -69225, -55152, -118401, -102202, -146753, -61611, -13989, -40260, -56191, -117528, -53407, 11826, -16175, -17834, -69044, -113830, -60326, -62806, -60976, -357, -40019, -96190, 3352, 79740, 23366, -64931, -91981, -7792, 123194, 22798, 11431, 26545, -99904, -62139, 27090, 21159, -113341, -95705, -81392, -74961, -146012, -171039, -82677, 36791, -110274, -124453, 10885, -71510, -13266]
7372a3266k5415J3769q3084j3376Q0678M8505N8917l529j44897k6907K1254O8890
7360a8461J8599K1619M7888N0588m4949k5588M4656K5173o5571m5324l3972k3878
7348d9220K8267J5659J12453l6703j24108o5792J0848M5094M4663M1902n6101
7337c3038p2879N1883M6276p228l2337m49N525J7938M1944o9281p791q23n1967
7324a12227K7125K9675Q4778J8643n669l396n5064M7807o0369M1787J4909J11229
7312A39228j0595m2682o8511j05599J72378L9739O554j28791J2913L0728N8031
7301A03393j13137N7629K8866p1110m0126n5146J2137r947J71161j04369k8131
7290d8780J6393O3991M4224J2681j2457l3047O4624l522r1996r0371L9230J10907
$$ y = [-13266, -38681, -24912, -107996, -121372, -40694, 7811, 66728, 63199, -81698, -108605, -87351, -18461, 138, 21757, 69645, 120233, 75284, 49696, 94352, 119525, 53954, 8630, -25342, -49220, -20953, -5294, 107159, 70456, -53652, -119444, -108596, -63502, -18839, 23063, -33038, -105917, -54034, -7758, -14986, -47323, -47772, -42247, -24309, 17635, -51646, -59437, -60260, -112227, -85102, -55427, 29351, 47994, 42325, 38929, -16135, 31672, -28697, 13090, 27999, 139228, 128633, 85951, 17440, -88159, 84219, 123958, 130512, 1721, 14634, 45362, 103393, -9744, 47885, 76751, 5641, -34485, -89631, -77494, -87441, 83720, -20649, -48780, -32387, 31604, 75828, 88509, 76052, 43005, 107629, 104107, 12111, -78260, -39030, 71877]
7278G1877Q602k4041k8563M8599k1517J5985R277j00119J0235O3600P1175m8015
7266G7095p5959r087J12293j9443Q51Q9621l8756q5249N1692R1164m8547r3263
7254E2412n151j899Q297o4032k341K9103M0751L6273Q44r5040K1045M9581M2689
7241A12532O178o1866n5171m2591J75249k3772Q004P6458k3203k7006N8039L2038
7229B34889q9376r457o3070J3983j9915p702q730k383P4236N0509O4766m420k7307
7216B06023j02198l7464l8322N2822m5347J1175Q1408K4029o5279j28946L7489
7205d610n0552j2143l7347P9429J93575N5111p5036r9309J7692k9721K1816o1515
7193b610R0011K4482K9477m7040M3127k705j23112M2638Q0540n953N9744m1778
$$ y = [71877, 80479, 56438, 27875, 76474, 54957, 70942, 80219, -19900, -9665, 53935, 125110, 77095, 1136, -7951, 104342, 84899, 85750, 175371, 136615, 51366, 103058, 194222, 145675, 52412, 47261, 45362, 53659, -10373, -12714, 16389, 57140, 93413, 94257, -783, 20262, 69843, 112532, 118710, 56844, 1673, -40918, 134331, 110559, 118563, 195021, 171818, 144812, 202851, 234889, 145513, 136056, 72986, 86969, 67054, 59352, 50622, 48239, 122475, 172984, 237750, 233330, 206023, 103825, 66361, 28039, 80861, 35514, 46689, 128097, 152126, 86847, -42099, -4610, -55162, -67305, -104652, -25223, 168352, 223463, 148427, 49118, 66810, 37089, 58905, -2610, 87401, 111883, 141360, 94320, 137447, 134742, 11630, 54268, 134808, 128855, 188599, 146821]
7181A46821r1356l2035n2772J52109L8408R0740o9494j4088l552M546m9461k8883
7169I0983l5385m8788r385K3552K1696J11729L3011p2173j8318j706n7956q1624
7157d4364P6578J05575k9398M1157k391N1900m8349J1065P5492n018k5465o8104
7145A38678J53540J64118O8959j3544P809p0297o5287p7428j01736m9566p3103
7134H2143o8241O5745Q8713p9930O968l101L6272p1365O6424J12501m5726q9293
7122A01110n001J7418q447m380k3958P7297K8025o2163R182M164n231M6182k5884
7109A48314j1721J4206J26239j33557k5919l287J10128m3477q8729K7232N2158
7098A71587J5443K4814J4612m065n4541l7017M4001j931j1786j9552j01315M6837
$$ y = [146821, 55465, 23430, -29342, 122767, 161175, 251915, 182421, 168333, 164781, 169327, 119866, 90983, 55598, 6810, -2575, 20977, 42673, 154402, 187413, 115240, 96922, 95216, 37260, -44364, 32214, 137789, 108391, 149548, 147157, 199057, 150708, 161773, 237265, 232247, 206782, 138678, 292218, 456336, 525295, 511751, 519560, 449263, 383976, 306548, 204812, 155246, 82143, 13902, 79647, 168360, 88430, 95398, 92297, 128569, 57204, 123628, 236129, 190403, 101110, 96109, 113527, 105080, 100700, 76742, 154039, 182064, 119901, 129083, 133247, 128016, 174198, 148314, 136593, 150799, 277038, 143481, 117562, 114275, 224403, 180926, 92197, 119429, 171587, 187030, 211844, 226456, 222391, 167850, 130833, 174834, 172903, 161117, 141565, 40250, 87087]
7086H7087J61186R1055j7379j42916j25837K2646R5045O4224p1522k8693j2085
7075A22811m6687k0889L9306l3864L6238M375K4891k2932N0948M1500m0839O2079
7063B16937k6398O5061p3526N8898l9431J3298M7931J3955J0981p4129P9807j22711
7051A70673j273J48590q4659k4396k5524M9951j1341N7405j25794K7218l7789
7040A43061r1882J31700M7661j0680k7206j22381j553P6913J8181j0340M9932
7029B03406M5843K486J985j7203l9423P2979m0201l5334M7386N5209n0364M8730
7017B95499J21895j8717l9384M981j5049q1349K9389L6430J4516j14551m6532
7006A87128N547R7465K761q6813Q3865o0554q275k550J3507m4428k3080J15827
$$ y = [87087, 248273, 339328, 321949, 179033, 53196, 75842, 170887, 235111, 163589, 134896, 122811, 76124, 55235, 94541, 60677, 96915, 101290, 126181, 103249, 154197, 195697, 154858, 216937, 190539, 255600, 182074, 240972, 201541, 214839, 262770, 276725, 287706, 213577, 293384, 170673, 169400, 317990, 233331, 208935, 183411, 233362, 222021, 279426, 153632, 180850, 143061, 51179, 182879, 230540, 219860, 192654, 70273, 68720, 145633, 163814, 153474, 203406, 249249, 251735, 253720, 236517, 197094, 270073, 229872, 194538, 241924, 297133, 246769, 295499, 417394, 398677, 359293, 364274, 349225, 267876, 297265, 333695, 348211, 233660, 187128, 192675, 290140, 292901, 206088, 289953, 229399, 221124, 218574, 232081, 187653, 164573, 280400]
6994B80400j3110q0931M2118M6449K0635J9936K086l7337j13407K6134r084K61332
6982D45221j5012K3997r6388j10125l7602Q1292N9181m3326l4217K721O577r5449
6970A86870P886N3913M504l3957j2516J12208Q192p7617j3665J0771j2586L1679
6958B65682p722L0718O8837N2716Q8731j29579n7890L059P3296j3273J8688M9996
6946D43259j7257j8216K794j13155L312J40931n1438k8178n78n8137K3169N2450
6934C78956J7416M528j32089k6325R0530L8795M4445K016m8484p8842R3094Q552
6922C92592O585M877q7051o6294l7480L297O9995K6279j6359Q0810N1797J3612
6910D42660K840k2344o6157r515N973N3503J11041j21914j2599K3024l4591o4004
$$ y = [280400, 267290, 186359, 228477, 274926, 295561, 315497, 317583, 280246, 166839, 192973, 183889, 445221, 430209, 454206, 357818, 247693, 210091, 291383, 350564, 307238, 273021, 275742, 282319, 186870, 194756, 248669, 253173, 219216, 206700, 318908, 327100, 249483, 235818, 246589, 234003, 265682, 257960, 288678, 357515, 410231, 498962, 369383, 311493, 314552, 387848, 374575, 393263, 443259, 426002, 407786, 410580, 297425, 300737, 441668, 390230, 362052, 361474, 303337, 326506, 378956, 396372, 400900, 268811, 242486, 333016, 371811, 416256, 418272, 369788, 290946, 384040, 392592, 399177, 404054, 317003, 250709, 213229, 216526, 286521, 312800, 296441, 377251, 429048, 442660, 445500, 423156, 356999, 347484, 353457, 406960, 518001, 396087, 383488, 406512, 371921, 307917]
6898C07917k8808N8614k1347l1669N4902K0049K5319j30546l8531R8464l2542
6887B81822K5564J05994L9966N68q9898o3707P9331L822j10972N4390R9876o3209
6875C63547q9791J27333R3715K9982r4039j5304j9736n1915K1399N9403M4625
6864D69219n1986J54695Q0284o8312n3275L0363m567p8616j21312P9098K4913
6853D60504m0750l8177k145N3890M6375m6444l8762l5861P0080J32943l0737q1691
6841D49225J13777q933j02010P846k7100L9551M9241R2788n2346p2924m7464r37
6829D40714p119O0586k4219r7476L1987J62718j7860L3892P09r0519M4364n84
6817E37193j1956J2811N1888l1923N8343l4576K2501p0649q6279O0824j8657M6263
$$ y = [307917, 279109, 337723, 316376, 284707, 339609, 359658, 384977, 254431, 215900, 314364, 281822, 307386, 413380, 453346, 453914, 364016, 300309, 379640, 383462, 272490, 326880, 426756, 363547, 273756, 401089, 494804, 524786, 430747, 415443, 395707, 343792, 365191, 424594, 469219, 417233, 571928, 652212, 583900, 530625, 560988, 556421, 477805, 356493, 435591, 460504, 419754, 381577, 379432, 433322, 479697, 433253, 394491, 358630, 428710, 561653, 530916, 449225, 563002, 554069, 452059, 459905, 432805, 472356, 521597, 614385, 562039, 489115, 441651, 440714, 433595, 494181, 469962, 372486, 404473, 567191, 549331, 583223, 583932, 493413, 537777, 537193, 525237, 538048, 589936, 558013, 616356, 581780, 604281, 533632, 447353, 508177, 489520, 535783]
6805E35783O5899J2431R8378o8349K5833J4707L8319n2118J4323j07526O6803
6794F44483L7068M4290l905k7359n6648l6123L9505R8718l2034j3348J7312k1266
6782F90693O4302J9760r7216J0692J1895p9406P4574L1235l5568k10763J32379
6771F12577J68954n2919o5311k6300K8305P6936n8312L1833p0389M9666K1436
6760G16476J9355N2741O2774o3579P1147J03375M156n1065Q0494o4564N000J23055
6748A059365j2916M9279J02878j3288n0130p1933l5273j3805o6404J67027J8212
6737A133012k7103l4068o2934L2698j27687M363P7538M3402M992Q8342N984n8171
6725A080368O0R6682R1706J4668J66546M8354R6247M682p1648j26406l7933L5933
$$ y = [535783, 601682, 614113, 712491, 644142, 669975, 684682, 723001, 670883, 685206, 577680, 644483, 681551, 725841, 721936, 694577, 637929, 601806, 641311, 740029, 707995, 694647, 711959, 690693, 754995, 774755, 677539, 688231, 700126, 620720, 695294, 726529, 690961, 480198, 612577, 781531, 728612, 663301, 637001, 665306, 742242, 683930, 715763, 645374, 695040, 716476, 735831, 788572, 851346, 787767, 858914, 962289, 966445, 915380, 995874, 931310, 936310, 1059365, 1046449, 1095728, 1198606, 1185318, 1135188, 1063255, 1027982, 1014177, 947773, 1114800, 1133012, 1105909, 1071841, 1008907, 1041605, 913918, 918281, 995819, 1039221, 1044213, 1132555, 1138539, 1080368, 1080428, 1177110, 1268816, 1283484, 1450030, 1498384, 1594631, 1599313, 1527665, 1401259, 1363326, 1399259]
6713A399259j06310r5036L2620J29784k9185k20873M7324N4919r59l2025m6874
6702A132644J23413Q6571P022k7951l3911N9752l0925l8306J83808q7665J21J19685
6690A494258p2501k17733J8577J2547O7341p6319q0777J53697Q3769r7781j33159
6679A151919O2916k1647n9942J15697L3738j6052M6233l321j7587j3198n9002
6668A219754o0656J29273P9556J9670r4425Q0826j4641l7792J4808l877k7830
6657A304666Q0815J04435o5551m7O534p4338R0403Q9980j2653m0817M692K1867
6645A509986p032M5119o1725P0493L4525l092L0386n7224n1461p955P3264J5807
6633A591091p9243Q2247M4262l3665K0038m0394n676p6569l5516Q5791K7066m500
$$ y = [1399259, 1292949, 1197913, 1230533, 1360317, 1331132, 1110259, 1157583, 1212502, 1211543, 1179518, 1132644, 1256057, 1342628, 1349650, 1321699, 1287788, 1347540, 1316615, 1278309, 1462117, 1374452, 1374573, 1494258, 1421757, 1204024, 1222601, 1235148, 1302489, 1226170, 1145393, 1299090, 1382859, 1285078, 1151919, 1214835, 1193188, 1133246, 1248943, 1282681, 1266629, 1312862, 1309541, 1291954, 1278756, 1219754, 1159098, 1288371, 1367927, 1387597, 1293172, 1373998, 1359357, 1321565, 1336373, 1332496, 1304666, 1385481, 1489916, 1424365, 1424318, 1430852, 1356514, 1446917, 1536897, 1524244, 1483427, 1488119, 1509986, 1502954, 1548073, 1486348, 1556841, 1591366, 1588274, 1618660, 1561436, 1509975, 1502020, 1575284, 1591091, 1511848, 1594095, 1638357, 1604692, 1624730, 1584336, 1578660, 1502091, 1466575, 1552366, 1579432, 1574932]
6621A574932J16565J5846Q129P5717j9751p7147k0167p1135M3544O3773K7680
6610A737986p121k8225M3936R3972l7833N9240q85k8280M7861J6519K3805j5891
6598A905084M4076R9000O1474K1598Q642n5180r508P803k3034P6735N5835r7626
6586B094899J4867Q9650K6352R0094P3169J6471K5855q0112r6900J91040O7110
6575B512495l7527k1481J16091M8524L483O8000J33561q9573j12728K15054J20152
6564B956051K8682K1874N5121l4371P7472M6351l6687M5377k9908k2817J50629
6553C257774J17083n6746n0349O1435n1340j5488J48146J14873J47644j8952L8124
6542C692204J77688k8151J04287J16866Q5085M3091j293j9488J73176J6036N8524
$$ y = [1574932, 1691497, 1707343, 1715472, 1791189, 1771438, 1694291, 1674124, 1602989, 1646533, 1710306, 1737986, 1730865, 1702640, 1746576, 1840548, 1802715, 1861955, 1861070, 1832790, 1880651, 1897170, 1920975, 1905084, 1949160, 2048160, 2109634, 2131232, 2139874, 2084694, 2075186, 2082989, 2059955, 2136690, 2192525, 2094899, 2109766, 2199416, 2225768, 2315862, 2389031, 2405502, 2431357, 2351245, 2254345, 2445385, 2512495, 2474968, 2453487, 2569578, 2618102, 2621585, 2689585, 2823146, 2733573, 2620845, 2835899, 2956051, 2984733, 3006607, 3061728, 3027357, 3104829, 3151180, 3114493, 3159870, 3129962, 3107145, 3257774, 3374857, 3318111, 3267762, 3329197, 3277857, 3262369, 3410515, 3525388, 3673032, 3654080, 3692204, 3869892, 3841741, 3946028, 4062894, 4147979, 4191070, 4189777, 4170289, 4343465, 4359501, 4418025]
6531D418025j4075J76126K8091l3830J16896J76640k9247J0505J35693O1174J65350
6520E211348Q9784J6493Q5427M2652N1205J02517j7315N9417P4841M8310J02529
6509E867208J11429J64131J0761J52514O4868N7506N8218J7957R5102R3902J64969
6498F858565Q6571J3124M6254K00194N3582O4622J50500J33700J62853K30382
6488H000347J91369K22367K22445J95985J23077J49616R6839J31098J04883N0258
6478I488284J31087J23917K22812K21901K93159J94269L23880L56552K13867L27127
6468A1896855L94046L91351L31482L90987K90044M39368M08525M14018M39316
6459A5395992M75017L74284L98207M16578N67806P41147P78461O69626Q88583
$$ y = [4418025, 4403950, 4580076, 4608167, 4574337, 4691233, 4867873, 4838626, 4849131, 4984824, 5045998, 5211348, 5301132, 5317625, 5403052, 5445704, 5496909, 5599426, 5582111, 5641528, 5716369, 5764679, 5867208, 5978637, 6142768, 6153529, 6306043, 6370911, 6428417, 6486635, 6504592, 6599694, 6693596, 6858565, 6945136, 6958260, 7004514, 7204708, 7258290, 7322912, 7473412, 7607112, 7769965, 8000347, 8191716, 8414083, 8636528, 8832513, 8955590, 9105206, 9202045, 9333143, 9438026, 9488284, 9619371, 9743288, 9966100, 10188001, 10481160, 10675429, 10999309, 11355861, 11569728, 11896855, 12290901, 12682252, 13013734, 13404721, 13694765, 14134133, 14542658, 14956676, 15395992, 15871009, 16245293, 16643500, 17060078, 17627884, 18369031, 19147492, 19817118, 20705701]
6450B0705701J033756R85182R93331J172667J384765J929192J988078K357073
6442C2549745K958242L513057M017488M684464N482636O105078O069629M476120
6434F9856459J450881k373430m965944n877074n239860m108241l047609j873347
6426D3821835r81801m44916J56945N40391R58463J663361K318540K978434L797161
6417E4808413M996973N984696P320610Q963190J0596077J2080208J2233902R332331
6409A26316400K697096n821721j2863371j5349182j4286036j1404402q531908
6402F0756876o256991m693001l529001k502849j885721j329774p03847r6505N77174
6393D0336361J070195J828941K688683L411307M110773M986415N678028N688047
$$ y = [20705701, 21739457, 22724639, 23717970, 24890637, 26275402, 28204594, 30192672, 32549745, 35507987, 39021044, 43038532, 47722996, 53205632, 59310710, 65380339, 69856459, 71307340, 68933910, 63967966, 58090892, 52851032, 48742791, 45695182, 43821835, 42840034, 42395118, 42552063, 43092454, 44050917, 45714278, 48032818, 51011252, 54808413, 59805386, 65790082, 73110692, 82073882, 92669959, 104750167, 116984069, 126316400, 129013496, 123191775, 110328404, 94979222, 80693186, 69288784, 60756876, 54499885, 49806884, 46277883, 43775034, 41889313, 40559539, 39855692, 39759187, 40336361, 41406556, 43235497, 45924180, 49335487, 53446260, 58432675, 64110703, 69798750]
6385F9798750M158515N22503m013192p377572q442016p984180o594016n353586
6377C4715206l949513l132166k674826k269912j954950j466406j180378j108365
6369A6978690j000039o60773o43073n73479m66146m33284m43936n94243m02155
6360A1761562j87544k54714l82688l14817m1324j15524j80322k02243k09192m35753
6350I437441m05583k12514j90855j25401j82556j57925m9060j07693j08464j28399
6340G768991p5239J2696j32326j45412l7650m5163m034O7643M7738J39538J12061
6329G708843J13212K24365K67146K88233L35464N33856L36996M8461k04039l66169
6319I286368m89833m20091m01307k91626q3849J0906j05465j14597r2092k10029
$$ y = [69798750, 73957265, 74479768, 70466576, 63089004, 54646988, 46662808, 40068792, 34715206, 30765693, 27633527, 24958701, 22688789, 20733839, 19267433, 18087055, 16978690, 15978651, 15317878, 14674805, 14101326, 13635180, 13201896, 12757960, 12163717, 11761562, 11574018, 11319304, 10936616, 10621799, 10580475, 10464951, 10284629, 10082386, 9873194, 9437441, 9031858, 8819344, 8628489, 8503088, 8320532, 8162607, 8113547, 8005854, 7897390, 7768991, 7693752, 7706448, 7574122, 7428710, 7391060, 7345897, 7341863, 7409506, 7457244, 7596782, 7708843, 7822055, 8046420, 8313566, 8601799, 8937263, 9471119, 9808115, 9856576, 9652537, 9286368, 8796535, 8376444, 7975137, 7683511, 7599662, 7610568, 7505103, 7390506, 7298414, 7088385]
6309G088385j744Q9195K9639K15577J55189l0585M4059Q5923Q2462J46147J41479
6298H045726K95103K98971K50936K16298L32918M73725N79789L80768J67482L30403
6288A1372119j6323k49553j74758j58701o3534q3432k8822J12745K24096M16517
6278A1350354N04817P26433Q90233P60608N16796M46136j46548l88870o51403
6269A4008556p21970l46281l24216k45148q4726J59266K91211M34520O15901Q43825
6259A4630938N48207P0507k8992J28814K98492N92015P36996J018721J304520
6250A9300218J394130J520946J403666P94025k96505j386725k011897k055068
6242A8662790j770825j480003j207500q65431n78015l24330l01945k8222o5604
$$ y = [7088385, 7086641, 7175836, 7205475, 7421052, 7576241, 7545656, 7589715, 7675638, 7758100, 7904247, 8045726, 8340829, 8639800, 8890736, 9107034, 9439952, 9913677, 10493466, 10874234, 11041716, 11372119, 11355796, 11106243, 10931485, 10772784, 10709250, 10625818, 10596996, 10709741, 10933837, 11350354, 11855171, 12581604, 13471837, 14232445, 14749241, 15195377, 15048829, 14659959, 14008556, 13286586, 12940305, 12616089, 12370941, 12286215, 12445481, 12736692, 13171212, 13787113, 14630938, 15179145, 15249652, 15220660, 15349474, 15647966, 16239981, 16976977, 17995698, 19300218, 20694348, 22215294, 23618960, 24412985, 24116480, 22729755, 20717858, 18662790, 16891965, 15411962, 14204462, 13339031, 12761016, 12436686, 12134741, 12106519, 12040915]
6233A2040915J77880J74347M26680M29169O66976Q99171O47360K45719Q6720K55454
6223A6050391L72659K98329P7903k20779q22578j064813j063308j097912q30810
6214A1699082o57623n40725m79997l12416k39534k05669p6960j90847j21785j62345
6204H711181l1902J1020j10364q845J3716p0059P7314J16648J40648Q5628j72327
6193H762658j64224j88902r2757O6p1123P9773L4427O054J44997J86096l5191
6182H661874O2243J69830J67128J27393K00414J16058P5408J07183J03518n7212
6172I733837J09112M1270R7756K01726J40979K75958J99616J85620K49705K35838
6162A1471417K50521K32263L18585K87134M23642L35036K61876M37031M04678
$$ y = [12040915, 12218795, 12393142, 12819822, 13248991, 13915967, 14815138, 15462498, 15708217, 15794937, 16050391, 16423050, 16721379, 16799282, 16578503, 15755925, 14691112, 13627804, 12529892, 11699082, 11041459, 10500734, 10020737, 9708321, 9468787, 9263118, 9186158, 8995311, 8873526, 8711181, 8679279, 8690299, 8579935, 8571090, 8584806, 8514747, 8592061, 8708709, 8849357, 8934985, 8762658, 8598434, 8409532, 8316775, 8316841, 8245718, 8325491, 8359918, 8365972, 8510969, 8697065, 8661874, 8724117, 8893947, 9061075, 9188468, 9388882, 9504940, 9580348, 9687531, 9791049, 9733837, 9842949, 9884219, 9981975, 10183701, 10324680, 10600638, 10800254, 10985874, 11235579, 11471417, 11721938, 11954201, 12272786, 12559920, 12983562, 13318598, 13580474, 14017505, 14422183]
6153A4422183M36016M46229M56033L78840L46934L00107M23194N29287N49946
6144A8288769N91916M60419M72984O88323P55693Q96745R98154J124448J264353
6135B5541804J437992J439583J691937K139239K413751L123354L874919M551271
6127D6213850N454342O604358P902395Q536398P349765K898488l640664p075798
6119G4243134o765737m880340k686213o37159J222918K613970M382263N525051
6111G3017887N430115K615318j190031j562773K52511K735824M893972N342754
6103I1535577L267658j019626n330924o985286o161502l990267j288327J256820
6095G1284123K700885K255231j182999m945440n324818l685857j238468Q84728
$$ y = [14422183, 14858199, 15304428, 15760461, 16139301, 16486235, 16786342, 17209536, 17738823, 18288769, 18880685, 19341104, 19814088, 20502411, 21258104, 22154849, 23153003, 24277451, 25541804, 26979796, 28419379, 30111316, 32250555, 34664306, 37787660, 41662579, 46213850, 51668192, 58272550, 66174945, 74711343, 82061108, 84959596, 81318932, 74243134, 67477397, 62597057, 59910844, 59273685, 60496603, 63110573, 67492836, 73017887, 78448002, 81063320, 79873289, 78310516, 78563027, 81298851, 86192823, 91535577, 94803235, 93783609, 88452685, 81467399, 75305897, 71315630, 70027303, 71284123, 73985008, 76240239, 75057240, 70111800, 64786982, 61101125, 59862657, 60747385]
6087F0747385K694019M599199O469291O940703M653782j630471q906564j1775848
6079F3791496j0949748q660098o527469m897795l508338k838725k458198j984927
6071B1966198j637414j422910j169353j149014r30752o96171o56430p37142n26264
6062A3040748n28727n44560n13879m42533m17127m08694l50968l93498k69998
6053I170764l19987k88507k63603k74827p4280j52646j98065j26049k64848j47773
6043G060179q9602k72076o5211o1729j15435M310j89748j46303p0134r6974l8687
6032E918590q963k7475j64349j0286k6716j56163n5032p1945j39779N2307O0083
6021E370272n4451m9926q2962n020o4834R349P6782o3082j1285J06779j9625k19573
$$ y = [60747385, 63441404, 68040603, 74509894, 81450597, 86104379, 84473908, 75567344, 63791496, 52841748, 44181650, 37654181, 32756386, 29248048, 26409323, 23951125, 21966198, 20328784, 18905874, 17736521, 16587507, 15656755, 14960584, 14304154, 13567012, 13040748, 12512021, 11967461, 11453582, 11011049, 10593922, 10185228, 9834260, 9440762, 9170764, 8850777, 8562270, 8298667, 8023840, 7949560, 7796914, 7598849, 7472800, 7207952, 7060179, 6970577, 6698501, 6633290, 6571561, 6456126, 6460436, 6270688, 6124385, 6054251, 5957277, 5918590, 5909627, 5882152, 5717803, 5707517, 5680801, 5524638, 5469606, 5397661, 5257882, 5310189, 5370272, 5315821, 5265895, 5182933, 5177913, 5113079, 5122428, 5199210, 5136128, 5124843, 5231622, 5211997, 4992424]
6009D992424k4375Q5128k9697k647j535L0022M0248p0325J12071P7634K5713L4114
5997E268775J21034J2566j06324j651M7668n5346k1893N1694p2563k2776Q228
5986E229412j164P4508R8066n6518O3124J6453P6331m1270R8565L5122l6949M1147
5974E596827M1953K4403J24948J20080M481O6351R8153O5564q9016P8623J72532
5963F304899J22878J07850N0437P4092M4149Q569q899Q0663P1301P5552J48404
5952G079895J02349J46586J30863N5653N1130P4852K44428J58930j6163J88183
5942H216706K74973J38358O4449P7146L49498K98120L60095L83347M29044N62912
5932A1154648J73455J08745K8964K7738k4945q6523P2023Q6190O7075P8946L10322
$$ y = [4992424, 4968049, 5053177, 5023480, 5020833, 5019298, 5049320, 5089568, 5019243, 5131314, 5208948, 5234661, 5268775, 5389809, 5402375, 5296051, 5294400, 5342068, 5286722, 5264829, 5316523, 5243960, 5221184, 5229412, 5228248, 5302756, 5400822, 5344304, 5407428, 5423881, 5500212, 5458942, 5557507, 5592629, 5555680, 5596827, 5638780, 5663183, 5788131, 5908211, 5912692, 5979043, 6077196, 6142760, 6053744, 6132367, 6304899, 6427777, 6535627, 6586064, 6660156, 6704305, 6712874, 6703975, 6784638, 6855939, 6931491, 7079895, 7182244, 7328830, 7459693, 7515346, 7566476, 7641328, 7885756, 8044686, 8028523, 8216706, 8491679, 8630037, 8694486, 8771632, 9121130, 9419250, 9779345, 10162692, 10591736, 11154648, 11328103, 11436848, 11465812, 11493550, 11468605, 11382082, 11454105, 11540295, 11607370, 11686316, 11996638]
5921A1996638K31341J65774K08055K02070L41889K55455L77109K35823M13242
5912A4427396M83063M03991M72236M74504M28786M49253M92801M86769O50555
5903A8769354O49529Q02937P08010R58845J018193R29072J314074J341601J583643
5894B8075258J771241J945971K499028L078366L704744M266674N149347O012897
5886E6503526O926258P686502P095254M565341j3193m984844p544984p614615
5878F2619245o440598m752490l314167k121573j353878p47963j28678M32855J098521
5869D5291274J707859K417037L282443M228023N462433O921030Q317072R990038
5861H7617209J1985373J3462546J2738383P494046j822576j1398704j6160172
$$ y = [11996638, 12227979, 12393753, 12601808, 12803878, 13145767, 13401222, 13778331, 14014154, 14427396, 14910459, 15314450, 15786686, 16261190, 16689976, 17139229, 17632030, 18118799, 18769354, 19418883, 20221820, 20929830, 21888675, 22906868, 23835940, 25150014, 26491615, 28075258, 29846499, 31792470, 34291498, 37369864, 41074608, 45341282, 50490629, 56503526, 63429784, 71116286, 78211540, 82776881, 82763688, 77778844, 70233860, 62619245, 56178647, 51426157, 48111990, 45990417, 44636539, 43888576, 43759898, 44192753, 45291274, 46999133, 49416170, 52698613, 56926636, 62389069, 69310099, 77627171, 87617209, 99602582, 113065128, 125803511, 133297557, 131474981, 120076277, 103916105]
5854A03916105j6011773j3470118j0217647p628654n689300m333290l326117k648051
5846D0591155j884136j154832n74475r3946N24152J092918J608813K365435L150551
5837D5625635L734704M384112M799533M598663K831140r44453m895383p461420
5829E2672531p677963o412547n227161l982660l126301k544405k093201j755333
5821A9852960j397895j132087j004370q79565o80688n37302n77148m61478j99382
5812A2983045l14235m16384l92096l54439j77999j84870l3789n0693r2961o8128
5802A0897451j3528J51393J11828K18962j68753k64355k37670j67854k43831p9463
5792A0204180j44102j41063L7031R0067N854n9167M8404k5966q246K46431K00200
$$ y = [103916105, 87904332, 74434214, 64216567, 56587913, 50898613, 46565323, 43239206, 40591155, 38707019, 37552187, 36977712, 36883766, 37407918, 38500836, 40109649, 42475084, 45625635, 49360339, 53744451, 58543984, 63142647, 65973787, 65029334, 60133951, 52672531, 44994568, 38582021, 33354860, 29372200, 26245899, 23701494, 21608293, 19852960, 18455065, 17322978, 16318608, 15439043, 14758355, 14221053, 13643905, 13182427, 12983045, 12668810, 12252426, 11860330, 11505891, 11327892, 11143022, 11109233, 11058540, 10965579, 10897451, 10883923, 11035316, 11147144, 11366106, 11197353, 10932998, 10695328, 10527474, 10283643, 10204180, 10060078, 9919015, 9956046, 10046113, 10051967, 9992800, 10041204, 10015238, 10006992, 10253423, 10453623]
5781A0453623J26337J59312M7296J10800J86865P8571J65523J88826L52824L97222
5771A2267199M75393O58888N01573J6643n83720o95564n40838l83333k80862m47322
5761A0988057k89773k33652k14380j53555r6624l5265j15085l5646P8041r77l0474
5750I860667N1848r5482j33702k08704J5318O1604P6843J07020O3002p8293l8171
5739I681950j06628j35080l25797l98425n11074j81221k39214n3062q0244r9601
5729G551604J09193j579J09619J47845J25823L4862l2139j47209l4562j57103
5719G706354l9556m2068p0184K3439M3472P4463J82881K60367J80655L39324N17922
5708I177069L86509N45633N96200P09860Q82323Q16516R90874J115749P92929
$$ y = [10453623, 10579960, 10739272, 10786568, 10897368, 11084233, 11162804, 11328327, 11517153, 11869977, 12267199, 12742592, 13401480, 13903053, 13919696, 13335976, 12640412, 12099574, 11716241, 11435379, 10988057, 10698284, 10464632, 10250252, 10096697, 10000073, 9964808, 9849723, 9814077, 9892118, 9891141, 9860667, 9912515, 9817033, 9683331, 9474627, 9489945, 9551549, 9628392, 9735412, 9798414, 9720121, 9681950, 9575322, 9440242, 9114445, 8716020, 8204946, 8023725, 7784511, 7731449, 7651205, 7551604, 7660797, 7659218, 7768837, 7916682, 8042505, 8077367, 8045228, 7898019, 7863457, 7706354, 7666798, 7624730, 7554546, 7577985, 7621457, 7695920, 7878801, 8139168, 8319823, 8659147, 9177069, 9563578, 10109211, 10705411, 11415271, 12297594, 13114110, 14104984, 15220733, 16013662]
5699A6013662K41897k78320r08993j077430q48029p35054n98148l94219k84713
5690A1130653j31516j4500J4513k9556K21715K77186L93393O18980O72638Q46918
5680A4000424J051335J193877J477465J819371J930977K083351J617964K92245
5672B5467009j095797k052313k213060k070607j619234j170345q12082p08886
5664A3724685n33297k59796k82809k62128j59043r1948j11355N468L0367R3308
5654A2153452J86283M08378O10216N98294O69086O39417N14703K20984k58019
5645A5742794o95459r53721p80175q38604o09694l78686l36864l24673j45963
5636A0678955l1531k60562k34423j02649P9186K4966j9036q5036p4391O2488O6115
$$ y = [16013662, 16255559, 15977239, 15068246, 13990816, 13142787, 12407733, 11809585, 11415366, 11130653, 10999137, 10984637, 10999150, 10969594, 11191309, 11468495, 11861888, 12480868, 13153506, 14000424, 15051759, 16245636, 17723101, 19542472, 21473449, 23556800, 25174764, 25467009, 24371212, 22318899, 20105839, 18035232, 16415998, 15245653, 14433571, 13724685, 13191388, 12931592, 12648783, 12386655, 12227612, 12135664, 12024309, 12029777, 12060144, 12153452, 12339735, 12748113, 13358329, 13956623, 14625709, 15265126, 15779829, 16000813, 15742794, 15047335, 14093614, 13313439, 12474835, 11865141, 11486455, 11149591, 10824918, 10678955, 10647424, 10386862, 10152439, 10049790, 10128976, 10153942, 10134906, 10049870, 9975479, 10037967, 10104082]
5625A0104082J74818L7957J41808J89495K02464K10190K23794K16954K58394J84458
5615A1944414L53905K83942K48576K22934J21560K67277L44532M16098L13197
5606A4516435L77315M76310L55733L27511M00606M58722N32701M74269L59551
5597A8279153O17709O15269O67060P97427P63555R20364R83883J099963J221937
5588B5966320J387913J514243J737392K262113K455557L119137L681312M439115
5580D6563102N327086O364633P821672R068215R625330P078661R39872n848507
5572H6940064q427042p419411m967565k474960l74196J595651L650100M834266
5564G3356907M411289J810468k087255k872952j348450R35603L363142N299605
$$ y = [10104082, 10278900, 10316857, 10458665, 10648160, 10850624, 11060814, 11284608, 11501562, 11759956, 11944414, 12298319, 12582261, 12830837, 13053771, 13175331, 13442608, 13787140, 14203238, 14516435, 14893750, 15370060, 15725793, 16053304, 16453910, 16912632, 17445333, 17919602, 18279153, 18896862, 19512131, 20179191, 20976618, 21740173, 22660537, 23644420, 24744383, 25966320, 27354233, 28868476, 30605868, 32867981, 35323538, 38442675, 42123987, 46563102, 51890188, 58254821, 66076493, 75144708, 84770038, 91848699, 92788571, 86940064, 78513022, 71093611, 66126046, 63651086, 63276890, 64872541, 68522641, 73356907, 77768196, 79578664, 77491409, 74618457, 73270007, 74205610, 77568752, 82868357]
5556H2868357O346537M698469N09714m274254o704511o386910m179193j362941
5548G1515268O95571R57848j659586n066475n775255m355514k351021m32029J276426
5539E4805233K822758M329753N504099N382795K550579l190489q560814r929524
5531E3714390q978745p178291n340295m032641l019678k480717k145597j737332
5523A8801094j447945j247316j055154r35254o84994o55010m67947l79770m57225
5514A1470479m61606l86393m76026l93575m09654m39053l95505l11042k76350
5505G921275l52044m02534l06856k32003k04676j96594j13447j32997j75976o4994
5495E739154j65094j65381l562j12120j57526j25906j77300O5335k28634j65988
$$ y = [82868357, 89214894, 93913363, 94423077, 90148823, 83444312, 77057402, 72878209, 71515268, 72210839, 73168687, 71509101, 66442626, 60667371, 56311857, 53960836, 53528807, 54805233, 57627991, 61957744, 67461843, 72844638, 75395217, 72204728, 63643914, 53714390, 44735645, 37557354, 32217059, 28184418, 25164740, 22684023, 20538426, 18801094, 17353149, 16105833, 15050679, 14115425, 13430431, 12775421, 12307474, 11927704, 11470479, 11008873, 10622480, 10146454, 9752879, 9343225, 8904172, 8508667, 8197625, 7921275, 7569231, 7166697, 6859841, 6627838, 6423162, 6226568, 6113121, 5980124, 5804148, 5739154, 5574060, 5408679, 5405117, 5292997, 5135471, 5009565, 4832265, 4897600, 4668966, 4502978]
5485D502978j47459j34263q9710k1400l1169p0504q8151k19146M526j20012j70612
5474C415078j00791j41038l2299j2320j14871m777n4954O3749r3881J072l1927
5463B893041j93061n8204q0806m0607p657m1428M5244j03388n5744J9792j0014
5452B367168j4901r5750Q2223j56233p3706M0389k559K2388j41406j36489p8648
5441A812476K9329M7259j4271j10005r961k6405l7987n2824l6008j6759N3790
5430A638634k1172l0779M5313K1178p4587l9688K1609r500k0776p2672p6730Q9603
5418A470433N9112n7637p1568k2616M7076j16216k8590k6214L6652j0292N5721
5407A335861j6004J05969N5334j63438l620J2489M8714j5982O2079r4970n019
$$ y = [4502978, 4355519, 4221256, 4131546, 4110146, 4078977, 4008473, 3920322, 3701176, 3705702, 3585690, 3415078, 3314287, 3173249, 3140950, 3128630, 3013759, 3008982, 2954028, 3017777, 2923896, 2924968, 2893041, 2699980, 2641776, 2560970, 2520363, 2512706, 2471278, 2516522, 2413134, 2357390, 2377182, 2367168, 2352267, 2256517, 2338740, 2182507, 2108801, 2149190, 2146631, 2169019, 2027613, 1891124, 1812476, 1841805, 1889064, 1874793, 1764788, 1754827, 1728422, 1690435, 1637611, 1601603, 1584844, 1638634, 1617462, 1586683, 1631996, 1653174, 1578587, 1538899, 1560508, 1551008, 1530232, 1457560, 1380830, 1470433, 1529545, 1471908, 1400340, 1377724, 1424800, 1308584, 1279994, 1253780, 1290432, 1280140, 1335861, 1319857, 1425826, 1481160, 1317722, 1314102, 1326591, 1375305, 1359323, 1421402, 1326432, 1321413]
5396A321413M4668R0667l5792l3796R6952k6537p3407q8897q958P5722P931p1444
5384A298522j861M2390J01022J3449p1793N168j4172l0954o1660O3626r7623p8932
5372A167182Q8344L3914R2422L7172M1178m4307M2195K2471M6416O957n7570j52879
5360A323495m7946j01133P7342l8271j8248P9689N0766q4304K2394J05056L5507
5349A404347J8243Q4234p2495O0660k6868j1079j35844q807J2628q3219J23596
5338A365396o8173P040Q6107L1108p958M0428L1648m8339j06060o7715j46073
5327A117409k7119l3410K321n0871k4223m1239K31L0621q3135P7909K2909k1046
5315I70357M0153m2459M6169l5120P781J1111k8722p305O7225J49853J44987k05
$$ y = [1321413, 1366081, 1456748, 1420956, 1387160, 1484112, 1457575, 1384168, 1295271, 1286313, 1362035, 1369966, 1298522, 1296661, 1339051, 1440073, 1453522, 1381729, 1386897, 1372725, 1341771, 1280111, 1343737, 1246114, 1167182, 1255526, 1289440, 1381862, 1419034, 1460212, 1415905, 1458100, 1480571, 1526987, 1533944, 1476374, 1323495, 1275549, 1174416, 1251758, 1213487, 1195239, 1274928, 1325694, 1241390, 1263784, 1368840, 1404347, 1422590, 1506824, 1434329, 1494989, 1468121, 1457042, 1321198, 1312391, 1325019, 1241800, 1365396, 1297223, 1304263, 1390370, 1421478, 1413520, 1453948, 1485596, 1437257, 1331197, 1263482, 1117409, 1090290, 1056880, 1059201, 1008330, 984107, 942868, 943099, 973720, 890585, 968494, 991403, 970357, 1010510, 968051, 1014220, 979100, 986881, 997992, 969270, 961965, 1029190, 1179043, 1324030, 1323825]
5303A323825N2767M7676r76j2512P5529j18068j04273l6622j1934k1116o8713
5292A125583m408j0766n5475K0078K0906P389N4746k8365l7322Q6086n012j5451
5280A157989N7638J61398l6217J5049k0236O9259O9147M2516q7375p0991J0864
5269A369041K5347J38730K2563n1214q780j67657J1810L008l03n7308j04101M0781
5257A221917J49252J1841n3613M47O752N1065J6964J09114N7763j4610o5856K1256
5245A512292l1658J9556j02107j1329J20858N2002O2560l5077K6150O8091n9664
5234A621674P4092r2891p544Q0568J83312L5475j5285j1627L6719Q0915J30700
5223B116108p1536m8849j5161o8471l9727L2578m616K8957j5335m1663N4021J1804
$$ y = [1323825, 1376592, 1424268, 1423292, 1410780, 1486309, 1368241, 1263968, 1227346, 1215412, 1194296, 1125583, 1121175, 1110409, 1054934, 1075012, 1095918, 1103307, 1158053, 1129688, 1092366, 1178452, 1173440, 1157989, 1215627, 1377025, 1340808, 1355857, 1335621, 1404880, 1474027, 1516543, 1429168, 1358177, 1369041, 1394388, 1533118, 1555681, 1504467, 1495687, 1328030, 1339840, 1342848, 1342545, 1285237, 1181136, 1221917, 1371169, 1383010, 1329397, 1329844, 1336596, 1387661, 1404625, 1513739, 1571502, 1556892, 1491036, 1512292, 1480634, 1500190, 1398083, 1386754, 1507612, 1559614, 1622174, 1587097, 1613247, 1681338, 1621674, 1695766, 1602875, 1595331, 1675899, 1859211, 1894686, 1879401, 1867774, 1904493, 1985408, 2116108, 2044572, 1995723, 1980562, 1912091, 1872364, 1904942, 1900326, 1929283, 1913948, 1872285, 1926306, 1938110]
5211A938110o0406Q329m5603q8676m1954j4815l2881o1082L6686L4056N4953o594
5199A720123p6661K8610k3738j1264M5134L4426n0436J22603N173j64028l9124
5188A590818J37362n2026q4490Q0531o3775J04942P7017k2063J48916m5379p2850
5177A799003n5239J03597J08654K0760L3076R2355K7803j12691L7745O6067R137
5166B130267O3597P2249J2051J9442Q4675P0886L7948j2232j8990Q4571j46232
5155B398232K9334Q7691O793J50338N3386j41791j23320J79235L7472j04627J7713
5144B590456M8574M1723O3875O1870O765L1913K1063N6021R1316J53522J69103
5133C336201J59974R2173P9212J15599K17363J87735K25068K90245L70901L26580
$$ y = [1938110, 1877704, 1886033, 1840430, 1751754, 1709800, 1694985, 1662104, 1601022, 1637708, 1671764, 1726717, 1720123, 1643462, 1672072, 1648334, 1637070, 1682204, 1716630, 1666194, 1788797, 1793970, 1629942, 1590818, 1728180, 1676154, 1591664, 1672195, 1608420, 1713362, 1790379, 1768316, 1917232, 1871853, 1799003, 1743764, 1847361, 1956015, 1976775, 2009851, 2102206, 2130009, 2017318, 2055063, 2121130, 2130267, 2193864, 2266113, 2278164, 2297606, 2382281, 2453167, 2491115, 2478883, 2459893, 2544464, 2398232, 2427566, 2515257, 2522050, 2672388, 2725774, 2583983, 2460663, 2639898, 2677370, 2572743, 2590456, 2639030, 2680753, 2744628, 2806498, 2813263, 2845176, 2866239, 2922260, 3013576, 3167098, 3336201, 3496175, 3588348, 3667560, 3783159, 4000522, 4188257, 4413325, 4703570, 5074471, 5401051]
5123E401051N74524O57095O98051L2664q75421p65624o73073m19946j86023r9904
5113D343394j21563j24350O3088m4094k9536P6596J09056K8757J6718J46739J66569
5102D631374J90483K62465M3996j81805j43816r3712j01438N698K3643L8424j0674
5091D664638L4306L2399J73802K32819J24792J10647J53867R7042J20611J09885
5081E854808K55708M3192J08006J63696K88808K28343J93569J18602J74051J10268
5071G539051Q4758J50244L74939J86462K45196M16765K74229L32560L50572L51640
5061A0306416N12736N86750P64777Q01722R99448J059183J392794J806138K248328
5052B0478292K345227K173284j18660k234243j768638j090063j98042M90831Q78652
$$ y = [5401051, 5975575, 6632670, 7330721, 7363385, 6487964, 5722340, 5049267, 4629321, 4443298, 4343394, 4221831, 4097481, 4160569, 4116475, 4086939, 4163535, 4272591, 4301348, 4318066, 4464805, 4631374, 4821857, 5084322, 5128318, 4946513, 4802697, 4708985, 4607547, 4613245, 4636888, 4675312, 4664638, 4698944, 4731343, 4905145, 5137964, 5262756, 5373403, 5527270, 5624312, 5744923, 5854808, 6110516, 6153708, 6261714, 6425410, 6714218, 6942561, 7136130, 7254732, 7428783, 7539051, 7623809, 7774053, 8148992, 8335454, 8580650, 8997415, 9271644, 9604204, 9954776, 10306416, 10819152, 11405902, 12170679, 12972401, 13971849, 15031032, 16423826, 18229964, 20478292, 22823519, 24996803, 24878143, 22643900, 20875262, 19785199, 19587157, 20077988, 20956640]
5043B0956640J389892J844485K501359L352390M439397N524900O849888Q678687
5035E5537638J1503811J3410402J1784768J477707j3556834j6767776j4052104
5028D9337612j0427864p153567m752021l120185k486541k070356j931591j884845
5020A5510642j722482j347570r31125r04855o97186m79409m65750l63725n00051
5011H098489n17367l66742l95562l95598l34811j67655k46078k6209k50678j71626
5001E226163k48151k15794p4054j10703j28806j62653j75933j49036j47925k08151
4991C604957p6988J4766k5072O758l7297q8902m7979l7277j15200l7054l7949
4980C122763N7987j1574j38908n6923M5453J90n7911r8686M5436J19741j22838
$$ y = [20956640, 22346532, 24191017, 26692376, 30044766, 34484163, 40009063, 46858951, 55537638, 67041449, 80451851, 92236619, 93714326, 80157492, 63389716, 49337612, 38909748, 31756181, 27004160, 23883975, 21397434, 19327078, 17395487, 15510642, 13788160, 12440590, 11509465, 10604610, 9907424, 9428015, 8962265, 8598540, 8098489, 7581122, 7214380, 6818818, 6423220, 6088409, 5920754, 5674676, 5648467, 5397789, 5226163, 4978012, 4762218, 4688164, 4577461, 4448655, 4286002, 4110069, 3961033, 3813108, 3604957, 3527969, 3542735, 3517663, 3524421, 3487124, 3398222, 3350243, 3312966, 3197766, 3160712, 3122763, 3180750, 3169176, 3030268, 2973345, 3018798, 3018988, 2961077, 2862391, 2907827, 3027568, 2904730]
4969B904730O7028J1484j14946K2588N7523L3799l2160l4913N118p2444k009r8382
4957B747416m7283k7304P5713N7031j7730N5201J03763p2919o3808j6590q311
4946B785179n9861J55490l4414n3177j6884l9754N4100J48371p3147K944N4957
4935B923804j6096q3948j8988O1257l2615R9344L648j9631P9974n7760N2037j16668
4923B874358p8424j0427n0267n3909L5107N1343J882J96376l1324j16756m5364
4912B772595r9871j9572l3375J9988J23232J88622R4783J59958P2993K03217L22755
4901C805325M02046L82233p564l68989k90661k55519k54842k00773O746j07988
4891C110014L130j49824J6609N5502n7540N903Q3233J26431J103K0078k6448o6066
$$ y = [2904730, 2971758, 2983242, 2868296, 2890884, 2948407, 2982206, 2950046, 2915133, 2920251, 2847807, 2845798, 2747416, 2700133, 2672829, 2748542, 2805573, 2787843, 2843044, 2946807, 2873888, 2810080, 2793490, 2785179, 2725318, 2880808, 2846394, 2793217, 2776333, 2736579, 2790679, 2939050, 2865903, 2868847, 2923804, 2907708, 2823760, 2804772, 2866029, 2833414, 2932758, 2936406, 2916775, 2996749, 2938989, 2991026, 2874358, 2795934, 2785507, 2735240, 2681331, 2716438, 2767781, 2769663, 2966039, 2934715, 2817959, 2772595, 2672724, 2653152, 2619777, 2639765, 2762997, 2951619, 3046402, 3206360, 3279353, 3482570, 3805325, 4207371, 4589604, 4582040, 4213051, 3922390, 3666871, 3412029, 3211256, 3218002, 3110014, 3113144, 2963320, 2979929, 3035431, 2977891, 2983794, 3067027, 3193458, 3194561, 3214639, 3188191, 3122125]
4879C122125q0396l2435j38Q24K47840J2803Q242J9947K1077P0303k5571M1437
4867C406058J6336L3562R3734R6647j6408k0788J6011M5467L2726j2915M8396
4856C738826J07180O2812n3712J2356J89299M9172N8107L5767J12621K3786M4789
4845D381003J93264Q3472J47930N3774J5245L3362R8232O2489K7829n6921j6205
4834E023474J56621J39785N6382N5889j2218J56038K0355p0783J20308J09942
4824E755793O2220J79871J094J11948J02437J3908J88632K16684J33934J59594
4814F926115J71279J71154K06844K6662J29347R3805J4532J22867J08851K8454
4804G999910J26663q753K0729N4502P4189k7810Q7346J6281K15987n5068r7423
$$ y = [3122125, 3041729, 3009294, 3009156, 3009980, 3257820, 3270623, 3278865, 3298812, 3319889, 3390192, 3364621, 3406058, 3422394, 3455956, 3549690, 3646337, 3629929, 3609141, 3625152, 3670619, 3703345, 3690430, 3738826, 3846006, 3908818, 3855106, 3867462, 4056761, 4105933, 4164040, 4199807, 4312428, 4336214, 4381003, 4574267, 4657739, 4805669, 4859443, 4874688, 4908050, 5006282, 5068771, 5096600, 5039679, 5023474, 5180095, 5319880, 5376262, 5432151, 5419933, 5575971, 5596326, 5525543, 5645851, 5755793, 5818013, 5997884, 5998978, 6110926, 6213363, 6227271, 6415903, 6632587, 6766521, 6926115, 7097394, 7268548, 7475392, 7502054, 7631401, 7725206, 7739738, 7862605, 7971456, 7999910, 8126573, 8117820, 8138549, 8193051, 8267240, 8239430, 8326776, 8343057, 8559044, 8503976, 8406553]
4793H406553o8926R2752K6457J57806M9924L11792K70558K93708J81604K26596
4783I948824q0538n9509j14095J02544Q2002L18140J41627L25773K97220L56843
4773A1318831L06982L50418L41902L85102L49274M41511K96961L49681M08647
4764A4549309O17019M84230N95963P13763P82603P58657Q26385M20252N39992
4755B0288173O16732R08586P37877P51493P39665N73203N59702N93846N95819
4746B6365096O13905N99571Q09838R46261J161404J052508J240084J090225J016142
4737C4895034J092452J230533J219833Q70819O68275R79447J152276J551983J957270
4728D5617922K321217K884784L139533L503633M145671M816889N312614O185107
$$ y = [8406553, 8337627, 8430379, 8456836, 8614642, 8664566, 8976358, 9246916, 9540624, 9722228, 9948824, 9868286, 9808777, 9694682, 9797226, 9879228, 10197368, 10338995, 10664768, 10961988, 11318831, 11625813, 11976231, 12318133, 12703235, 13052509, 13494020, 13790981, 14140662, 14549309, 15166328, 15650558, 16246521, 16960284, 17742887, 18501544, 19327929, 19748181, 20288173, 20904905, 21813491, 22551368, 23302861, 24042526, 24615729, 25175431, 25769277, 26365096, 26979001, 27578572, 28388410, 29334671, 30496075, 31548583, 32788667, 33878892, 34895034, 35987486, 37218019, 38437852, 39308671, 39976946, 40956393, 42108669, 43660652, 45617922, 47939139, 50823923, 53963456, 57467089, 61612760, 66429649, 71742263, 77927370]
4720G7927370P949320R939884J2416731J6206646K1395782K6949774L1603751
4713B04389258L9900764N4443196O8550197O7792027K9759678n9647345r1078052
4706C14109723p5593203n7416195l7607019k5975947j7322126j3736443j0689496
4699G5769294r246489o985677n961466m635707l954799l033499l107566k208800
4691C6635291j830847j389357j834419j795906k088567j792172j921760j560336
4683B2421927j371375p11279q83463q51650r74770o50186r22443n86378p50414
4674A4719969o65487q04433m44682n91990m19676n66079k68206m41322k57180
4665A0260914j21529r5609k75086l08247m76833j85064k48374o6879k41233p1903
$$ y = [77927370, 85876690, 95816574, 108233305, 124439951, 145835733, 172785507, 204389258, 244290022, 298733218, 367283415, 435075442, 464835120, 405187775, 314109723, 238516520, 181100325, 143493306, 117517359, 100195233, 86458790, 75769294, 66522805, 59537128, 53575662, 48939955, 44985156, 41951657, 38844091, 36635291, 34804444, 33415087, 31580668, 29784762, 27696195, 25904023, 23982263, 22421927, 21050552, 20339273, 19455810, 18604160, 17629390, 16979204, 16056761, 15470383, 14719969, 14054482, 13250049, 12805367, 12213377, 11793701, 11227622, 10959416, 10518094, 10260914, 10139385, 10043776, 9768690, 9460443, 8983610, 8798546, 8550172, 8483293, 8242060, 8170157]
4655H170157l3948j9613l083j79052k04980m8289r4880K57110l9930j56957j91828
4644G454707j09167k87984j06098k27679k44036j84127k79536n52164k30404k62044
4634D971468k03965l8799n2330l8377O0176J37006M5303k78819k39734j02853
4624D259076p7560r1743j43479m6184j23916j85566j01509r2699q8116j38708
4614C169596r5751j21938K5595k0315k2761p0402q5831N6261j8859R1234J31466
4603C038295L0219l6730J26972N2410l5772R3879J8822J40856K43840J45923l3623
4592C785091l67485j34101l23147k32703j40310o5032j7915o3239j60951j53969
4582B126239j72444R839o9404l6101j6126Q9407J2921j2765j5749j5316j00605
$$ y = [8170157, 8136209, 8116596, 8113513, 7934461, 7729481, 7681192, 7586312, 7843422, 7803492, 7646535, 7454707, 7345540, 7057556, 6951458, 6723779, 6479743, 6295616, 6016080, 5463916, 5233512, 4971468, 4767503, 4728704, 4676374, 4637997, 4698173, 4835179, 4880482, 4601663, 4361929, 4259076, 4181516, 4089773, 3946294, 3900110, 3776194, 3590628, 3489119, 3396420, 3308304, 3169596, 3073845, 2951907, 2977502, 2957187, 2934426, 2864024, 2778193, 2834454, 2815595, 2906829, 3038295, 3068514, 3031784, 3158756, 3211166, 3175394, 3269273, 3288095, 3428951, 3672791, 3818714, 3785091, 3417606, 3283505, 2960358, 2727655, 2587345, 2522313, 2504398, 2441159, 2280208, 2126239, 1953795, 1963634, 1894230, 1858129, 1842003, 1931410, 1944331, 1931566, 1915817, 1900501, 1799896]
4571A799896O5431q3460O6895L963l3161K0148j8350r4150N8155L8643J7170j0169
4559A831011K2765J4236J3991o4260l3030k3683j43960j15548r640N6351J20648
4548A668881r9717k2762l8873l0121O2617J97664J4735j13553j2331j13721j25916
4537A386903J073l7048L6507l3048Q881J29809n2561r8314J25714J1972r5052
4526A384836o8222o9677l3657m4026M456L2011M1336R5375k0240Q8796J2919l6055
4514A387852P7986M0183O7571O565j1408n2461j08397K5671m7741k5780k2865
4503A337176m6685O9115j1961m8143n8834k5629K1143P3574M0761K3144M8463
4492A422124r8142K2889J06639o9416J33729M4421j19479J0603l6925L3761K1893
$$ y = [1799896, 1865327, 1781867, 1848762, 1852725, 1819564, 1839712, 1821362, 1727212, 1785367, 1824010, 1841180, 1831011, 1853776, 1868012, 1882003, 1817743, 1784713, 1761030, 1617070, 1501522, 1491882, 1548233, 1668881, 1569164, 1546402, 1507529, 1477408, 1540025, 1737689, 1752424, 1638871, 1626540, 1512819, 1386903, 1387976, 1350928, 1387435, 1354387, 1363268, 1493077, 1440516, 1342202, 1467916, 1479888, 1384836, 1316614, 1246937, 1213280, 1169254, 1173710, 1205721, 1247057, 1342432, 1322192, 1410988, 1423907, 1387852, 1465838, 1506021, 1573592, 1580157, 1568749, 1516288, 1407891, 1433562, 1385821, 1360041, 1337176, 1290491, 1359606, 1347645, 1299502, 1240668, 1215039, 1236182, 1309756, 1350517, 1373661, 1422124, 1323982, 1346871, 1453510, 1384094, 1517823, 1562244, 1442765, 1453368, 1416443, 1450204, 1472097]
4481A472097l7419l1635L7130p1566N484P0811o5683k7337O3689J20949o8444
4470A468076r7616J2414J21317m6130M953o382P1006J14440K481N7443M0532J55458
4458A897992p1987n1207J8990m6660Q542J0266J12011L1849J15949P1890J62791
4447B260426N5387k061k341l2079j20147q2823K1359o4023o2040J45517j29300
4436A987875P6364J58750J07982M9734N6044Q9486K23839J94879K68461K21096
4426C434510L78502M71638M52826K32537l16688n05649m93757m23201l44770k15163
4416B670785r7312p361j8754p468m6238m7868j67052n6762n7949k3247P9121k891
4404B217004J7745m0846l3067R7765O3788N8126R0105Q4654J56799K51846K63889
$$ y = [1472097, 1434678, 1403043, 1440173, 1368607, 1374091, 1444902, 1379219, 1351882, 1415571, 1536520, 1468076, 1370460, 1382874, 1504191, 1458061, 1463014, 1456632, 1527638, 1642078, 1644559, 1702002, 1742534, 1897992, 1826005, 1774798, 1793788, 1747128, 1755670, 1765936, 1877947, 1909796, 2025745, 2097635, 2260426, 2315813, 2313752, 2311411, 2279332, 2159185, 2076362, 2097721, 2033698, 1971658, 2117175, 1987875, 2064239, 2222989, 2330971, 2380705, 2436749, 2526235, 2750074, 2944953, 3213414, 3434510, 3813012, 4284650, 4737476, 4970013, 4653325, 4147676, 3653919, 3230718, 2885948, 2670785, 2573473, 2566112, 2547358, 2539890, 2493652, 2445784, 2278732, 2221970, 2164021, 2140774, 2219895, 2217004, 2234749, 2193903, 2160836, 2258601, 2322389, 2380515, 2470620, 2555274, 2712073, 2963919, 3227808]
4393C227808M32733K08145j70708l18290k94073m02911l41714j40028j54987L716
4383B049691K6874j17969K7743q107r2040l0240M9901l9103n1928K35445l4362
4372B015905J34995J91334J1672K34589K64247J70677L29850J44332k44575m34240
4362B818786k41959k04965j49525k02531j46981j25781j12156m972k7131j26732
4352A476053k2259K4930k8267j8641p8247m3772O6605k4078N005q234O5202p2084
4340A342213q9545j6037n8996k925k3750Q3478K8681M0476J1527k242o5853r0966
4328A156061p7072P6235M4530J30445n9393m5884J11925k2621M6979M5645p0209
4317A336641j67870k9627O0552J3417J07224q4750N9837k2408Q9436J9793j2341
$$ y = [3227808, 3660541, 3868686, 3697978, 3379688, 3085615, 2682704, 2340990, 2200962, 2045975, 2049691, 2076565, 1958596, 1986339, 1978232, 1886192, 1855952, 1905853, 1866750, 1814822, 2050267, 2015905, 2150900, 2342234, 2353906, 2588495, 2852742, 3023419, 3353269, 3497601, 3253026, 2818786, 2576827, 2371862, 2222337, 2019806, 1872825, 1747044, 1634888, 1629916, 1602785, 1476053, 1453794, 1478724, 1450457, 1431816, 1353569, 1309797, 1376402, 1352324, 1357329, 1349095, 1414297, 1342213, 1252668, 1236631, 1177635, 1174710, 1150960, 1234438, 1263119, 1303595, 1315122, 1312880, 1247027, 1156061, 1078989, 1155224, 1199754, 1330199, 1270806, 1224922, 1336847, 1314226, 1361205, 1406850, 1336641, 1168771, 1139144, 1199696, 1213113, 1320337, 1235587, 1295424, 1273016, 1362452, 1382245, 1369904]
4306A369904q6142n967J08627N4468j00477k8017j2119R8351k3259o5133l9400
4295A270836M9676N549R035L2670J8233P560m475j4086q1334L453J9052P0902
4283A387071P018m9118p190J1220l6003N5806L0436q4359q288L4703K7661P795
4271A376752j3594m5060J919Q702N9433N2619p4910l852n3022K1205J156Q103
4259A339451M1599l7285J8909J06020R0330j10735J28367k9289R0M9191O2528
4248A659176O9897q4738k5563o8752R2360K0270P3578M3145Q3690K5646K4455
4237A913164M8717k1752K7229m0829J3065l3035n0228o6982J15696O8357p7441
4226A895961l0482j02695O6335k0683J52086M5953l5923r80J13790r4332J8030
$$ y = [1369904, 1283762, 1277795, 1386422, 1440890, 1340413, 1312396, 1300277, 1398628, 1375369, 1310236, 1270836, 1320512, 1326061, 1335096, 1367766, 1385999, 1393559, 1389084, 1374998, 1293664, 1297117, 1316169, 1387071, 1394089, 1344971, 1337781, 1349001, 1312998, 1368804, 1399240, 1314881, 1306593, 1341296, 1368957, 1376752, 1363158, 1318098, 1320017, 1328719, 1388152, 1440771, 1365861, 1362009, 1308987, 1330192, 1331348, 1339451, 1381050, 1343765, 1362674, 1468694, 1559024, 1448289, 1576656, 1547367, 1547457, 1596648, 1659176, 1729073, 1644335, 1618772, 1550020, 1642380, 1662650, 1736228, 1779373, 1863063, 1888709, 1913164, 1961881, 1940129, 1967358, 1926529, 1939594, 1906559, 1856331, 1789349, 1905045, 1973402, 1895961, 1865479, 1762784, 1829119, 1808436, 1960522, 2006475, 1970552, 1969572, 2083362, 1989030, 2007060]
4215B007060R43l4303J40487O5481L5919O1407L8661p5282R9069m7444r8236j2327
4203B181435Q3927K4549N7178l1779o1454k2581o410J01536R532L3581k0578Q235
4191B357171K7093j2257j935O4923l6642R8096o7973L3250M6382j5513N9573L2507
4179B584675m5368K2903m232J50560O9338m4905q3026L8078J5904j1633J22198
4168B814492R890O136j8565m4854k5404J48202J2670j6955L1201P9660P6965m7519
4156C025919j9931N4628J14848l9646m3365J20115N6955n4828p1263P3097n4422
4145C162107R9852P5899o514l1104N9333K4528M489j1175K075l7690l55J09162
4133C450607j1587R8201o2096n3335j1905M1441J45602P5213k5499O7855j00043
$$ y = [2007060, 2008003, 1973700, 2114187, 2179668, 2215587, 2276994, 2315655, 2240373, 2339442, 2291998, 2193762, 2181435, 2265362, 2289911, 2347089, 2315310, 2253856, 2231275, 2224865, 2326401, 2335933, 2369514, 2348936, 2357171, 2384264, 2372007, 2370072, 2434995, 2398353, 2496449, 2428476, 2461726, 2508108, 2492595, 2552168, 2584675, 2539307, 2562210, 2557978, 2708538, 2777876, 2732971, 2649945, 2688023, 2703927, 2692294, 2814492, 2824382, 2830518, 2811953, 2767099, 2741695, 2889897, 2902567, 2885612, 2916813, 2996473, 3073438, 3025919, 3005988, 3060616, 3175464, 3135818, 3092453, 3212568, 3269523, 3214695, 3143432, 3216529, 3162107, 3261959, 3337858, 3331344, 3300240, 3359573, 3384101, 3388590, 3377415, 3379490, 3341800, 3341445, 3450607, 3439020, 3537221, 3475125, 3421790, 3409885, 3451326, 3596928, 3672141, 3646642, 3714497, 3614454]
4122C614454O9083N2595j2345n698q419Q5137m1581Q887J27668M3051M6601J06092
4110D085525L9405J7192M0213R4643P6868O2377N286N5676n0564k9344L6572L5608
4098D469457n1233j5245K8769J08959J56254P3509l4285M0871O1684L0296J48372
4087E017408P4553O8120Q6857K15900J26896p691J78814J95805J27810Q0589K94470
4076F459531J68496L05622M92032K27495o1145j18076j62527k19855j34058L739
4066F961254Q4053J45917K19813K25324L12172L46221K14993K87627k6607m0406
4056H730361K2085K0583N509p1060R8378P1105J90776K53093K87436M69507O56228
4045A0734001Q40613O53101L83182l21257j021484r48679p37428n42738j97392
$$ y = [3614454, 3683537, 3736132, 3723787, 3718089, 3709670, 3794807, 3753226, 3762113, 3889781, 3932832, 3979433, 4085525, 4124930, 4142122, 4182335, 4276978, 4353846, 4416223, 4421509, 4477185, 4426621, 4397277, 4433849, 4469457, 4418224, 4402979, 4431748, 4540707, 4696961, 4770470, 4736185, 4777056, 4838740, 4869036, 5017408, 5091961, 5160081, 5246938, 5462838, 5589734, 5582043, 5760857, 5956662, 6084472, 6165061, 6459531, 6628027, 6933649, 7425681, 7653176, 7592031, 7473955, 7311428, 7091573, 6957515, 6961254, 7045307, 7191224, 7411037, 7636361, 7948533, 8294754, 8509747, 8797374, 8770767, 8730361, 8752446, 8773029, 8778538, 8707478, 8805856, 8876961, 9067737, 9320830, 9608266, 10077773, 10734001, 11574614, 12227715, 12610897, 12289640, 11268156, 10319477, 9582049, 9039311, 8841919]
4036H841919j297m5110j36580k2942J0587K4294J44677P2291O7935R753k15327
4025H750200k78557k59997k77038l02059k29339J4068J10804P7996K51299J58931
4015H016308J47087J71635k760j61444l67682l90818k78024k02744j36377p8189
4005F716992j6825l7241p1949l1331n2029q3498o09P9384k6285o1822n0775p8312
3993F285700K6720N1112R3612R385Q717J42556o4218l5830J33251J84670j7631
3982F818044k1070N4985L5510m4365M4013J9222M0072Q5445P4604P0198K2961
3971G199619L1806J36003r269q1208J26564K1948P5692J19210K411j7308O6250
3960G671718L2742n147Q7636J52002q1853n6272r907O4852J74075K2716J03819
$$ y = [8841919, 8840622, 8795512, 8658932, 8635990, 8646577, 8670871, 8815548, 8887839, 8955774, 8965527, 8750200, 8471643, 8211646, 7934608, 7632549, 7403210, 7417278, 7528082, 7606078, 7857377, 8016308, 8163395, 8335030, 8332270, 8170826, 7803144, 7412326, 7134302, 6931558, 6795181, 6716992, 6700167, 6662926, 6590977, 6559646, 6507617, 6424119, 6423510, 6502894, 6476609, 6414787, 6364012, 6285700, 6312420, 6363532, 6457144, 6466529, 6475246, 6617802, 6553584, 6517754, 6651005, 6835675, 6818044, 6796974, 6851959, 6887469, 6843104, 6887117, 6906339, 6946411, 7031856, 7106460, 7176658, 7199619, 7231425, 7367428, 7358159, 7276951, 7403515, 7425463, 7501155, 7620365, 7622776, 7605468, 7671718, 7704460, 7699313, 7786949, 7938951, 7857098, 7800826, 7790919, 7855771, 8029846, 8052562, 8156381]
3949H156381J4525L6842l6463l3851J4457j8344O4470J69784O6414k0687J6320
3938H429848L8964N5120O4776m903j787K2354J14051L442P7K0972J8435q1894
3926H679455M6245m410J23638m5572q3878Q4625P9354J02616k1230L0916l4377
3915H957382N3249N1980j71422J13665L1899O9039R8450R9033N1377j18504K8678
3904I264826L9573k8086O1750J49029J35321k9252r2259j6804R5628Q9180m656
3893I664250L4504q8169l1687M8229Q0465N8032j6932p4933M3014R8434o48M4058
3881I858617r8880R691J5379K6008J40451q7472J4395j22946N9351O8730J02247
3870I985571o631N5200k1014l0111J22519J10590L7500n8884j3059J15054J27776
$$ y = [8156381, 8170906, 8207748, 8171285, 8137434, 8151891, 8133547, 8198017, 8367801, 8434215, 8413528, 8429848, 8468812, 8523932, 8588708, 8583805, 8582018, 8604372, 8718423, 8721865, 8721942, 8742914, 8761349, 8679455, 8725700, 8721290, 8844928, 8799356, 8715478, 8800103, 8879457, 8982073, 8960843, 8991759, 8957382, 9010631, 9062611, 8891189, 9004854, 9036753, 9105792, 9204242, 9303275, 9354652, 9236148, 9264826, 9304399, 9276313, 9338063, 9487092, 9622413, 9593161, 9500902, 9484098, 9579726, 9668906, 9664250, 9698754, 9610585, 9578898, 9627127, 9707592, 9765624, 9748692, 9673759, 9716773, 9815207, 9814559, 9858617, 9759737, 9769428, 9784807, 9810815, 9951266, 9863794, 9878189, 9755243, 9814594, 9883324, 9985571, 9978940, 10034140, 10013126, 9983015, 10105534, 10216124, 10253624, 10194740, 10181681, 10296735, 10424511]
3859A0424511L5985o503O564j6255J8284J32234K4351J24002n0432N6509J33107
3848A0882357M4997P3870P7908J5009J31325J25706J27299J23977M1350K05696
3838A1849494J24296K10882K62522K91786K76159M19533K27102L78575M40534
3829A4480883M49469O45383Q14532R69087J286615J562907J919353K136301K771851
3820B7036381K859370K046345k33866k810481l350939k955922k418840j792602
3812A8379446j265237q66359p69042n82276m92334k69397l30204j38539r4391
3803A3571667j63530k28718j25516m1733j40237R1756q6913p9345j13390L0176
3793A2714217K2281j43692j9998m0819j3669k8994n1186o2831m40j3133L7132
$$ y = [10424511, 10460496, 10453993, 10460557, 10444302, 10462586, 10594820, 10619171, 10743173, 10692741, 10749250, 10882357, 10927354, 11001224, 11079132, 11094141, 11225466, 11351172, 11478471, 11602448, 11643798, 11849494, 11973790, 12184672, 12447194, 12738980, 13015139, 13434672, 13661774, 14040349, 14480883, 14930352, 15575735, 16390267, 17359354, 18645969, 20208876, 22128229, 24264530, 27036381, 29895751, 31942096, 31708230, 28897749, 25546810, 22590888, 20172048, 18379446, 17114209, 16247850, 15478808, 14896532, 14404198, 14134801, 13804597, 13666058, 13571667, 13408137, 13179419, 13053903, 13012170, 12871933, 12963689, 12876776, 12797431, 12684041, 12714217, 12736498, 12592806, 12572808, 12531989, 12518320, 12489326, 12438140, 12375309, 12374869, 12361736, 12398868]
3782A2398868L4473n1926P4893p439p4985O2475P4714J2678P4754M625J28051
3771A2731181K5786J08972L4175R7334L1711M888P2201K0916k5810l1991Q13J70595
3759A3240771j3022r4476k7580j07966O4932k5673N1052m975K5570Q4552j1799
3748A3181386O0897J3226N8892n5340Q4037J64016J21232J29558R8771M5723J16647
3737A4019045k6171J0604O1631K1282O3310Q9823k7189J11896j52447Q523J66459
3726A4346766l3521j9865P5954R1126P7516J909l0158J13283J17358L33Q7394
3715A4828095Q2428R6704L2087K41512J80553R7077J78863J40194O2197J37489
3705A6077199J36809J16312K9324J31763R0601Q6075J44225K03627R6878R9347
$$ y = [12398868, 12433341, 12381415, 12456308, 12448869, 12373884, 12436359, 12511073, 12523751, 12598505, 12603130, 12731181, 12756967, 12865939, 12900114, 12997448, 13029159, 13034047, 13106248, 13127164, 13101354, 13069363, 13070176, 13240771, 13227749, 13133273, 13105693, 12997727, 13062659, 13036986, 13088038, 13083063, 13108633, 13193185, 13181386, 13242283, 13255509, 13314401, 13259061, 13343098, 13507114, 13628346, 13757904, 13856675, 13902398, 14019045, 13992874, 14003478, 14065109, 14086391, 14149701, 14239524, 14212335, 14324231, 14171784, 14180307, 14346766, 14313245, 14293380, 14369334, 14460460, 14537976, 14539885, 14509727, 14623010, 14740368, 14740701, 14828095, 14910523, 15007227, 15039314, 15280826, 15461379, 15558456, 15737319, 15877513, 15939710, 16077199, 16214008, 16330320, 16359644, 16491407, 16582008, 16668083, 16812308, 17015935, 17112813, 17212160]
3695A7212160J25893J77886J40997J82053L16548K22306L56625K10139L92432
3686A9337039N72993O48466M84664P89462R15621R98100Q64040L61321l56651
3677B4615055p64828p90193m99452m04340j57234k2257J1961J36866M21620L26997
3667B2874195M94934O78069P37791N44779p7171l71639l45426j17323j05319M3424
3657B4356314K23557K49584M19769L79279M39189O53214O35788P54846J016089
3648B9127629J227986J063991M23566m37518p67805p71742m89107j76378L5086
3639B9235708J22968K59083N38220N38081Q42123J061181J168713R33900J95018
3630C4894995p87364r19488o77028m21738j40897O5365J44848J34800J96327L35151
$$ y = [17212160, 17338053, 17515939, 17656936, 17838989, 18155537, 18377843, 18734468, 18944607, 19337039, 19910032, 20558498, 21043162, 21832624, 22748245, 23746345, 24610385, 24971706, 24615055, 23850227, 23060034, 22560582, 22156242, 21999008, 21976751, 21988712, 22125578, 22547198, 22874195, 23369129, 24047198, 24784989, 25329768, 25252597, 24880958, 24535532, 24418209, 24312890, 24356314, 24579871, 24829455, 25249224, 25628503, 26067692, 26720906, 27356694, 28111540, 29127629, 30355615, 31419606, 31843172, 31405654, 30637849, 29866107, 29377000, 29200622, 29235708, 29358676, 29617759, 30155979, 30694060, 31536183, 32597364, 33766077, 34699977, 34894995, 34107631, 33188143, 32511115, 32089377, 31948480, 32013845, 32158693, 32293493, 32489820, 32824971]
3620C2824971M26449N03839M54733O53640P25193O85898O15792L74613j09061
3611C7156067q1851n5158M0137L45075L83082M33079L37724N89176P00624Q95116
3601D0743071Q25759P48875M81356j60703j84649L2537J30690L25445N22768N44629
3591D4009778M89791N48043P70458P37930O79097P82404Q56024Q00079Q73856
3582E0547460R74514R66229R00451R52925J119669J137930R75767R28002J102324
3573E9605271R63082J056488J012737R84395J130009J164218J068013J086344
3565F8070557J116612J333934J236374J225373J337630J434896J394172J505199
3557G8654747J501368J590046J790198J775670J672843J869726K078040K249006
$$ y = [32824971, 33251420, 33755259, 34209992, 34863632, 35588825, 36274723, 36890515, 37265128, 37156067, 37074216, 37019058, 37059195, 37404270, 37787352, 38220431, 38558155, 39147331, 39847955, 40743071, 41568830, 42317705, 42799061, 42638358, 42453709, 42486246, 42616936, 42942381, 43465149, 44009778, 44499569, 45047612, 45818070, 46556000, 47235097, 48017501, 48873525, 49673604, 50547460, 51521974, 52488203, 53388654, 54341579, 55461248, 56599178, 57574945, 58502947, 59605271, 60568353, 61624841, 62637578, 63621973, 64751982, 65916200, 66984213, 68070557, 69187169, 70521103, 71757477, 72982850, 74320480, 75755376, 77149548, 78654747, 80156115, 81746161, 83536359, 85312029, 86984872, 88854598, 90932638, 93181644]
3549I3181644K385729K627204K652224K886230L147782L461885L970388M231083
3541A18544169M735016N163408N795163O207721O825744P481056P917455Q385782
3533A71055514Q886537R138721R192163Q957974Q107451O681813M662810J768483
3525B28451466j692005n306767q611912j0756100j1501981j1095672j0144908
3518A69342121q978196p803164o946885o017687n270074m792867m157707l841413
3510A21534128l474256l113362k816723k634660k531911k300275k175449k137079
3502A00350413j994992j934399j869234j754519j766373j827990j677848j742307
3494H5782751j931020j847655j890686j919221j927188j909812j897126j791881
$$ y = [93181644, 95567373, 98194577, 100846801, 103733031, 106880813, 110342698, 114313086, 118544169, 123279185, 128442593, 134237756, 140445477, 147271221, 154752277, 162669732, 171055514, 179942051, 189080772, 198272935, 207230909, 215338360, 222020173, 226682983, 228451466, 226759461, 221452694, 212840782, 202084682, 190582701, 179487029, 169342121, 160363925, 152560761, 145613876, 139596189, 134326115, 129533248, 125375541, 121534128, 118059872, 114946510, 112129787, 109495127, 106963216, 104662941, 102487492, 100350413, 98355421, 96421022, 94551788, 92797269, 91030896, 89202906, 87525058, 85782751, 83851731, 82004076, 80113390, 78194169, 76266981, 74357169, 72460043, 70668162]
3486G0668162j667556j768535j535838j441936j468038j434612j457544j330419
3478E8563684j331554j245485j240676j150132j054827r35677p63331p16630q64221
3469D9261151q06134p75072p53038p03572p39718o25524o33006o96825n68887
3460D2959375n50661n06237n70777n07546m97166m79486l69519l51253k54745
3451C8871985l36024k06593l48880o26967n95876m70274n92870n43638m10434
3442C4740429m57536l87535m04711m30289l48288k99664k87629k97520l79431
3433C1447826j95359k25643l99999j35789k84940j71011j67975k13558j71104
3424B9482448j94510k53894k69148k68818j72890j10799j09940j11067l06644
$$ y = [70668162, 69000606, 67232071, 65696233, 64254297, 62786259, 61351647, 59894103, 58563684, 57232130, 55986645, 54745969, 53595837, 52541010, 51605333, 50842002, 50125372, 49261151, 48455017, 47679945, 46926907, 46223335, 45483617, 44858093, 44225087, 43528262, 42959375, 42408714, 41902477, 41331700, 40824154, 40326988, 39847502, 39477983, 39126730, 38871985, 38535961, 38329368, 37980488, 37353521, 36757645, 36287371, 35694501, 35150863, 34740429, 34282893, 33895358, 33490647, 33060358, 32712070, 32412406, 32124777, 31827257, 31447826, 31252467, 31026824, 30626825, 30491036, 30206096, 30035085, 29867110, 29653552, 29482448, 29287938, 29034044, 28764896, 28496078, 28323188, 28212389, 28102449, 27991382, 27684738]
3415B7684738l07947l92240l25614k99581k85230j98269k13022k00964j84469
3406B5277402j33712k72222k21460j07630j70715r3914j30910j30999j30447l01090
3396B3584303j03864R2134o9473j33413k53273j98275j4153O1488l07585j78059
3386B2479830M7584l7345j21993n1244j08820o2147o0094j22130j37356j50178
3376B1676107L6600M8103j38964j13151l530Q180q7883k03923j37835J9946r03
3365B1102747m1318n9943q3333j10707j77383j58412j75599o5583r5791k09447
3355A9925231j14093j25527p379j48071j87339j14212q9476j82436j6473j54387
3345A8785838j53721m5787p8493j32420r1973L6668k3025r1219n0438r2735r7423
$$ y = [27684738, 27376791, 26984551, 26658937, 26359356, 26074126, 25875857, 25662835, 25461871, 25277402, 25143690, 24871468, 24650008, 24542378, 24371663, 24277749, 24146839, 24015840, 23885393, 23584303, 23480439, 23572573, 23503100, 23369687, 23116414, 22918139, 22903986, 22965474, 22657889, 22479830, 22527414, 22490069, 22368076, 22316832, 22208012, 22145865, 22085771, 21963641, 21826285, 21676107, 21712707, 21760810, 21621846, 21508695, 21505165, 21513345, 21425462, 21221539, 21083704, 21103650, 21102747, 21061429, 21001486, 20918153, 20807446, 20630063, 20471651, 20296052, 20230469, 20134678, 19925231, 19811138, 19685611, 19678232, 19530161, 19342822, 19228610, 19139134, 18956698, 18940225, 18785838, 18632117, 18586330, 18507837, 18375417, 18283444, 18320112, 18297087, 18205868, 18155430, 18062695, 17965272]
3334A7965272N6959r4106m9867l5630j97482j91463n3881o5247o2903k37602j32801
3323A6901249j48436j17832j63300p1753o8493k47964j36891n5616o7899L5780
3313A5858845k0235r400j1318K5708k3557l9398P9996p3972n00R8530k0749r210
3301A5854740j2590M0265K4042M6850K5682P4343k9891O2480j43088n5068J23684
3290A6011449O1699M7104M7593Q0369L1279J42867J75159K28899R2551Q1755L580
3279A7004304L17501J39434R1087J49852J0725J25756J17303J11368L39163L17822
3269A8724315J03835N5711R7687K65621K31532K94525K84146J10864J23981K02413
3259B0494630K38445L15663Q6644J41752J31402Q8617K35311K70266J87261L06835
$$ y = [17965272, 18022231, 17928125, 17878258, 17842628, 17645146, 17453683, 17399802, 17334555, 17271652, 17034050, 16901249, 16752813, 16634981, 16471681, 16399928, 16331435, 16083471, 15946580, 15890964, 15823065, 15858845, 15838610, 15829210, 15817892, 15843600, 15820043, 15780645, 15860641, 15786669, 15786169, 15884699, 15863950, 15854740, 15842150, 15882415, 15906457, 15953307, 15978989, 16053332, 16023441, 16085921, 15942833, 15887765, 16011449, 16073148, 16120252, 16167845, 16248214, 16279493, 16422360, 16597519, 16826418, 16918969, 17000724, 17004304, 17321805, 17461239, 17552326, 17702178, 17712903, 17838659, 17955962, 18067330, 18406493, 18724315, 18828150, 18883861, 18981548, 19247169, 19478701, 19773226, 20057372, 20168236, 20292217, 20494630, 20733075, 21048738, 21135382, 21277134, 21408536, 21497153, 21732464, 22002730, 22189991, 22496826]
3249B2496826K64997L10057L63837J65305K79005L22498L89182L85984M42934
3240B5420625L74819K87075M15406M01121L70551M64909N37070N77207N30258
3231B9379041N29646P03381O55090P74252O09762Q24615P92433Q70547Q78357
3222C6017124R56520J145909J092095J112755R05315J049496J073562J032469
3214D4385245Q81515O47937N28953M33599L81390K88169L43962L91504M36526
3205D8718800P62505O96396P25382R41078J004164J107058J428127J613445J802257
3196E8799212K066420K033132K098810K243462K406629K766429K709037K715807
3188G7838938K371679J784315J173824K82012j016361k203495k930787k962692
$$ y = [22496826, 22761823, 23071880, 23435717, 23601022, 23880027, 24202525, 24591707, 24977691, 25420625, 25795444, 26082519, 26497925, 26899046, 27269597, 27734506, 28271576, 28848783, 29379041, 29908687, 30612068, 31267158, 32041410, 32651172, 33475787, 34268220, 35138767, 36017124, 36973644, 38119553, 39211648, 40324403, 41229718, 42279214, 43352776, 44385245, 45266760, 45914697, 46443650, 46877249, 47258639, 47546808, 47890770, 48282274, 48718800, 49481305, 50177701, 50903083, 51844161, 52848325, 53955383, 55383510, 56996955, 58799212, 60865632, 62898764, 64997574, 67241036, 69647665, 72414094, 75123131, 77838938, 80210617, 81994932, 83168756, 83450768, 82434407, 80230912, 77300125, 74337433]
3180G4337433k592681k044925j374220q38513k85474N2768L72408P20669J015063
3171F9362528J208459J329874J450661J568307J668245J595922J519881J519160
3163H1223037J549709J265698Q24673K54304n34724j160856j622268k119117k210889
3154G7469567k343124k697417k950280k892044k501655k139832j542375j147602
3146E9255238j005026n58556l00073j16983Q1323j1945J38759L5681j12701l53925
3136E7051792p06241r32560j103550j276402j580073j926060k214419k330828
3128D4981659k396318k264911k045600j752941j681247j578348j358618j203299
3120C0700377j112275r90404r38861q90542p05603n36854n69985m78879o46124
$$ y = [74337433, 71744752, 69699827, 68325607, 67487094, 67201620, 67254388, 67626796, 68347465, 69362528, 70570987, 71900861, 73351522, 74919829, 76588074, 78183996, 79703877, 81223037, 82772746, 84038444, 84863117, 85117421, 84582697, 83421841, 81799573, 79680456, 77469567, 75126443, 72429026, 69478746, 66586702, 64085047, 61945215, 60402840, 59255238, 58250212, 57691656, 57391583, 57274600, 57355923, 57343978, 57482737, 57518418, 57405717, 57051792, 56345551, 55412991, 54309441, 53033039, 51452966, 49526906, 47312487, 44981659, 42585341, 40320430, 38274830, 36521889, 34840642, 33262294, 31903676, 30700377, 29588102, 28597698, 27658837, 26768295, 26062692, 25525838, 24955853, 24476974, 23830850]
3111B3830850n83931m05242m42589m79550n65412m36134n46633o81720o55927
3102A9033712n76063n47819n38730m67640o21440n18339l66283l01156l78732
3093A4717510m10276l68483l37592k43785k73143l40620l72486k93752k79560
3084A1797813k68461k14550j89079j07469j55408k02208m0336n5953j35090j52429
3074A0276830j96408j59715j40319j11796j19638j87220j13196k50536j98239
3065H799763j62461j09387j96024k54943k62412o6692j50547k10489k68511m0668
3055G077629j94518k26593l2229j21106o0684m0236n9659n4309j27691j43091
3045F017513l9847o4998m8776j9991j17177j17800o9959j09520j34900r1897m0578
$$ y = [23830850, 23246919, 22841677, 22399088, 21919538, 21354126, 20917992, 20371359, 19689639, 19033712, 18457649, 17909830, 17371100, 16903460, 16282020, 15763681, 15397398, 15096242, 14717510, 14307234, 13938751, 13601159, 13357374, 13084231, 12743611, 12371125, 12077373, 11797813, 11529352, 11314802, 11125723, 11018254, 10862846, 10660638, 10620302, 10564349, 10429259, 10276830, 10080422, 9920707, 9780388, 9668592, 9548954, 9361734, 9248538, 8998002, 8799763, 8637302, 8527915, 8331891, 8076948, 7814536, 7747844, 7597297, 7386808, 7118297, 7077629, 6883111, 6656518, 6624289, 6503183, 6442499, 6402263, 6342604, 6288295, 6160604, 6017513, 5977666, 5912668, 5863892, 5843901, 5726724, 5608924, 5538965, 5429445, 5294545, 5202648, 5162070]
3034E162070j22530j35136j41494p9871j31631m2543o6280j32003m1646r4966
3024D173970j40921n684j57573j11133n3154j06862r3752m32r825r4515J3265
3013C413384j04920Q6866l0698r7089j6514m3591j20997j03047R731M1447j48426
3002B886146j04487r6378K7401l8012j5983O0465p2239K8578M5047r6362L2668
2991B656844k3610j40575j6186l9885j18551O5013Q4126q0548m1342q7423R4032
2980B351895K9362l4357o5677j6771j22463n8771P4795k6926m8179L515r1172
2969A995251K62M6559j5904L6745j3257l3869P2403j37239m5244o6590r1031j4766
2957A733320J131j4143J6437O1755N3254J1608m9395j0427P4057n5577M7296j29276
$$ y = [5162070, 5039540, 4904404, 4762910, 4683039, 4551408, 4508865, 4442585, 4310582, 4268936, 4173970, 4033049, 4027365, 3869792, 3758659, 3705505, 3598643, 3504891, 3504459, 3494634, 3400119, 3413384, 3308464, 3395330, 3364632, 3267543, 3251029, 3207438, 3086441, 2983394, 2993125, 3034572, 2886146, 2781659, 2685281, 2712682, 2674670, 2658687, 2719152, 2646913, 2675491, 2720538, 2624176, 2656844, 2633234, 2492659, 2476473, 2436588, 2318037, 2383050, 2467176, 2386628, 2345286, 2257863, 2351895, 2381257, 2346900, 2281223, 2264452, 2141989, 2083218, 2158013, 2131087, 2082908, 2086423, 1995251, 1995513, 2042072, 2026168, 2062913, 2049656, 2015787, 2088190, 1950951, 1905707, 1839117, 1748086, 1733320, 1734451, 1720308, 1736745, 1798500, 1851754, 1863362, 1813967, 1803540, 1877597, 1822020, 1869316, 1740040]
2945A740040o2181m8430o3m9082n3109J7786N6098j4215k7862J17007K3198j15650
2933A583537K8426J833j25603m0124J5238J22448m129j4289p1188N4894O0379
2922A611422j02269m023r843n5137o321o1835p5472Q8858M0506l240n2532l6829
2910A333285L3587J3199M2523J1263O4708m2504M8828K013r3019L5058K5414n7584
2898A416771M9105o2420o2149l8838O0741K2939j1568q4542J9056j15928N9873
2887A253040P6866l6666l6366L9023j11946l605P3409J18090J63q0825J8264j2138
2875A297309k8030N2374o107q3655M4806j0371L8142q8391n0399o8823N3631j9637
2863A130849r1505m7518J9361N2767R3465j80016K6960M3508N4381M2635j07457
$$ y = [1740040, 1677859, 1629429, 1629366, 1580284, 1527175, 1544961, 1601059, 1586844, 1558982, 1675989, 1699187, 1583537, 1611963, 1613796, 1488193, 1448069, 1463307, 1585755, 1581626, 1567337, 1496149, 1551043, 1611422, 1509153, 1505130, 1495287, 1440150, 1433829, 1371994, 1296522, 1385380, 1425886, 1422646, 1370114, 1333285, 1366872, 1380071, 1422594, 1433857, 1498565, 1456061, 1504889, 1506902, 1413883, 1448941, 1474355, 1416771, 1465876, 1403456, 1341307, 1302469, 1363210, 1386149, 1374581, 1290039, 1309095, 1193167, 1253040, 1329906, 1293240, 1256874, 1295897, 1183951, 1180346, 1253755, 1371845, 1372008, 1291183, 1309447, 1297309, 1269279, 1321653, 1315546, 1231891, 1276697, 1266326, 1304468, 1216077, 1165678, 1096855, 1150486, 1130849, 1039344, 991826, 1011187, 1063954, 1157419, 977403, 1004363, 1047871, 1102252, 1144887, 1037430]
2852A037430r3760R1521l2778j4310K5994l200k0446L3807J3124m8179k1392q6831
2840H80980q09p7563L293P2364J484j66038J7624l7008N4483L9923m414p8981
2828G05338L4295K1837p2594k6190K3083M4452J7353m8852k7957J6017r3813M5
2816E93014R3530L3451L7681q6727O3778L4980j37132l4044j1911N7544j1105
2805F33059q4590J6444n9809K2738o271L8279N0403j14331P4929j2309M1329J0061
2793F09932j9051K9383J24589l1030j14701k3291k3321N2659J9099q8842o214
2782E29212m703o8126j6959J22387r79m8643r8028K7842J18302l9628n1437j00493
2770C68747r3411J1345O3080j3497j6151K6536L0661K2143k606L9292m1572n9198
$$ y = [1037430, 943670, 1035191, 1002413, 988103, 1014097, 1010897, 990451, 1024258, 1037382, 989203, 967811, 880980, 880171, 802608, 805901, 878265, 879749, 713711, 731335, 694327, 748810, 788733, 784319, 705338, 739633, 761470, 688876, 662686, 685769, 730221, 747574, 698722, 670765, 686782, 592969, 593014, 686544, 719995, 757676, 670949, 734727, 769707, 632575, 598531, 586620, 644164, 633059, 548469, 564913, 505104, 527842, 521571, 559850, 610253, 495922, 570851, 558542, 599871, 609932, 590881, 620264, 744853, 713823, 599122, 575831, 552510, 605169, 624268, 535426, 529212, 524509, 456383, 439424, 561811, 560832, 512189, 414161, 442003, 560305, 520677, 469240, 368747, 275336, 286681, 349761, 336264, 320113, 346649, 377310, 399453, 396847, 436139, 394567, 335369]
2758C35369o758J31002l599n1250M8961q6753q0521j8549J96552l6656q7422l0740
2746C09636q0936O1514R127L0998m4528j0046m7679P0682Q899l9218L082l1030
2734B40501J8806L626j6037m5386m214r1016P0347M392R604k6558m5770j7301
2722A00994M9262m6244J2682j1713K0976n2235l8640K10844N8089r8269N1406
2711B57152L0116k0296K8838k7834j57556J7951P552J2111k3970M3789N7925j527
2699B24251J9049Q9679j27357p0414R6845L4862j0941j2404K8053o2520L6899
2688B46002j8894r7449k723K8803K7550K5038l5912n6472R70M9295m7800n945
2676A12463n5447M431m8952Q3682J3743L5343l3707M3264l0723p7487n6612P2335
$$ y = [335369, 328611, 459613, 456014, 404764, 453725, 366972, 286451, 267902, 464454, 427798, 340376, 309636, 228700, 290214, 299341, 330339, 285811, 275765, 228086, 298768, 307667, 268449, 271531, 240501, 259307, 262933, 246896, 201510, 197296, 106280, 176627, 181019, 190623, 164065, 118295, 100994, 150256, 104012, 116694, 104981, 125957, 73722, 35082, 245926, 304015, 205746, 257152, 287268, 266972, 295810, 267976, 110420, 128371, 135923, 148034, 124064, 167853, 225778, 224251, 243300, 332979, 205622, 135208, 232053, 266915, 255974, 243570, 271623, 209103, 246002, 227108, 129659, 126936, 155739, 183289, 208327, 172415, 115943, 116913, 166208, 118408, 112463, 57016, 61447, 12495, 96177, 109920, 145263, 111556, 154820, 124097, 46610, -10002, 62333]
2664F2333O1569L7776l098j211p6044J8839K6685O6259L2333R6800N676n9798
2652B68119L104k2054j69977j09190K4030M7308m813K3400P5957l0501N6197n8588
2640A02992r5103o9863R30Q0793O0429J8146p530j11897M0303N9902k252J5935
2628I2785l2057j8767j12737Q1071M3635M2506K9032l3987q6697j07197l0760
2617a33173K2140O2392N2569l6492k5920J10972k7007k9026O9045j29290r0706
2606a54496R1819M5883l7723k8240R4384J2164M9343p7226J41275j4680p5967
2595D6536l9345N1508k4307J7940J6652l5464n851r4420L3868M2041k5133L3470
2583A7495k0966m6245K4624J7534p1437M6608P0354R5736q0932q5168p063j37902
$$ y = [62333, 123902, 161678, 158580, 157369, 81325, 100164, 126849, 193108, 225441, 322241, 327917, 268119, 271223, 249169, 79192, -29998, -5968, 41340, 36527, 59927, 135884, 105383, 161580, 102992, 7889, -61974, -61044, 19749, 80178, 98324, 90794, -21103, 19200, 79102, 76850, 92785, 60728, 41961, -70776, 10295, 53930, 96436, 125468, 91481, 4784, -102413, -133173, -111033, -48641, 3928, -32564, -58484, 52488, 25481, -3545, 65500, -63790, -154496, -62677, -16794, -54517, -82757, 11627, 23791, 73134, -4092, 137183, 122503, 46536, 7191, 58699, 34392, 52332, 68984, 33520, 27669, -66751, -32883, 9158, -15975, 17495, -3471, -49716, -25092, -7558, -78995, -32387, 37967, 133703, 52771, -32397, -39460, -177362]
2571a77362J1056J09235j5352J54367l0193O7298j20901l3842R5658r0771l8175
2560f8982M9926k0428N7719L5913j33358n7304J6566Q1260N7449P2744M1133O758
2548A39396J4968m4449n1121O7121p5391o0980L3965O3811j76565M6284P8669
2537C5708M484K4427J55544M2162j00179l3763p4921l0942j2249N9691R3384O384
2525A69730N748m2990r261M668O4822R2386o4294k3814J19838l7797o7191L3578
2513B45423m9141n8265Q0816J1844l9379P4532J0501n8438R4990l9891p9636J1478
2501B04834j0535J18399K7337o4356J6504K4174k2526J08590K617K6394K8351
2490D59783l8974J06735Q757p5855l8446O1198P143L7630L8514j2321l2513n2115
$$ y = [-177362, -166306, -57071, -72423, 81944, 51751, 119049, -1852, -35694, 59964, -30807, -68982, -19056, -39484, 18235, 54148, -79210, -136514, -119948, -38688, 18761, 91505, 132638, 139396, 154364, 109915, 58794, 125915, 50524, -10456, 23509, 87320, -89245, -42961, 35708, 40192, 64619, 220163, 262325, 162146, 128383, 53462, 22520, 10271, 69962, 163346, 169730, 175478, 132488, 123227, 127895, 192717, 285103, 220809, 196995, 316833, 279036, 211845, 245423, 196282, 138017, 218833, 230677, 191298, 265830, 276331, 217893, 312883, 272992, 193356, 204834, 194299, 312698, 340035, 275679, 292183, 316357, 293831, 402421, 405038, 431432, 459783, 420809, 527544, 536301, 460446, 422000, 483198, 490341, 527971, 566485, 554164, 521651, 469536]
2478D69536j34621K4931J23696Q612N8972m287N0743L5887j25815l548K5582Q4881
2466F14569K2876m8200n7737R4481J2808L034L1308n0096L6603K4594k4256K9504
2454F89488m3016J20123J03785j03766L3564N4044J4626m8408J0318J32074J18528
2443A081360q3054K9932K10637J2239O2138N1484n2890J65165Q596J8404J18789
2432A622800M4626P4623P2310N7051M0506N6671O8350M4995m3690J56295J15250
2421B309787N7617P4496K55544J47180P9265P323J21607J62780M0657j5193J26796
2410C367859J71768K37283J97902J34730L02582L89012M23801L96225L66420K39037
2400F226619K57064O32119P05949P67767J224329J819463K241622K596492L211678
$$ y = [469536, 334915, 359846, 483542, 492154, 551126, 546839, 597582, 633469, 507654, 504106, 529688, 614569, 637445, 589245, 531508, 625989, 638797, 641831, 673139, 623043, 659646, 684240, 659984, 689488, 646472, 766595, 870380, 766614, 800178, 854222, 868848, 820440, 830758, 962832, 1081360, 998306, 1028238, 1238875, 1251114, 1313252, 1364736, 1311846, 1477011, 1485607, 1504011, 1622800, 1667426, 1742049, 1814359, 1871410, 1911916, 1968587, 2036937, 2081932, 2038242, 2194537, 2309787, 2367404, 2441900, 2697444, 2844624, 2923889, 2931212, 3052819, 3215599, 3256256, 3241063, 3367859, 3539627, 3776910, 3974812, 4109542, 4412124, 4801136, 5224937, 5621162, 5987582, 6226619, 6483683, 7115802, 7821751, 8589518, 9813847, 11633310, 13874932, 16471424, 19683102]
2391A9683102M492253O140676O732190L435971o082588q482044o380816m842856
2383A4695888k915260k114852j356015j130834r64164q20887n13969l32564j37689
2374D409654r1063k70328l68459l85273l14917j45149j39173k48539l55450j96976
2364A894327j22043q2420j74238j13150k7635L814j64890m0039r7407n7092l9328
2353I79899K9196R777J4493j06171j28247j8768k6542m4721l4830n7454M5753
2342F62385l3006m4216m4084q1360q139r1j00469O5159J25638P663j30275m393
2330D14812L4571k3734n9429p0516Q6828q9231l1559p196l2222m4323K8303O7333
2318B73637Q8355J1979n0544k3598j08006q0130M8376R6362K764j22638N83k8053
$$ y = [19683102, 24175355, 30316031, 37048221, 40484192, 34401604, 25919560, 19538744, 14695888, 11780628, 9665776, 8309761, 7178927, 6214763, 5393876, 4879907, 4547343, 4409654, 4318591, 4048263, 3679804, 3294531, 2979614, 2834465, 2695292, 2446753, 2091303, 1894327, 1772284, 1689864, 1515626, 1402476, 1374841, 1378655, 1213765, 1173726, 1076319, 1019227, 979899, 1009095, 1018872, 1033365, 927194, 798947, 780179, 753637, 708916, 674086, 616632, 662385, 629379, 585163, 541079, 459719, 451580, 451489, 351020, 416179, 541817, 549480, 419205, 414812, 449383, 425649, 366220, 295704, 382532, 293301, 261742, 254546, 222324, 178001, 206304, 273637, 361992, 373971, 323427, 299829, 191823, 111693, 160069, 256431, 259195, 136557, 137140, 109087]
2306A09087k1234O2712J8213o451q1342l3024r5135J6352n3309J06909J21047
2295A43825q9673J0162k6303J7544Q8731M6715j08590l0492K2160j2695n5888
2284E496M5854N7199j9390M0209K434j12546N4743P1392j47653k8759K9983j9412
2272b0450P193l2102J2088k3284l8706m9581M3961J01880N9022q02j00553l7463
2260g8797N065L7026J6012L8748K0213m6844k0502Q5911n1257j3997m5643j9494
2248g3559O5193Q048R291k8713P806r4185P602K390m761J21058j4016R075J0123
2235B5352q4110N6000N6726j10609K14P9639o0438n0771l0894l0905K2681j0927
2223a38042m5388Q4134j2157j683M3913L6078m9425k8850L5833j5755M3148j4207
$$ y = [109087, 87853, 150565, 168778, 162327, 80985, 47961, -47174, -30822, -84131, 22778, 143825, 54152, 64314, 38011, 55555, 144286, 191001, 82411, 51919, 74079, 61384, 5496, 51350, 108549, 89159, 129368, 131802, 19256, 73999, 145391, -2262, -31021, -1038, -20450, -13257, -45359, -33271, -56555, -95261, -144842, -100881, 999, 60021, 59219, -41334, -78797, -73732, -36706, -20694, 18054, 38267, -8577, -29079, 56832, 5575, -8422, -54065, -73559, -8366, -318, 8973, -19740, -11934, -106119, -98517, -96127, -100888, 20170, 6154, 15229, 25352, -58758, -2758, 53968, -56641, -56427, 23212, -37226, -87997, -118891, -149796, -127115, -138042, -183430, -99296, -111453, -113136, -69223, -33145, -82570, -111420, -75587, -91342, -48194, -62401]
2211f2401J9407k2647P5096j33550M3314O4546L1232l0530Q025J5141K3315j5731
2199A5217k7821J9836n4453K5444q3232M18L1353j7432l3498Q7086J581l229k8032
2186f6762j00246m0813N9253n432P9058N2728m054j38057q0683R7791j8220M5046
2174a20391q3367N9844L0142l4812K8992k2931m2657P281R0223N2161J6184j15859
2162a35190o932M5317m5460J2671L0010q6809K1091M4870R8642m6748m5363o51
2150a14552m9713Q7336M9708o7100r471j1634r26M3111O71o0470n8922o205J45925
2137e2242J4649o1322R5742l7851L3362j4831P299M7340l6005l9546m130m6187
2125i3722j05212P8184J99083O844m7138Q1155l3329M8473L2848n764j30462l278
$$ y = [-62401, -42994, -65641, 9455, -124095, -80781, -16235, 14997, -15533, -7508, 7633, 30948, 15217, -12604, 7232, -47221, -21777, -105009, -104591, -73238, -90670, -124168, -37082, -35501, -38730, -66762, -167008, -207821, -148568, -154000, -74942, -22214, -26268, -164325, -245008, -147217, -165437, -120391, -203758, -143914, -113772, -148584, -119592, -142523, -185180, -177899, -87676, -35515, -19331, -135190, -142122, -96805, -142265, -129594, -99584, -186393, -165302, -120432, -21790, -68538, -113901, -114552, -164265, -76929, -27221, -94321, -103792, -115426, -116352, -73241, -72570, -133040, -191962, -198167, -52242, -37593, -98915, -3173, -41024, -7662, -22493, -15194, 32146, -3859, -43405, -47535, -93722, -198934, -120750, 78333, 85177, 38039, 119194, 85865, 134338, 167186, 161422, 30960, 27682]
2113B7682O8409j62702j5765K2400k5508j2994K8257M8917n2457J6079N2975o9146
2101g3853r9716j1461Q0353K9329K7040j5024l6560m9837k713k9595R5758P051
2089g9228j54626O724J32171m9208k1269L9042k3227J0217R174p4818J541L5348
2077a68159P2337M5416k24K0954k353K1699o2069o8837m8003K1681k2775R5490
2065i4843J9284K9593p6363J2574N6749K1463q3935n8092L3537K1033N5317N9581
2053d102o3457M4177j5689m4170l8618L8498O8541o969K251k2062m7483k5225
2041a14308J95430J4551m5412j36145O3524k0602k5876M9073k1903q4784m9244
2030a75696m6264L6872M0262j1592K7499O1899K0560J5408k6020o1842l829O3069
$$ y = [27682, 96091, -66611, -82376, -59976, -85484, -98478, -70221, -21304, -73761, -57682, -4707, -73853, -173569, -185030, -104677, -75348, -48308, -63332, -99892, -149729, -152442, -182037, -86279, -79228, -233854, -227130, -94959, -144167, -165436, -126394, -149621, -139404, -130230, -205048, -203507, -168159, -95822, -50406, -50630, -29676, -32029, -10330, -72399, -141236, -189239, -167558, -190333, -94843, -75559, -45966, -122329, -109755, -53006, -31543, -115478, -173570, -140033, -119000, -63683, -4102, -67559, -23382, -39071, -83241, -121859, -83361, -14820, -21789, -19538, -41600, -89083, -114308, 81122, 95673, 50261, -85884, -22360, -42962, -68838, -19765, -41668, -126452, -175696, -221960, -185088, -144826, -156418, -128919, -67020, -46460, -31052, -57072, -118914, -122743, -59674]
2018e9674m4573N5460o4033J4589j510m5531J25748l5156K185p7986n0706N1757
2006a29430J8438o6139N3246Q8304p8438n0072P050j06303O4969J8803K8404m5647
1994a96815j10584J64104P7808o6626N420m0132J36640p7388p3837k0749k25J6613
1982a85771L2448J06206j2791o4646j5212R2561J10565O6647j13710j33257k9315
1971a46275J85320J9780o4861K1479m4700l3399j21779l4836Q2898o5242J08340
1960i3275l9358q0055L4678j8903J15278J60623p6947j03294m541J9414m7853
1949a34233o9606l8N3728j0007K6602J3127K415k2251L8164k599K1587M7553l6139
1936g1697j24802P5786N6725l0779j2364p0671K863r457J12854p7783K9802R3102
$$ y = [-59674, -104247, -48787, -112820, -98231, -99741, -145272, -19524, -54680, -52495, -130481, -181187, -129430, -110992, -177131, -123885, -35581, -114019, -164091, -157041, -263344, -198375, -179572, -151168, -196815, -307399, -143295, -65487, -132113, -126693, -166825, -30185, -107573, -181410, -202159, -202384, -185771, -153323, -47117, -59908, -124554, -139766, -47205, 63360, 130007, 16297, -116960, -146275, 39045, 58825, -6036, 15443, -29257, -62656, -184435, -219271, -136373, -201615, -93275, -132633, -212688, -178010, -196913, -81635, 78988, 2041, -101253, -105794, -86380, -134233, -203839, -203877, -150149, -160156, -133554, -120427, -118012, -140263, -102099, -104698, -83111, -35558, -71697, -196499, -120713, -63988, -94767, -107131, -177802, -174939, -184396, -71542, -149325, -119523, -26421]
1924b6421n5925R7091M853j11325K0771J3643m9459j01897R4101M2341N553K7583
1912c9091R5892p4745j33857L6017J03465l164m4050N2156r251K8545L434l7286
1900b1935q389J1855N8034O8914q87j56785n8492Q0825k7144l646j3716j31237
1888b02603L1765J01777J9104R7628j10029k3142N0881J21725R2278p6476r7603
1877E305j50716N4824K6628j8377o9308O4197N2292p4858K5830j8924m3595N465
1865a41237O330P6643o4633K6399k2847L8705O7160p757O251m9993K4944j6466
1853e6501P7611p1118k071K9474q3490K1161K2219l7668n1472N2993J2121J5562
1841g1179L5000L1184J8820o304q0732k964K2416j3374P6427l2931j02336K4376
$$ y = [-26421, -82346, 14745, 19598, -91727, -70956, -57313, -106772, -208669, -114568, -72227, -66674, -39091, 56801, -17944, -151801, -115784, -12319, -15483, -59533, -7377, -16628, 11917, 15351, -21935, -30324, -18469, 39565, 108479, 107592, -49193, -107685, -26860, -54004, -57650, -71366, -202603, -170838, -69061, -49957, 47671, -62358, -85500, -34619, 87106, 179384, 102908, 5305, -145411, -90587, -63959, -82336, -151644, -87447, -35155, -110013, -84183, -103107, -146702, -141237, -134907, -58264, -122897, -96498, -119345, -80640, -13480, -21237, -14986, -64979, -40035, -56501, 21110, -50008, -52079, -22605, -106095, -84934, -62715, -100383, -151855, -98862, -86741, -71179, -36179, -4995, 13825, 7521, -73211, -76175, -53759, -67133, 9294, -23637, -125973, -101597]
1829a01597n0601J6236R918j2360L6780P6517q610k9114k7961m1422k0184R4433
1817e7965j5509q9503m6711L0445J6059R6496K1530j23581O4219J379J98k5357
1805a28300N4467Q8287Q510m9428J8286m0719N1518L2057l744r2920o4216P2272
1793e3930P5084p4717q0626j4063M575m2965M0389N9663n6946J2679J08113R6865
1781G4121l9212m9509k1978j9352r3089k9178J33890M2610J6050j4424R8441k3289
1769G5081r5625J2199M6278j28416m9092Q9402K7263l6858J31223K4020j00430
1758d955p4785N6515p5519j9911q827L5604k827M7315J03033p8064l0523l9957
1746i2901M1375J32452k9576j21486M8581R0001m5802q6896o9338n062L8821n7220
$$ y = [-101597, -152198, -135962, -126044, -138404, -101624, -25107, -33717, -62831, -90792, -132214, -152398, -57965, -73474, -162977, -209688, -179243, -163184, -66688, -45158, -168739, -104520, -103141, -102943, -128300, -73833, 14454, 22964, -26464, -8178, -48897, 2621, 34678, 30934, -61986, -126202, -53930, 21154, -53563, -134189, -148252, -143677, -186642, -146253, -86590, -143536, -130857, -22744, 74121, 34909, -14600, -36578, -55930, -149019, -178197, -44307, -1697, 14353, -71, 98370, 75081, -20544, -8345, 37933, -90483, -139575, -50173, -22910, -59768, 71455, 95475, -4955, -79740, -23225, -98744, -118655, -127482, -91878, -94705, -47390, 55643, -22421, -52944, -92901, -51526, 80926, 51350, -70136, -21555, 68446, 22644, -64252, -133590, -138652, -99831, -157051]
1734a57051N8749L3540l410q8206P6862J7773l7182O2201J4859l0905m8504j6466
1722a17740l6520m6531k2440K0345J03870J6888J6191k2606L2151L308J0849o6154
1710a08389M7115J4095o7585M5413K7743n3460M1764L4975j6502r1676k10004
1699c36511J30009J38638J5751l4433M3285l0857j2902L9548j35830K2263K7786
1688a33253N9276P5214R84l7686r5030K8214l0659O9237J0867k7854o0129o7485
1676b08304Q9572N5713l841p5878J3610L2112N3500n7660L6405n900k0489N69
$$ y = [-157051, -98302, -64762, -68172, -156378, -79516, -61743, -98925, -36724, -21865, -52770, -101274, -117740, -154260, -200791, -223231, -202886, -99016, -82128, -65937, -88543, -56392, -53084, -42235, -108389, -61274, -47179, -114764, -69351, -41608, -95068, -53304, -18329, -34831, -126507, -336511, -206502, -67864, -52113, -86546, -43261, -74118, -87020, -47472, -183302, -161039, -133253, -73977, 1237, 2221, -35465, -130495, -102281, -132940, -63703, -52836, -80690, -140819, -208304, -118732, -63019, -66860, -142738, -129128, -97016, -43516, -101176, -64771, -70671, -91160, -90591]
$$ [...]
##END NTUPLES=NMR SPECTRUM
##END=
