##TITLE=1H_CG-1181-E1
 CDCl3
 8 sc, 
 3.12.2024
##JCAMPDX= 6.0         $$ Bruker NMR JCAMP-DX V2.0
##DATA TYPE= NMR SPECTRUM
##DATA CLASS= NTUPLES
##ORIGIN= UXNMR, Bruker Analytische Messtechnik GmbH
##OWNER= root
$$ XWIN-NMR		Version 3.5
$$ Tue Dec  3 14:05:54 2024 Russian Standard Time (UT+4h)  she@DPX200
##.OBSERVE FREQUENCY= 200.1315
##.OBSERVE NUCLEUS= ^1H
##.ACQUISITION MODE= SIMULTANEOUS
##.ACQUISITION SCHEME= undefined
##.AVERAGES= 8
##.DIGITISER RES= 18
##SPECTROMETER/DATA SYSTEM= spect
##.PULSE SEQUENCE= zg30
##.SOLVENT NAME= CDCl3
##.SHIFT REFERENCE= (INTERNAL, CDCl3, 0, 19.4019)
##AUDIT TRAIL= $$ (NUMBER, WHEN, WHO, WHERE, WHAT)
$$ ##TITLE= Audit trail, XWIN-NMR		Version 3.5
$$ ##JCAMPDX= 5.01
$$ ##ORIGIN= Bruker BioSpin GmbH
$$ ##OWNER= she
$$ F:/spectra/data/she/nmr/H-F/1/pdata/1/auditp.txt
$$ ##AUDIT TRAIL=  $$ (NUMBER, WHEN, WHO, WHERE, WHAT)
(   1,<2024-12-03 14:04:41.20 +0400>,<she>,<DPX200>,
      <created by zg, POWCHK disabled, PULCHK disabled
       configuration hash MD5:
       00 E9 B6 7A A2 85 ED C7 34 08 36 98 17 FE 4E 26
       data hash MD5: 16K
       29 80 61 A2 6C C1 42 FF F0 C4 9D CB CB 37 CB 67>)
(   2,<2024-12-03 14:04:43.40 +0400>,<she>,<DPX200>,
      <Start of raw data processing
       efp BC_mod = 2 LB = 0.24 FT_mod = 6 PKNL = 1 PHC0 = -26877.09 PHC1 = 14.18744 SI = 16K 
       data hash MD5: 16K
       86 A6 14 DA 60 52 CC BA 3B B0 10 99 47 73 0C DC>)
(   3,<2024-12-03 14:05:04.87 +0400>,<she>,<DPX200>,
      <pk PHC0 = 1.66646 PHC1 = -3 
       data hash MD5: 16K
       97 89 9A 7A 2A F1 77 0B E7 DD 0F A1 CD 1B 2D 95>)
(   4,<2024-12-03 14:05:08.76 +0400>,<she>,<DPX200>,
      <abs ABSG = 5 
       data hash MD5: 16K
       3D ED 5D 0C 30 A6 6D D8 63 81 80 9B 20 DF 2E 75>)
$$ ##END=
$$ 
$$ hash MD5
$$ 47 D0 45 32 31 14 77 6B B4 AE 31 C1 8C 62 B8 23
##$RELAX= 
##$RELAX= 
##$RELAX= 
##$RELAX= 
##$RELAX= 
##$RELAX= 
$$ Bruker specific parameters
$$ --------------------------
##$DU= <F:/spectra>
##$EXPNO= 1
##$NAME= <H-F>
##$PROCNO= 1
##$TYPE= <nmr>
##$USER= <she>
##$AMP= (0..31)
100 100 100 100 100 100 100 100 100 100 100 100 100 100 100 100 100 100 
100 100 100 100 100 100 100 100 100 100 100 100 100 100 
##$AQSEQ= 0
##$AQ_mod= 1
##$AUNM= <au_zg>
##$AUTOPOS= <>
##$BF1= 200.13
##$BF2= 200.13
##$BF3= 200.13
##$BF4= 200.13
##$BF5= 200.13
##$BF6= 200.13
##$BF7= 200.13
##$BF8= 200.13
##$BYTORDA= 1
##$CFDGTYP= 0
##$CFRGTYP= 5
##$CHEMSTR= <none>
##$CNST= (0..31)
1 1 145 1 1 1 1 1 1 1 1 1 1 1 1 1 1 1 1 1 1 1 1 1 1 1 1 1 1 1 1 1 
##$CPDPRG= <>
##$CPDPRG1= <>
##$CPDPRG2= <>
##$CPDPRG3= <>
##$CPDPRG4= <mlev>
##$CPDPRG5= <mlev>
##$CPDPRG6= <mlev>
##$CPDPRG7= <mlev>
##$CPDPRG8= <mlev>
##$CPDPRGB= <>
##$CPDPRGT= <>
##$D= (0..31)
0 1.2 0 0 0 0 0 0 0 0.06 0 0.03 0 0 0 0 0.0002 0 0 0 0 0 0 0 0 0 0 0 0 
0 0 0 
##$DATE= 1733220280
##$DBL= (0..7)
120 120 120 120 120 120 120 120 
##$DBP= (0..7)
150 150 150 150 150 150 150 150 
##$DBP07= 0
##$DBPNAM0= <>
##$DBPNAM1= <>
##$DBPNAM2= <>
##$DBPNAM3= <>
##$DBPNAM4= <>
##$DBPNAM5= <>
$$ [...]
##$SUBNAM3= <"">
##$SUBNAM4= <"">
##$SUBNAM5= <"">
##$SUBNAM6= <"">
##$SUBNAM7= <"">
##$SUBNAM8= <"">
##$SUBNAM9= <"">
##$SW= 24.0689530833862
##$SWIBOX= (0..15)
0 0 2 0 0 0 0 0 0 0 0 0 0 0 0 0 
##$SW_h= 4816.95568400771
##$TD= 16384
##$TD0= 1
##$TE= 0
##$TE2= 300
##$TE3= 300
##$TEG= 300
##$TL= (0..7)
0 120 120 120 120 120 120 120 
##$TP= (0..7)
150 150 150 150 150 150 150 150 
##$TP07= 0
##$TPNAME0= <>
##$TPNAME1= <>
##$TPNAME2= <>
##$TPNAME3= <>
##$TPNAME4= <>
##$TPNAME5= <>
##$TPNAME6= <>
##$TPNAME7= <>
##$TPOAL= (0..7)
0.5 0.5 0.5 0.5 0.5 0.5 0.5 0.5 
##$TPOFFS= (0..7)
0 0 0 0 0 0 0 0 
##$TUNHIN= 0
##$TUNHOUT= 0
##$TUNXOUT= 0
##$USERA1= <user>
##$USERA2= <user>
##$USERA3= <user>
##$USERA4= <user>
##$USERA5= <user>
##$V9= 5
##$VALIST= <valist>
##$VCLIST= <CCCCCCCCCCCCCCC>
##$VD= 0
##$VDLIST= <DDDDDDDDDDDDDDD>
##$VPLIST= <PPPPPPPPPPPPPPP>
##$VTLIST= <TTTTTTTTTTTTTTT>
##$WBST= 1024
##$WBSW= 4
##$XGAIN= (0..3)
0 0 0 0 
##$XL= 0
##$YL= 0
##$YMAX_a= 161692
##$YMIN_a= -316708
##$ZGOPTNS= <>
##$ZL1= 120
##$ZL2= 120
##$ZL3= 120
##$ZL4= 120
##$ABSF1= 19.41514
##$ABSF2= -4.65399
##$ABSG= 5
##$ABSL= 3
##$ALPHA= 0
##$AQORDER= 0
##$ASSFAC= 0
##$ASSFACI= 0
##$ASSFACX= 0
##$ASSWID= 0
##$AUNMP= <proc_1d>
##$AZFE= 0.1
##$AZFW= 0.1
##$BCFW= 0
##$BC_mod= 2
##$BYTORDP= 0
##$COROFFS= 0
##$CY= -3
##$DATMOD= 1
##$DC= 0
##$DFILT= <>
##$DTYPP= 0
##$F1P= 0
##$F2P= 0
##$FCOR= 1
##$FTSIZE= 16384
##$FT_mod= 6
##$GAMMA= 0
##$GB= 0
##$INTBC= 1
##$INTSCL= 2.524811e-10
##$ISEN= 128
##$LB= 0.24
##$LEV0= 0
##$LPBIN= 0
##$MAXI= 10000
##$MC2= 0
##$MEAN= 0
##$ME_mod= 0
##$MI= 1.114404
##$NCOEF= 0
##$NC_proc= -7
##$NLEV= 6
##$NOISF1= 3.799351
##$NOISF2= 2.8
##$NSP= 0
##$NTH_PI= 0
##$NZP= 0
##$OFFSET= 19.40192
##$PC= 1
##$PHC0= -26875.42
##$PHC1= 11.18744
##$PH_mod= 1
##$PKNL= yes
##$PPARMOD= 0
##$PSCAL= 0
##$PSIGN= 0
##$REVERSE= no
##$SF= 200.130025571663
##$SI= 16384
##$SIGF1= 3
##$SIGF2= 2
##$SINO= 5.538805
##$SIOLD= 16384
##$SREGLST= <1H.CDCl3>
##$SSB= 0
##$STSI= 16384
##$STSR= 0
##$SW_p= 4816.95568400771
##$SYMM= 0
##$S_DEV= 0
##$TDeff= 16384
##$TDoff= 0
##$TI= <>
##$TILT= no
##$TM1= 0
##$TM2= 0
##$TOPLEV= 0
##$USERP1= <user>
##$USERP2= <user>
##$USERP3= <user>
##$USERP4= <user>
##$USERP5= <user>
##$WDW= 1
##$XDIM= 16384
##$YMAX_p= 498426127
##$YMIN_p= -281718
$$ End of Bruker specific parameters
$$ ---------------------------------
##NTUPLES= NMR SPECTRUM
##VAR_NAME=  FREQUENCY,     SPECTRUM/REAL,   SPECTRUM/IMAG
##SYMBOL=    X,             R,               I
##VAR_TYPE=  INDEPENDENT,   DEPENDENT,       DEPENDENT
##VAR_FORM=  AFFN,          ASDF,            ASDF
##VAR_DIM=   16384,         16384,           16384
##UNITS=     HZ,            ARBITRARY UNITS, ARBITRARY UNITS
##FACTOR=    0.29402158847633, 1,            1
##FIRST=     3882.90680950149, 0,            0
##LAST=      -934.048874506221, 0,           0
##MIN=       -934.048874506221, -281718,     0
##MAX=       3882.90680950149, 498426127,    0
$$ Real data points
##PAGE= N=1
##DATA TABLE= (X++(R..R)), XYDATA
$$ [...]
$$ plain form
7919 2486495 2449597 2404047 2290822 2306071 2229981 2250817 2195023 2188379 2331704 2280562 2224438
7908 2224438 2234313 2272036 2400616 2923245 2274827 2205700 2230019 2177023 2029553 1936423 1921601
7897 1921601 1762527 1773101 1707597 1673962 1584117 1617687 1598715 1455540 1431661 1466780 1457450
7886 1457450 1479821 1446313 1381455 1420683 1389030 1236632 1292445 1372518 1368503 1292776 1308528
7875 1308528 1203190 1182030 1230053 1262173 1331154 1261696 1297750 1245214 1281675 1305510 1280123
7864 1280123 1329263 1299712 1286925 1203253 1147285 1014505 1085827 1136393 1073630 1014220 986940
7853 986940 1166535 1142484 1178247 1122814 949205 1024937 1047515 928884 997667 1029498 1003323
7842 1003323 944740 1013935 1097634 1041572 1009793 1009873 1081471 1130950 946992 972219 1081460 1144652
$$ packed form
7919B486495l6898m5550j13225J5249p6090K0836n5794o644J43325n1142n6124
7908B224438R875L7723J28580N22629o48418o9127K4319n2996j47470r3130j4822
7897A921601j59074J0574o5504l3635q9845L3570j8972j43175k3879L5119r330
7886A457450K2371l3508o4858L9228l1653j52398N5813Q0073m015p5727J5752
7875A308528j05338k1160M8023L2120O8981o9458L6054n2536L6461K3835k5387
7864A280123M9140k9551j2787q3672n5968j32780P1322N0566o2763n9410k7280
7853I86940J79595k4051L5763n5433j73609P5732K2578j18631O8783L1831k6175
7842A003323n8583O9195Q3699n6062l1779Q0P1598M9479j83958K5227J09241O3192
$$ plain form
7830 1144652 1169327 1105757 1169695 1188072 1140646 1229492 1206992 1088211 1047354 1117657 1102881
7819 1102881 961963 1002920 1055148 1070036 969433 1042255 1144430 1202450 1115217 1130080 1127537
7808 1127537 1167567 1213679 1271263 1357116 1336691 1325366 1354580 1336510 1281260 1191512 1163887
7797 1163887 1195434 1107040 982658 932224 965350 871668 821335 780116 766938 803778 710264
7786 710264 722788 811702 754277 758927 711556 749437 820968 908883 820432 807765 806941 853149
7774 853149 798638 797200 726405 613312 596089 555712 574953 465423 384523 361681 356227 430409
7762 430409 361916 292170 304397 319281 398287 376131 422343 373271 312726 277882 278659 264289
7750 264289 251895 310556 315439 228521 222751 253746 203658 247275 239299 162890 143027 247012
$$ packed form
7830A144652K4675o3570O3938J8377m7426Q8846k2500j18781m0857P0303j4776
7819A102881j40918M0957N2228J4888j00603P2822J02175N8020q7233J4863k543
7808A127537M0030M6112N7584Q5853k0425j1325K9214j8070n5250q9748k7625
7797A163887L1547q8394j24382n0434L3126r3682n0333m1219j3178L6840r3514
7786G10264J2524Q8914n7425M650m7371L7881P1531Q7915q8451j2667q24M6208
7774H53149n4511j438p0795j13093j7223m0377J9241j09530q0900k2842n454P4182
7762D30409o8493o9746J2227J4884P9006k2156M6212m9072o0545l4844P77j4370
7750B64289j2394N8661M883q6918n770L0995n0088M3617p976p6409j9863J03985
$$ plain form
7738 247012 277278 244608 166349 162597 216650 196350 280150 180852 175272 193813 159600 177461
7726 177461 191794 242939 203614 183145 166045 169415 161569 128985 187444 186256 255748 224355
7714 224355 159939 275788 238139 180996 145128 214595 296767 279773 304130 287444 407408
7703 407408 459497 458621 416935 409999 338537 318519 282606 226591 226691 144165 127169 163823 171954
7690 171954 184809 202267 152409 97803 165029 105171 115650 113849 176726 120676 104103 169675
7678 169675 158317 66455 99391 71485 24568 -22472 159084 122896 69899 180327 172989
7667 172989 162559 115955 143433 25574 60345 24774 48277 107879 177216 240141 259115
7656 259115 113382 20132 19494 89304 12029 -69884 -9725 39000 46688 13436 -59330 -3247
$$ packed form
7738B47012L0266l2670p8259l752N4053k0300Q3800r9298n580J8541l4213J7861
7726A77461J4333N1145l9325k0469j7100L370p846l2584N8459j188O9492l1393
7714B24355o4416J15849l7649n7143l5868O9467Q2172j6994K4357j6686J19964
7703D07408N2089q76m1686o936p1462k0018l5913n6015J00q2526j6996L6654Q131
7690A71954J2855J7458m9858n4606O7226n9858J0479j801O2877n6050j6573O5572
7678A69675j1358r1862L2936k7906m6917m7040J81556l6188n2997J10428p338
7667A72989j0430m6604K7478j17859L4771l5571K3503N9602O9337O2925J8974
7656B59115j45733r3250o38O9810p7275q1913O0159M8725P688l3252p2766N6083
$$ plain form
7644 -3247 -27544 -40672 -28858 39098 118053 165268 101592 88833 102704 17177 -28374 72996
7632 72996 113561 184752 132692 -38846 61213 27872 43815 4791 6433 -4655 47636 -1185
7620 -1185 -28611 89637 -17631 -944 61794 60711 -14764 -35151 -49571 -5422 17689 93513
7608 93513 105737 31752 -42524 -17107 13197 -31247 -31111 25609 122244 36570 67924 51993
7596 51993 74922 50341 30219 108211 -24143 -58819 18838 116213 30095 -31518 66303 47193
7584 47193 30495 -16145 47986 32757 12248 98098 160353 122280 74148 183714 140250 116710
7572 116710 108237 63341 54692 24899 26906 41814 67461 17799 5118 12997 38129 55883
7560 55883 84375 78509 126643 95818 140690 195613 191035 148818 29403 96242 72006 7984
$$ packed form
7644c247k4297j3128J1814O7956P8955M7215o3676j2759J3871q5527m5551J01370
7632G2996M0565P1191n2060j71538J00059l3341J5943l9024J642j1088N2291m8821
7620a185k7426J18248j07268J6687O2738j083p5475k0387j4420M4149K3111P5824
7608I3513J2224p3985p4276K5417L0304m4444J36N6720R6635q5674L1354j5931
7596E1993K2929k4581k0122P7992j32354l4676P7657R7375q6118o1613R7821j9110
7584D7193j6698m6640O4131j5229k0509Q5850O2255l8073m8132J09566m3464k3540
7572A16710q473m4896q649k9793K007J4908K5647m9662j2681P879K5132J7754
7560E5883K8492n866M8134l0825M4872N4923m578m2217j19415O6839k4236o4022
$$ plain form
7548 7984 -7856 71678 9996 12619 125881 170228 148316 25687 18744 42410 109717 175200
7536 175200 95030 77007 19484 83513 191046 169403 228068 240450 245947 162279 119293 113482
7524 113482 158816 166966 79917 13912 -58816 13124 -29192 9440 -38578 7454 54819 -60423
7512 -60423 -35280 51090 49943 94858 48300 126661 159228 103601 172535 70685 137990 124020
7500 124020 36128 113492 4586 47452 -12348 -132 75660 35 -5849 34548 69040 7297
7488 7297 4377 24345 -16008 12640 67070 36954 36071 -39499 -35456 -28921 -126981 -202525 -121818
7475 -121818 -43360 -94604 -117954 -77313 -65616 -27421 -84102 -110358 -17230 -79070 -71698 -45091
7463 -45091 -111433 -114399 -99801 -82207 -34705 -27933 -47880 -50978 -108515 -86280 -68885 -42592
$$ packed form
7548G984j5840P9534o1682K623J13262M4347k1912j22629o943K3666O7307O5483
7536A75200q0170j8023n7523O4029J07533k1643N8665J2382N497q3668m2986n811
7524A13482M5334Q150q7049o6005p2728P1940m2316L8632m8018M6032M7365j15242
7512f0423K5143Q6370j147M4915m6558P8361L2567n5627O8934j01850O7305j3970
7500A24020q7892P7364j08906M2866n9800J2216P5792p5625n884M0397L4492o1743
7488G297k920J9968m0353K8648N4430l0116q83p5570M043O535r8060p5544Q0707
7475a21818P8458n1244k3350M0641J1697L8195n6681k6256R3128o1840P372K6607
7463d5091o6342k966J4598J7594M7502O772j9947l098n7537K2235J7395K6293
$$ plain form
7451 -42592 -90010 -144045 -281718 -136224 -113779 -70261 -50611 32652 -2222 -59556 -80121
7440 -80121 64241 68224 -12031 -99392 -61479 -10675 -44948 -92028 -60757 -81454 -115414 -60679
7428 -60679 -137959 -84114 -164703 -94723 -76336 -165422 -199368 -111566 -66286 -67997 -151092 -151021 -50283
7415 -50283 -53740 -163567 -89075 -90568 -140042 -61125 -122193 -93590 -112360 -117039 -87958 -77651
7403 -77651 -115093 -22969 -36000 -126118 -71807 -108823 -9641 35703 -34927 -151875 1210
7392 1210 -14253 -92439 -54746 -314 -42542 -132983 -95492 -89753 -37763 -10747 -48553 87604
7380 87604 -10271 -32635 -76270 -131318 -168911 -146635 -114656 -105322 -108396 -94455 -71368 -62075
7368 -62075 -82188 -119240 -196177 -144223 -45821 -17517 -68329 -56416 -103569 -182865 -104677 209
$$ packed form
7451d2592m7418n4035j37673J45494K2445M3518J9650Q3263l4874n7334k0565
7440h0121J44362L983q0255q7361L7913N0804l4273m7080L1271k0697l3960N4735
7428f0679p7280N3845q0589O9980J8387q9086l3946Q7802M5280j711q3095P1J00738
7415e0283l457j09827P4492j493m9474P8917o1068K8603j8770m679K9081J0307
7403g7651l7442R2124j3031r0118N4311l7016R9182M5344p0630j16948J53085
7392A210j5463p8186L7693N4432m2228r0441L7491N739N1990K7016l7806J36157
7380H7604r7875k2364m3635n5048l7593K2276L1979R334l074J3941K3087R293
7368f2075k0113l7052p6937N1954R8402K8304n0812J1913m7153p9296P8188J04886
$$ plain form
7356 209 -97370 -195229 -28433 -90180 -55368 -5674 -87386 -35272 -5255 50026 29595 -36239
7344 -36239 -5330 -62219 16221 -3022 -45503 -78707 -70150 -34316 5199 18894 -64809 -120283
7332 -120283 -60464 -122388 -90078 -96097 -64763 -82587 -150096 -143038 -146217 -173632 -101711 -49429
7320 -49429 13151 -87157 -71846 -77887 -197003 -216278 -97904 -59313 -56487 -105145 -33151 -7040
7308 -7040 -43393 -94128 -101466 28704 -114858 -6555 -106236 -94206 -117337 -116154 -82932 -56526
7296 -56526 -5549 -51620 -20334 -107316 21659 -129633 -186715 -40630 -74100 -99860 -112806
7285 -112806 -123002 -118764 -144657 -211384 -131531 -170103 -131538 -180110 -159465 -149437 -135675 -137336
7273 -137336 -163208 -195054 -164771 -189302 -229689 -234478 -152858 -142937 -64035 -59041 -78442 -108018
$$ packed form
7356B09r7579r7859J66796o1747L4812M9694q1712N2114L0017N5281k0431o5834
7344c6239L0909n6889P8440j9243m2481l3204Q557L5834L9515J3695q3703n5474
7332a20283N9819o1924L2310o019L1334j7824o7509P058l179k7415P1921N2282
7320d9429O2580j00308J5311o041j19116j9275J18374L8591K826m8658P1994K6111
7308g040l6353n0735p338J30170j43562J08303r9681J2030k3131J183L3222K6406
7296e6526N0977m6071L1286q6982J28975j51292n7082J46085l3470k5760j2946
7285a12806j0196M238k5893o6727P9853l8572L8565m8572K0645J0028J3762j661
7273a37336k5872l1846L0283k4531m0387m789Q1620R921P8902M994j9401k9576
$$ plain form
7261 -108018 -52862 -52119 -67633 -80120 -40604 9577 -53603 -18054 -10350 -38955 5442 24386
7249 24386 42165 66850 58302 -12307 -110903 -99042 -15065 -118923 -98680 24238 -90908
7238 -90908 -34954 -37979 -120008 -58272 -49093 -35581 21357 -45777 -82853 -101216 14092 -27605
7226 -27605 -30943 -91698 -171200 -103939 -117351 -142052 17244 83584 -4237 -133780 -78034 -76318
7214 -76318 -53942 -50798 7294 -80406 -68774 -56700 -99044 -111680 -164823 -96720 -127470 -111245
7202 -111245 -58186 -41801 22463 -57721 -63073 -2251 -23220 -88375 -117677 -1430 -61331 -83583
7190 -83583 67643 72409 -111514 -135771 -111928 18756 -4085 -114899 -128065 29530 166465
7179 166465 88700 110278 56566 18321 -5592 1444 -61985 -38158 22470 -80062 -120604 -51009
$$ packed form
7261a08018N5156P43j5514j2487L9516N0181o3180L5549P704k8605M4397J8944
7249B4386J7779K4685q548p0609r8596J1861Q3977j03858K0243J22918j15146
7238i0908N5954l025q2029O1736R179J3512N6938o7134l7076j8363J15308m1697
7226b7605l338o0755p9502O7261j3412k4701J59296O6340q7821j29543N5746J716
7214g6318K2376L144N8092q7700J1632J2074m2344j2636n3143O8103l0750J6225
7202a11245N3059J6385O4264q0184n352O0822k0969o5155k9302J16247n9901k2252
7190h3583J51226M766j83923k4257K3843J30684k2841j10814j3166J57595J36935
7179A66465p7765K1578n3712l8245k3913P036o3429K3827O0628j02532m0542O9595
$$ plain form
7167 -51009 -104624 -94599 -116771 24737 -22549 -8660 -67665 2662 -56389 -70201 -71448 -134619
7155 -134619 -47776 -90148 -64288 -121150 -25962 -8119 -36164 -24434 -138802 -103272 -35003
7144 -35003 -4384 -24896 28092 50283 33755 46629 -49842 -47713 -50134 112627 -10258 -56998
7132 -56998 -4434 72825 46655 -65502 17941 -41449 -94807 -62706 -127938 -71867 -81831 -12143
7120 -12143 -38874 4387 -91118 -61913 -150695 -115557 -90013 -81115 -86773 -182824 -196820 -120405
7108 -120405 -123986 -171337 -202383 -153367 -158182 -95933 -27059 -64293 -52933 -86901 -63326 -61392
7096 -61392 -9859 9127 -51873 -13792 -79601 -134368 -37871 -99869 -149863 -63160 -77746 -93932
7084 -93932 -92475 -89700 -114565 -10891 -127488 -138881 -134581 -79421 -113049 -93528 -122868 -105465
$$ packed form
7167e1009n3615J0025k2172J41508m7286J3889n9005P0327n9051j3812j247o3171
7155a34619Q6843m2372K5860n6862R5188J7843k8045J1730j14368L5530O8269
7144c5003L0619k0512N2988K2191j6528J2874r6471K129k421J62761j22885m6740
7132e6998N2564P7259k6170j12157Q3443n9390n3358L2101o5232N6071r964O9688
7120a2143k6731M3261r5505K9205q8782L5138K5544Q898n658r6051j3996P6415
7108a20405l581m7351l1046M9016m815O2249O8874l7234J1360l3968K3575J934
7096f1392N1533J8986o1000L8081o5809n4767R6497o1998m9994Q6703j4586j6186
7084i3932J457K775k4865J03674j16597j1393M300N5160l3628J9521k9340J7403
$$ plain form
7072 -105465 -35041 -208953 -167403 -190756 -51909 54777 57596 -23971 -27276 -29878 -12171 58182
7060 58182 37509 -35825 38933 -22658 -10869 -68851 -126663 -56380 -11918 -11501 14889 65225
7048 65225 -52503 -133811 -27573 -57762 -30947 -89451 -102523 -144464 -70738 -109943 -89254
7037 -89254 -59005 11040 -58904 -52077 3548 19089 -18823 -92958 -20368 -59434 -56869 -72969
7025 -72969 -22763 -22904 -113614 -94412 -153046 -17706 66796 -48557 -65847 -91072 -26138 -49740
7013 -49740 -57643 -100852 -95505 -74206 -115799 25881 -114420 -91535 38181 81242 3047 -58674
7001 -58674 -54539 -18704 -120938 -135044 -50297 -98170 -128845 -69369 -49414 -155730 -87981 143
6989 143 55748 -38623 -9022 -105830 -176625 -138128 -102141 -26823 -70939 -16292 10460 -138593
$$ packed form
7072a05465P0424j73912M1550k3353J38847J06686K819q1567l305k602J7707P0353
7060E8182k0673p3334P4758o1591J1789n7982n7812P0283M4462M17K6390N0336
7048F5225j17728q1308J06238l0189K6815n8504j3072m1941P3726l9205K0689
7037h9254L0249P0045o9944O827N5625J5541l7912p4135P2590l9066K565j6100
7025g2969N0206j41r0710J9202n8634J35340Q4502j15353j7290k5225O4934k3602
7013d9740p903m3209N347K1299m1593J41680j40301K2885J29716M3061p8195o1721
7001e8674M135L5835j02234j4106Q4747m7873l0675N9476J9955j06316O7749Q8124
6989A43N5605r4371K9601r6808p0795L8497L5987P5318m4116N4647K6752j49053
$$ plain form
6977 -138593 -198492 -96255 -39023 -95666 -87485 -95924 -161199 -47037 -66543 2506 70484 -38999
6965 -38999 30002 14208 47746 25591 56749 -20557 -117971 -104753 44736 -11439 -77776 -18501
6953 -18501 -59058 12063 -37324 -112629 -22767 -32633 -85980 -117077 -106078 30630 72613 -54699
6941 -54699 -9566 1927 115583 145445 136196 71029 135321 51187 -94226 -49014 -11490 -93857
6929 -93857 -51214 -13118 -96766 -100962 -151712 -93983 -15515 -35120 -24844 -35187 9876 -98493
6917 -98493 -101343 -40207 -142124 -103277 19590 25339 24489 -12621 -40570 -74066 -78248 24978
6905 24978 -101468 -136502 -107837 -63438 -76848 -51001 -41603 60941 112512 21075 -35592 -21765
6893 -21765 -58104 -130058 -158011 11348 -24897 25339 97174 74692 126015 90963 48833 69775
$$ packed form
6977a38593n9899J02237N7232n6643Q181q439o5275J14162j9506O9049O7978j09483
6965c8999O9001j5794L3538k2155L1158p7306r7414J3218J49489n6175o6337N9275
6953a8501m0557P1121m9387p5305Q9862r866n3347l1097J0999J36708M1983j27312
6941e4699M5133J1493J13656K9862r249o5167O4292q4134j45413M5212L7524q2367
6929i3857M2643L8096q3648m196n0750N7729P8468j9605J0276j0343M5063j08369
6917i8493k850O1136j01917L8847J22867N749q50l7110k7949l3496m182J03226
6905B4978j26446l5034K8665M4399j3410K5847R398J02544N1571r1437n6667J3827
6893b1765l6339p1954k7953J69359l6245N0236P1835k2482N1323l5052m2130K0942
$$ plain form
6881 69775 -62824 -49050 14949 18620 -17803 -88906 40312 71523 -28757 -116052 -43515
6870 -43515 -14376 -16433 -20076 -13287 25201 45189 -61968 -36311 -46415 -87248 -32149 -70227
6858 -70227 -93646 409 108920 -10944 -43918 50433 69376 10980 71007 -60571 -86662
6847 -86662 -19288 -35752 -129065 -88884 19779 73448 54779 2945 35291 -36373 13334 33358
6835 33358 -24392 -152258 -36278 -46934 63703 104484 150989 34586 -21356 46854 32204
6824 32204 24459 -6582 3128 93545 33221 -13260 -118055 -87158 70003 33033 126747 12526
6812 12526 -29958 31679 -17513 -15403 18807 -10431 56594 -53067 -6424 6229 -44692 -54123
6800 -54123 5232 -53645 -34786 -108092 -47640 -99035 -71792 25114 4194 12629 20069 -85052
$$ packed form
6881F9775j32599J3774O3999L671l6423p1103J29218L1211j00280q7295P2537
6870d3515K9139k057l643O789L8488J9988j07157K5657j0104m0833N5099l8078
6858g0227k3419R4055J08511j19864l2974R4351J8943n8396O0027j31578k6091
6847h6662O7374j6464r3313M0181J08663N3669j8669n1834L2346p1664M9707K0024
6835C3358n7750j27866J15980j0656J10637M0781M6505j16403n5942O8210j4650
6824C2204p745l1041R710R0417o0324m6481j04795L0897J57161l6970R3714j14221
6812A2526m2484O1637m9192K110L4210k9238O7025j09661M6643J2653n0921r431
6800e4123N9355n8877J8859p3306O0452n1395K7243R6906k0920Q435P440j05121
$$ plain form
6788 -85052 94733 126772 -15320 48094 -2672 -250 39997 42566 -12039 -4653 -76359 12293
6776 12293 -11206 13820 38028 -21483 -76791 32923 28358 -20887 25340 -2745 84165 7370
6764 7370 -31003 -62153 -88505 -29766 -60174 38390 734 -9844 -52886 -66869 -39797 7846
6752 7846 31450 3960 7838 34956 19293 -24958 12248 78576 18491 64035 42664 -12261
6740 -12261 26280 -99066 -26993 33874 23633 20814 -67648 -114396 -9513 51360 24825 -21670
6728 -21670 -40329 -89909 34338 88867 -77408 -33012 31513 13754 142303 84758 100766
6717 100766 -1158 3060 73463 27910 42087 79482 155264 2205 94691 127427 54529
6706 54529 -73579 -73049 -48672 -5821 121935 106033 13066 11041 4526 60450 69797 40225
$$ packed form
6788h5052J79785L2039j42092O3414n0766K422M0247K569n4605P386p1706Q8652
6776A2293k3499K5026K4208n9511n5308J09714m565m9245M6227k8085Q6910p6795
6764G370l8373l1150k6352N8739l0408R8564l7656j0578m3042j3983K7072M7643
6752G846K3604k7490L878K7118j5663m4251L7206O6328o0085M5544k1371n4925
6740a2261L8541j25346P2073O0867j0241k819q8462m6748J04883O0873k6535m6495
6728b1670j8659m9580J24247N4529j66275M4396O4525j7759J28549n7545J6008
6717A00766j01924M218P0403m5553J4177L7395P5782j53059R2486L2736p2898
6706E4529j28108N30K4377M2851J27756j5902r2967k025o515N5924R347k9572
$$ plain form
6694 40225 -53118 64903 118386 41113 6234 -45939 -25674 -62489 -30616 -5955 -23287 26362
6682 26362 42032 4669 -9742 -12753 26251 6523 6222 44702 64073 147754 135392 41894
6670 41894 -30396 70488 5030 92654 67115 154084 188900 72044 31583 118122 96023
6659 96023 27191 181335 73739 141079 125244 69885 87665 67630 -139 -23094 -133091
6648 -133091 -94140 -45757 58696 152330 80950 -25467 51819 96817 178715 93393 78291
6637 78291 112553 -20873 14025 67804 96830 64578 10822 156034 148967 166890 171656 237205
6625 237205 255018 178062 174101 2634 9697 104237 98773 55030 84843 67199 91841 190682
6613 190682 182342 163515 80635 71094 130786 100552 62962 110179 150650 73053 48285 87363
$$ packed form
6694D0225r3343J18021N3483p7273l4879n2173K0265l6815L1873K4661j7332M9649
6682B6362J5670l7363j4411l011L9004j9728l01L8480J9371Q3681j2362r3498
6670D1894p2290J00884o5458Q7624k5539Q6969L4816j16856m0461Q6539k2099
6659I6023o8832J54144j07596O7340j5835n5359J7780k0035o7769k2955j09997
6648a33091L8951M8383J04453R3634p1380j06417P7286M4998Q1898q5322j5102
6637G8291L4262j33426L4898N3779K9026l2252n3756J45212p067J7923M766O5549
6625B37205J7813p6956l961j71467P063R4540n464m3743K9813j7644K4642R8841
6613A90682q340j8827q2880r541N9692l0234l7590M7217M0471p7597k4768L9078
$$ plain form
6601 87363 124965 64747 12152 77225 109698 22401 39915 88743 37923 -12650 75194 74340
6589 74340 21109 114947 174792 61598 65589 126559 68506 69822 82231 49660 71923 161209
6577 161209 24783 9948 132753 2070 -7547 90050 160398 116572 126329 124647 106406 23886
6565 23886 32955 49594 125035 111075 103530 126026 150787 123861 113125 82916 -17898 123968
6553 123968 123100 88568 82431 132329 56229 108855 8707 32999 74169 55112 60579 19244
6541 19244 59383 55419 -5993 -56051 7998 181188 76452 91439 35344 72741 101850 199173
6529 199173 172233 74630 140228 106580 135844 155006 71909 80336 138165 141823 119981 84873
6517 84873 113521 157185 171975 58045 141070 258068 212699 192391 137256 129913 230518
$$ packed form
6601H7363L7602o0218n2595O5073L2473q7297J7514M8828n0820n0573Q7844q54
6589G4340n3231R3838N9845j13194L991O0970n8053J316J2409l2571K2263Q9286
6577A61209j36426j4835J22805j30683r617R7597P0348m3826R757j682j8241q2520
6565B3886R069J6639P5441j3960p545K2496K4761k6926j0736l0209j00814J41866
6553A23968q68l4532o137M9898p6100N2626j00148K4292M1170j9057N467m1335
6541A9244M0139l964o1412n0058O4049J73190j04736J4987n6095L7397K9109R7323
6529A99173k6940r7603O5598l3648K9264J9162q3097Q427N7829L658k1842l5108
6517H4873K8648M3664J4790j13930Q3025J16998m5369k0308n5135p343J00605
$$ plain form
6506 230518 43854 2862 58760 115115 204732 153676 196172 180200 72400 88430 61026
6495 61026 114371 9244 141690 265006 260254 167345 259107 159832 126659 191352 153066
6484 153066 108417 97268 144346 99868 95103 130040 85136 100663 113923 66730 42992 77952
6472 77952 98883 72738 111441 148723 187841 120853 186770 248916 183709 139175 148034 187643
6460 187643 166855 221452 117500 167542 265013 292070 312301 240692 141326 117844 117309 231282
6448 231282 267321 277001 209037 173997 178426 159298 211907 227579 233440 201957 156164 168121
6436 168121 288471 308443 280314 232783 164860 282305 376299 301793 397860 313326 373683
6425 373683 458895 401961 468047 434602 430415 413945 436572 609698 451769 513098 473347
$$ packed form
6506B30518j86664m0992N5898N6355Q9617n1056M2496j5972j07800J6030k7404
6495F1026N3345j05127J32446J23316m752r2909R1762r9275l3173O4693l8286
6484A53066m4649j1149M7078m4478m765L4937m4904J5527J3260m7193k3738L4960
6472G7952K0931k6145L8703L7282L9118o6988O5917O2146o5207m4534Q859L9609
6460A87643k0788N4597j03952N0042R7471K7057K0231p1609r9366k3482n35J13973
6448B31282L6039R680o7964l5040M429j9128N2609J5672N861l1483m5793J1957
6436A68121J20350J9972k8129m7531o7923J17445R3994p4506R6067q4534O0357
6425C73683Q5212n6934O6086l3445m187j6470K2627J73126j57929O1329l9751
$$ plain form
6414 473347 589199 555992 624510 655270 607800 707874 783282 898978 774589 777315 867051
6403 867051 855131 738035 664507 819273 794126 720737 834082 827705 813000 925251 953947
6392 953947 1083574 1109164 1248611 1174913 1110514 1168170 1117223 1076854 942826 887959 823701
6381 823701 931604 819499 848858 904794 919164 877050 834560 822614 933995 1060527 992902
6370 992902 1001017 1069763 988138 955667 903111 833616 875537 845404 909192 901703 991772 851739
6358 851739 785022 902007 773212 720513 850699 908156 892767 795059 789319 885672 903937
6347 903937 995706 922933 905283 909288 978762 864579 791770 760890 839660 992257 937360
6336 937360 953468 1007385 1036019 926696 1029028 1034837 1143537 1241265 1131324 1043526 1143163
$$ packed form
6414D73347J15852l3207O8518L0760m7470J00074P5408J15696j24389K726Q9736
6403H67051j1920j17096p3528J54766k5147p3389J13345o377j4705J12251K8696
6392I53947J29627K5590J39447p3698o4399N7656n0947m0369j34028n4867o4258
6381H23701J07903j12105K9359N5936J4370m2114m2490j1946J11381J26532o7625
6370I92902Q115O8746q1625l2471n2556o9495M1921l0133O3788p489R0069j40033
6358H51739o6717J16985j28795n2699J30186N7457j5389r7708n740R6353J8265
6347I03937R1769p2773j7650M005O9474j14183p2809l0880P8770J52597n4897
6336I37360J6108N3917K8634j09323J02332N809J08700R7728j09941q7798R9637
$$ plain form
6325 1143163 1086503 1128313 1184146 1111549 1110418 1138289 1268901 1243588 1181362 1198993 1322577
6314 1322577 1261188 1288547 1351670 1331442 1337175 1416090 1384913 1256834 1214368 1317598 1386647
6303 1386647 1376166 1291862 1388400 1402966 1477548 1504084 1505959 1587002 1470037 1451224 1582064
6292 1582064 1661284 1575172 1632315 1727635 1786050 1741117 1710970 1803301 1760292 1775504 1824640
6281 1824640 1851301 1885869 1910543 2039505 2059702 2084494 2131477 2117979 2156873 2226227 2285442
6270 2285442 2361446 2333652 2410360 2483261 2514678 2472211 2554179 2655045 2733977 2674787 2746784
6259 2746784 2789327 2799844 2874635 2847976 2860984 2914699 3045695 3155816 3243902 3161931 3327787
6248 3327787 3408454 3530377 3537283 3845879 3871630 3922103 4071488 4145408 4275763 4354229 4428061
$$ packed form
6325A143163n6660M1810N5833p2597j131K7871J30612k5313o2226J7631J23584
6314A322577o1389K7359O3123k0228N733P8915l1177j28079m2466J03230O9049
6303A386647j0481q4304R6538J4566P4582K6536J875Q1043j16965j8813J30840
6292A582064P9220q6112N7143R5320N8415m4933l0147R2331m3009J5212M9136
6281A824640K6661L4568K4674J28962K0197K4792M6983j3498L8894O9354N9215
6270B285442P6004k7794P6708P2901L1417m2467Q1968J00866P8932n9190P1997
6259B746784M2543J0517P4791k6659J3008N3715J30996J10121Q8086q1971J65856
6248C327787Q0667J21923O906L08596K5751N0473J49385P3920J30355P8466P3832
$$ plain form
6237 4428061 4428049 4522221 4779025 4833201 5012367 5202484 5317110 5560392 5752840 5973511 6272022
6226 6272022 6433427 6759628 6970096 7167988 7511599 7719044 7958678 8296543 8574029 8766511
6216 8766511 9106227 9503376 9864612 10344971 10652964 10977350 11449644 12011312 12625175 13218120
6206 13218120 13914937 14564847 15044316 15612953 16304961 16834065 17453900 18093373 18957135
6197 18957135 19871020 20843232 21877716 22891087 23847820 25082601 26431868 27985298 29722175
6188 29722175 31822892 34009122 36580930 39470300 42613208 46294713 50547877 55529907
6180 55529907 61523908 68492786 76440981 84020741 89494255 91579857 90241465 86565484
6172 86565484 82012777 78107409 75434717 74156894 74471979 75802586 78060493 81733431
$$ packed form
6237D428061j2R4172K56804N4176J79166J90117J14626K43282J92448K20671K98511
6226F272022J61405L26201K10468J97892L43611K07445K39634L37865K77486J92482
6216H766511L39716L97149L61236M80359L07993L24386M72294N61668O13863N92945
6206A3218120O96817O49910M79469N68637O92008N29104O19835O39473Q63762
6197A8957135R13885R72212J034484J013371R56733J234781J349267J553430J736877
6188B9722175K100717K186230K571808K889370L142908L681505M253164M982030
6180E5529907N994001O968878P948195P579760N473514K085602j338392l675981
6172H6565484m552707l905368k672692j277823L15085J330607K257907L672938
$$ plain form
6164 81733431 86827934 93315667 101691035 112373780 125615634 140077866 152940640 160092216
6156 160092216 159335164 150790823 137162903 122098171 108693981 98054411 90107733 84377570
6148 84377570 80319333 77741153 76499987 76640917 78124757 80848744 85065548 90607850
6140 90607850 96307385 100279363 100643661 97105223 89908637 80615255 71310881 63026698
6132 63026698 56142978 50614907 45931376 42028609 38735153 36092473 33721654 31765705
6124 31765705 29993617 28338489 26883332 25535483 24197447 23019763 21970495 20965588
6116 20965588 20131696 19338948 18543327 17884809 17203192 16721914 16238559 15843659 15500476
6107 15500476 14998443 14548225 14230966 13803523 13559938 13249891 12957802 12872001 12699124 12437296
$$ packed form
6164H1733431N094503O487733Q375368J0682745J3241854J4462232J2862774P151576
6156A60092216p57052q544341j3627920j5064732j3404190j0639570p946678n730163
6148H4377570m058237k578180j241166J40930J483840K723987M216804N542302
6140I0607850N699535L971978L64298l538438p196586r293382r304374q284183
6132F3026698o883720n528071m683531l902767l293456k642680k370819j955949
6124C1765705j772088j655128j455157j347849j338036j177684j049268j004907
6116B0965588q33892p92748p95621o58518o81617m81278m83355l94900l43183
6107A5500476n02033m50218l17259m27443k43585l10047k92089q5801j72877k61828
$$ plain form
6097 12437296 12121397 11820489 11559281 11309245 11171525 10958087 10879200 10833635 10820358 10727099
6087 10727099 10760302 10692683 10709239 10864666 10766876 10695640 10766911 10647359 10580100 10660983 10670043
6076 10670043 10702928 10661903 10678109 10708957 10841685 11001205 11253438 11608139 11895918 12124076
6066 12124076 12434089 12703437 13072321 13571500 14146914 14761877 15596451 16498530 17713083
6057 17713083 18933952 20303054 21582694 22351594 22593703 22349913 21768603 21109312 20462558
6048 20462558 20026082 19813642 19763937 20022439 20406958 21083978 22022579 23150980 24533038
6039 24533038 26474810 28762010 31409162 34048093 36070560 36816284 36232062 34325451
6031 34325451 31764188 29051665 26754418 24826830 23453362 22263797 21338910 20807201
$$ packed form
6097A2437296l15899l00908k61208k50036j37720k13438p8887m5565j3277r3259
6087A0727099L3203o7619J6556J55427r7790p1236P1271j19552o7259Q0883R060
6076A0670043L2885m1025J6206L0848J32728J59520K52233L54701K87779K28158
6066A2124076L10013K69348L68884M99179N75414O14963Q34574R02079J214553
6057A7713083J220869J369102J279640P68900K42109k43790n81310o59291o46754
6048B0462558m36476k12440m9705K58502L84519O77020R38601J128401J382058
6039B4533038J941772K287200K647152K638931K022467P45724n84222j906611
6031C4325451k561263k712523k297247j927588j373468j189565r24887n31709
$$ plain form
6023 20807201 20434996 20432811 20521281 20953310 21555922 22514634 23479194 24314541 24563184 24075971
6013 24075971 23127511 21718838 20040812 18541523 17295447 16174075 15242368 14553845 13827342
6004 13827342 13323787 12774590 12312941 12039533 11829506 11579549 11408007 11287519 11196053 11109636
5994 11109636 10874840 10885651 10944030 10922903 11062321 11221180 11385932 11528527 11687083 11919713
5984 11919713 12229291 12557355 12805926 13089889 13387190 13828536 14112245 14459436 14820567
5975 14820567 15310043 15729556 16080064 16571544 17045054 17622927 18310906 18921744 19588107
5966 19588107 20286068 21119607 21992144 22934288 23921555 25026671 26145321 27428747 28877293
5957 28877293 30411867 32136478 34209036 36438541 38837901 41512543 44627864 48458428
$$ packed form
6023B0807201l72205k185Q8470M32029O02612R58712R64560Q35347K48643m87213
6013B4075971r48460j408673j678026j499289j246076j121372r31707o88523p26503
6004A3827342n03555n49197m61649k73408k10027k49957j71542j20488r1466q6417
5994A1109636k34796J0811N8379k1127J39418J58859J64752J42595J58556K32630
5984A1919713L09578L28064K48571K83963K97301M41346K83709L47191L61131
5975A4820567M89476M19513L50508M91480M73510N77873O87979O10838O66363
5966A9588107O97961Q33539Q72537R42144R87267J105116J118650J283426J448546
5957B8877293J534574J724611K072558K229505K399360K674642L115321L830564
$$ plain form
5949 48458428 52870011 58193572 64765129 72758136 82551386 93673403 102886763 108320458
5941 108320458 109412650 106629993 102530928 99730847 99715260 102784229 108110859 113079716
5933 113079716 116827769 119373448 121520201 124973194 129159849 132339075 132586454 129585468
5925 129585468 124639782 119916222 117649774 117457490 116615124 114547034 110917194 106975864
5917 106975864 104616271 105241124 109060712 114159715 116611210 114284325 106793467 95397808
5909 95397808 82894722 71806608 63055523 56245543 50729390 46193102 42314038 39117586
5901 39117586 36249461 33856621 31916103 29996225 28494726 27040654 25615595 24284718
5893 24284718 23069189 22032249 21028518 20128286 19408645 18485739 17775575 17159950 16426146
$$ packed form
5949D8458428M411583N323561O571557P993007R793250J1122017R213360N433695
5941A08320458J092192k782657m099065k800081j5587L068969N326630M968857
5933A13079716L748053K545679K146753L452993M186655L179226K47379l000986
5925A29585468m945686m723560k266448j92284q42366k068090l629840l941330
5917A06975864k359593O24853L819588N099003K451495k326885p490858j1395659
5909I5397808j2503086j1088114q751085o809980n516153m536288l879064l196452
5901C9117586k868125k392840j940518j919878j501499j454072j425059j330877
5893B4284718j215529j036940j003731r00232p19641r22906p10164o15625p33804
$$ plain form
5884 16426146 15809063 15314024 14847503 14390843 13917859 13447504 12991729 12498408 12059227
5875 12059227 11673807 11238843 10916921 10619310 10348053 10181069 10064168 9762739 9461082
5866 9461082 9274575 9190570 9015347 8756353 8584943 8563314 8364194 8183564 7953210 7847447
5856 7847447 7796386 7612392 7551324 7544755 7393682 7287729 7308569 7249376 7188098 7207177 7122520
5845 7122520 7047650 7059040 6894489 6829574 6693253 6652626 6590026 6491227 6535151 6476888 6384218
5834 6384218 6536859 6596375 6674041 6799355 6789693 6884393 6922283 7121013 7199003 7443482 7521737
5823 7521737 7713687 7863227 7903346 7990412 8155384 8213990 8166206 8183732 8103246 8166582 8261522
5812 8261522 8492328 8604611 8738177 8940941 9115021 9337991 9616920 9873010 10198163 10403740
$$ packed form
5884A6426146o17083m95039m66521m56660m72984m70355m55775m93321m39181
5875A2059227l85420m34964l21922k97611k71257j66984j16901l01429l01657
5866I461082j86507q4005j75223k58994j71410k1629j99120j80630k30354j05763
5856G847447n1061j83994o1068o569j51073j05953K0840n9193o1278J9079q4657
5845G122520p4870J1390j64551o4915j36321m0627o2600r8799M3924n8263r2670
5834F384218J52641N9516P7666J25314r662R4700L7890J98730P7990K44479P8255
5823G521737J91950J49540M0119Q7066J64972N8606m7784J7526q0486O3336R4940
5812H261522K30806J12283J33566K02764J74080K22970K78929K56090L25153K05577
$$ plain form
5802 10403740 10670038 10870223 11095116 11546850 11864238 12255392 12547156 12858564 13268561
5793 13268561 13766340 14271268 14919342 15596053 16342456 16993833 17671448 18365283 19057675
5784 19057675 19696692 20514562 21227436 22103690 23042717 23895531 25001296 26197537 27458366
5775 27458366 28934766 30631548 32731309 35064393 37665107 40545275 43628790 47042445
5767 47042445 50904531 55434964 60856373 67328972 75188320 84423550 93850499 101484035
5759 101484035 105279180 104687752 100410464 94319154 88380590 83965961 81261939 80120547
5751 80120547 80264550 81734069 84269935 88419706 94129317 101930635 112215343 125172149
5743 125172149 140584614 155462909 164764956 165792408 158505390 144974454 129002212
$$ packed form
5802A0403740K66298K00185K24893M51734L17388L91154K91764L11408M09997
5793A3268561M97779N04928O48074O76711P46403O51377O77615O93835O92392
5784A9057675O39017Q17870P12874Q76254R39027Q52814J105765J196241J260829
5775B7458366J476400J696782K099761K333084K600714K880168L083515L413655
5767D7042445L862086M530433N421409O472599P859348R235230R426949P633536
5759A01484035L795145n91428m277288o091310n938564m414629k704022j141392
5751H0120547J44003J469519K535866M149771N709611P801318J0284708J2956806
5743A25172149J5412465J4878295R302047J027452p287018j3530936j5972242
$$ plain form
5736 129002212 114439546 102752263 93820844 87182135 82306848 78943990 77083396 76623187
5728 76623187 77271085 79071691 81889714 85904805 90647072 94684808 96125845 93993422
5720 93993422 88588237 80955367 72709509 65115562 58961617 53923732 49900638 46713508
5712 46713508 43923399 41696778 39836934 38279815 37152225 36305469 35700552 34979972 33941945
5703 33941945 32452251 30932745 29528538 28322136 27213808 26165552 25276866 24360721
5695 24360721 23486196 22640307 21889531 21255453 20783074 20198237 19745969 19426760 19132816
5686 19132816 18785079 18552171 18392172 18113922 17651708 17095301 16467494 15798272 15327861
5677 15327861 14964385 14667996 14249253 14116270 14120278 13783936 13690468 13555095 13333096 13206515
$$ packed form
5736A29002212j4562666j1687283q931419o638709m875287l362858j860594m60209
5728G6623187O47898J800606K818023M015091M742267M037736J441037k132423
5720I3993422n405185p632870q245858p593947o153945n037885m023094l187130
5712D6713508k790109k226621j859844j557119j127590q46756o04917p20580j038027
5703C3941945j489694j519506j404207j206402j108328j048256q88686r16145
5695B4360721q74525q45889p50776o34078m72379n84837m52268l19209k93944
5686A9132816l47737k32908j59999k78250m62214n56407o27807o69222m70411
5677A5327861l63476k96389m18743j32983M008l36342r3468j35373k21999j26581
$$ plain form
5667 13206515 13039841 12856027 12889213 12919104 12739859 12467193 12200757 11898760 11722423 11660872
5657 11660872 11596909 11549741 11447513 11343750 11248931 11293529 11342603 11199770 11247801 11217112 11199732
5646 11199732 11155763 11057510 11118981 11219515 11250283 11271384 11238982 11225625 11443875 11641263 11972222
5635 11972222 12369443 12721023 13129645 13580707 14309684 15138313 16043240 17025186 18234574
5626 18234574 19713744 21378199 23021057 24365350 25138273 25199770 24746761 23726067 22838308
5617 22838308 21977071 21414728 21176467 21129575 21455450 22071519 22796659 23814636 25232769
5608 25232769 26955893 28968142 31612555 34533321 37104609 38588995 38517347 37088745
5600 37088745 34371926 31398760 28638137 26443188 24746377 23328801 22445599 21984583
$$ packed form
5667A3206515j66674j83814L3186K9891j79245k72666k66436l01997j76337o1551
5657A1660872o3963m7168j02228j03763r4819M4598M9074j42833M8031l0689j7380
5646A1199732m3969r8253O1471J00534L0768K1101l2402j3357K18250J97388L30959
5635A1972222L97221L51580M08622M51062P28977Q28629R04927R81946J209388
5626A8234574J479170J664455J642858J344293P72923O1497m53009j020694q87759
5617B2838308q61237n62343k38261m6892L25875O16069P25140J017977J418133
5608B5232769J723124K012249K644413K920766K571288J484386p1648j428602
5600C7088745k716819k973166k760623k194949j696811j417576q83202m61016
$$ plain form
5592 21984583 21649682 21492769 21572810 21764376 22128480 22610537 23254340 23931502 24557326 24613619
5582 24613619 24089182 23011496 21713768 20280924 18890884 17991744 17178521 16671612 16429147
5573 16429147 16069046 15799621 15589662 15458019 15389179 15402672 15541910 15622118 15760719 16014302
5563 16014302 16241897 16465303 16686852 16968987 17376277 17820409 18260474 18767133 19329874
5554 19329874 19894808 20461103 21176180 21849722 22657870 23576391 24362421 25444812 26671209
5545 26671209 27904221 29104846 30401910 31755839 33365543 35122980 37081980 39420940
5537 39420940 42045566 44946428 48288638 52240552 56976851 62667273 69726956 78329945
5529 78329945 88914918 101215004 112091960 118694361 120468353 117894985 113062537 109069691
$$ packed form
5592B1984583l34901j56913Q0041J91566L64104M82057O43803O77162O25824N6293
5582B4613619n24437j077686j297728j432844j390040q99140q13223n06909k42465
5573A6429147l60101k69425k09959j31643o8840J3493J39238Q0208J38601K53583
5563A6014302K27595K23406K21549K82135M07290M44132M40065N06659N62741
5554A9329874N64934N66295P15077O73542Q08148R18521P86030J082391J226397
5545B6671209J233012J200625J297064J353929J609704J757437J959000K338960
5537C9420940K624626K900862L342210L951914M736299N690422P059683Q602989
5529G8329945J0584973J2300086J0876956O602401J773992k573368m832448l992846
$$ plain form
5521 109069691 107787300 109731619 113349042 116272312 118019687 118521435 118953057 121025794
5513 121025794 125571943 130380684 133057711 132415220 129049427 124565563 121076034 118376662
5505 118376662 115070896 111124444 106424971 101722588 98461636 98011548 100448700 104343649
5497 104343649 106547428 104976101 99388399 90238814 79460968 69389345 61034238 54320071
5489 54320071 49046966 44776626 41241339 38199843 35628250 33432331 31607522 29990614
5481 29990614 28523659 27095345 25665398 24314433 23061576 21851587 20765618 19798540
5473 19798540 18930094 18142606 17313096 16699560 16031351 15342507 14738911 14238794 13700272
5464 13700272 13136612 12755708 12310092 11853014 11484405 10998162 10709344 10458298 10112822
$$ packed form
5521A09069691j282391J944319L617423K923270J747375N01748M31622K072737
5513A21025794M546149M808741K677027o42491l365793m483864l489529k699372
5505A18376662l305766l946452m699473m702383l260952m50088K437152L894949
5497A04343649K203779j571327n587702r149585j0777846j0071623q355107o714167
5489E4320071n273105m270340l535287l041496k571593k195919j824809j616908
5481B9990614j466955j428314j429947j350965j252857j209989j085969r67078
5473A9798540q68446p87488q29510o13536o68209o88844o03596n00117n38522
5464A3700272n63660l80904m45616m57078l68609m86243k88818k51046l45476
$$ plain form
5455 10112822 9781006 9526192 9223649 8863550 8704212 8356607 8061293 7866943 7702726
5446 7702726 7564783 7220999 7041026 6936247 6758587 6478351 6352271 6320950 6215074 6037119
5436 6037119 5973450 5866325 5793799 5613989 5523170 5406407 5378622 5255890 5193919 4934699
5426 4934699 4934389 4841509 4838040 4788875 4639569 4729269 4790701 4794077 4674887 4661705 4754820 4740856
5414 4740856 4627276 4727401 4738248 4661585 4733021 4718504 4794745 4708281 4646844 4618114 4560916
5403 4560916 4538810 4439327 4333689 4286514 4275175 4217276 4209460 4245444 4136570 4204672 4265960
5392 4265960 4384634 4535018 4593110 4813367 4946054 5001955 4784877 4644472 4495143 4341665
5382 4341665 4168964 4077893 3978724 3859352 3937145 3970034 3883779 3860111 3943221 4086256 4284216
$$ packed form
5455A0112822l31816k54814l02543l60099j59338l47605k95314j94350j64217
5446G702726j37943l43784j79973j04779j77660k80236j26080l1321j05876j77955
5436F037119o3669j07125p2526j79810r0819j16763k7785j22732o1971k59220
5426D934699l10r2880l469m9165j49306Q9700O1432L376j19190j3182R3115j3964
5414D740856j13580J00125J0847p6663P1436j4517P6241q6464o1437k8730n7198
5403D560916k2106r9483j05638m7175j1339n7899p816L5984j08874O8102O1288
5392D265960J18674J50384N8092K20257J32687N5901k17078j40405j49329j53478
5382D341665j72701r1071r9169j19372P7793L2889q6255k3668Q3110J43035J97960
$$ plain form
5371 4284216 4484509 4810670 5143166 5505185 5829103 6257710 6884597 7228682 7326059 6839380
5361 6839380 6253146 5676834 5154301 4580193 4202618 3998849 3883633 3857299 3779496 3682170
5351 3682170 3687036 3717462 3728410 3892165 4098892 4197026 4379533 4776338 5216071 5862540
5341 5862540 6505184 6829986 6874649 6500451 5868260 5226736 4735582 4217516 3746711 3505873
5331 3505873 3361275 3204940 3094223 3130108 3055266 2993554 2843253 2971510 3032860 3017004
5321 3017004 3122818 3314514 3482235 3700026 3950608 4096288 4226641 4173967 4139704 3955190
5311 3955190 3685459 3463530 3211223 3007396 2929657 2847346 2721100 2575863 2506632 2420298
5301 2420298 2363007 2260256 2282029 2233033 2305669 2419597 2472836 2490226 2597653 2786473 2797903
$$ packed form
5371D284216K00293L26161L32496L62019L23918M28607O26887L44085R7377m86679
5361F839380n86234n76312n22533n74108l77575k03769j15216k6334p7803r7326
5351C682170M866L0426J0948J63755K06727R8134J82507L96805M39733O46469
5341E862540O42644L24802M4663l74198o32191o41524m91154n18066m70805k40838
5331C505873j44598j56335j10717L5885p4842o1712j50301J28257O1350j5856
5321C017004J05814J91696J67721K17791K50582J45680J30353n2674l4263j84514
5311C955190k69731k21929k52307k03827p7739q2311j26246j45237o9231q6334
5301B420298n7291j02751K1773m8996P2636J13928N3239J7390J07427J88820J1430
$$ plain form
5290 2797903 2890328 3101960 3109753 3180519 3229375 3314820 3400834 3379841 3390740 3256757 3253666
5279 3253666 3267722 3265361 3256032 3267013 3282578 3279615 3320151 3297307 3368001 3409592 3355667 3397033
5267 3397033 3385867 3333738 3339874 3212368 3217343 3187562 3187637 3150576 2980128 2884382 2770120 2650919
5255 2650919 2703054 2667689 2719334 2700694 2525228 2450865 2377853 2148872 2154005 2224190 2234022
5244 2234022 2168466 2138273 2204779 2264108 2270176 2301737 2383111 2427782 2507502 2557187 2495712 2563094
5232 2563094 2481004 2299777 2261335 2211527 2393297 2410178 2257950 2193891 2291140 2382510 2388618
5221 2388618 2377753 2505049 2516891 2617418 2598923 2634515 2770650 2837411 2892690 2924460 2906164
5210 2906164 2960094 3140455 3293511 3489486 3651588 3942487 4352932 4772590 5357009 6234995
$$ packed form
5290B797903R2425K11632P793P0766M8856Q5445Q6014k0993J0899j33983l091
5279C253666J4056k361r329J0981J5565k963M0536k2844P0694M1591n3925M1366
5267C397033j1166n2129O136j27506M975k9781P5l7061j70448r5746j14262j19201
5255B650919N2135l5365N1645j8640j75466p4363p3012k28981N133P0185R832
5244B234022o5556l0193O6506N9329O068L1561Q1374M4671P9720M9685o1475O7382
5232B563094q2090j81227l8442m9808J81770J6881j52228o4059R7249R1370O108
5221B388618j0865J27296J1842J00527j8495L5592J36135O6761N5279L1770j8296
5210B906164N3930J80361J53056J95975J62102K90899M10445M19658N84419Q77986
$$ plain form
5200 6234995 6840830 7060109 6831562 6111964 5456224 4900630 4528713 4216061 4130854 4008925
5190 4008925 3845730 3759069 3789678 3827199 3922884 4149608 4387643 4852424 5055784 5215955
5180 5215955 5079691 4881929 4477729 4197376 4206336 4125368 4241066 4261652 4214947 4222200 4247371
5169 4247371 4323534 4301113 4478923 4534861 4635049 4881188 4983774 5093310 5310627 5328705
5159 5328705 5560098 5756679 5928564 6254899 6578101 6885723 7062115 7388713 7686271 8145888
5149 8145888 8562573 9106707 9749973 10508330 11256211 12259131 13028540 14053681 15322628
5140 15322628 17033432 19185626 21886969 25302675 30011418 36118076 43012122 46643548
5132 46643548 46905109 43061801 36580104 30495016 25761205 22205767 19173695 16637716
$$ packed form
5200F234995O05835K19279k28547p19598o55740n55594l71917l12652q5207j21929
5190D008925j63195q6661L0609L7521R5685K26724K38035M64781K03360J60171
5180E215955j36264j97762m04200k80353Q960q0968J15698K0586m6705P253K5171
5169D247371P6163k2421J77810N5938J00188K46139J02586J09536K17317J8078
5159E328705K31393J96581J71885L26335L23202L07622J76392L26598K97558M59617
5149H145888M16685N44134O43266P58357P47881J002920P69409J025141J268947
5140A5322628J710804K152194K701343L415706M708743O106658O894046L631426
5132D6643548K61561l843308o481697o085088m733811l555438l032072k535979
$$ plain form
5124 16637716 14602200 13029627 11782387 10751447 9840009 9168704 8532737 8051538 7621783
5115 7621783 7195981 6849931 6439253 6200314 5909823 5647695 5327228 5126170 5039099 4817683
5105 4817683 4668681 4474421 4445438 4364289 4176939 4075497 4041367 3882062 3767924 3718796
5095 3718796 3567866 3325929 3505927 3356337 3176859 3149827 3131257 3222510 3227003 3143789 3156234
5084 3156234 3198392 3227298 3217079 3284737 3365911 3366660 3363102 3447950 3520240 3577629 3592163 3523509
5072 3523509 3560831 3666440 3636782 3694219 3726203 3798053 3902161 4098865 4161659 4220126 4212377
5061 4212377 4283668 4366339 4405241 4376859 4419764 4429434 4568912 4624091 4926424 5091102 5251933
5050 5251933 5459786 5555486 5721629 6027912 6215375 6624782 7049972 7739959 8611801 9710149
$$ packed form
5124A6637716k035516j572573j247240j030940r11438o71305o35967m81199m29755
5115G621783m25802l46050m10678k38939k90491k62128l20467k01058q7071k21416
5105D817683j49002j94260k8983q1149j87350j01442l4130j59305j14138m9128
5095C718796j50930k41937J79998j49590j79478k7032j8570R1253M493q3214J2445
5084C156234M2158K8906j0219O7658Q1174P49l558Q4848P2290N7389J4534o8654
5072C523509L7322J05609k9658N7437L1984P1850J04108J96704O2794N8467p749
5061D212377P1291Q2671L8902k8382M2905R670J39478N5179L02333J64678J60831
5050E251933K07853R5700J66143L06283J87463M09407M25190O89987Q71842J098348
$$ plain form
5040 9710149 11127575 12997964 14517723 14860884 14145890 12526342 10513979 9028573 7850117
5031 7850117 7129354 6432444 5949555 5581116 5310282 5032784 4696528 4500222 4392272 4221697
5021 4221697 4094851 3921760 3872045 3724979 3819663 3795805 3771071 3719881 3633073 3528031 3540397
5010 3540397 3634170 3629474 3565681 3579595 3579728 3499599 3547499 3555239 3515771 3562519 3605149 3717128
4998 3717128 3703228 3793640 3781602 3753638 3717897 3858083 3839851 3786204 3789202 3928089 3961611
4987 3961611 4088571 4193356 4286632 4390012 4433439 4512687 4544844 4600810 4687019 4789989 4886441
4976 4886441 5034770 5128831 5223611 5276337 5186023 5225429 5443979 5447443 5541949 5759787 5804560
4965 5804560 6001895 6264137 6563783 6673311 6787247 7036924 7272716 7553486 7840871 8029042
$$ packed form
5040I710149J417426J870389J519759L43161p14994j619548k012363j485406j178456
5031G850117p20763o96910m82889l68439k70834k77498l36256j96306j07950j70575
5021D221697j26846j73091m9715j47066R4684k3858k4734n1190q6808j05042J2366
5010C540397R3773m696o3793J3914J33q0129M7900P740l9468M6748M2630J11979
4998C717128j3900R0412j2038k7964l5741J40186j8232n3647K998J38887L3522
4987C961611J26960J04785R3276J03380M3427P9248L2157N5966Q6209J02970R6452
4976D886441J48329R4061R4780N2726r0314L9406K18550L464R4506K17838M4773
4965E804560J97335K62242K99646J09528J13936K49677K35792K80770K87385J88171
$$ plain form
4955 8029042 8227994 8560229 8871023 9310868 9667994 10209686 10374913 10925834 11389469 11883777
4945 11883777 12521854 13296220 14049209 14908895 16004572 17072013 17541622 17981798 18366589
4936 18366589 19013745 19623238 20345014 21147626 22145020 23045053 24066943 25155721 26462703
4927 26462703 27653709 29220807 30699169 32651472 34542675 36564556 38284607 39974448
4919 39974448 41254289 42788042 44162833 46261829 48286758 50984796 53553879 56483953
4911 56483953 59158985 62695622 66402174 71354941 76854610 84106133 91814282 101479282
4903 101479282 111491967 123603160 136953135 154213523 174291563 200151508 231549349
4896 231549349 274419372 330049025 409835566 475892495 498426127 476186177 403712995
$$ packed form
4955H029042J98952L32235L10794M39845L57126N41692J65227N50921M63635M94308
4945A1883777O38077P74366P52989Q59686J095677J067441M69609M40176L84791
4936A8366589O47156O09493P21776Q02612R97394R00033J021890J088778J306982
4927B6462703J191006J567098J478362J952303J891203K021881J720051J689841
4919C9974448J279841J533753J374791K098996K024929K698038K569083K930074
4911E6483953K675032L536637L706552M952767N499669P251523P708149R665000
4903A01479282J0012685J2111193J3349975J7260388K0078040K5859945L1397841
4896B31549349M2870023N5629653P9786541O6056929K2533632k2239950p2473182
$$ plain form
4889 403712995 324574509 259048113 214388194 180243799 154926132 134977995 119660013
4882 119660013 107010948 97390696 89062900 82159303 76087178 71354506 67058456 63179212
4874 63179212 58568611 54469561 50741461 47733027 45077539 42817876 40660919 38741541
4866 38741541 36733138 35035717 33514320 32307102 31075018 30228443 29164926 27710864
4858 27710864 26044631 24707600 23484159 22281743 21203618 20311726 19433500 18637542 17883458
4849 17883458 17232231 16435300 15787142 15207631 14615388 14171425 13756999 13328897 12894904
4840 12894904 12376275 11961772 11630564 11300177 10948165 10721203 10412372 10046325 9804615
4831 9804615 9407060 9096046 8708377 8507658 8371664 8200125 7938897 7606314 7438182 7161575
$$ packed form
4889D03712995p9138486o5526396m4659919l4144395k5317667j9948137j5317982
4882A19660013j2649065r620252q327796o903597o072125m732672m296050l879244
4874F3179212m610601m099050l728100l008434k655488k259663k156957j919378
4866C8741541k008403j697421j521397j207218j232084q46575j063517j454062
4858B7710864j666233j337031j223441j202416j078125q91892q78226p95958p54084
4849A7883458o51227p96931o48158n79511n92243m43963m14426m28102m33993
4840A2894904n18629m14503l31208l30387l52012k26962l08831l66047k41710
4831I804615l97555l11014l87669k00719j35994j71539k61228l32583j68132k76607
$$ plain form
4821 7161575 6962129 6858772 6665818 6538198 6424353 6315774 6042821 5990884 5707820 5478291
4811 5478291 5261071 5103551 4956155 4967683 4839167 4885322 5007175 5041441 5056245 5073138
4801 5073138 5105082 5199800 5406257 5579187 5532148 5376726 5023291 4756301 4351354 4122113
4791 4122113 3883911 3757559 3483007 3378756 3112863 3017993 2952164 2987604 2858025 2940473
4781 2940473 2845221 2797756 2650054 2479123 2534183 2509868 2281945 2306368 2257416 2291445 2319955
4770 2319955 2336272 2232581 2189129 2139459 2177919 2042376 2015699 2014886 2020644 1870239 1726790
4759 1726790 1591326 1507257 1563499 1606134 1638920 1636375 1494956 1604042 1520680 1591068 1634750
4748 1634750 1549276 1455136 1537857 1549367 1518726 1588595 1619984 1519438 1408970 1401534 1489403
$$ packed form
4821G161575j99446j03357j92954j27620j13845j08579k72953n1937k83064k29529
4811E478291k17220j57520j47396J1528j28516M6155J21853L4266J4804J6893
4801E073138L1944R4718K06457J72930m7039j55422l53435k66990m04947k29241
4791D122113k38202j26352k74552j04251k65893r4870o5829L5440j29579Q2448
4781B940473r5252m7465j47702j70931N5060k4315k27923K4423m8952L4029K8510
4770B319955J6317j03691m3452m9670L8460j35543k6677q13N758j50405j43449
4759A726790j35464q4069N6242M2635L2786k545j41419J09086q3362P0388M3682
4748A634750q5474r4140Q2721J1510l0641O9869L1389j00546j10468p436Q7869
$$ plain form
4737 1489403 1420135 1354340 1277668 1454534 1438125 1458073 1241502 1132343 1199675 1299340 1217290
4726 1217290 1249192 1172775 1137532 1139642 1046902 1043817 1080650 1094392 1108336 1147216 1152246 1006517
4714 1006517 1015668 1003351 935504 977167 1087276 1148475 1181675 1202765 1082446 1076455 1144340
4703 1144340 1312651 1425816 1479181 1483666 1536621 1591736 1639889 1594390 1677780 1651970 1621747
4692 1621747 1595934 1528661 1457652 1569269 1438131 1417723 1398207 1405656 1408146 1478724 1358045
4681 1358045 1284608 1235380 1297206 1328732 1412916 1501457 1482133 1511996 1511969 1485012 1506181 1527701
4669 1527701 1699115 1526129 1563426 1649988 1796501 1922860 2092772 2236470 2437480 2475308
4659 2475308 2842617 3324294 3769887 4335489 4754414 4734333 4398960 3872117 3272883 2842492
$$ packed form
4737A489403o9268o5795p6672J76866j6409J9948k16571j09159O7332R9665q2050
4726A217290L1902p6417l5243K110r2740l085L6833J3742J3944L8880N030j45729
4714A006517R151j2317o7847M1663J10109O1199L3200K1090j20319n991O7885
4703A144340J68311J13165N3365M485N2955N5115M8153m5499Q3390k5810l0223
4692A621747k5813o7273p1009J11617j31138k0408j9516P449K490P0578j20679
4681A358045p3437m9228O1826L1526Q4184Q8541j9324K9863k7k6957K1169K1520
4669A527701J71414j72986L7297Q6562J46513J26359J69912J43698K01010L7828
4659B475308L67309M81677M45593N65602M18925k0081l35373n26843n99234m30391
$$ plain form
4649 2842492 2490015 2278309 2034963 1801434 1807503 1637870 1485839 1334767 1369419 1321822
4639 1321822 1131224 1103903 1062494 997141 997855 992823 899636 799297 828414 856255 736952
4628 736952 667187 714470 702016 666486 755430 722344 799109 766409 585471 640658 618908
4617 618908 601435 546122 617143 640393 695422 672650 712535 765609 783341 774901 751762 744386
4605 744386 709786 670280 712906 646548 513790 579770 598483 593662 709019 803096 621233
4594 621233 609968 707652 651731 531601 526677 557786 624558 598801 590422 580230 592445 694809
4582 694809 590791 578434 659664 703459 732571 812014 842995 740318 706829 767785 672507
4571 672507 625523 620610 670323 695629 712386 665989 593870 649993 520074 628372 765113
$$ packed form
4649B842492l52477k11706k43346k33529O069j69633j52031j51072L4652m7597
4639A321822j90598k7321m1409o5353P14n032r3187j00339K9117K7841j19303
4628G36952o9765M7283j2454l5530Q8944l3086P6765l2700j80938N5187k1750
4617F18908j7473n5313P1021K3250N5029k2772L9885N3074J7732q440k3139p376
4605G44386l4600l9506M2626o6358j32758O5980J8713m821J15357R4077j81863
4594F21233j1265R7684n5921j20130m924L1109O6772k5757q379j0192J2215J02364
4582F94809j04018j2357Q1230M3795K9112P9443L0981j02677l3489O0956r5278
4571F72507m6984m913M9713K5306J6757m6397p2119N6123j29919J08298J36741
$$ plain form
4560 765113 802191 716854 806939 809438 695682 732202 765348 696777 692534 820418 766159 727092
4548 727092 835277 882106 861140 945536 873473 925878 847742 835655 763701 783869 905271
4537 905271 920641 998197 1046552 1060739 1095190 1044213 1007522 1100817 1131162 1141924 1172374 1198893
4525 1198893 1043692 1091794 1025441 1125713 1022606 1133182 1278822 1312833 1323923 1271202
4515 1271202 1265831 1270308 1200347 1234214 1287821 1252046 1292023 1267628 1237979 1202617 1235551 1255024
4503 1255024 1270015 1371003 1375128 1394159 1420452 1451236 1449327 1604933 1606120 1577517 1640903 1690767
4491 1690767 1798317 1831197 1703679 1684766 1639431 1643525 1690099 1773315 1801102 1875516 1911054
4480 1911054 1986564 2055073 2069948 2022974 2052566 2066458 2116460 2219362 2305093 2172297 2168999
$$ packed form
4560G65113L7078q5337R0085K499j13756L6520L3146o8571m243J27884n4259l9067
4548G27092J08185M6829k0966Q4396p2063N2405p8136j2087p1954K0168J21402
4537I05271J5370P7556M8355J4187L4451n0977l6691R3295L0345J0762L0450K6519
4525A198893j55201M8102o6353J00272j03107J10576J45640L4011J1090n2721
4515A271202n371M477o9961L3867N3607l5775L9977k4395k9649l5362L2934J9473
4503A255024J4991J00988M125J9031K6293L0784j909J55606J187k8603O3386M9864
4491A690767J07550L2880j27518j8913m5335M094M6574Q3216K7787P4414L5538
4480A911054P5510O8509J4875m6974K9592J3892N0002J02902Q5731j32796l298
$$ plain form
4469 2168999 2319840 2273215 2281519 2266713 2253971 2361679 2390580 2411659 2512967 2562039 2556716
4458 2556716 2671434 2737164 2763414 2869504 3028094 3042510 3127510 3158312 3190806 3328277 3349865
4447 3349865 3393065 3381470 3521230 3673422 3789006 3943836 4081141 4205338 4561030 4909418
4437 4909418 5118412 5348521 5653133 5960139 6299529 6743270 7152782 7548638 7714232 7533336
4427 7533336 7417267 7276363 7308085 7458856 7758162 8116706 8609110 8967329 9311756 9338756
4417 9338756 9360270 9498565 9553581 9771277 9972211 10287353 10834673 11659648 12712326 13363773
4407 13363773 13298542 12584352 11536930 10713195 10074058 9771412 9572859 9437549 9358401 9372883
4397 9372883 9399029 9275946 9104016 8687948 8217664 7759057 7472780 7371683 7279805 7333059
$$ packed form
4469B168999J50841m6625Q304j4806j2742J07708K8901K1079J01308M9072n323
4458B556716J14718O5730K6250J06090J58590J4416Q5000L0802L2494J37471K1588
4447C349865M3200j1595J39760J52192J15584J54830J37305J24197L55692L48388
4437D909418K08994K30109L04612L07006L39390M43741M09512L95856J65594j80896
4427G533336j16069j40904L1722J50771K99306L58544M92404L58219L44427K7000
4417I338756K1514J38295N5016K17696K00934L15142N47320Q24975J052678O51447
4407A3363773o5231p14190j047422q23735o39137l02646j98553j35310p9148J4482
4397I372883K6146j23083j71930m16068m70284m58607k86277j01097r1878N3254
$$ plain form
4387 7333059 7528386 7607051 7348569 7006282 6588909 6192246 5924717 5671609 5519357 5238793
4377 5238793 4987959 4831922 4729794 4611605 4496127 4388561 4271291 4251900 4199724 4274060
4367 4274060 4211995 4169930 4261010 4274343 4232098 4158512 4237576 4237803 4165779 4133835 4222872 4010450
4355 4010450 4081573 4136893 4128792 4059457 4117805 4122047 4122185 4168037 4140831 4130859 4227884 4245821
4343 4245821 4261215 4254933 4285797 4366316 4352010 4392150 4273256 4318292 4296003 4242513 4301427
4332 4301427 4339034 4424256 4336146 4366191 4395991 4423099 4378263 4460549 4436443 4389658 4440283
4321 4440283 4390281 4363161 4521173 4650306 4628606 4667424 4751756 4817528 4862344 4873183 4881364
4310 4881364 4947208 4905391 5106523 5125394 5031711 4978978 4974781 5005820 4985723 4981184 5009095 5158132
$$ packed form
4387G333059J95327P8665k58482l42287m17373l96663k67529k53108j52252k80564
4377E238793k50834j56037j02128j18189j15478j07566j17270j9391n2176P4336
4367D274060o2065m2065R1080J3333m2245p3586P9064K27p2024l1944Q9037k12422
4355D010450P1123N5320q101o9335N8348M242J38M5852k7206r972R7025J7937
4343D245821J5394o282L0864Q0519j4306M0140j18894M5036k2289n3490N8914
4332D301427L7607Q5222q8110L0045K9800K7108m4836Q2286k4106m6785N0625
4321D440283n0002k7120J58012J29133k1700L8818Q4332O5772M4816J0839Q181
4310D881364O5844m1817K01132J8871r3683n2733m197L1039k0097m539K7911J49037
$$ plain form
4298 5158132 5258922 5220496 5174959 5323039 5404102 5432666 5485660 5490806 5551619 5599447 5590878
4287 5590878 5669045 5751889 5958153 6018811 6030882 6091221 6199422 6259422 6252470 6389098 6533204
4276 6533204 6680967 6933173 7109386 7240543 7502279 7845133 8350559 8793636 9208515 9801663
4266 9801663 10581437 11677112 13115055 15006489 16722479 17399982 16419815 14178269 12306240
4257 12306240 10816698 9841530 8993964 8405108 7886316 7560123 7227644 7011355 6925246
4248 6925246 6805428 6666632 6707897 6682567 6632203 6393347 6417240 6356432 6319057 6300030 6326014
4237 6326014 6391442 6404338 6366909 6410777 6363954 6368608 6357393 6360636 6371916 6282953 6346095 6295288
4225 6295288 6280187 6191385 6246647 6248432 6147411 6253614 6305821 6304341 6265635 6180859 6221247
$$ packed form
4298E158132J00790l8426m5537J48080Q1063K8564N2994N146O0813M7828q569
4287E590878P8167Q2844K06264O0658J2071O0339J08201O0000o952J36628J44106
4276F533204J47763K52206J76213J31157K61736L42854N05426M43077M14879N93148
4266I801663P79774J095675J437943J891434J715990O77503r80167k241546j872029
4257A2306240j489542r75168q47566n88856n18792l26193l32479k16289q6109
4248F925246j19818j38796M1265k5330n0364k38856K3893o0808l7375j9027K5984
4237F326014O5428J2896l7429M3868m6823M654j1215L243J1280q8963O3142n0807
4225F295288j5101q8802N5262J785j01021J06203N2207j480l8706q4776M0388
$$ plain form
4214 6221247 6242407 6289878 6295828 6230534 6261663 6268147 6350516 6267919 6237857 6241117 6151463 6153699
4202 6153699 6193911 6157673 6130031 6149765 6056942 6041621 6114989 6171252 6100955 6122809 6112773
4191 6112773 6166084 6248350 6206911 6203805 6210884 6269467 6246054 6179291 6213913 6193461 6184850 6261497
4179 6261497 6216099 6203656 6186798 6274402 6317263 6245329 6198670 6306877 6344771 6379234 6455731
4168 6455731 6462139 6508518 6479018 6547671 6573485 6606079 6591808 6650864 6534776 6547184 6628861
4157 6628861 6651491 6747126 6850001 6817941 6939508 6914514 7026541 7048976 7127277 7185567 7264689
4146 7264689 7217529 7407536 7483489 7481822 7664243 7808471 7815452 7946324 7974885 8145149 8204133
4135 8204133 8286100 8401873 8491006 8661787 8741767 8900012 8927612 9170980 9298452 9557718
$$ packed form
4214F221247K1160M7471N950o5294L1129O484Q2369q2597l0062L260q9654K236
4202F153699M0212l6238k7642J9734r2823j5321P3368N6263p0297K1854j0036
4191F112773N3311Q2266m1439l106P079N8583k3413o6763L4622k0452q611P6647
4179F261497m5398j2443j6858Q7604M2861p1934m6659J08207L7894L4463P6497
4168F455731O408M6379k9500O8653K5814L2594j4271N9056j16088J2408Q1677
4157F628861K2630R5635J02875l2060J21567k4994J12027K2435P8301N8290P9122
4146G264689m7160J90007P5953j667J82421J44228O981J30872K8561J70264N8984
4135H204133Q1967J15773Q9133J70781P9980J58245K7600K43368J27472K59266
$$ plain form
4125 9557718 9795465 9866640 9957587 9953938 10073455 10264288 10383562 10558519 10746340 10843860
4115 10843860 10992778 11201352 11399754 11539883 11693431 11886293 12058350 12183785 12542202
4106 12542202 12798172 12969480 13252099 13511932 13871677 14193092 14470847 14689406 14888638
4097 14888638 15071665 15255884 15531904 15799013 16107557 16489292 16851643 17159187 17505427
4088 17505427 17800465 18216958 18657497 19130111 19453064 19976180 20435038 20935566 21486091
4079 21486091 22050652 22691126 23234408 23890625 24320843 24929126 25535950 26137899 26859444
4070 26859444 27624812 28300313 29085128 29764916 30454225 31261086 32053352 32810856 33571929
4061 33571929 34356310 35240682 36114160 37169495 38100905 39003822 39975960 41212995 42429320
$$ packed form
4125I557718K37747P1175R0947l649J19517J90833J19274J74957J87821R7520
4115A0843860J48918K08574J98402J40129J53548J92862J72057J25435L58417
4106A2542202K55970J71308K82619K59833L59745L21415K77755K18559J99232
4097A4888638J83027J84219K76020K67109L08544L81735L62351L07544L46240
4088A7505427K95038M16493M40539M72614L22953N23116M58858N00528N50525
4079B1486091N64561O40474N43282O56217M30218O08283O06824O01949P21545
4070B6859444P65368O75501P84815O79788O89309Q06861P92266P57504P61073
4061C3571929P84381Q84372Q73478J055335R31410R02917R72138J237035J216325
$$ plain form
4052 42429320 43806659 45326118 46812197 48432458 50228214 52201934 54339956 56576249
4044 56576249 59177731 62103484 65213632 68600620 72385584 76433366 80741152 85261041
4036 85261041 89984831 94695103 99227590 103576223 107144881 109415190 109925851 108534688
4028 108534688 105229360 100683415 95656288 90435363 85853582 81716975 77929287 74711240
4020 74711240 71764455 69285789 67132699 64997183 62979705 61150885 59548242 58002314
4012 58002314 56621658 55231728 53743201 52286783 50870256 49598607 48228407 46742549
4004 46742549 45413410 44120168 42872199 41612524 40533388 39466298 38359414 37478112
3996 37478112 36646382 35852135 35044557 34240691 33469626 32843121 32346188 31809349 31384748
$$ packed form
4052D2429320J377339J519459J486079J620261J795756J973720K138022K236293
4044E6576249K601482K925753L110148L386988L784964M047782M307786M519889
4036H5261041M723790M710272M532487M348633L568658K270309N10661j391163
4028A08534688l305328m545945n027127n220925m581781m136607l787688l218047
4020G4711240k946785k478666k153090k135516k017478j828820j602643j545928
4012E8002314j380656j389930j488527j456418j416527j271649j370200j485858
4004D6742549j329139j293242j247969j259675j079136j067090j106884q81302
3996C7478112q31730p94247q07578q03866p71065o26505m96933n36839m24601
$$ plain form
3987 31384748 31040972 30815570 30721564 30733295 31046561 31306020 31302646 30883249 30113933 29189433
3977 29189433 28081636 27113219 26504813 25823548 25282925 24821028 24465078 24021077 23616704
3968 23616704 23538852 23454052 23430979 23443535 23536238 23869873 24159059 24634433 25384267 26469594
3958 26469594 27740470 28396881 28409318 27604804 25993659 24331930 22781729 21656780 20787579
3949 20787579 19869940 19179862 18722880 18355942 18028496 17670598 17595327 17485220 17382221 17344981
3939 17344981 17327429 17265024 17398287 17672368 17969682 18365927 18678065 18716290 18228555 17511792
3929 17511792 16738466 15901713 15269264 14879918 14426385 14141829 13975798 13746779 13392846
3920 13392846 13203202 12959390 12833687 12632931 12568982 12574940 12504765 12284335 12178809 12179866
$$ packed form
3987C1384748l43776k25402r4006J1731L13266K59459l374m19397p69316r24500
3977B9189433j107797r68417o08406o81265n40623m61897l55950m44001m04373
3968B3616704p7852q4800k3073J2556R2703L33635K89186M75374P49834J085327
3958B6469594J270876O56411J2437q04514j611145j661729j550201j124949q69201
3949B0787579r17639o90078m56982l66938l27446l57898p5271j10107j02999l7240
3939A7344981j7552o2405J33263K74081K97314L96245L12138L8225m87735p16763
3929A7511792p73326q36753o32449l89346m53533k84556j66031k29019l53933
3920A3392846j89644k43812j25703k00756o3949N958p0175k20430j05526J057
$$ plain form
3910 12179866 11985037 11842086 11750307 11624160 11486244 11344461 11111484 10978250 10913607 10894863
3900 10894863 10711763 10565552 10404606 10328429 10219485 10160348 10073823 9875073 9794431 9814632
3890 9814632 9712706 9606957 9599123 9446228 9294481 9261052 9228633 9189129 9002317 8903606 8822725
3879 8822725 8781181 8622641 8530827 8410973 8329086 8269334 8162291 8136062 8054426 8060055 7899942
3868 7899942 7894553 7999610 7907086 7853859 7656824 7697898 7776630 7762729 7852270 7784889 7828870
3857 7828870 7849681 7798052 7780684 7806802 7789901 7765561 7882757 7862425 7919150 8012021 8033662
3846 8033662 8249044 8281331 8421361 8445932 8383589 8484099 8702858 8851271 8924029 9056252
3836 9056252 9098018 9373832 9479578 9700856 9919669 9963551 10163875 10331230 10520069 10745867
$$ packed form
3910A2179866j94829j42951r1779j26147j37916j41783k32977j33234o4643j8744
3900A0894863j83100j46211j60946p6177j08944n9137q6525j98750q0642K0201
3890I814632j01926j05749p834j52895j51747l3429l2419l9504j86812r8711q0881
3879H822725m1544j58540r1814j19854q1887n9752j07043k6229q1636N629j60113
3868G899942n389J05057r2524n3227j97035M1074P8732j3901Q9541o7381M3981
3857G828870K0811n1629j7368K6118j6901k4340J17196k0332N6725R2871K1641
3846H033662K15382L2287J40030K4571o2343J00510K18759J48413P2758J32223
3836I056252M1766K75814J05746K21278K18813M3882K00324J67355J88839K25798
$$ plain form
3826 10745867 10952518 11243465 11478510 11817380 12167293 12317169 12553398 12673189 12971460
3817 12971460 13126126 13248997 13518202 13832266 14279513 14761498 15325344 15864579 16295572
3808 16295572 16906763 17545198 18171611 18816517 19478554 20142175 20872718 21642925 22504737
3799 22504737 23314973 24025616 24744698 25352014 25668088 25981904 26293702 26725998 27010146
3790 27010146 27593568 28296256 29015251 29872244 30858325 31901395 32983063 34197413 35449758
3781 35449758 36849779 38382590 39790387 41031224 42050563 42999011 43425901 42987156 41998530
3772 41998530 40863481 39807027 39134774 38797075 38681776 38767519 39007786 39634583 40247335
3763 40247335 40842997 41585341 42364482 42977137 43554557 44012291 44188804 43981108 43392010
$$ packed form
3826A0745867K06651K90947K35045L38870L49913J49876K36229J19791K98271
3817A2971460J54666J22871K69205L14064M47247M81985N63846N39235M30993
3808A6295572O11191O38435O26413O44906O62037O63621P30543P70207Q61812
3799B2504737Q10236P10643P19082O07316L16074L13816L11798M32296K84148
3790B7010146N83422P02688P18995Q56993R86081J043070J081668J214350J252345
3781C5449758J400021J532811J407797J240837J019339R48448M26890m38745r88626
3772D1998530j135049j056454o72253l37699j15299Q5743K40267O26797O12752
3763D0247335N95662P42344P79141O12655N77420M57734J76513k07696n89098
$$ plain form
3754 43392010 42546876 41491499 40345350 39049873 37660958 36385083 35257986 34461921
3746 34461921 33738881 33356307 32938510 32659373 32349085 32028012 31587002 31059855 30327025
3737 30327025 29568484 28573024 27357806 26052700 24671535 23442030 22207041 21098432
3729 21098432 20153521 19212274 18373419 17706307 17115213 16429117 15879699 15260188 14872837
3720 14872837 14352000 14054906 13591096 13151299 12711781 12293011 11928385 11505775 11080851
3711 11080851 10703951 10198429 9887499 9608147 9380931 9208982 8884453 8527619 8191430
3702 8191430 8037748 7830065 7614913 7394591 7206922 7056393 6904913 6764518 6618360 6500117
3692 6500117 6457576 6259323 6051891 5958564 5800869 5617544 5616290 5406827 5368452 5131364
$$ packed form
3754D3392010q45134j055377j146149j295477j388915j275875j127097p96065
3746C4461921p23040l82574m17797k79137l10288l21073m41010n27147p32830
3737C0327025p58541r95460j215218j305106j381165j229505j234989j108609
3729B1098432r44911r41247q38855o67112n91094o86096n49418o19511l87351
3720A4872837n20837k97094m63810m39797m39518m18770l64626m22610m24924
3711A1080851l76900n05522l10930k79352k27216j71949l24529l56834l36189
3702H191430j53682k07683k15152k20322j87669j50529j51480j40395j46158j18243
3692F500117m2541j98253k07432r3327j57695j83325j254k09463l8375k37088
$$ plain form
3682 5131364 4955076 4715587 4700015 4513512 4404125 4193935 4232746 4185573 4140304 4098807
3672 4098807 4051442 3851744 3780570 3764882 3709796 3592709 3547181 3416443 3283063 3274426 3224942
3661 3224942 3123151 3005001 2928192 2883226 2750269 2772821 2622853 2547432 2583727 2480187
3651 2480187 2469721 2324539 2243473 2216298 2164025 2197860 2160931 2137294 2116206 1953515 1984198
3640 1984198 1949722 1847419 1905780 1948811 1838152 1763739 1796609 1852312 1715555 1735748 1560468
3629 1560468 1661224 1578813 1630344 1605294 1562219 1572677 1507516 1529459 1391958 1423450 1441938
3618 1441938 1455066 1535896 1534705 1547698 1492726 1440914 1315245 1292924 1303244 1284091 1289774 1386279
3606 1386279 1345943 1264449 1301120 1234759 1190419 1205607 1287891 1128493 1155484 1125954 959344
$$ packed form
3682E131364j76288k39489j5572j86503j09387k10190L8811m7173m5269m1497
3672D098807m7365j99698p1174j5688n5086j17087m5528j30738j33380q637m9484
3661C224942j01791j18150p6809m4966j32957K2552j49968p5421L6295j03540
3651B480187j0466j45182q1066k7175n2273L3835l6929k3637k1088j62691L0683
3640A984198l4476j02303N8361M3031j10659p4413L2870N5703j36757K0193j75280
3629A560468J00756q2411N1531k5050m3075J0458o5161K1943j37501L1492J8488
3618A441938J3128Q0830j191J2993n4972n1812j25669k2321J0320j9153N683R6505
3606A386279m0336q1494L6671o6361m4340J5188Q2284j59398K6991k9530j66610
$$ plain form
3595 959344 1046162 1103161 1171617 1182896 1156370 1163518 1150259 1050663 1069856 1158941 995954 1046519
3583 1046519 1103182 977890 1109405 1155759 1002491 1038582 994416 984690 997961 1036050 1074688
3572 1074688 1060288 1093380 1100470 996970 959668 1067495 1063162 1055983 1053472 1042350 1029987 978531
3560 978531 864730 736386 810365 838287 831220 884172 809794 814377 839372 883746 933688 946596
3548 946596 857807 764961 843405 892965 897076 865787 688169 800563 785549 690381 740962
3537 740962 698203 739171 661482 689432 699683 645228 630139 538779 564024 612363 726578
3526 726578 683402 717176 697259 614940 509901 541800 580683 585648 670592 551201 709875
3515 709875 664651 522841 481664 565062 532109 473253 491461 351183 480870 504029 479893
$$ packed form
3595I59344Q6818N6999O8456J1279k6526P148j3259r9596J9193Q9085j62987N0565
3583A046519N6663j25292J31515M6354j53268L6091m4166r726J3271L8089L8638
3572A074688j4400L3092P090j03500l7302J07827m333p179k511j1122j2363n1456
3560I78531j13801j28344P3979K7922p067N2952p4378M583K4995M4374M9942J2908
3548I46596q8789r2846P8444M9560M111l1289j77618J12394j5014r5168N0581
3537G40962m2759M0968p7689K7950J0251n4455j5089r1360K5245M8339J14215
3526G26578m3176L3774j9917q2319j05039L1899L8883M965Q4944j19391J58674
3515G09875m5224j41810m1177Q3398l2953n8856J8208j40278J29687K3159k4136
$$ plain form
3504 479893 469744 401093 453061 360831 368298 434859 333606 394891 458757 437252 433450 373512
3492 373512 345280 426436 446716 410234 496428 459385 442963 357177 421889 422999 445977 437264
3480 437264 370649 352603 363516 408714 344823 405882 220315 255530 327488 358787 263207
3469 263207 319216 485107 360732 347898 368217 321348 266647 288438 233915 235787 275161
3458 275161 265704 285507 330923 312071 267689 276154 300210 268579 305965 320430 237803 258709
3446 258709 350177 329806 184510 193328 256777 257838 195353 233222 233263 290854 120548 61768
3434 61768 36895 182249 111758 198359 239346 242561 278072 231438 185806 250872 147088 187571
3422 187571 257277 158245 124957 176473 232055 64576 125862 87708 31361 48654 194991
$$ packed form
3504D79893j0149o8651N1968r2230P467O6561j01253O1285O3866k1505l802n9938
3492C73512k8232Q1156K0280l6482Q6194l7043j6422q5786O4712J110K2978q713
3480D37264o6615j8046J0913M5198o3891O1059j85567L5215P1958L1299r5580
3469B63207N6009J65891j24375j2834K0319m6869n4701K1791n4523J872L9374
3458B75161r457J9803M5416j8852m4382Q465K4056l1631L7386J4465q2627K0906
3446B58709R1468k0371j45296Q818O3449J061o2485L7869M1N7591j70306n8780
3434F1768k4873J45354p0491Q6601M0987L215L5511m6634m5632O5066j03784M0483
3422A87571O9706r9032l3288N1516N5582j67479O1286l8154n6347J7293J46337
$$ plain form
3411 194991 120447 161916 81241 108100 106785 102928 146782 191984 176465 158255 221070 134535
3399 134535 134016 117970 -18351 -38977 51482 136953 54233 98268 76114 127816 141199 201559
3387 201559 137246 107984 10932 4161 50511 156821 232771 159301 103359 202761 178239 127669
3375 127669 53734 117676 145901 110840 15977 -11694 52489 -27299 280 89021 159698 147041
3363 147041 80922 -29668 -111440 -59706 -18371 -80806 -1651 15406 52621 20553 -4882
3352 -4882 52890 -6034 -32116 53908 56729 91415 131460 43983 -7348 45870 10869 -49302
3340 -49302 -49862 -6471 25628 23276 -49751 -64728 -2257 89881 76010 -21938 38273 96714
3328 96714 497 -25659 -42249 -67483 50756 -80191 6516 56450 82292 19812 -35566
$$ packed form
3411A94991p4544M1469q0675K6859j315l857M3854M5202j5519j8210O2815q6535
3399A34535n19j6046j36321k0626R0459Q5471q2720M4035k2154N1702J3383O0360
3387B01559o4313k9262r7052o771M6350J06310P5950p3470n5942R9402k4522n0570
3375A27669p3935O3942K8225l5061r4863k7671O4183p9788K7579Q8741P0677j2657
3363A47041o6119j10590q1772N1734M1335o2435P9155J7057L7215l2068k5435
3352d882N7772n8924k6082Q6024K821L4686M0045q7477n1331N3218l5001o0171
3340d9302n60M3391L2099k352p3027j4977O2471R2138j3871r7948O0211N8441
3328I6714r6217k6156j6590k5234J18239j30947Q6707M9934K5842o2480n5378
$$ plain form
3317 -35566 -11067 78966 32281 -23363 64047 97907 27457 -58789 -102090 -15319 -20458 -90837
3305 -90837 32528 -20146 16824 43744 -20082 39537 133608 -37575 -38987 -56089 54621
3294 54621 20141 8165 21831 21455 10792 46846 34556 8131 69291 106575 17354 758
3282 758 -37224 92584 79325 161718 26487 -907 5713 44867 29993 -81457 -38337 43686
3270 43686 77697 121671 155801 85676 63804 12737 14252 99846 110646 38865 51033 44906
3258 44906 60320 32461 -4221 -22411 53137 168100 148353 117790 60148 101703 142520 54794
3246 54794 135677 30746 124756 233192 180099 172831 281018 291756 143071 204468 231625
3235 231625 167939 266608 331663 282992 313729 328233 399716 369956 223806 348825 506460
$$ packed form
3317c5566K4499R0033m6685n5644Q7410L3860p0450q6246m3301Q6771n139p0379
3305i0837J23365n2674L6970K6920o3826N9619R4071j71183j412j7102J10710
3294E4621l4480j1976J3666l76j0663L6054j2290k6425O1160L7284q9221j6596
3282G58l7982J29808j3259Q2393j35231k7394O620L9154j4874j11450M3120Q2023
3270D3686L4011M3974L4130p0125k1872n1067J515Q5594J0800p1781J2168o127
3258D4906J5414k7859l6682j8190P5548J14963j9747l0563n7642M1555M0817q7726
3246E4794Q0883j04931R4010J08436n3093p268J08187J0738j48685O1397K7157
3235B31625o3686R8669O5055m8671L0737J4504P1483k9760j46150J25019J57635
$$ plain form
3224 506460 422367 389181 451488 441650 538989 498318 514322 647186 596239 772074 801069
3213 801069 724361 754580 906572 920198 965928 1014344 1035467 918097 1025966 1086602 1156504
3202 1156504 1322940 1331298 1396141 1525428 1672421 1779649 1794072 2040530 2205743 2463207
3192 2463207 2776248 2966049 3372248 3711673 3978394 4427497 4850845 5470417 6313303 7388735
3182 7388735 8909598 11043624 13550494 14977357 14581548 12201077 9531531 7689759
3174 7689759 6391958 5177789 4500458 3963212 3503888 3254017 3074266 2762742 2505614
3165 2505614 2229732 2150803 1976137 1888838 1735173 1571397 1365772 1282752 1184858 1174684
3155 1174684 1181011 1077226 875878 931242 989080 854232 755722 792929 738719 772980 729160
$$ packed form
3224E06460q4093l3186O2307r838R7339m0671J6004J32864n0947J75835K8995
3213H01069p6708L0219J51992J3626M5730M8416K1123j17370J07869O0636O9902
3202A156504J66436Q358O4843J29287J46993J07228J4423K46458J65213K57464
3192B463207L13041J89801M06199L39425K66721M49103M23348O19572Q42886J075432
3182G388735J520863K134026K506870J426863l95809k380471k669546j841772
3174G689759j297801j214169o77331n37246m59324k49871j79751l11524k57128
3165B505614k75882p8929j74666q7299j53665j63776k05625q3020r7894j0174
3155A174684O327j03785k01348N5364N7838j34848r8510L7207n4210L4261m3820
$$ plain form
3144 729160 625871 532118 558340 460108 402960 438578 401841 382062 424638 419729 333170 316007
3132 316007 402241 351834 298165 358619 287406 254334 224857 302301 291130 201723 224695 171484
3120 171484 288110 108569 109799 188143 139497 115976 73435 84029 73717 50201 29745
3109 29745 131172 103564 188028 79295 36567 69653 135153 56824 60132 11915 -26378 -45420
3097 -45420 73478 45967 60236 40876 -30732 -20884 19128 -87473 -57233 -17736 -10075 60941
3085 60941 84891 1994 55247 435 -43742 -36792 -74361 -141631 -66051 -45874 -55021 -45165
3073 -45165 -90703 -98532 -48959 -2557 -22240 16989 78235 82380 75990 -24532 -12628 -52757
3061 -52757 38682 75055 28103 -84790 -47902 8167 -64931 -130053 -126979 -181048 -96339 -96802
$$ packed form
3144G29160j03289r3753K6222r8232n7148L5618l6737j9779M2576m909q6559j7163
3132C16007Q6234n0407n3669O0454p1213l3072k9477P7444j1171q9407K2972n3211
3120A71484J16626j79541J230P8344m8646k3521m2541J0594j0312k3516k0456
3109B9745J01427k7608Q4464j08733m2728L3086O5500p8329L308m8217l8293j9042
3097d5420J18898k7511J4269j9360p1608R848M0012j06601L0240L9497P661P1016
3085F0941K3950q2897N3253n4812m4177O950l7569o7270P5580K0177r147R856
3073d5165m5538p829M9573M6402j9683L9229O1246M145o390j00522J1904m0129
3061e2757R1439L6373m6952j12893L6888N6069p3098o5122L074n4069Q4709m63
$$ plain form
3049 -96802 -61295 -11036 -65645 -84079 20463 -18102 -71966 -12993 -58196 -10551 33588 -29518
3037 -29518 -55628 -108064 -125025 -70146 -148196 -129598 -140932 -128102 -100482 -96920 -42520 -8323
3025 -8323 52537 3795 -84500 -19170 -85093 -83065 -70820 -88719 -25450 -55944 -138334 -4361
3013 -4361 -47886 -4285 64368 25615 -48013 -12575 -32950 -22165 -70651 -23842 -22346 -102415
3001 -102415 34757 75358 -45318 -35558 -48972 -62289 -21584 -93818 -54126 -25152 -95832
2990 -95832 -48577 37621 52108 -15465 -107328 -85787 -103985 -144741 -3967 -14590 -54197 60226
2978 60226 -5842 -14056 -36041 59488 -6292 17012 -97141 -128436 -107885 -95399 -8371 -57114
2966 -57114 -52415 -65462 41754 -165650 -103676 -151413 -204519 -84377 -76491 -74953 -147209 -79764
$$ packed form
3049i6802L5507N0259n4609j8434J04542l8565n3864N8973m5203M7645M4139o3106
3037b9518k6110n2436j6961N4879p8050J8598j1334J2830K7620L562N4400L4197
3025h323O0860m8742q8295O5330o5923K028J2245j7899O3269l0494q2390J33973
3013d361m3525M3601O8653l8753p3628L5438k0375J0785m8486M6809J496q0069
3001a02415J37172M0601j20676R760j3414j3317M0705p2234L9692K8974p0680
2990i5832M7255Q6198J4487o7573r1863K1541j8198m0756J40774j0623l9607J14423
2978F0226o6068q214k1985R5529o5780K3304j14153l1295K0551J2486Q7028m8743
2966e7114M699j3047J07216k07404O1974m7737n3106J20142P886J538p2256O7445
$$ plain form
2954 -79764 -24424 10718 17771 -48683 -26006 -22458 80962 -7843 -39601 -31369 -75571 -19180
2942 -19180 -134925 -256708 -89692 -79940 -92595 -65170 -183515 -53767 -71194 -64524 -22960
2931 -22960 -104027 -112617 -141697 -24366 -141810 -104738 -16619 -68849 -5379 3729 -17595 -105910
2919 -105910 -96421 -36992 -89854 -90363 -12632 1580 -74109 50571 -59276 -201474 -192754 -174357
2907 -174357 -60058 -68710 -22643 -18532 -33633 -54658 -75391 -27195 -10085 4370 -93327 -91124
2895 -91124 -60455 -30648 -109457 -30686 23805 -3839 -125873 -80045 -63432 -128088 -134494 -134371
2883 -134371 -157050 -108487 -76431 -90906 16504 -37434 -95845 -99814 -95238 -221541 -92680
2872 -92680 -29104 -40594 -75985 40086 -55498 -34416 15066 -21499 -108054 -76891 -97205 7122
$$ packed form
2954g9764N5340L5142P053o6454K2677L548J03420q8805l1758Q232m4202N6391
2942a9180j15745j21783J67016R752j2655K7425j18345J29748j7427O670M1564
2931b2960q1067q590k9080J17331j17444L7072Q8119n2230O3470R108k1324q8315
2919a05910R489N9429n2862n09P7731J4212p5689J24680j09847j42198Q720J8397
2907a74357J14299q652M6067M111j5101k1025k0733M8196J7110J4455r7697K203
2895i1124L0669K9807p8809P8771N4491k7644j22034M5828J6613o4656o406J23
2883a34371k2679M8563L2056j4475J07410n3938n8411l969M576j26303J28861
2872i2680O3576j1490l5391J16071r5584K1082M9482l6565q6555L1163k0314J04327
$$ plain form
2860 7122 -104413 -74566 -66440 -103665 -71719 -138953 -184043 -131489 -27098 -141471 23178
2849 23178 65357 -13240 -13380 -84206 -44692 -69077 -69816 -102273 -37449 -68965 -202068 -108802
2837 -108802 -69202 -22376 -5509 -57614 -74408 -59229 -75934 -16249 -1111 2352 -73463 -68875
2825 -68875 -83953 -76380 -82637 -85726 -11025 -396 -59056 -5459 -45346 -62169 -109356 -99485 -84532
2812 -84532 -66466 -86608 -59603 -123913 -183278 -85696 -77485 -87561 -133266 -94386 -128134 -162572
2800 -162572 -128138 -57930 -91051 -148794 -86411 -95966 -68649 -142891 -22380 34725 -143123
2789 -143123 -75891 45500 -11886 -76980 -86652 -130270 -58181 -32567 -105866 -73173 -112589 -80253
2777 -80253 -59281 -116390 -99292 -91373 -143347 -62107 13730 -46723 86534 -40454 -49301 -34629
$$ packed form
2860G122j11535K9847Q126l7225L1946o7234m5090N2554J04391j14373J64649
2849B3178M2179p8597j40p0826L9514k4385p39l2457O4824l1516j33103R3266
2837a08802L9600M6826J6867n2105j6794J5179j6705N9685J5138L463p5815M588
2825f8875j5078P573o257l089P4701J0629n8660N3597l9887j6823m7187R871J4953
2812h4532J8066k0142K7005o4310n9365R7582Q211j0076m5705L8880l3748l4438
2800a62572L4434P0208l3121n7743O2383r555K7317p4242J20511N7105j77848
2789a43123O7232J21391n7386o5094r672m3618P2089K5614p3299L2693l9416L2336
2777h0253K0972n7109J7098P919n1974Q1240P5837o0453J33257j26988q847J4672
$$ plain form
2765 -34629 -82389 -30614 30698 -16296 -119514 -22792 15054 -36180 -27254 -55795 -15705 -65918
2753 -65918 -61707 -74184 -103330 -22891 -78446 91979 67929 -41205 -30502 -85873 -5145 -20449
2741 -20449 53958 -8750 -25888 -64536 -127537 -115315 -117305 -114994 -69365 -49087 -125432 -88595
2729 -88595 -81059 -125276 -40686 -19728 -105579 -174748 -114541 -101268 -91330 -14518 -51499 2148
2717 2148 -60428 -83691 -3024 -13819 -64839 -41237 -52081 -70698 -10541 -20949 -110868 -143724
2705 -143724 -64257 -137765 -127802 -207634 -191040 -95930 3922 -114954 -71272 -89224 -141710 -104612
2693 -104612 -106578 -59627 -76384 -10020 -103462 -68629 -30935 -62510 -60277 30201 7599 10256
2681 10256 -53985 -40798 -89815 -82954 -26114 -109026 -90965 -127321 -59502 -38770 -65805 -102569
$$ packed form
2765c4629m7760N1775O1312m6994j03218R6722L7846n1234Q926k8541M0090n0213
2753f5918M211j2477k9146Q0439n5555J70425k4050j09134J0703n5371Q0728j5304
2741b0449P4407o2708j7138l8648o3001J2222j990K311M5629K0278p6345L6837
2729h8595P536m4217Q4590K0958q5851o9169O0207J3273R938P6812l6981N3647
2717B148o2576k3263Q0667j0795n1020K3602j0844j8617O0157j0408q9919l2856
2705a43724P9467p3508R963p9832J6594R5110R9852j18876M3682j7952n2486L7098
2693a04612j966M6951j6757O6364r3442L4833L7694l1575K233R0478k2602K657
2681A0256o4241J3187m9017O861N6840q2912J8061l6356O7819K0732k7035l6764
$$ plain form
2669 -102569 -29498 51939 84806 -62923 -57076 -137237 -50809 74256 -12564 2535 -117428
2658 -117428 -77287 -201856 6242 -53274 15452 3435 -123575 -61266 -11951 -24830 -13781
2647 -13781 -5519 -44657 29075 56960 2555 -35519 20532 69021 30512 24281 -34699 -57724
2635 -57724 -48833 -92537 -150611 -96460 -85876 -22672 -86639 -42815 -10136 20512 3389 -35878
2623 -35878 -75233 12919 14233 -19441 -53337 -106874 -180290 -134403 -113267 -87588 -160079 -190693
2611 -190693 -115097 -57019 19041 -92789 -71996 -56425 -75022 -73600 -48185 -5693 23840 -29281
2599 -29281 -4200 -55151 -25787 -42227 -75062 -135367 -90567 -109082 -37454 -62859 -127420 -102807
2587 -102807 -78667 -120284 -43293 9936 -32001 -49986 -9320 -46592 -70710 -61244 8099 -40213
$$ packed form
2669a02569P3071Q1437L2867j47729N847q0161Q6428J25065q6820J5099j19963
2658a17428M0141j24569K08098n9516O8726j2017j27010O2309M9315j2879J1049
2647a3781Q262l9138P3732K7885n4405l8074N6051M8489l8509o231n8980k3025
2635e7724Q891m3704n8074N4151J0584O3204o3967M3824L2679L0648j7123l9267
2623c5878l9355Q8152J314l3674l3896n3537p3416M5887K1136K5679p2491l0614
2611a90693P5596N8078P6060j11830K0793J5571j8597J422K5415M2492K9533n3121
2599b9281K5081n0951K9364j6440l2835o0305M4800j8515P1628k5405o4561K4613
2587a02807K4140m1617P6991N3229m1937j7985M0666l7272k4118R466O9343m8312
$$ plain form
2575 -40213 -63109 -31970 9095 -4744 8061 -86656 -153929 -66251 -699 -52206 -135376 -40345
2563 -40345 -8001 -84286 -18243 -56414 -43409 23214 40030 2736 -56411 -87524 -29355 -17466
2551 -17466 -118441 -137053 -164070 -125484 -45712 -65986 -68954 -39957 -108396 -121029 -48388 -108831
2539 -108831 -15003 96858 -36789 -58338 12964 16190 14736 -8426 -72457 -139012 -123351 -189912
2527 -189912 -141174 -139756 -94330 -46594 -55060 -40365 -77120 -164551 -133197 -115168 -134279 -114066
2515 -114066 -38319 13426 -62728 -34704 -46773 -21919 -92363 -21756 -33220 -49416 -76546 -98594
2503 -98594 -75228 -22297 -73780 -128216 -125270 -119067 -126193 -76907 -180047 -20929 -25214 -4532
2491 -4532 -38228 -40357 -63110 -38438 -57290 -144707 -58414 -49239 -37445 -163276 -91842 -78107
$$ packed form
2575d0213k2896L1139M1065j3839J2805r4717o7273Q7678O5552n1507q3170R5031
2563d0345L2344p6285O6043l8171J3005O6623J6816l7294n9147l1113N8169J1889
2551a7466j00975j8612k7017L8586P9772k0274k968K8997o8439j2633P2641o0443
2539a08831R3828J11861j33647k1549P1302L226j454k3162o4031o6555J5661o6561
2527a89912M8738J418M5426M7736q466J4695l6755q7431L1354J8029j9111K0213
2515a14066P5747N1745p6154K8024j2069K4854p0444P0607j1464j6196k7130k2048
2503i8594K3366N2931n1483n4436K946O203p126M9286j03140J59118m285K0682
2491d532l3696k129k2753K4672j8852q7417Q6293R175J1794j25831P1434J3735
$$ plain form
2479 -78107 33751 -45456 61757 -54385 -197282 -162610 -81460 -130072 -163658 -86792 -70225
2468 -70225 -106535 -136839 -12595 2188 -37812 52146 -60856 -92426 -90860 -146939 -50386 49666
2456 49666 -18986 -37921 99711 -32643 42949 -6711 -82381 17436 3523 -25794 10607
2445 10607 -60153 -67271 -91470 -64696 -111637 3160 -31487 -34709 -102198 -100319 -27955 726
2433 726 -51881 13169 4550 -100282 12427 40732 -46095 -45792 31350 -17431 -51709 -64219
2421 -64219 -31981 -7802 60685 50397 -63607 -105840 -15437 23170 18099 -22064 61151 32538
2409 32538 -38544 -83088 -81638 -99441 28843 -69391 -45753 -44823 -37599 -2182 -81164 -72984 -3758
2396 -3758 -507 9011 -72602 -83415 -43508 -76887 56296 -30362 -98270 -118271 -88905 -157247
$$ packed form
2479g8107J11858p9207J07213j16142j42897L4672Q1150m8612l3586P6866J6567
2468g0225l6310l0304J24244J4783m0000Q9958j13002l1570J566n6079R6553J00052
2456D9666o8652j8935J37632j32354P5592m9660p5670R9817j3913k9317L6401
2445A0607p0760p118k4199K6774m6941J14797l4647l222o7489J879P2364K8681
2433G26n2607O5050q619j04832J12709K8305q6827L03P7142m8781l4278j2510
2421f4219L2238K4179O8487j0288j14004m2233R0403L8607n071m0163Q3215k8613
2409C2538p1082m4544J450j7803J28284r8234K3638R30P224L5417p8982Q180O9226
2396c758L251R518q1613j0813L9907l3379J33183q6658o7908k0001K9366o8342
$$ plain form
2384 -157247 -86724 -18038 -17963 -70621 -119355 -126079 -85506 25503 -85659 -112879 -4303 18802
2372 18802 -95552 -88853 -68125 -158376 -106863 -105523 -63180 -27117 -18606 -100770 -87482 -16811
2360 -16811 -23340 -1099 -50439 -25221 -14713 -50001 27791 19784 -75852 -62877 -25270 10440
2348 10440 -4771 18706 36335 62668 -58723 -24805 25141 -69169 -129765 -72168 -80495 -123946
2336 -123946 -143359 -152797 -13242 -5730 -116238 -128116 -27470 -120518 -43901 -41169 -15574 -104428
2324 -104428 -79484 -44931 -100612 -36600 -14576 42253 21142 -9950 23370 64895 -2652 -16890
2312 -16890 -32364 -59069 -18282 25707 5649 20944 31449 -7506 -90264 -73173 22480 -92224
2300 -92224 -78436 -90899 -49796 -42902 -132243 -52597 14351 20271 -92740 -48820 21514 -113755
$$ packed form
2384a57247P0523O8686P5n2658m8734o724M0573J11009j11162k7220J08576K3105
2372A8802j14354O699K0728r0251N1513J340M2343L6063Q511q2164J3288P0671
2360a6811o529K2241m9340K5218J0508l5288P7792q007r5636J2975L7607L5710
2348A0440j5211K3477J7629K6333j21391L3918M9946r4310o0596N7597q327m3451
2336a23946j9413r438J39555P512j10508j1878J00646r3048P6617K732K5595q8854
2324a04428K4944L4553n5681O4012K2024N6829k1111l1092L3320M1525o7547j4238
2312a6890j5474k6705M0787M3989k0058J5295J0505l8955q2758J7091R5653j14704
2300i2224J3788j2463M1103O894q9341P9646O6948N920j13011M3920P0334j35269
$$ plain form
2288 -113755 -134991 -436 -30653 -27136 -121887 -125437 -34665 -2899 -38807 -119025 -232326 -209539
2276 -209539 -66252 -34791 -8569 -24321 -36152 -9185 -2218 51831 22301 -94399 41088
2265 41088 122922 91513 61650 -40142 -80786 -13722 119547 119736 44831 -120916 -89813 -44178
2253 -44178 -22264 -9495 -13262 11499 -39709 -29007 -48147 22501 15615 -47970 -53667 -59973 -73629
2240 -73629 -99512 7487 19025 -74201 -57724 14817 -68128 -85071 -5252 14438 -5549 73477
2228 73477 21786 15333 28502 -45564 -39268 14191 93172 -8401 -27332 10781 -26997 -31196
2216 -31196 -61077 -128602 -126219 -60698 -21757 24413 -14740 41402 95951 -8639 -70361 -17325
2204 -17325 -28488 -98861 25487 -40002 -239702 -171600 -48949 -94780 34061 -7438 -68306
$$ packed form
2288a13755k1236J34555l0217L517r4751l550R0772L1766l5908q0218j13301K2787
2276b09539J43287L1461K6222j5752j1831K6967O967N4049k9530j16700J35487
2265D1088Q1834l1409k9863j01792m0644O7064J33269J89p4905j65747L1103M5635
2253d4178K1914J2769l767K4761n1208J0702j9140P0648o886o3585n697o306j3656
2240g3629k5883J06999J1538r3226J6477P2541q2945j6943P9819J9690j9987P9026
2228G3477n1691o453J3169p4066O296N3459P8981j01573j8931L8113l7778m199
2216c1196k9881o7525K383O5521L8941M6170l9153N6142N4549j04590o1722N3036
2204a7325j1163p0373J24348o5489j99700O8102J22651m5831J28841m1499o0868
$$ plain form
2193 -68306 -54754 -26722 -17406 -56312 13598 124017 -4279 -11159 -3489 2516 34393 119433
2181 119433 160662 -48247 22921 2227 18446 -28351 -91249 -127153 -127243 -42683 -37889 7062
2169 7062 19943 15602 -91735 -131455 -128701 -109732 -135911 -129730 7843 -113613 6415 -12944
2157 -12944 -17044 22426 -8831 49594 14216 -60160 -8678 67147 63874 -41638 -168128 -90616
2145 -90616 -49536 -85282 -79926 -82832 -128030 -68500 -30736 17385 -7598 -81872 -59847 10252
2133 10252 -49015 20705 -31518 -54235 1420 59312 -5010 -63574 3745 -48213 -14397 -21419
2121 -21419 1019 108276 26132 22035 25909 42620 -33516 -12996 112168 -31750 19290 25973
2109 25973 -30822 7449 -65208 -2488 -5023 -50753 -30397 55085 9569 -48514 -57268 -77480
$$ packed form
2193f8306J3552K8032R316l8906O9910J10419j28296o880P670O005L1877Q5040
2181A19433M1229k08909P1168k0694J6219m6797o2898l5904r0Q4560M794M4951
2169G062J2881m341j07337l9720K754J8969k6179O181J37573j21456J20028j9359
2157a2944m100L9470l1257N8425l5378p4376N1482P5825l273j05512j26490P7512
2145i0616M1080l5746N356k906m5198N9530L7764M8121k4983p4274K2025P0099
2133A0252n9267O9720n2223k2717N5655N7892o4322n8564O7319n1958L3816p022
2121b1419K2438J07257q2144m097L874J6711p6136K0520J25164j43918N1040O683
2109B5973n6795L8271p2657O2720k535m5730K0356Q5482m5516n8083q754k0212
$$ plain form
2097 -77480 -18083 -76617 6579 28813 -39251 -35504 20505 -53142 -28490 84300 -60908 -69170
2085 -69170 -28414 161868 136280 -14206 -21185 -5084 9518 19667 37876 66749 101018 9613
2073 9613 53806 5044 -45074 -30661 -107366 -39059 24286 32254 -29538 -49945 1140 -99061
2061 -99061 -117923 -81896 5436 11682 12398 -28241 -58887 -7629 -12241 -22645 -93432 -22735 -9373
2048 -9373 -20013 -6193 -1112 -57005 -135606 -91921 -2866 -18004 -79826 -19079 7785 -49546
2036 -49546 -113773 -52055 -33249 470 -55544 23339 12980 -74974 -40681 -2484 96933 66640
2024 66640 -39209 -24047 -59900 -38799 -109351 -24296 -27651 -23192 -44322 -138905 -51223 -47517
2012 -47517 45514 117500 -32767 -67002 -16765 -23358 -28689 -51396 -60182 22831 40464 48051
$$ packed form
2097g7480N9397n8534Q3196K2234o8064L747N6009p3647K4652J12790j45208q262
2085f9170M0756J90282k5588j50486o979J6101J4602J0149J8209K8873L4269r1405
2073I613M4193m8762n0118J4413p6705O8307O3345P968o1792k0407N1085j00201
2061i9061j8862L6027Q7332O246P16m0639l0646N1258m612j0404p0787P0697J3362
2048i373j0640J3820N081n5893p8601M3685Q9055j5138o1822O0747K6864n7331
2036d9546o4227O1718J8806L3719n6014P8883j0359q7954L4293L8197R9417l0293
2024F6640j05849J5162l5853K1101p0552Q5055l355M459k1130r4583Q7682L706
2012d7517R3031P1986j50267l4235N0237o593n331k2707q786Q3013J7633P587
$$ plain form
2000 48051 -3924 -45480 76976 30601 49057 35871 68911 54365 84544 94565 -4389 -66297
1988 -66297 -105737 8052 95914 -727 -50414 -29633 36571 29251 69980 7677 -11990 -60968
1976 -60968 -117501 -97309 -67157 -36800 98403 139759 -79719 -69039 49085 15687 -22823
1965 -22823 -37349 -74463 -7557 -14473 -33747 19971 9065 46977 141598 69410 49687 116312
1953 116312 39690 143362 54312 109 -3702 68313 147292 123833 43672 31503 2634 64133
1941 64133 106214 -3041 10102 39771 63496 18935 -16072 5303 89965 37367 117793 75077
1929 75077 158189 -53347 -58753 -51798 -47772 83938 61264 27895 14871 -99376 -72827 -44071
1917 -44071 -34864 12099 72645 -136563 -156364 -82163 -169793 -74697 -16737 52486 -9551 40594
$$ packed form
2000D8051n1975m1556J22456m6375J8456j3186L3040j4546L0179J0021r8954o1908
1988f6297l9440J13789Q7862r6641m9687K0781O6204p320M0729o2303j9667m8978
1976f0968n6533K0192L0152L0357J35203M1356k19478J0680J18124l3398l8510
1965b2823j4526l7114O6906o916j9274N3718j0906L7912R4621p2188j9723O6625
1953A16312p6622J03672q9050n4203l811P2015P8979k3459q0161j2169k8869O1499
1941F4133M2081j09255J3143K9669K3725m4561l5007K1375Q4662n2598Q0426m2716
1929G5077Q3112k11536n406O955M026J31710k2674l3369j3024j14247K6549K8756
1917d4071R207M6963O0546k09208j9801P4201q7630R5096N7960O9223o2037N0145
$$ plain form
1905 40594 -31176 -8379 16688 17378 -310 32470 3464 -90709 -152497 -66576 -25284 -131525
1893 -131525 -86550 1784 -24687 -6633 -83841 -66123 20014 73097 67996 39231 33410 -46539
1881 -46539 13622 -28905 28058 117952 101713 -20458 -61 19012 42507 53434 46606 46689
1869 46689 -87803 6316 -912 28200 66037 73591 291 17469 82844 -9595 72491 13434
1857 13434 -15798 -29213 35034 148435 60304 -8000 7642 18498 -32878 34816 -17555 -97242
1845 -97242 -98536 18493 19278 -26089 -90526 -67395 -55888 20168 72743 7284 -36545 18550
1833 18550 -30926 -26827 -57184 -110054 -49775 77813 135876 54562 51943 92181 52253 109619
1821 109619 -55861 -97823 58086 20018 -1235 15008 36477 22686 -2733 -45655 33858
$$ packed form
1905D0594p1770K2797K5067O90j7688L2780k9006r4173o1788Q5921M1292j06241
1893a31525M4975Q8334k6471J8054p7208J7718Q6137N3083n101k8765n821p9949
1881d6539O0161m2527N6963Q9894j6239j22171K0397J9073K3495J0927o828Q3
1869D6689j34492R4119p228K9112L7837P554p3300J7178O5375r2439Q2086n9057
1857A3434k9232j3415O4247J13401q8131o8304J5642J0856n1376O7694n2371p9687
1845i7242j294J17029P85m5367o4437K3131J1507P6056N2575o5459m3829N5095
1833A8550m9476M099l0357n2870O0279J27588N8063q1314k619M0238l9928N7366
1821A09619j65480m1962J55909l8068k1253J6243K1469j3791k5419m2922P9513
$$ plain form
1810 33858 22414 72072 -93702 -33994 64649 96555 143614 2740 16807 -74290 -8829
1799 -8829 -61506 -31328 -29050 -43386 33459 22149 55814 14691 -1375 58472 82677 127863
1787 127863 50556 64133 148354 31583 1109 7292 12143 -27296 24260 -6809 40642 52239
1775 52239 96558 4094 16604 -6614 -7312 42232 54218 -10505 -33762 32066 13555 47427
1763 47427 43315 106442 -73001 -91044 26745 70429 13703 -85378 -52197 -109379 -62957 -14666
1751 -14666 -11686 26754 80718 65945 -52514 41473 111043 43524 -18929 -7589 42173 53946
1739 53946 -57324 -92088 -22149 21203 72093 55679 62872 10973 96645 -5384 72567 124627
1727 124627 78578 62352 18282 -40370 -27480 -18276 -45694 -28089 18168 -19510 -38951 -31106
$$ packed form
1810C3858j1444M9658j65774N9708R8643L1906M7059j40874J4067r1097O5461
1799h829n2677L0178K278j4336P6845j1310L3665m1123j6066N9847K4205M5186
1787A27863p7307J3577Q4221j16771l0474O183M851l9439N1556l1069M7451J1597
1775E2239M4319r2464J2510k3218o98M9544J1986o4723k3257O5828j8511L3872
1763D7427m112O3127j79443j8043J17789M3684n6726r9081L3181n7182M6422M8291
1751a4666K980L8440N3964j4773j18459R3987O9570o7519o2453J1340M9762J1773
1739E3946j11270l4764O9939M3352N0890j6414P193n1899Q5672j02029P7951N2060
1727A24627m6049j6226m4070n8652J2890R204k7418J7605M6257l7678j9441P845
$$ plain form
1715 -31106 -49987 -111591 -176296 -60689 -40971 47463 131276 115463 31452 36138 61099 6942
$$ packed form
1715c1106j8881o1604o4705J15607J9718Q8434Q3813j5813q4011M686K4961n4157
$$ [...]
##END NTUPLES=NMR SPECTRUM
##END=
