##TITLE=1H_CG-1181-E
 CDCl3
 8 sc, 
 3.12.2024
##JCAMPDX= 6.0         $$ Bruker NMR JCAMP-DX V2.0
##DATA TYPE= NMR SPECTRUM
##DATA CLASS= NTUPLES
##ORIGIN= UXNMR, Bruker Analytische Messtechnik GmbH
##OWNER= root
$$ XWIN-NMR		Version 3.5
$$ Tue Dec  3 13:59:47 2024 Russian Standard Time (UT+4h)  she@DPX200
##.OBSERVE FREQUENCY= 200.1315
##.OBSERVE NUCLEUS= ^1H
##.ACQUISITION MODE= SIMULTANEOUS
##.ACQUISITION SCHEME= undefined
##.AVERAGES= 8
##.DIGITISER RES= 18
##SPECTROMETER/DATA SYSTEM= spect
##.PULSE SEQUENCE= zg30
##.SOLVENT NAME= CDCl3
##.SHIFT REFERENCE= (INTERNAL, CDCl3, 0, 19.4151)
##AUDIT TRAIL= $$ (NUMBER, WHEN, WHO, WHERE, WHAT)
$$ ##TITLE= Audit trail, XWIN-NMR		Version 3.5
$$ ##JCAMPDX= 5.01
$$ ##ORIGIN= Bruker BioSpin GmbH
$$ ##OWNER= she
$$ F:/spectra/data/she/nmr/H-F/1/pdata/1/auditp.txt
$$ ##AUDIT TRAIL=  $$ (NUMBER, WHEN, WHO, WHERE, WHAT)
(   1,<2024-12-03 13:58:25.78 +0400>,<she>,<DPX200>,
      <created by zg, POWCHK disabled, PULCHK disabled
       configuration hash MD5:
       00 E9 B6 7A A2 85 ED C7 34 08 36 98 17 FE 4E 26
       data hash MD5: 16K
       57 22 A4 90 43 55 84 B8 E5 A8 66 CA 3C 7A E2 B2>)
(   2,<2024-12-03 13:58:30.87 +0400>,<she>,<DPX200>,
      <Start of raw data processing
       efp BC_mod = 2 LB = 0.24 FT_mod = 6 PKNL = 1 PHC0 = -26713.07 PHC1 = 6.98744 SI = 16K 
       data hash MD5: 16K
       F6 41 FA 0B 7E 33 3D 89 E1 02 D8 AD ED 77 93 EA>)
(   3,<2024-12-03 13:58:54.85 +0400>,<she>,<DPX200>,
      <pk PHC0 = -164.0159 PHC1 = 7.2 
       data hash MD5: 16K
       69 B5 A4 66 D6 D4 B2 57 1A 0A 20 0B 71 3D 9E 77>)
(   4,<2024-12-03 13:58:58.10 +0400>,<she>,<DPX200>,
      <abs ABSG = 5 
       data hash MD5: 16K
       1A 5B F1 92 D2 0B F4 4E 59 6A 38 FB 82 2B 31 AD>)
$$ ##END=
$$ 
$$ hash MD5
$$ DC ED 93 F8 AF 4E 9F 8C 28 0F AA E2 02 48 EF 86
##$RELAX= 
##$RELAX= 
##$RELAX= 
##$RELAX= 
##$RELAX= 
##$RELAX= 
$$ Bruker specific parameters
$$ --------------------------
##$DU= <F:/spectra>
##$EXPNO= 1
##$NAME= <H-F>
##$PROCNO= 1
##$TYPE= <nmr>
##$USER= <she>
##$AMP= (0..31)
100 100 100 100 100 100 100 100 100 100 100 100 100 100 100 100 100 100 
100 100 100 100 100 100 100 100 100 100 100 100 100 100 
##$AQSEQ= 0
##$AQ_mod= 1
##$AUNM= <au_zg>
##$AUTOPOS= <>
##$BF1= 200.13
##$BF2= 200.13
##$BF3= 200.13
##$BF4= 200.13
##$BF5= 200.13
##$BF6= 200.13
##$BF7= 200.13
##$BF8= 200.13
##$BYTORDA= 1
##$CFDGTYP= 0
##$CFRGTYP= 5
##$CHEMSTR= <none>
##$CNST= (0..31)
1 1 145 1 1 1 1 1 1 1 1 1 1 1 1 1 1 1 1 1 1 1 1 1 1 1 1 1 1 1 1 1 
##$CPDPRG= <>
##$CPDPRG1= <>
##$CPDPRG2= <>
##$CPDPRG3= <>
##$CPDPRG4= <mlev>
##$CPDPRG5= <mlev>
##$CPDPRG6= <mlev>
##$CPDPRG7= <mlev>
##$CPDPRG8= <mlev>
##$CPDPRGB= <>
##$CPDPRGT= <>
##$D= (0..31)
0 1.2 0 0 0 0 0 0 0 0.06 0 0.03 0 0 0 0 0.0002 0 0 0 0 0 0 0 0 0 0 0 0 
0 0 0 
##$DATE= 1733219905
##$DBL= (0..7)
120 120 120 120 120 120 120 120 
##$DBP= (0..7)
150 150 150 150 150 150 150 150 
##$DBP07= 0
##$DBPNAM0= <>
##$DBPNAM1= <>
##$DBPNAM2= <>
##$DBPNAM3= <>
##$DBPNAM4= <>
$$ [...]
##$SUBNAM3= <"">
##$SUBNAM4= <"">
##$SUBNAM5= <"">
##$SUBNAM6= <"">
##$SUBNAM7= <"">
##$SUBNAM8= <"">
##$SUBNAM9= <"">
##$SW= 24.0689530833862
##$SWIBOX= (0..15)
0 0 2 0 0 0 0 0 0 0 0 0 0 0 0 0 
##$SW_h= 4816.95568400771
##$TD= 16384
##$TD0= 1
##$TE= 0
##$TE2= 300
##$TE3= 300
##$TEG= 300
##$TL= (0..7)
0 120 120 120 120 120 120 120 
##$TP= (0..7)
150 150 150 150 150 150 150 150 
##$TP07= 0
##$TPNAME0= <>
##$TPNAME1= <>
##$TPNAME2= <>
##$TPNAME3= <>
##$TPNAME4= <>
##$TPNAME5= <>
##$TPNAME6= <>
##$TPNAME7= <>
##$TPOAL= (0..7)
0.5 0.5 0.5 0.5 0.5 0.5 0.5 0.5 
##$TPOFFS= (0..7)
0 0 0 0 0 0 0 0 
##$TUNHIN= 0
##$TUNHOUT= 0
##$TUNXOUT= 0
##$USERA1= <user>
##$USERA2= <user>
##$USERA3= <user>
##$USERA4= <user>
##$USERA5= <user>
##$V9= 5
##$VALIST= <valist>
##$VCLIST= <CCCCCCCCCCCCCCC>
##$VD= 0
##$VDLIST= <DDDDDDDDDDDDDDD>
##$VPLIST= <PPPPPPPPPPPPPPP>
##$VTLIST= <TTTTTTTTTTTTTTT>
##$WBST= 1024
##$WBSW= 4
##$XGAIN= (0..3)
0 0 0 0 
##$XL= 0
##$YL= 0
##$YMAX_a= 337715
##$YMIN_a= -357998
##$ZGOPTNS= <>
##$ZL1= 120
##$ZL2= 120
##$ZL3= 120
##$ZL4= 120
##$ABSF1= 19.57968
##$ABSF2= -4.489454
##$ABSG= 5
##$ABSL= 3
##$ALPHA= 0
##$AQORDER= 0
##$ASSFAC= 0
##$ASSFACI= 0
##$ASSFACX= 0
##$ASSWID= 0
##$AUNMP= <proc_1d>
##$AZFE= 0.1
##$AZFW= 0.1
##$BCFW= 0
##$BC_mod= 2
##$BYTORDP= 0
##$COROFFS= 0
##$CY= -3
##$DATMOD= 1
##$DC= 0
##$DFILT= <>
##$DTYPP= 0
##$F1P= 0
##$F2P= 0
##$FCOR= 1
##$FTSIZE= 16384
##$FT_mod= 6
##$GAMMA= 0
##$GB= 0
##$INTBC= 1
##$INTSCL= 2.524811e-10
##$ISEN= 128
##$LB= 0.24
##$LEV0= 0
##$LPBIN= 0
##$MAXI= 10000
##$MC2= 0
##$MEAN= 0
##$ME_mod= 0
##$MI= 1.114404
##$NCOEF= 0
##$NC_proc= -6
##$NLEV= 6
##$NOISF1= 3.799351
##$NOISF2= 2.8
##$NSP= 0
##$NTH_PI= 0
##$NZP= 0
##$OFFSET= 19.41514
##$PC= 1
##$PHC0= -26877.09
##$PHC1= 14.18744
##$PH_mod= 1
##$PKNL= yes
##$PPARMOD= 0
##$PSCAL= 0
##$PSIGN= 0
##$REVERSE= no
##$SF= 200.13002292533
##$SI= 16384
##$SIGF1= 3
##$SIGF2= 2
##$SINO= 5.538805
##$SIOLD= 16384
##$SREGLST= <1H.CDCl3>
##$SSB= 0
##$STSI= 16384
##$STSR= 0
##$SW_p= 4816.95568400771
##$SYMM= 0
##$S_DEV= 0
##$TDeff= 16384
##$TDoff= 0
##$TI= <>
##$TILT= no
##$TM1= 0
##$TM2= 0
##$TOPLEV= 0
##$USERP1= <user>
##$USERP2= <user>
##$USERP3= <user>
##$USERP4= <user>
##$USERP5= <user>
##$WDW= 1
##$XDIM= 16384
##$YMAX_p= 374928789
##$YMIN_p= -147017
$$ End of Bruker specific parameters
$$ ---------------------------------
##NTUPLES= NMR SPECTRUM
##VAR_NAME=  FREQUENCY,     SPECTRUM/REAL,   SPECTRUM/IMAG
##SYMBOL=    X,             R,               I
##VAR_TYPE=  INDEPENDENT,   DEPENDENT,       DEPENDENT
##VAR_FORM=  AFFN,          ASDF,            ASDF
##VAR_DIM=   16384,         16384,           16384
##UNITS=     HZ,            ARBITRARY UNITS, ARBITRARY UNITS
##FACTOR=    0.29402158847633, 1,            1
##FIRST=     3885.55244371376, 0,            0
##LAST=      -931.403240293951, 0,           0
##MIN=       -931.403240293951, -147017,     0
##MAX=       3885.55244371376, 374928789,    0
$$ Real data points
##PAGE= N=1
##DATA TABLE= (X++(R..R)), XYDATA
$$ [...]
7283d9566l2260j8356M4030m2004P6853j8970k196l9536L7046J7573j0833l9522
7271g7741r346l4980l160L7671O87j1654O1712j4908n0277L9440J6025k776J0118
7258c9189n037k11M0463m8771k5481K0068K0190K3930p4325L4997k2032j2329
7246h7727L91o967N0810j798J0737J2338m2188r290N0556j9434m2579L553m172
7233h5770K9532Q074j1681K7002R971m4740o209K9337L4143L8739o3384l7125
7221g2111n005L226K2440k1085l796O4948j4503p7782P813K1019L5806M6157J6307
7208B3434o3541M241K9207n111J4053J9056q81n6452n9975L5890j835J7317K8998
7195a5599J1038n4730j4165O4111J7176M602J5634m056L970R942L1781K3882k0050
$$ y = [-49566, -81826, -100182, -56152, -98156, -21303, -40273, -42469, -82005, -44959, -27386, -38219, -77741, -87087, -122067, -125227, -87556, -86869, -98523, -36811, -51719, -101996, -62556, -46531, -49307, -39189, -44226, -44437, -3974, -52745, -78226, -58158, -37968, -14038, -88363, -53366, -75398, -87727, -87336, -94303, -43493, -45291, -34554, -22216, -64404, -73694, -23138, -42572, -85151, -81598, -85770, -56238, -48164, -59845, -32843, -22872, -67612, -73821, -44484, -10341, 28398, -34986, -72111, -77116, -73890, -51450, -72535, -76331, -11383, -25886, -103668, -95855, -74836, -39030, 7127, 23434, -40107, -35866, -6659, -11770, 2283, 21339, 20458, -35994, -95969, -60079, -61914, -44597, -15599, -4561, -59291, -73456, -9345, 7831, 12433, 28067, 24011, 27981, 37923, 69704, 93586, 73536]
7182G3536k4935J2450K6716l8722k8435K948l9992O139l559J7941j1570L2777
7170B5294K1570j7501L7610m1933K6848R681n8593J9587k672l5108n2368n980
7158g3565L6463j7315M2098L494q033L1447J243n099k5068o427J4285K648k9224
7145c3053j8821K5038l131N7922p7287j7921Q681O817J5112j893K3854O763k6774
7132c4693K9400r835K6384J526m1301j9618J1544J1339J8254J6678m6047n7905
7120i4274O9470P338j0635j6149k8991K2336m2294p178O8999j6182k6222J9696
7108e4086j1969M841J7076q1283N0619O7886m6722j4583n9819L8308O0985j5571
7096d4318L567O144K0653l6102k8363k4234L7068J4887K8246J4133j1580o8615
$$ y = [73536, 48601, 61051, 87767, 49045, 20610, 23558, -16434, -10295, -13854, 4087, -7483, 25294, 46864, 29363, 66973, 25040, 51888, 61569, 2976, 22563, 19891, -15217, -67585, -73565, -37102, -54417, -12319, -8825, -16858, 14589, 15832, 10733, -14335, -20762, -6477, -3829, -33053, -51874, -26836, -29967, 27955, -49332, -67253, -58572, -51755, -36643, -38536, -14682, -7919, -34693, -5293, -15128, 11256, 12782, -28519, -48137, -36593, -25254, -7000, 9678, -36369, -94274, -24804, -17466, -28101, -44250, -73241, -50905, -93199, -100377, -31378, -47560, -73782, -54086, -66055, -61214, -44138, -125421, -74802, -6916, -53638, -68221, -128040, -89732, -28747, -44318, -40751, -34607, -13954, -50056, -78419, -102653, -65585, -50698, -22452, -8319, -19899, -88514]
7084h8514n3896M5128J5559O8023k2764n1950L5066O1816m0664p7596M7736J5944
7072d6112m2928M2829l3254L3135l1312j0506L0917l2484j3349K5270R329J2679
7060e5786Q60j3983j015K1036K3796j451k0080J8560o565m1920m7759R819K9568
7047h4920L3945j2257j0714m5840K2192M8613M5159o529K0758J0392j1283r98
7035H518k941m9832J2364M198k9172N962K7054n4293K412J716j7507L1562j3774
7022g3733J7795p348L8430k8661m067k6311K7550k6278K5934r56J3020l6197K3175
7009e7647l5087n375K4631O298N5058k8829L514K5997k4079n419j4024o8266J5825
6996a07403K6044N6166m29j040l570K2197n0517r684Q100K2125J9501p311J1333
$$ y = [-88514, -142410, -97282, -81723, -13700, -36464, -88414, -53348, 8468, -32196, -109792, -62056, -46112, -89040, -46211, -79465, -46330, -77642, -88148, -57231, -89715, -103064, -77794, -68465, -55786, -54926, -68909, -69924, -48888, -25092, -26543, -46623, -28063, -34628, -76548, -124307, -114488, -84920, -50975, -63232, -73946, -119786, -97594, -48981, -3822, -10351, 10407, 20799, 9516, 8518, 5577, -44255, -31891, -27693, -56865, -50903, -23849, -78142, -75730, -74014, -91521, -59959, -73733, -55938, -63286, -24856, -53517, -57584, -83895, -56345, -82623, -56689, -57645, -44625, -80822, -57647, -92734, -98109, -73478, -67180, -12122, -40951, -37437, -11440, -35519, -40938, -54962, -123228, -107403, -81359, -25193, -25622, -26662, -30232, -8035, -58552, -68236, -60136, -38011, -18510, -25821, -14488]
6983a4488k9382o626l6109j5184K9944K7120L5187m03j4180J5415l9618k1695
6971g0019k010k0082K9578Q0857n2277r360o527k1054Q1525j8012j0784J1612
6959f553m8306P830K8000k4802J2704N3538P42l0328p707N2842k2712j0497J143
6946E894M8669K3306J0819J8989j02035j3554O1521o3958P0591J0487p6741M4821
6934C8809n9834k9622L7893M270P057m5421j9689K4206m69K4976M058k0006k3812
6921e7584k1720J0724J3164L1128j5405P059m4439n2222L1104J3632Q8766j0868
6909f661l5423k3944M7429j1783L0961O16J9800N573k7245j7439J1249O2417l7251
6896A8299l6716M0849J9942l997M9210n121m8713q584L468N472J4632l3084l501
$$ y = [-14488, -43870, -50496, -86605, -101789, -71845, -44725, -9538, -9941, -24121, -8706, -48324, -70019, -72029, -92111, -62533, 18324, -33953, -43313, -49840, -70894, 10631, -7381, -18165, -6553, -54859, -47029, -19029, -43831, -31127, 22411, 23153, -7175, -14882, 37960, 15248, 4751, 5894, 54563, 77869, 88688, 107677, 5642, -7912, 53609, -10349, 60242, 70729, -6012, 38809, -21025, -50647, -12754, -8484, -1427, -46848, -66537, -42331, -42800, -17824, -13766, -33772, -57584, -79304, -68580, -55416, -24288, -39693, -32634, -77073, -129295, -98191, -84559, 4207, -6661, -42084, -66028, -18599, -30382, 579, 1195, 20995, 26568, -677, -18116, -6867, 55550, 18299, -18417, 22432, 42374, 38377, 87587, 82466, 33753, 25169, 28637, 34109, 48741, 15657, 12156]
6883A2156K4018l9060K6419o6639j9994M3352J2227M851Q197r145k7797j0009
6871d1424j4518J0509M9253J0017L172p0651n774J0976L303J6118m327l0125j4397
6858g7868M1779J029N330J5843K7787m6581M3352j4077l5906K3681r17O194j3309
6845b3663J4672n4159o3555K6848M7978J0443m2810O9261K397K6616J8271p5566
6833d3267k6486R864K6749k895J1685L4565K0716K0087m3573L82m1547j2101l0746
6820g6567q569N2415l900j2265q463l479L1322l5746L8861L8784J1907o669j8419
6807g88l0061K340J6750K6594l6128L9305k4518M490J403k3637J4282m4527N0106
6794d389k1436k8497k2123k06K1561J6857l0528J9639j895J9033N0555j7922o7287
$$ y = [12156, 36174, -2886, 23533, -43106, -63100, -19748, -7521, -2670, 5527, -3618, -31415, -41424, -55942, -45433, 3820, 13837, 17009, -53642, -59416, -48440, -45137, -29019, -33346, -63471, -77868, -36089, -35060, -29730, -13887, 13900, -32681, 10671, -3406, -39312, -15631, -16548, -10354, -23663, -8991, -63150, -126705, -99857, -51879, -41436, -84246, -14985, -12588, 14028, 32299, -43267, -69753, -59889, -33140, -36035, -24350, 10215, 30931, 51018, 7445, 7827, -33720, -45821, -76567, -85136, -32721, -36621, -48886, -57349, -60828, -29506, -65252, -26391, 12393, 24300, 17631, -788, -30849, -28509, -11759, 14835, -21293, 18012, -6506, -2016, -613, -24250, -9968, -54495, -4389, -25825, -54322, -76445, -76651, -55090, -38233, -68761, -49122, -51017, -31984, 18571, 649, -66638]
6781f6638J5779l298K7477J5356m5971J4683L581L2154J2375l1967l1712j5575
6769g3756L6517j3822K7977J2571l4345o6591K8276L7990l4975J1342o13j4786
6757h4215l1274P7609J0420p7415L6140O0367m052j2621k6001K3917p633o661
6745d1419Q401L707L02m7940J5917k679L0054n1979K7361J8590k5140M7279K7423
6732I877j9184o33q371q424O253N116m619m7924M7025m7822l9646M8737L8011
6719b1604l3284k7087K0922q723K3245k015k7639N0449o457j9583L3959o316J5712
6706h421k1313k4881l7481J0976J8632l6481J1230J7902O2015o2636K3114L1735
6694a5609n234o195N1116K67J0213k5420p0617j2009K907L8585N9725L1097l5633
$$ y = [-66638, -50859, -54157, -26680, -11324, -57295, -42612, -39031, -6877, 5498, -26469, -58181, -73756, -37239, -51061, -23084, -10513, -44858, -111449, -83173, -45183, -80158, -68816, -69429, -84215, -115489, -37880, -27460, -104875, -68735, -8368, -12420, -25041, -51042, -27125, -34758, -41419, -33018, -29311, -29009, -76949, -61032, -63711, -33657, -85636, -58275, -39685, -64825, -17546, 9877, -9307, -9940, -18311, -26735, -20482, -15366, -19985, -67909, -20884, -68706, -108352, -59615, -21604, -54888, -81975, -61053, -69776, -46531, -48546, -76185, -25736, -32193, -51776, -17817, -24133, -8421, -29734, -54615, -92096, -81120, -62488, -98969, -87739, -69837, -7822, -70458, -47344, -15609, -20843, -27038, 24078, 24345, 34558, 9138, -61479, -73488, -70581, -31996, 27729, 58826, 23193]
6681B3193J9376l9586j7272n0729K2240K4556k186J7445J4920J6032L0532R035
6669F7556k878k8934M5930K7725m7590l628J8446L7037L5449j5747l7711n2714
6657D2941m6071p722j8703l8238Q7126J7784j8893l6845L1683n92j0680k5597
6645b3807M1834K3259J053K1608q203K2591j2569l9074M768k1024L2611N7325
6633A00372j4564k0550k0205M2140P754j4742k8905l1298k0563K6647L6013n0425
6621A1674O823l1301j5646N3579j4723j5936J7879p001j2425O924k6997q782J7160
6608a8772J6365Q146j5300K63o5390L5509J1939l8119M4399q326r832J9586O0651
6595D1119o6334J9883J3525l8084j8939P120L0124M3004j7749m2183j2789l975
$$ y = [23193, 42569, 2983, -14289, -65018, -42778, -18222, -20408, -2963, 11957, 27989, 58521, 67556, 64678, 35744, 81674, 109399, 61809, 58181, 76627, 113664, 149113, 133366, 95655, 42941, -3130, -10852, -29555, -67793, 19333, 37117, 18224, -18621, 13062, 12470, 1790, -23807, 18027, 41286, 42339, 63947, 55744, 78335, 65766, 26692, 31460, 10436, 43047, 100372, 85808, 65258, 45053, 87193, 94947, 80205, 51300, 20002, -561, 26086, 62099, 11674, 18497, -12804, -28450, 25129, 10406, -5530, 12349, 5348, -7077, -153, -27150, -35932, -18772, -2407, 5739, -9561, -9298, -74688, -39179, -27240, -65359, -20960, -29286, -39118, -19532, 41119, -25215, -5332, 8193, -29891, -48830, -41710, -11586, 31418, 13669, -28514, -41303, -45278]
6583d5278J9695M5287m0107j8256o9613L6816K1947L546N713M1407n8612J885
6571e5570K1864M6554K0327l3726o4108K0213M9678n5317k7667l041L585K2182
6559e5026L6847o1390K9819K3819j2049p898J364J9244j3019L5648m8462K2143
6547b8960K3057m8951Q456L3033l4941j5821P254J5963L570j0001j9304M6660
6535a9985P2006m5763L6492L914K780n3785l7273j9378J8758J0399j4703K1481
6523b5057Q880k9922o345L0018j2988l3464q434K4549K1835r971O735M031K4309
6510e824K0170K2568J9328n9885k2229K3734l7305J7495j0596l0935Q397L0355
6498b4727j7969M781Q15L976n661o8361K6843N5602L3949N893r528L6167j0967
$$ y = [-45278, -25583, 19704, -20403, -38659, -108272, -71456, -49509, -45963, -40250, 1157, -57455, -55570, -33706, 12848, 33175, -551, -64659, -44446, 5232, -50085, -77752, -80793, -77208, -55026, -18179, -79569, -49750, -25931, -37980, -45878, -44514, -25270, -38289, -2641, -51103, -28960, -5903, -54854, -46398, -13365, -48306, -64127, -56873, -40910, -37340, -47341, -66645, -19985, 52021, 6258, 42750, 46664, 49444, -4341, -41614, -60992, -42234, -31835, -46538, -25057, -16177, -46099, -52444, -22426, -35414, -68878, -77312, -52763, -30928, -40899, -34164, -30133, -5824, 14346, 36914, 56242, -3643, -25872, -2138, -39443, -21948, -32544, -63479, -55082, -24727, -42696, -37915, -37100, -33124, -38785, -107146, -80303, -24701, 9248, 15141, 5613, 41780, 30813]
6485C0813r470j0038k7320l7947K9320R947l8148j954n2886O5089M6491Q883Q450
6472B1230l4272L8282j8690Q736K3661j5390m4859K265o379J2616k3404r59l99
6459c7562J7088l0213M2730P3387q4390l430K7320l4505r9M5521j2541N973j0353
6446a074j1214J2629P418l5443j6014J3763j1943j6207j3138J0895P3106J2361
6434B5139k9390j8234J1565M5346l7139K1048l314j5742l088K1165j6684l2698
6422c2026K961L3156j7444l3120O1809L936j8532p464O0927l476o4002N2637l5288
6409D074k5682P355K8584K6695L602R560R170o036j7121k4221o048Q174J608k3325
6395c611K3960k5098l0797N4367p216k8843J2784j8906N590J7711P063n734j0481
$$ y = [30813, 21343, 11305, -16015, -53962, -24642, -14695, -52843, -54797, -107683, -42594, 3897, 12780, 21230, -13042, 25240, 6550, 15286, 38947, 23557, -21302, -19037, -25416, -12800, -36204, -37163, -37562, -20474, -50687, -7957, 65430, -18960, -22390, 4930, -29575, -29674, 15847, 3306, 9279, -1074, -12288, 341, 7759, -27684, -43698, -29935, -41878, -58085, -71223, -60328, 12778, 25139, -4251, -22485, -10920, 34426, -2713, 18335, 15021, -721, -3809, 17356, 672, -32026, -29065, 4091, -13353, -46473, 15336, 19272, 740, -6724, 54203, 50727, -13275, 39362, 4074, -21608, -14253, 14331, 41026, 44628, 54188, 63358, 57322, 40201, 15980, 9932, 18106, 19714, -3611, 20349, -4749, -35546, 18821, 11605, -17238, -4454, -23360, -17770, -59, 7004, 1270, -9211]
6382i211L4152p681J117m9478K8085M4015k9259j7348L8367Q224m6355K8235j0057
6369A2806J4264M7940j6389J4236l5551J8979R010n2687j4202L7120P3142K518
6357A11186k9956l1952j6743j120K3847M9773p7759r192J7884K1181K1819j3405
6345F5563J746J479K693R585J4418j1439k4318P5927l5108R442J6226q413k6176
6332I1625K2179k0106O854n775K5477L3095K4372q2282P9125N083r532M5827k0012
6319A95930l9979J6292K0446m294J65Q384N3321K4111j6097q218k461k5122O9227
6306B91705j1168O0298K6827L207K5688K4775j1987J03522K881Q884m1631N6708
6294E39709r888p6750J6459k3030l4165j9588j4660m489n9610K5700L4691j8689
$$ y = [-9211, 24941, 17260, 18377, -31101, -3016, 40999, 11740, -5608, 32759, 40983, -5372, 22863, 12806, 27070, 75010, 58621, 72857, 37306, 56285, 65295, 12608, -1594, 35526, 108668, 111186, 81230, 49278, 32535, 31415, 55262, 105035, 27276, 18084, 35968, 57149, 78968, 65563, 67309, 68788, 71481, 81066, 95484, 84045, 59727, 135654, 100546, 109988, 126214, 117801, 91625, 113804, 93698, 100552, 94777, 120254, 153349, 177721, 95439, 174564, 179647, 170115, 215942, 195930, 155951, 172243, 192689, 188395, 188560, 196944, 250265, 274376, 258279, 250061, 247600, 222478, 291705, 280537, 340835, 367662, 370869, 396557, 421332, 409345, 512867, 515748, 524632, 483001, 539709, 529821, 453071, 469530, 446500, 412335, 392747, 378087, 373598, 313988, 339688, 374379, 355690]
6282C55690r947k3230j9063N2274N043J3955J6445M5716l0308M9554l0097n2958
6270C73074P480l6692O4569J888q051O6992K3350o4168J0391o325K2362o4708
6258C90162K0018M4789k2636k2315K8259j3671P549O8348M16N6956M1312j0244
6246E88943N3813K9093o34M5358j0459J5078r5828k5884j1455K3970M2033l3788
6234F20240N6444O50o2343q061M8257L3801O3446J1619O8018Q6238L986L80M9084
6221I71759J8138K8048L2711L2917Q3663O8848M4411P1397j5497r9897M548M8707
6209A289753k3125M2481J10559N7788Q7167J20854J32005J54669J22012J55897
6199B250060L3771q900N3455Q2744Q7570K0570j04830o1401m3104j07394N631
$$ y = [355690, 345743, 322513, 303450, 355724, 360767, 374722, 391167, 436883, 406575, 456129, 426032, 373074, 380554, 343862, 408431, 410319, 402268, 469260, 492610, 428442, 438833, 432508, 454870, 390162, 410180, 454969, 432333, 410018, 438277, 424606, 432155, 500503, 500919, 557875, 599187, 588943, 642756, 671849, 671215, 716573, 706114, 721192, 625364, 599480, 588025, 611995, 654028, 620240, 676684, 677334, 614991, 606930, 655187, 688988, 752434, 764053, 832071, 918309, 922295, 922675, 971759, 989897, 1017945, 1050656, 1083573, 1167236, 1236084, 1280495, 1351892, 1336395, 1236498, 1241046, 1289753, 1266628, 1309109, 1419668, 1477456, 1564623, 1685477, 1817482, 1972151, 2094163, 2250060, 2283831, 2274931, 2328386, 2411130, 2498700, 2519270, 2414440, 2353039, 2309935, 2202541, 2208172]
6188B208172k6459M1949J27149K06032J64257K05053J78155Q2035j05238j54019
6178B927086j36796k06485j14976m5525n8466j13793j31926j04129q6798j4787
6168A913405k3942L7522J02457O3868N4882P9703k5477p5365j28385j34335q4665
6157A779668j52133n8976p3614L8994q0474j7319r584k7056k5j7744k1501j5207
6145A345029j208N2492P9238k316J5209J741L1118o1650j7824K474L9943L0726
6133A514972L6431L1084q221Q2025J32448N5949O5640L5444J7585R7906M9895
6122B111158N9003J46791Q3346R4165J75317J09195R1309Q8039P1456L7737Q0996
6111C148512Q7832J13773J27989J61669J01374R8241J41396J12906J68417J98546
$$ y = [2208172, 2181713, 2223662, 2350811, 2556843, 2721100, 2926153, 3104308, 3186343, 3081105, 2927086, 2790290, 2583805, 2468829, 2423304, 2364838, 2251045, 2119119, 2014990, 1928192, 1913405, 1889463, 1926985, 2029442, 2093310, 2148192, 2227895, 2202418, 2127053, 1998668, 1864333, 1779668, 1627535, 1568559, 1494945, 1533939, 1453465, 1436146, 1426562, 1399506, 1399481, 1381737, 1360236, 1345029, 1343821, 1396313, 1475551, 1473235, 1488444, 1490185, 1521303, 1459653, 1441829, 1444303, 1484246, 1514972, 1551403, 1582487, 1574266, 1656291, 1788739, 1844688, 1910328, 1945772, 1963357, 2061263, 2111158, 2170161, 2316952, 2400298, 2494463, 2669780, 2778975, 2870284, 2958323, 3029779, 3067516, 3148512, 3236344, 3350117, 3478106, 3639775, 3741149, 3839390, 3980786, 4093692, 4262109, 4460655]
6101D460655J93285J86828K47459K33737L40513L59779L71740M41149M94028M73382
6091G802555N42715N62165N38579O91174P44614R71603J100674J268406J544196
6082A5766681J733088J845397J528538R93542J6325p49353j017247j141235p73846
6073A8201890m96122j37259J07670L60873O46653R34350J218193J620671J946370
6064B4403289K401865L000373L445174L447718K537283P15949j594001l396707
6056C4960943l959530l599870k872448k147908j578148j103565p80264m88882
6048A8430328j94932K4758L40936N95956Q57074J158766J365421J164786M02636
6039B4145729o24803j657236k260887k246954k091548j717735j361922j162177
$$ y = [4460655, 4653940, 4840768, 5088227, 5321964, 5662477, 6022256, 6393996, 6835145, 7329173, 7802555, 8345270, 8907435, 9446014, 10137188, 10881802, 11853405, 12954079, 14222485, 15766681, 17499769, 19345166, 20873704, 21867246, 21883571, 21134218, 20116971, 18975736, 18201890, 17705768, 17568509, 17676179, 18037052, 18683705, 19618055, 20836248, 22456919, 24403289, 26805154, 29805527, 33250701, 36698419, 39235702, 39951651, 38357650, 34960943, 31001413, 27401543, 24529095, 22381187, 20803039, 19699474, 18919210, 18430328, 18235396, 18260154, 18601090, 19197046, 20054120, 21212886, 22578307, 23743093, 24145729, 23520926, 21863690, 19602803, 17355849, 15264301, 13546566, 12184644, 11022467]
6031A1022467r19150p61013o63622n94551n20311m50974m77472m20279l03287
6022E911808l70363k82780l09149j95159k32715k38684j97498j61628k13422j43641
6012C566769j16527p9472j19302r7991j09426n4142q2335j26139p4802o8534p4673
6001B563426r4508j93397l2928p124q7900q7165q5906K615j1940m8467o0559n661
5989A850486J5704k7259n6153m8853n567K0248l9971m4807Q592j6439p890j244
5977A646847K4178O0559n6660Q3717K0037k0441O4041P6058R7267J61047J16160
5966B272810Q2091K0352n6511j27240m974n1483l9622J4207J30899O3532L382
5955B307443J9227K1366M8393O9193P9866n8375q5894p8485r9210j6442r604k3245
$$ y = [11022467, 10103317, 9342304, 8678682, 8084131, 7563820, 7112846, 6635374, 6215095, 5911808, 5541445, 5258665, 4949516, 4754357, 4521642, 4282958, 4085460, 3923832, 3710410, 3566769, 3450242, 3370770, 3251468, 3153477, 3044051, 2989909, 2907574, 2781435, 2706633, 2638099, 2563426, 2468918, 2275521, 2242593, 2235469, 2147569, 2060404, 1974498, 1977113, 1965173, 1916706, 1856147, 1850486, 1866190, 1838931, 1782778, 1733925, 1728358, 1748606, 1708635, 1663828, 1672420, 1655981, 1648091, 1646847, 1671025, 1731584, 1674924, 1758641, 1778678, 1758237, 1822278, 1898336, 1995603, 2156650, 2272810, 2354901, 2375253, 2318742, 2191502, 2186528, 2135045, 2095423, 2109630, 2240529, 2304061, 2307443, 2326670, 2348036, 2396429, 2465622, 2545488, 2487113, 2401219, 2322734, 2223524, 2207082, 2197478, 2174233]
5943B174233l8760p3330r9259K0128N9051R1365O3396M2997q8320k11061j83384
5932A757056j72686j35674o0569r5014j07732M500k3212m7764p6841k739l2053
5921A007272k5166l211J3068o1165l5020j7850m0773k2560l7398q386L514q6948
5909F85377j3892p756J1353L5209L0415N966J0642L9402N2438l7574q147K799
5897H06232k3903n5475M729R172m5927l9142j1380l1595l7872J5627L8503K3778
5885F52747M3953M2007k2601J672j4147l7825P7986l4316K1179K6685l45Q956
5873G65951j0345K009J8141k4163l1707N1250K7993J4653k1665J9783j8646n3621
5861G39633l3893j0543q827K1151o3502r210M5022O3985j1953N8706N3235J3147
$$ y = [2174233, 2135473, 2062143, 1962884, 1983012, 2042063, 2133428, 2196824, 2239821, 2151501, 1940440, 1757056, 1584370, 1448696, 1388127, 1293113, 1185381, 1189881, 1166669, 1118905, 1042064, 1039325, 1007272, 982106, 978895, 991963, 930798, 895778, 877928, 837155, 814595, 777197, 768811, 772325, 685377, 671485, 663729, 675082, 710291, 740706, 746672, 757314, 796716, 849154, 811580, 803433, 806232, 782329, 726854, 731583, 740755, 694828, 655686, 644306, 612711, 574839, 590466, 628969, 652747, 696700, 738707, 716106, 717778, 703631, 665806, 743792, 709476, 730655, 757340, 756995, 765951, 755606, 757615, 775756, 751593, 719886, 771136, 799129, 813782, 792117, 811900, 793254, 739633, 705740, 695197, 686370, 707521, 644019, 634809, 679831, 743816, 731863, 790569, 843804, 856951]
5849H56951m2612K7639M6806k2128j7263M200M1509P1423J5522N429L2136O3571
5837A083183L0361P7199Q5931O9810R2378O6368J79069K29217K17647K65186J29665
5826B526014p5163q3907j95166k11285j67932j94087j17532j11762q8311k9850
5816A251019j0510k3257n0396n546N471L146k8969m1334L1416j96j7297O9202
5804A182749J8462M7502P74L171N2805N9534K4555O9298O6214R7545J13211J38513
5792A874333J40952R5121P7990L5745J03884Q7151L1107k8564j06994j12332j21201
5781B077192j6584j7038j2904J21018Q6195J05101J47806K01409K15902K04633
5771C112730J62327P8884R5277O3148n316j93177l54212k89401k05097j61926
$$ y = [856951, 814339, 841978, 888784, 866656, 849393, 853593, 895102, 966525, 982047, 987476, 1019612, 1083183, 1113544, 1190743, 1276674, 1346484, 1438862, 1505230, 1684299, 1913516, 2131163, 2396349, 2526014, 2450851, 2366944, 2171778, 1960493, 1792561, 1598474, 1480942, 1369180, 1280869, 1251019, 1240509, 1217252, 1166856, 1161310, 1166781, 1169927, 1140958, 1099624, 1131040, 1130844, 1113547, 1182749, 1201211, 1248713, 1249487, 1252658, 1305463, 1364997, 1389552, 1458850, 1525064, 1622609, 1735820, 1874333, 2015285, 2110406, 2188396, 2224141, 2328025, 2415176, 2446283, 2417719, 2310725, 2198393, 2077192, 2060608, 2043570, 2030666, 2151684, 2237879, 2342980, 2490786, 2692195, 2908097, 3112730, 3275057, 3353941, 3449218, 3512366, 3507050, 3313873, 2959661, 2670260, 2465163, 2303237]
5761B303237j18354j85137m4057L4680k2475N274N0075O7624Q3486J27166M3179
5750B344698M8402p9117m5532j08466j09921j44298j47737j15205r2326o2386
5740A488112q7901o8728L7732k8093m5930j0403l87J545J1639J3381K8713p071
5728A332609k988J6423J6563P359k1146l6650L8744K6599P799k8941p714M0410
5716A389067L4267P2246K7492M8186L0961O8663J2621M92N4950N1901Q391K9317
5704A828554L4603N278k6755L045L4413O5680r267P8759N044K9948P2331O9924
5692B191557O3559N3064m931L7343R6320M8495Q4737J09903J02029N7574N9917
5681B899567R5877J02582J45209J45374J26223J15119J42034J42175J30780J47377
$$ y = [2303237, 2184883, 1999746, 1955689, 1990369, 1967894, 1973168, 2023243, 2090867, 2174353, 2301519, 2344698, 2393100, 2313983, 2268451, 2159985, 2050064, 1905766, 1758029, 1642824, 1550498, 1488112, 1400211, 1331483, 1369215, 1341122, 1295192, 1284789, 1284402, 1285947, 1297586, 1310967, 1339680, 1332609, 1329621, 1346044, 1362607, 1369966, 1348820, 1312170, 1350914, 1377513, 1385312, 1356371, 1348657, 1389067, 1423334, 1495580, 1523072, 1571258, 1602219, 1670882, 1683503, 1683995, 1738945, 1790846, 1799237, 1828554, 1863157, 1868435, 1841680, 1844725, 1879138, 1944818, 1935551, 2014310, 2019354, 2049302, 2121633, 2191557, 2255116, 2308180, 2303249, 2340592, 2436912, 2485407, 2570144, 2680047, 2782076, 2839650, 2899567, 2995444, 3098026, 3243235, 3388609, 3514832, 3629951, 3771985, 3914160, 4044940, 4192317]
5671D192317J46327J40927J85513K02802K59701K20400K77083K89852L35703L42265
5661F592890L89418M59780O08981O56954O54771P48795Q70733J015251J114375
5652A3111948J342965J648051J913207K210090K253853J752737Q45091l76125
5644B4701817j329742j707473j468853j052591o40388l10489o507K75735N69317
5635A9030826Q70219J262683J657627K137790K736377L415595L952408L611372
5627C8674897K165585l63866k902814m193242m172338l524499k683180k006951
5619B0993592j490863j193509q59836m89457k68631K6179K26050N48914P82452
5610A8274891J062922J138533Q43436J66236p72419j730231k136201k014897j672244
$$ y = [4192317, 4338644, 4479571, 4665084, 4867886, 5127587, 5347987, 5625070, 5914922, 6250625, 6592890, 6982308, 7442088, 8051069, 8708023, 9362794, 10111589, 10982322, 11997573, 13111948, 14454913, 16102964, 18016171, 20226261, 22480114, 24232851, 25077942, 24701817, 23372075, 21664602, 20195749, 19143158, 18502770, 18192281, 18185774, 18461509, 19030826, 19901045, 21163728, 22821355, 24959145, 27695522, 31111117, 35063525, 38674897, 40840482, 40476616, 37573802, 33380560, 29208222, 25683723, 23000543, 20993592, 19502729, 18309220, 17449384, 16959927, 16691296, 16717475, 16943525, 17492439, 18274891, 19337813, 20476346, 21319782, 21486018, 20713599, 18983368, 16847167, 14832270, 13160026]
5601A3160026j414020j154290r76647p15638o02914n27731m66067m28655l94790
5592F479274l35246k69207k62462k18231k30278j96807j77116j59373j33555o8051
5582D428948j02251j65666j63591p3722n0301q5835m6591j31311j28443j8099
5572C463138j8492q7895k8652K7543r354l4274M1740L2819P5432K7393P9107J382
5560C569887J7647L9517n2530n4500k8359J44686M6192L1122J9896P41j23786
5549C610513j17732l9999J9410J00931J21049P8926L4034k0753r9725p6836l7068
5538C572750q4328n5546r7365j28634j92896p2765q8884r2739j02391r4208r6185
5527B466809r6572n9101R4125M4195L3571j8346j52783j68066j16665j22224j11974
$$ y = [13160026, 11746006, 10591716, 9615069, 8899431, 8296517, 7768786, 7302719, 6874064, 6479274, 6144028, 5874821, 5612359, 5394128, 5163850, 4967043, 4789927, 4630554, 4496999, 4428948, 4326697, 4161031, 3997440, 3923718, 3873417, 3787582, 3740991, 3609680, 3481237, 3463138, 3444646, 3356751, 3328099, 3355642, 3346288, 3312014, 3353754, 3386573, 3462005, 3489398, 3568505, 3569887, 3587534, 3627051, 3574521, 3520021, 3491662, 3636348, 3682540, 3713662, 3733558, 3734299, 3610513, 3492781, 3452782, 3472192, 3573123, 3694172, 3773098, 3807132, 3786379, 3686654, 3609818, 3572750, 3488422, 3432876, 3335511, 3206877, 3013981, 2941216, 2852332, 2759593, 2657202, 2562994, 2466809, 2370237, 2311136, 2405261, 2449456, 2483027, 2464681, 2311898, 2143832, 2027167, 1904943, 1792969]
5516A792969n4160o2224l4326l514p077Q8333L7602L9282K0310J5457l0305j00465
5504A701882q4575j60748m6561o7033l5659m2379k4693J4491L713m54P5981N1604
5492A385569M5775l655O5233m7747p5421n3795j16676p8612r467l5673o295J194
5480A070430j38598n7976M0203k2243J7837j4539R184o37p280J0426m2125k0535
5468H44147o485j7725k068O2383o1961m2564J7036j3895J4725l8131j2027J8785
5456G62220n9096m7467n1914m6233J8887l9386Q227k353k6919Q158l8274l7197
5444D48653J6821L564K8703L4272l7226o4543j4623J6329N49K506M4994n333l7834
5431D36832o271Q920K051k9301J7920l323j0667L4933m118n1459M2263M2452o8759
$$ y = [1792969, 1738809, 1676585, 1642259, 1638745, 1631668, 1720001, 1757603, 1796885, 1817195, 1832652, 1802347, 1701882, 1617307, 1456559, 1409998, 1342965, 1307306, 1264927, 1240234, 1254725, 1258438, 1257984, 1333965, 1385569, 1431344, 1427689, 1492922, 1445175, 1369754, 1315959, 1199283, 1120671, 1111204, 1075531, 1069236, 1070430, 931832, 873856, 914059, 891816, 909653, 895114, 904298, 903661, 896381, 906807, 864682, 844147, 837662, 819937, 817869, 880252, 818291, 775727, 792763, 778868, 793593, 755462, 743435, 762220, 703124, 655657, 603743, 557510, 576397, 537011, 545238, 542885, 515966, 524124, 485850, 448653, 465474, 469038, 497741, 532013, 494787, 430244, 415621, 431950, 432499, 435005, 479999, 474666, 436832, 430561, 439481, 441532, 412231, 430151, 426828, 416161, 451094, 446976, 395517, 437780, 480232, 411473]
5418D11473N2351P959k5457O085k0591L8177L0119O716M266m2992L142L3424P8
5405E04750L9608j8516K9101k4824P183K5916p461l6616j4619p412q008m1123
5393D47979K7671J9068n2272J9184J054j5798K2176O5237j97R972J3921L3652
5381E91647j6620l1921J5038L5817j0938o4482n0631m2908j1236l4224m4261k7121
5369C08160Q1029m7496l3615k4338R0385K1893k0598l0877l8119K2927m7927l7051
5357B44373p288L9266l5863K0544M1675P780m4546j3433o0204O4257K5008l6232
5345B45337K0401M616l4207K1298R752m36l119o7502O543l4325L4060K6114k156
5332B26376k2782L559K0161L9980k4919m1290L023K4692k461q241J0726J7628
$$ y = [411473, 463824, 471783, 446326, 452411, 431820, 469997, 500116, 506832, 511098, 468106, 471248, 504672, 504750, 544358, 525842, 554943, 530119, 537302, 563218, 555757, 519141, 504522, 497110, 489102, 447979, 475650, 494718, 442446, 461630, 462684, 446886, 469062, 534299, 534102, 544074, 557995, 591647, 575027, 543106, 558144, 593961, 583023, 518541, 467910, 425002, 413766, 379542, 335281, 308160, 389189, 341693, 308078, 283740, 374125, 396018, 375420, 344543, 306424, 329351, 281424, 244373, 237085, 276351, 240488, 261032, 302707, 310487, 265941, 252508, 192304, 256561, 281569, 245337, 265738, 270354, 236147, 257445, 267197, 266761, 263642, 196140, 202683, 168358, 202418, 228532, 226376, 203594, 207153, 227314, 267294, 242375, 201085, 204108, 228800, 226339, 218098, 228824, 246452]
5320B46452N5540m4872O265m1666k195J5453m7360P3774l0439M142L0150J9464
5308B84708R816m5709l957k4907p2533M4828K5898O867L0579J9175l4202M5249
5296B85812R3127o8187j6094J5913q718K0445k2579o2925J00601J3266k0760R100
5284C39001J2416J8822m7727M558J3327l8711L5096n5716L4975K6897k4004J1042
5272C29976j0960M0281M3207J191k7090l7744L2063N8373N691q348j1429K2886
5260D38097N140L9023J6053K7246M4446K6533j622l2768j4676j0935L7447L2957
5248F06941m3325K0340K0975o4019M5702k7923L4510J02630N6386j4037o676L5676
5236G67180m762L9246j9606m1151l4734l3671J976m1875k1512M5408M9877J5083
$$ y = [246452, 301992, 257120, 263385, 221719, 219524, 234977, 187617, 261391, 230952, 235094, 265244, 284708, 294524, 248815, 244858, 219951, 147418, 192246, 218144, 225011, 255590, 274765, 240563, 285812, 378939, 310752, 294658, 310571, 301853, 322298, 299719, 236794, 337395, 350661, 329901, 339001, 351417, 370239, 322512, 327070, 340397, 301686, 336782, 281066, 316041, 342938, 318934, 329976, 319016, 359297, 402504, 403695, 376605, 338861, 370924, 429297, 434988, 426640, 415211, 438097, 443237, 482260, 498313, 525559, 570005, 596538, 594916, 562148, 547472, 536537, 573984, 606941, 563616, 583956, 604931, 540912, 586614, 558691, 593201, 695831, 752217, 738180, 731504, 767180, 762418, 801664, 782058, 740907, 706173, 672502, 674478, 632603, 611091, 656499, 706376, 721459]
5224G21459m1579L1751O427j4702M1233j3610R420L1450l8568L9023n0215M8703
5212G70792J2630o5197L5517J2155K9886J9773N3199K8190O1003P30p9179l1715
5200H47784L2728l2865K2895N4763L0793K8262k0340p713N1901M6385O1973M2912
5188A159478M4364M5001M8647j4118l656L3523J15240K8226L8897R2760P2949
5177A661311M0055P0404J36917O3576Q4619P0487P9203K9305Q3564P0936N3066
5166B443443R1395P3287O4767J17463J31969J98022J75815J66536K28732K84622
5156C976051L11036L94765L96820M56614M81801N51320P40563Q35905J082611
5147I227486J434878J732851K334096L089213L824378K964701O09325k599965
$$ y = [721459, 679880, 711631, 718058, 703356, 744589, 730979, 740399, 771849, 733281, 772304, 722089, 770792, 783422, 718225, 753742, 765897, 795783, 815556, 868755, 896945, 957948, 958678, 879499, 847784, 880512, 847647, 870542, 925305, 956098, 984360, 964020, 956307, 1008208, 1054593, 1116566, 1159478, 1203842, 1248843, 1297490, 1283372, 1279716, 1313239, 1428479, 1456705, 1495602, 1588362, 1661311, 1701366, 1771770, 1908687, 1972263, 2056882, 2127369, 2206572, 2235877, 2319441, 2390377, 2443443, 2534838, 2608125, 2672892, 2790355, 2922324, 3120346, 3296161, 3462697, 3691429, 3976051, 4287087, 4681852, 5078672, 5535286, 6017087, 6568407, 7308970, 8144875, 9227486, 10662364, 12395215, 14729311, 17818524, 21642902, 24607603, 25216928, 22616963]
5139B2616963m121176l750246k778315j942752j517710j064127q56862o90028
5131E895747n96263m42516m44499l66208l12357j99960k59014j75307j82477j84572
5121B732574j63431j79055j05598j10333q4324r0357j05167n4432o9712K0443
5111A790608m7248l0533o1642K1821n8602j9069j7187q9518o5370p6177o1342
5100A285741p0045n4349m0234m8175o6918p5012M4495l3820k1599j7292r6268
5089H06524M2105m0869m2455K5827m4130j8099n187k1469L2678n1606J208n1175
5077F33352J499m3280L8390j3679l8645J7679j7290j258j6532J6901k6660p6944
5065D73533N8233o466L0231j7947k8720O6378q3957k8905O5653O944k3045L3689
$$ y = [22616963, 18495787, 14745541, 11967226, 10024474, 8506764, 7442637, 6585775, 5895747, 5299484, 4856968, 4412469, 4046261, 3733904, 3533944, 3274930, 3099623, 2917146, 2732574, 2569143, 2390088, 2284490, 2174157, 2089833, 1999476, 1894309, 1839877, 1770165, 1790608, 1743360, 1712827, 1651185, 1673006, 1614404, 1595335, 1578148, 1488630, 1423260, 1347083, 1285741, 1215696, 1161347, 1121113, 1072938, 1006020, 931008, 975503, 941683, 920084, 902792, 806524, 848629, 807760, 765305, 791132, 747002, 728903, 723716, 702247, 734925, 683319, 684527, 633352, 634851, 591571, 629961, 616282, 577637, 595316, 578026, 576768, 560236, 577137, 550477, 473533, 531766, 525300, 555531, 537584, 508864, 575242, 491285, 462380, 528033, 534977, 511932, 545621]
5053E45621m4604K7983L9247j9408m5493m8808j0247m2955J739P385K8241j8798
5041D19903k9384n445n6294N586M3988R801n2507L662K7356o015n926n4739j3740
5028B86246K6892q090j5120K5343J0825j2474R681k8735J8954m7o490J9839l1776
5015B95048l1721M2041O43l132k896n507k3556k1184j6060N1864M1282q984K9075
5002C46913R772m1315O11j1065k4534j903N464K0275j8165K2637k7597r970k15
4989B70908J9940m249n4656K5177j3018K7024N043L225J7525L5740K386j8051
4977C16994l0424K0762j1819J5132j1289r379l4118J1855P9577K0308l0993k3570
4965C13036P2968j1850n4508L7172k034K988N5475j0720j0093L8337M6807M4112
$$ y = [545621, 501017, 529000, 568247, 548839, 503346, 454538, 444291, 401336, 403075, 410460, 438701, 419903, 390519, 385074, 328780, 334366, 378354, 388155, 335648, 339310, 366666, 360651, 354725, 299986, 286246, 313138, 305048, 289928, 315271, 326096, 313622, 323303, 294568, 313522, 313475, 306985, 326824, 295048, 263327, 305368, 306011, 302879, 299983, 294476, 270920, 249736, 233676, 285540, 326822, 317838, 346913, 356685, 315370, 315981, 304916, 280382, 278479, 283943, 304218, 286053, 308690, 281093, 271123, 270908, 290848, 286599, 231943, 257120, 244102, 271126, 276169, 279394, 296919, 332659, 335045, 316994, 286570, 307332, 295513, 310645, 299356, 289977, 255859, 267714, 347291, 367599, 336606, 313036, 386004, 374154, 319646, 356818, 354784, 357772, 413247, 402527, 392434, 430771, 477578, 521690]
4953E21690j2627k1532J1866J5779Q633l6721R263r6O8735l5005j5728M4887N846
4940E64990J2695L8842r35N4031L9301m734Q185m5625J25870O2884p456L9001
4928H87049k9647N6453L0799O39N8687K9073L6333o060j4308J05510N6626J01969
4916A313123k3739R8356Q4681Q2636L8912Q7553J77413J32175K48065K19475K32085
4905B690735L19319M43844M48651O61683Q95837J128690Q85304J56020q36307
4896F793776j159288j075841q55169n17453m36333k44393k07363j70744j59725
4887A967467j12556j15994q6571n0905j39813n5884l6853q8314k5178q6144m4749
4876A124506q406l1580j1979p152m6065L8194q852k8132Q570K9827j3870O6318
$$ y = [521690, 509063, 487531, 499397, 515176, 523809, 487088, 496351, 496255, 564990, 529985, 514257, 559144, 564990, 577685, 616527, 615592, 669623, 708924, 704190, 712375, 666750, 792620, 855504, 848048, 887049, 857402, 913855, 944654, 945293, 1003980, 1033053, 1069386, 1063326, 1049018, 1154528, 1211154, 1313123, 1289384, 1387740, 1472421, 1555057, 1593969, 1681522, 1858935, 1991110, 2239175, 2458650, 2690735, 3010054, 3453898, 3902549, 4564232, 5460069, 6588759, 7474063, 7630083, 6793776, 5634488, 4558647, 3703478, 3186025, 2749692, 2505299, 2297936, 2127192, 1967467, 1854911, 1738917, 1652346, 1601441, 1461628, 1405744, 1368891, 1280577, 1255399, 1169255, 1124506, 1116100, 1084520, 1072541, 1065389, 1019324, 1057518, 1048666, 1020534, 1029104, 1058931, 1045061, 1111379]
4864A111379R4749p888Q9028L6444L767K8948j1706n8709p1229o5462j00416l2905
4852A016000j10419q3073J8329j6760Q28J756P017p4485n6141p4329P7039l901
4840G01861n3541j6103M040l2307N2505l9163j9942L5422k1844n8610J1247M0007
4828F03572k9229m7196l9956M0970j4810q255O393p66K3703j4912o4238J9015
4816D74291j9158O1487m5684j8140L0814n779L8763J8759k2426L048q320p001
4804E00654L2277l194K9858J5997J562N862L5465M8659n6848k4270l024L0767
4792F13765j6253j06248M694M0979Q179l6385K5382J3495J3475j02830q86O0668
4780E18035m4391L1164j3414J6065j7223j5294k7652J5871p522N8235l1362L174
$$ y = [1111379, 1206128, 1198240, 1287268, 1323712, 1327479, 1356427, 1344721, 1286012, 1214783, 1149321, 1048905, 1016000, 905581, 822508, 840837, 824077, 824905, 826661, 833678, 759193, 703052, 628723, 705762, 701861, 648320, 632217, 636257, 603950, 656455, 617292, 597350, 632772, 610928, 552318, 563565, 603572, 574343, 527147, 487191, 528161, 513351, 505096, 511489, 510723, 534426, 519514, 455276, 474291, 455133, 516620, 470936, 452796, 483610, 477831, 516594, 535353, 512927, 515975, 507655, 500654, 532931, 529737, 559595, 575592, 577154, 583016, 618481, 667140, 610292, 586022, 582998, 613765, 597512, 491264, 495958, 536937, 545116, 508731, 534113, 547608, 561083, 458253, 457367, 518035, 473644, 504808, 491394, 507459, 490236, 474942, 447290, 463161, 455639, 513874, 482512, 485686]
4768D85686J2794m3043K5881K4679j7883O6039j0050l3293K6986K2348K4209m3508
4756E40845N415K774K882n2578k36R7897m1003k6681K0811L0562N3205j2867M3730
4743F64756Q3615j3121K8928L6431r620M874J3990J6942n501l2905j0594N1790
4731H29585l5051K6801j445J6285J7132K5634P934j912N9975N0313K0689J2642
4719A028582j7664J4161J7350M9309J6747J679K862Q2974o593K0004j742q41j1553
4706A195275L4089M4122J6780L9718M3820R6077M3368N7205J07728J79538R1652
4695A949372K4736M965o8791n0174m8838p6653L8212P9895k5152n5843j977Q048
4683A777800n9107l8289n3871n4577m8574r556q714n538J0930L5324J1348Q3282
$$ y = [485686, 498480, 455437, 481318, 505997, 488114, 554153, 544103, 510810, 537796, 560144, 584353, 540845, 546260, 549034, 551916, 499338, 499102, 596999, 555996, 529315, 550126, 580688, 633893, 621026, 664756, 748371, 735250, 764178, 800609, 790989, 795863, 809853, 826795, 821294, 788389, 777795, 829585, 794534, 821335, 819890, 836175, 853307, 878941, 886875, 884963, 944938, 995251, 1015940, 1028582, 1010918, 1025079, 1042429, 1091738, 1108485, 1110164, 1113026, 1196000, 1189407, 1209411, 1207669, 1206828, 1195275, 1229364, 1273486, 1290266, 1329984, 1373804, 1469881, 1513249, 1570454, 1678182, 1857720, 1949372, 1974108, 1979073, 1910282, 1860108, 1811270, 1734617, 1772829, 1852724, 1827572, 1771729, 1769752, 1777800, 1718693, 1680404, 1626533, 1571956, 1523382, 1513826, 1505112, 1499574, 1510504, 1545828, 1557176, 1640458]
4671A640458l1551j974K2583L7546J5283M4009K1575m6028O6321O3414J13335
4660A944971P4308Q1875J90308J32623J69411L08541L56006L34961M27507J39826
4650D160337j23466l17962l83072l37492l93632k78820k17945j99107j60951p7810
4640A670080j15822j07070r9386M2987n2104p231q2913q178N857n2454L495k2329
4628A174932l2017k1682k3175o582j4150j157m1430J842J8443N3375n4627L3850
4616A087622j1820L3324q08N153k9382K9437K16R237j3258O1889O13N278M1236
4603A218737j8521l9561m1552n6946m2811L4156m509o326k3908L7350j8027j3614
4591A024468M0245k7684o061O9601l3595L4067j9014J9115M5058k343Q996n7860
$$ y = [1640458, 1608907, 1606933, 1629516, 1667062, 1682345, 1726354, 1747929, 1701901, 1768222, 1831636, 1944971, 2019279, 2101154, 2291462, 2424085, 2593496, 2902037, 3258043, 3593004, 4020511, 4160337, 4036871, 3718909, 3335837, 2998345, 2604713, 2325893, 2107948, 1908841, 1747890, 1670080, 1554258, 1447188, 1347802, 1390789, 1338685, 1331454, 1248541, 1240363, 1246220, 1193766, 1197261, 1174932, 1142915, 1121233, 1098058, 1091476, 1077326, 1076169, 1034739, 1036581, 1055024, 1108399, 1053772, 1087622, 1075802, 1109126, 1108318, 1113471, 1084089, 1113526, 1113742, 1122979, 1109721, 1171610, 1172223, 1177501, 1218737, 1200216, 1160655, 1119103, 1062157, 1019346, 1053502, 1048993, 1042667, 1018759, 1056109, 1038082, 1024468, 1064713, 1037029, 1030968, 1100569, 1066974, 1101041, 1082027, 1101142, 1146200, 1143857, 1152853, 1094993]
4579A094993M2241Q3325K8680k6257M325o835K3508M2720m3277J3267O8908K4396
4567A349994j3251Q353r654K0834L8004l1797k146J566N5177N6483k3868Q2473
4555A532168J0575j2016K4921Q4255p130K9477k792l448k8935R2833L6904M4533
4543A801345P376L1989J0523L8546k1513K4413R470K0586J2180Q255M6782j928
4531A988024L6088M3212l084J1408R8656K1409K179J8092O3929k9274N501J8230
4519B274370N0550J2412R2587l2571k014j3030J1672P2560J4836J8740K1225M1792
4507B563129O7074M3511K3008J7749j7057N4983N4821O2977n2757j84Q7797L0534
4495B935585m5434M0797M1797M9627J9036o394M8251J9276J4999P964L5256k3609
$$ y = [1094993, 1137234, 1220559, 1249239, 1222982, 1227307, 1220472, 1243980, 1286700, 1243423, 1256690, 1325598, 1349994, 1336743, 1345096, 1335442, 1356276, 1394280, 1362483, 1360337, 1361903, 1417080, 1473563, 1449695, 1532168, 1542743, 1530727, 1555648, 1639903, 1632773, 1662250, 1659458, 1656010, 1627075, 1719908, 1756812, 1801345, 1808721, 1840710, 1851233, 1889779, 1868266, 1892679, 1902149, 1922735, 1934915, 1943170, 1989952, 1988024, 2024112, 2067324, 2064240, 2075648, 2174304, 2195713, 2197892, 2215984, 2279913, 2250639, 2256140, 2274370, 2324920, 2337332, 2429919, 2397348, 2395334, 2382304, 2393976, 2466536, 2481372, 2500112, 2521337, 2563129, 2630203, 2673714, 2696722, 2714471, 2697414, 2752397, 2807218, 2870195, 2817438, 2817254, 2905051, 2935585, 2890151, 2930948, 2972745, 3022372, 3041408, 3035014, 3083265, 3102541, 3117540, 3125504, 3160760, 3137151]
4483C137151N5028M2896m5121J5501L0741P3591L0748L2791O622Q362r265R5135
4471C474180j512J2704k4304M4851n6698J5612O6478q451N8337N820j4538L351
4459C575830O1283L6144N712o1765P3534K3059M7267P0714K5767L265N0925l3461
4447C878274L2743N9741p96O7651K299N2688N6356L3681L6325k5295M6772M7900
4435D288339Q1176O4619J9628L8283k682l2932J6385R3749K0958M9993O3923R120
4423D710559J4144m185O4610N2333J05118K9239O3643O1218K2659Q2733L7743
4412E239814K4775Q0874J42024M9136k7127Q632L2785j2246J8195J1752R0061
4401E658675K6736J2216N1286O9252Q4617L6382R4111K2272K9461J00568Q1740
$$ y = [3137151, 3192179, 3235075, 3189954, 3205455, 3236196, 3309787, 3340535, 3373326, 3379948, 3388310, 3379045, 3474180, 3472668, 3485372, 3461068, 3505919, 3449221, 3464833, 3531311, 3522860, 3581197, 3587017, 3572479, 3575830, 3637113, 3673257, 3678969, 3617204, 3690738, 3713797, 3761064, 3831778, 3857545, 3860810, 3911735, 3878274, 3911017, 3970758, 3969962, 4037613, 4039912, 4092600, 4148956, 4182637, 4218962, 4193667, 4240439, 4288339, 4369515, 4434134, 4453762, 4492045, 4489363, 4456431, 4472816, 4566565, 4587523, 4637516, 4701439, 4710559, 4724703, 4720518, 4785128, 4837461, 4942579, 4971818, 5035461, 5096679, 5119338, 5202071, 5239814, 5264589, 5345463, 5487487, 5536623, 5509496, 5518128, 5550913, 5538667, 5556862, 5568614, 5658675, 5685411, 5697627, 5748913, 5818165, 5902782, 5939164, 6033275, 6055547, 6085008, 6185576, 6267316]
4390F267316J9457P5489P5330N5774Q5147P6625J9214N2622K1143J05354O2799
4379F916270O5928K2087N5492J37687M3934N6812J14567N9294O7445N1551R2475
4368G683542P1711J06333J33070J08304J13974L9849J29454J10227J24359J42319
4358H763142O7338P0607R1070J58518J57184J14043J37908Q4180J25102J21155
4348I890247N5396J52011N7358J13516J05592R8249J10640Q5664M8134J26278
4338A0843085N9998N9136Q3977O9767P2093j5236N0350R3952N1720k0517P3381
4327A1421706N8547K0728N234Q8708O2597P5783l4369K9033K0425Q9447L0475
4316A1868314l6860P5555O5734J3631M2951L8002O7839L1258M6421J04669O9509
$$ y = [6267316, 6286773, 6362262, 6437592, 6493366, 6578513, 6655138, 6674352, 6726974, 6748117, 6853471, 6916270, 6982198, 7004285, 7059777, 7197464, 7241398, 7298210, 7412777, 7472071, 7539516, 7591067, 7683542, 7755253, 7861586, 7994656, 8102960, 8216934, 8256783, 8386237, 8496464, 8620823, 8763142, 8830480, 8901087, 8992157, 9150675, 9307859, 9421902, 9559810, 9643990, 9769092, 9890247, 9945643, 10097654, 10155012, 10268528, 10374120, 10472369, 10583009, 10668673, 10716807, 10843085, 10903083, 10962219, 11046196, 11115963, 11188056, 11172820, 11223170, 11317122, 11368842, 11348325, 11421706, 11480253, 11500981, 11506215, 11594923, 11657520, 11733303, 11698934, 11727967, 11748392, 11837839, 11868314, 11831454, 11907009, 11972743, 11986374, 12029325, 12067327, 12135166, 12166424, 12212845, 12317514, 12387023]
4305A2387023O2307L651K1725N3340K6408J6307l228k1512L8478M0892l1028k919
4293A2591444L4575J4049k9222r170k8243p2119k4220n7206j6922l2866m8966
4282A2321134j1765l8755m5897o9727K1707N1638l3533o6200j3039N1666N4415
4271A2221644l8463M5976P3839O269L0682J6284j6869l5147L5089J4188M0732
4260A2394224M1036O0704O6822R6353O7309M0046J04477K4327J9871J13762M8161
4249A3077092P1840J28192N9396O4412P0236O1126P5099Q4262P9784J02105Q2482
4238A3956026N7222J30615J41567N5713Q8630J40287J19035J25138J38915J10104
4228A5063252J25276J46439J64765J04585J61207J54491Q3392N0480K2545P2630
$$ y = [12387023, 12449330, 12452981, 12474706, 12528046, 12554454, 12570761, 12567533, 12546021, 12584499, 12625391, 12594363, 12591444, 12626019, 12640068, 12610846, 12601676, 12573433, 12501314, 12477094, 12419888, 12402966, 12370100, 12321134, 12309369, 12270614, 12224717, 12154990, 12176697, 12228335, 12194802, 12128602, 12115563, 12167229, 12221644, 12183181, 12229157, 12302996, 12309265, 12339947, 12356231, 12339362, 12304215, 12339304, 12353492, 12394224, 12435260, 12495964, 12562786, 12659139, 12726448, 12766494, 12870971, 12895298, 12915169, 13028931, 13077092, 13148932, 13277124, 13336520, 13400932, 13471168, 13532294, 13607393, 13691655, 13771439, 13873544, 13956026, 14013248, 14143863, 14285430, 14341143, 14429773, 14570060, 14689095, 14814233, 14953148, 15063252, 15188528, 15334967, 15499732, 15604317, 15765524, 15920015, 16003407, 16053887, 16076432, 16149062]
4218A6149062J17859K3792N7831P9642O1640Q5648M1604M7289J12184Q9706J23998
4207A6990255Q3911P2117J23671J41347J55918J02001J32662R3159J15775J09604
4197A8120420J7119O4918J3296K4142L3015O580J01427J29987M2659R0399J31131
4186A8775093J77075J33639J67023K31018K12306K25825K32410L31162L09663
4177B0795214L41741L16970M57083N31909O58229Q99335R70953N14642k89394
4168B5196682r38125q66891o63602l84619k44565j84202j01316j0980L2100K9108
4158B1863590M0844J06365J17532K6297P3499J13962J43902J29401R8229M5351
4148B2758972J08230J81745J10869J62380J33018J55271K65105K11631L01764
$$ y = [16149062, 16266921, 16290713, 16348544, 16428186, 16489826, 16575474, 16617078, 16664367, 16776551, 16866257, 16990255, 17074166, 17146283, 17269954, 17411301, 17567219, 17669220, 17801882, 17895041, 18010816, 18120420, 18137539, 18202457, 18215753, 18239895, 18272910, 18279490, 18380917, 18510904, 18553563, 18643962, 18775093, 18952168, 19085807, 19252830, 19483848, 19696154, 19921979, 20154389, 20485551, 20795214, 21136955, 21453925, 21911008, 22442917, 23101146, 24000481, 24971434, 25486076, 25196682, 24258557, 23391666, 22728064, 22343445, 22098880, 21914678, 21813362, 21802382, 21834482, 21863590, 21904434, 22010799, 22128331, 22154628, 22228127, 22342089, 22485991, 22615392, 22713621, 22758972, 22867202, 23048947, 23159816, 23322196, 23455214, 23610485, 23875590, 24087221, 24388985]
4139B4388985K64667L10255K98587K52612K17962K03332K50652K02518K32473
4130B6622043L15160L02801L43742L70376L27130L76822M18225L53292L84698
4121B9814289M35583L84839M40243L95812M28087N35068M61209N94614O18081
4112C4107825N61098L95235L40058L75567L27836N34924N17036M84520N22094
4103C8166193N53970O34290N80755O19118O66309O96276O67147O94444Q26262
4094D4104764Q20549Q64166R15174R50728J033986J079849J096809J066681J059924
4085E2992630J034639J117292J201541J243470J265839J292901J385975J403940
4077F2938227J491534J513954J577492J576090J580991J610594J671701J812849
$$ y = [24388985, 24653652, 24963907, 25262494, 25515106, 25733068, 25936400, 26187052, 26389570, 26622043, 26937203, 27240004, 27583746, 27954122, 28281252, 28658074, 29076299, 29429591, 29814289, 30249872, 30634711, 31074954, 31470766, 31898853, 32433921, 32895130, 33489744, 34107825, 34668923, 35064158, 35404216, 35779783, 36107619, 36642543, 37159579, 37644099, 38166193, 38720163, 39354453, 39935208, 40554326, 41220635, 41916911, 42584058, 43278502, 44104764, 44925313, 45789479, 46704653, 47655381, 48689367, 49769216, 50866025, 51932706, 52992630, 54027269, 55144561, 56346102, 57589572, 58855411, 60148312, 61534287, 62938227, 64429761, 65943715, 67521207, 69097297, 70678288, 72288882, 73960583, 75773432]
4069G5773432J925816J970413J981930K167268K220682K274195K420730K405432
4061I3139898K461993K518237K605013K585975K527233K545958K605307K626696
4053A13616310K757506K841239K875061K971754L053915L201561L427099L617286
4045A38361731L872589M119858M422641M828176N196951N734275O283038O870789
4037A79690048P579580Q398755R183960J0085816J1091387J2043358J3050194
4030B51123098J3985117J4921015J5688845J6245567J6268097J5579556J3883146
4023C57694441J0737980O195726L00642o140623j1720738j5199277j6527792j6192902
4015C09147457j5220134j3793575j2341917j0900301r665407q620895p664324
$$ y = [75773432, 77699248, 79669661, 81651591, 83818859, 86039541, 88313736, 90734466, 93139898, 95601891, 98120128, 100725141, 103311116, 105838349, 108384307, 110989614, 113616310, 116373816, 119215055, 122090116, 125061870, 128115785, 131317346, 134744445, 138361731, 142234320, 146354178, 150776819, 155604995, 160801946, 166536221, 172819259, 179690048, 187269628, 195668383, 204852343, 214938159, 226029546, 238072904, 251123098, 265108215, 280029230, 295718075, 311963642, 328231739, 343811295, 357694441, 368432421, 374628147, 374928789, 368788166, 357067428, 341868151, 325340359, 309147457, 293927323, 280133748, 267791831, 256891530, 247226123, 238605228, 230940904]
4008B30940904o869480o182095n729542n282718m946192m763844m662058m634361
4000A87870614m480245m495707m571822m656223m700513m694834m635842m454247
3992A51181181m350874m136350m043428l857820l738282l541778l314598l116206
3984A21081845l016500k907536k741690k638553k569087k502686k319827k315021
3976A00070945k212056k091310k047859j976851j868720j802002j764818j598662
3968H4708667j524021j474019j401997j352390j316175j313002j254364j175832
3960G3896867j099596j078527j051727r66479r97747j005228r02377q70464q65697
3951F5059025q19405p92634q70202p70396p37543p78596p90270p21994q07453
$$ y = [230940904, 224071424, 217889329, 212159787, 206877069, 201930877, 197167033, 192504975, 187870614, 183390369, 178894662, 174322840, 169666617, 164966104, 160271270, 155635428, 151181181, 146830307, 142693957, 138650529, 134792709, 131054427, 127512649, 124198051, 121081845, 118065345, 115157809, 112416119, 109777566, 107208479, 104705793, 102385966, 100070945, 97858889, 95767579, 93719720, 91742869, 89874149, 88072147, 86307329, 84708667, 83184646, 81710627, 80308630, 78956240, 77640065, 76327063, 75072699, 73896867, 72797271, 71718744, 70667017, 69700538, 68702791, 67697563, 66795186, 65924722, 65059025, 64239620, 63446986, 62576784, 61806388, 61068845, 60290249, 59499979, 58777985, 57970532]
3942E7970532p58242o89497p01421o75006o81771o24733o69079o19840o09336
3933E1941607o11509n42758n06540n47762n13646m89658m51777m22620m52418
3924D7402919m42918m43360m28601m12255l53221l63206l16472l30243l45399
3915D3967244k81211k20236l12487k30826k95476k70517j87900j72783j74445
3906D1821363k90742k40372k28537k11165k78244l02080k81414k52114l25134
3897C9411561l47344l51680l51370l98057l14202k99462l55332l69700l15278
3888C6309136l16348l43997l40942k59285k76451l19682k46279k54870k72311
3879C3678971k67074l09064k13119k53738k48228k90783l55813l53543l65809
$$ y = [57970532, 57212290, 56522793, 55821372, 55146366, 54464595, 53839862, 53170783, 52550943, 51941607, 51330098, 50787340, 50280800, 49733038, 49219392, 48729734, 48277957, 47855337, 47402919, 46960001, 46516641, 46088040, 45675785, 45322564, 44959358, 44642886, 44312643, 43967244, 43686033, 43465797, 43153310, 42922484, 42627008, 42356491, 42168591, 41995808, 41821363, 41530621, 41290249, 41061712, 40850547, 40572303, 40270223, 39988809, 39736695, 39411561, 39064217, 38712537, 38361167, 37963110, 37648908, 37349446, 36994114, 36624414, 36309136, 35992788, 35648791, 35307849, 35048564, 34772113, 34452431, 34206152, 33951282, 33678971, 33411897, 33102833, 32889714, 32635976, 32387748, 32096965, 31741152, 31387609, 31021800]
3870C1021800l42358l34198k67359l87939l50596k61309l23865k36530k20334
3861B8297312j53686j39071j40902j33455o0518j00611r0597m4389l4831J8296
3851B7417548J4554n539l1267o5343o199L9925j4784l380M8666K2484O1879J01409
3839B7579953J51830K41418K26165K19298K23437K46844K70343K46812K91485
3830B9697585L52617L56554M16564L83452M53862M61987M89173N20910N12733
3821C3645437M45884L72800M32105M31546L85768M67801N56772O73673O84999
3812C8096785O30454O38012P53448Q91671Q96926J039566J015365J124906J261223
3803D6348356J349085J396842J455263J599436J604119J684823J773606J912182
$$ y = [31021800, 30679442, 30345244, 30077885, 29689946, 29339350, 29078041, 28754176, 28517646, 28297312, 28143626, 28004555, 27863653, 27730198, 27669680, 27569069, 27478472, 27434083, 27399252, 27417548, 27432102, 27426563, 27395296, 27329953, 27323754, 27363679, 27348895, 27345515, 27394181, 27416665, 27478544, 27579953, 27731783, 27973201, 28199366, 28418664, 28642101, 28888945, 29159288, 29406100, 29697585, 30050202, 30406756, 30823320, 31206772, 31660634, 32122621, 32611794, 33132704, 33645437, 34091321, 34464121, 34896226, 35327772, 35713540, 36181341, 36738113, 37411786, 38096785, 38727239, 39365251, 40118699, 41010370, 41907296, 42946862, 43962227, 45087133, 46348356, 47697441, 49094283, 50549546, 52148982, 53753101, 55437924, 57211530, 59123712]
3795E9123712J986726K057728K215416K295908K272729K303552K121653K021259
3787G6398683J914848J733794J608299J493630J651388J681839J842796K110139
3779I0435416K330900K585465K834781L399342L651494L940870M276065M494689
3771A17949022M670019M767617M687482L993720K971364J486112m00076k079199
3763A38046061l036238k992341k313726j515592o14025K72517R73752J702462
3755A30522870K193240K637552K878605K934972K976917K669431K281807J626117
3747A50721511N30054p38971j958300k892124l612331m238222m701282m692041
3739A28418294m169123l447009k777904k079217j501955r52077o47100n94791
$$ y = [59123712, 61110438, 63168166, 65383582, 67679490, 69952219, 72255771, 74377424, 76398683, 78313531, 80047325, 81655624, 83149254, 84800642, 86482481, 88325277, 90435416, 92766316, 95351781, 98186562, 101585904, 105237398, 109178268, 113454333, 117949022, 122619041, 127386658, 132074140, 136067860, 139039224, 140525336, 140125260, 138046061, 135009823, 132017482, 129703756, 128188164, 127574139, 127846656, 128820408, 130522870, 132716110, 135353662, 138232267, 141167239, 144144156, 146813587, 149095394, 150721511, 151251565, 150512594, 148554294, 145662170, 142049839, 137811617, 133110335, 128418294, 124249171, 120802162, 118024258, 115945041, 114443086, 113491009, 112843909, 112249118]
3731A12249118p63929r67246j497725k011524k634173l212325l781345m369064
3723I3011787m603529m472762m204987l919308l603491l280787k912230k587510
3715F3427183k349492k169271j835709j742095j593930j496757j406115j489697
3707D9344117j452778j567041j543159j484565j536202j510666j402638j335152
3699C7511916j189862j086216j029663r83920r63442r17149r33886q86144p84590
3690B8737044p20513o78328o15602n90865n61139n26268m86877m82584m84266
3681B3590602m97137m83848m86120m93738m63995m71996n59745m60512n61092
3672A9112419n46032m87105m82652m71155m02121l01419l39991l21507l57627
$$ y = [112249118, 111485189, 110517943, 109020218, 107008694, 104374521, 101162196, 97380851, 93011787, 88408258, 83935496, 79730509, 75811201, 72207710, 68926923, 66014693, 63427183, 61077691, 58908420, 57072711, 55330616, 53736686, 52239929, 50833814, 49344117, 47891339, 46324298, 44781139, 43296574, 41760372, 40249706, 38847068, 37511916, 36322054, 35235838, 34206175, 33222255, 32258813, 31341664, 30407778, 29521634, 28737044, 28016531, 27338203, 26722601, 26131736, 25570597, 25044329, 24557452, 24074868, 23590602, 23093465, 22609617, 22123497, 21629759, 21165764, 20693768, 20134023, 19673511, 19112419, 18566387, 18079282, 17596630, 17125475, 16723354, 16421935, 16081944, 15760437, 15402810]
3663A5402810k23680k66356k62756k31641l05202k48276k95779k50210k65829
3654A3053081l90513l10283k62280l16983k63104k30599l17898k52024k93630
3645A0415767k84694k08242j76171k37608j63439j71514j84497j81661j85040
3636H622901j37976j65745j46534j29501j58745j52523j47005j46776j08518j17318
3626G212260j01585q3291j39844r7629r4891j09582p2061q4375o0583j5143p3177
3615F280099j47314o5449j04667n984p0691j14045m6189l8944o2932m5228k9833
3604E548823j23045o0081n4284j28890m6472m8368q588k3473o948q4766o5523
3593D898385o8984q5652j8736p4933m6476J7797m2138J0441p5687l0516R647n8063
$$ y = [15402810, 15179130, 14912774, 14650018, 14418377, 14113175, 13864899, 13569120, 13318910, 13053081, 12662568, 12352285, 12090005, 11773022, 11509918, 11279319, 10961421, 10709397, 10415767, 10131073, 9922831, 9746660, 9509052, 9345613, 9174099, 8989602, 8807941, 8622901, 8484925, 8319180, 8172646, 8043145, 7884400, 7731877, 7584872, 7438096, 7329578, 7212260, 7110675, 7027384, 6887540, 6789911, 6695020, 6585438, 6513377, 6429002, 6368419, 6353276, 6280099, 6132785, 6067336, 5962669, 5956685, 5885994, 5771949, 5725760, 5686816, 5623884, 5578656, 5548823, 5425778, 5365697, 5311413, 5182523, 5136051, 5087683, 5079095, 5055622, 5048674, 4963908, 4898385, 4829401, 4743749, 4725013, 4650080, 4603604, 4621401, 4579263, 4589704, 4514017, 4483501, 4493148, 4435085]
3581D435085o174k6104m0949J4310P661o2168j6279p9679m386q4325j5576o0595
3569D060821J6061n0216l2025M0033o4296j7100n1261L6966p443m6335L7508o861
3557C915852j4715k4853m820k9706J1446p3925l3423k6321p6963k2187k1066m2507
3545C556812l4194l9359r820L8007l2884r497l570K4917k0139J632K7621n8003
3533C441523p6906J2909k1842q4704o9160l9950o3232P0236n3106k8762n9690
3522C027316K330o7308j6310k0314k7373k0693j8909l0415k7543m2868q1306m3754
3510B632853k8852l4567n388l9537p6658p0429k1538J3060m5754k7056l3483n5375
3498B207276N5879J0255n2769L6155m6635p4587n5808O8059m3660o0217k3982
$$ y = [4435085, 4428911, 4402807, 4361858, 4376168, 4383829, 4321661, 4305382, 4225703, 4221317, 4136992, 4121416, 4060821, 4076882, 4026666, 3994641, 4034674, 3970378, 3953278, 3902017, 3938983, 3931540, 3885205, 3922713, 3915852, 3901137, 3876284, 3871464, 3841758, 3853204, 3779279, 3745856, 3719535, 3642572, 3620385, 3599319, 3556812, 3522618, 3483259, 3473439, 3511446, 3478562, 3469065, 3465495, 3490412, 3470273, 3471905, 3499526, 3441523, 3364617, 3377526, 3355684, 3270980, 3201820, 3161870, 3098638, 3168874, 3115768, 3087006, 3027316, 3029646, 2962338, 2946028, 2925714, 2898341, 2877648, 2858739, 2828324, 2800781, 2757913, 2676607, 2632853, 2604001, 2569434, 2564046, 2524509, 2447851, 2377422, 2355884, 2368944, 2323190, 2296134, 2262651, 2207276, 2263155, 2273410, 2220641, 2256796, 2210161, 2135574, 2079766, 2147825, 2104165, 2043948, 2019966]
3487B019966J9124j6278j01k6473L0639m4742o2666J9890j4286m7392J9827l2607
3475A864901P774p3118k2447J153l2867j5276K8281p9914o1739K0881R669l6763
3463A610535m0385N619m3666o2431j1314n1508J6060O723j8914M5299k8837n7643
3451A369538p050k3150l9759O950J8850k4814K3043j1403j2540K0112m588j8623
3439A296566l8099k2040K3348J2363n5103k6543j7402l160n1262P514l554j7829
3427A104799k8386P545j9616j2577n4892M465J7646m0001o3324O3743J7267j08428
3415H88241k8633M7504p1332K865L1797J0982k2201J9477o2038p7870J0982K6131
3403G75905l2962L0545L8843m1016m2281r92L647K272m9086k5482L2397l0100
$$ y = [2019966, 2039090, 2022812, 2022711, 1996238, 2026877, 1982135, 1919469, 1939359, 1925073, 1877681, 1897508, 1864901, 1872675, 1799557, 1777110, 1778263, 1745396, 1730120, 1758401, 1678487, 1616748, 1637629, 1647298, 1610535, 1570150, 1575769, 1532103, 1469672, 1458358, 1406850, 1422910, 1429633, 1410719, 1456018, 1427181, 1369538, 1362488, 1339338, 1299579, 1306529, 1325379, 1300565, 1323608, 1312205, 1299665, 1319777, 1315189, 1296566, 1258467, 1236427, 1259775, 1272138, 1217035, 1190492, 1173090, 1169930, 1118668, 1126182, 1122628, 1104799, 1076413, 1083958, 1064342, 1051765, 996873, 1001338, 1018984, 978983, 915659, 979402, 996669, 888241, 859608, 907112, 835780, 838645, 870442, 881424, 859223, 878700, 816662, 738792, 749774, 775905, 742943, 773488, 812331, 771315, 729034, 728042, 731689, 733961, 684875, 659393, 691790, 661690]
3391F61690K1566r469k1594j3202K260j7919N534j0014m3291l7322M5806K9452
3379F13497J6661k9098l7366j9074l0363q298M985q26k802k5474O506O497l597
3366D91248O844q0425L0556L6255J9745m308j4539n9042r753j7549K906R656n8543
3353C53051l0916j0242P3595n9779j819J3198K6113m545k7822N3113k9575K1176
3341C75548k0997J2800l4640K0907l14m982q211P420j7623k2736N551M1984o9646
3328B85061k4917L0329j0349K0617j5760K1083j4097J1592n9040J2167K5849l7403
3316B45132m933K7733l0399O5087q03o7499q422j5836o0326O067N4402M2219l4295
3303B18127k1919L3015l280N77J9739k7487j3163j9615N438m2245O3975n5371
$$ y = [661690, 683256, 673787, 652193, 638991, 641251, 623332, 628866, 618852, 575561, 538239, 584045, 613497, 630158, 601060, 563694, 544620, 514257, 505959, 510944, 510118, 507316, 481842, 488348, 494845, 491248, 498092, 417667, 448223, 484478, 504223, 499915, 485376, 426334, 416581, 399032, 401938, 411594, 353051, 322135, 311893, 385488, 325709, 323890, 337088, 363201, 358656, 330834, 383947, 354372, 375548, 354551, 367351, 332711, 353618, 353304, 348322, 340111, 347531, 329908, 307172, 312723, 354707, 285061, 260144, 290473, 280124, 300741, 284981, 306064, 291967, 303559, 244519, 256686, 282535, 245132, 240199, 267932, 237533, 302620, 301817, 234318, 225896, 210060, 149734, 155801, 210203, 252422, 218127, 196208, 229223, 225943, 226520, 246259, 218772, 205609, 185994, 191432, 149187, 213162, 157791]
3291A57791R504K006j4382P433L7162j2807m83Q356m1985K8114q468L206J4120
3278A89567r485J2717K8667j1921k9376k2702m0157O9457n277l6864K1702K4727
3266A91055k0046l6107Q5307K2048p4485n939r954O0532k1428q840l582M9M0399
3253B19009j6067l312r6206N6103Q99q1086L0623O4661r185M2446m2715j0506
3241A54664K2035K4065K72k030K4477N81l9188k5361J7313N1750m1850n228M6715
3228B28215P67k2122j4523L8010O534j9367J2217M458P9871j0449k9836J4029
3216B87804j9891Q5514n276k2120M9447l9911Q739J02277n5810k3887O4207L5931
3204D67024k829N846j9982K7213L0036o376M4753J0884O321K4666J1266L54L4326
$$ y = [157791, 167295, 169301, 154919, 162352, 199514, 186707, 186224, 194580, 152595, 180709, 172241, 175447, 189567, 180082, 192799, 221466, 209545, 180169, 157467, 117310, 186767, 181490, 144626, 166328, 191055, 171009, 134902, 220209, 242257, 167772, 161833, 151879, 212411, 190983, 182143, 178561, 178610, 219009, 202942, 199630, 103424, 159527, 160426, 79340, 109963, 174624, 165439, 207885, 165170, 154664, 176699, 200764, 201036, 199006, 223483, 224064, 184876, 159515, 176828, 228578, 186728, 181500, 228215, 228982, 206860, 192337, 230347, 236881, 217514, 229731, 234189, 314060, 303611, 273775, 287804, 267913, 353427, 348151, 326031, 375478, 335567, 344306, 446583, 390773, 366886, 431093, 467024, 464195, 470041, 450059, 477272, 507308, 500932, 545685, 556569, 562890, 587556, 598822, 599176, 633502]
3191F33502j9135n999N9674M9117O8162O4577O5029N8898J13492J06048J08945
3180A302310J81910J14756J98002J42679K43317K06238L56809M43033N01059P06384
3170D396497Q87800P64288P75207l28020j041203q38744p51822o15695n40143
3161B708165l93396k15675k47473j53935p3545j57248q7857j29030q7236p5331
3151A087439q6853r5944m0499o4284k1118k8229j962j12810r2528j0030j4483
3140E18699J6746l0160N185k2510l3652J1817o2559L7833o6294K7653K3942Q435
3128D35135j8623m2263L411k8535p7015j9761l2905O023j7943J1195J0029j3777
3116B14971j5058J096J8241J2668k8847N4771n0662l29l519L336l9738k8664K3677
$$ y = [633502, 614367, 608368, 668042, 717159, 785321, 849898, 914927, 973825, 1087317, 1193365, 1302310, 1484220, 1598976, 1796978, 1939657, 2182974, 2389212, 2746021, 3189054, 3690113, 4396497, 5284297, 6048585, 6823792, 6495772, 5454569, 4615825, 3864003, 3248308, 2708165, 2314769, 2099094, 1851621, 1697686, 1624141, 1466893, 1379036, 1250006, 1162770, 1087439, 1000586, 904642, 864143, 799859, 778741, 750512, 748550, 635740, 543212, 533182, 518699, 535445, 505285, 510470, 487960, 454308, 466125, 403566, 441399, 375105, 402758, 426700, 435135, 416512, 374249, 377660, 349125, 272110, 252349, 219444, 225467, 207524, 218719, 228748, 214971, 199913, 201009, 219250, 231918, 203071, 257842, 207180, 206851, 203332, 206668, 166930, 138266, 161943]
3103A61943j7100L4745l7138m6497L2979l990R392L865K4905L3654o6196n3909
3091G6653k9165j9643J6472M9069Q236K4251l5752P010J2025l3091K9174K7070
3079A32309m1120N294M570j7128J4253j2654k9730L7440L9708l5019l3212k0005
3067D4706J1965M9145L1744k45j9546r807o9068k0054L4352J3970n8468J8053
3055B6747L8080N7268o8630j3038K5248J0554l1768k1267M8979m0947P404p154
3043C1476J2242J0911J9316l6506l0842j7026m035O7333k8033j1963K0463r870
3031B3466o365l9692Q2820k4556L6068l8247l1757L9493m3656M366J4149j7033
3019i44j1759o51L5175O78J4333L3021p0967q345J1991l0326L2708N3841k5374
$$ y = [161943, 144843, 179588, 142450, 95953, 128932, 124942, 134334, 138199, 163104, 196758, 130562, 76653, 47488, 27845, 44317, 93386, 101622, 125873, 90121, 97131, 109156, 76065, 105239, 132309, 91189, 96483, 101053, 83925, 98178, 85524, 55794, 93234, 132942, 97923, 64711, 44706, 56671, 105816, 137560, 137315, 117769, 107962, 38894, 18840, 53192, 67162, 8694, 26747, 64827, 122095, 53465, 40427, 65675, 76229, 44461, 23194, 72173, 31226, 38630, 31476, 43718, 54629, 73945, 37439, 6597, -10429, -14464, 52869, 24836, 12873, 33336, 23466, 17101, -22591, 60229, 35673, 71741, 33494, 1737, 41230, -2426, 1940, 16089, -944, -12703, -13354, 21821, 22499, 36832, 69853, -1114, -9459, 2532, -27794, 4914, 58755, 33381]
3006C3381l3257J2873K0225j0451N3820l3753m0766l6441o299R239M1377K5672
2994C5620J5198l1776L6420j0493p8560N9735j6864j197N1126K7309p4586J5346
2982B7278L3713q210k1290m1676M3572K1536l8314r738N0049j7845P278l4346
2970A2007J0375j8768j6859N6537L2810p1123q267L110J5982L6411o872L0683
2958G6026r271K1181l8007k0372O658k4533n7882m678K3709J6036K3707m5984
2946c3410K3634K029J8569m5643N1684K5481n5725n1108J4137J9520R105n338
2934b7065l2481M6921J6060k4648K4992k3461J1681J7187l8607j9982K2152K211
2922b5040J5332K1340j5805L9298n0607P140j2915J9851m2329L7749k5507J7919
$$ y = [33381, 124, 12997, 33222, 22771, 76591, 42838, 2072, -34369, -40668, -31429, 9948, 35620, 50818, 19042, 55462, 44969, -33591, 26144, 9280, 8083, 59209, 86518, 11932, 27278, 60991, 52781, 31491, -10185, 33387, 54923, 16609, 6871, 56920, 39075, 46353, 12007, 22382, 3614, -13245, 43292, 76102, 4979, -3288, -178, 15804, 52215, 45343, 76026, 66755, 87936, 49929, 29557, 36215, 11682, -46200, -50878, -27169, -11133, 12574, -33410, -9776, -7747, 10822, -34821, 16863, 42344, -13381, -64489, -50352, -30832, -21727, -27065, -59546, -12625, 3435, -21213, 3779, -19682, -8001, 9186, -29421, -49403, -27251, -25040, -9708, 11632, -4173, 35125, -15482, -8342, -21257, -1406, -43735, -5986, -31493, -13574]
2910a3574N9269o6834r979K5623P197L0327j0088j1679m2751M1265J0933m9004
2898b9295N664N6590j6808l4069o580M5273n191K1826N534Q919k2917k8105k8119
2885b7278j4715O0287n9009M4481J677q193j3048j5502k119K7684K6630L694K6240
2872E0829p549p1771O046N3123j0779l3152k7752J6259N5469J9514l1649m6544
2860b7956L1056l1633N2957l3635n5819L3777J4170L6870M184k6310k0178K3141
2848F24K8222j2322j0464K2490j567l4006j8511N6323m3462m68j0421j1948M2247
2835F737O514J0903K633j7783R952k7603k1275j963J7397r482O566L3093k5780
2822a0091q181j8273P704J3794M2309j1537j2322K3999l7160p6529M1174J4115
$$ y = [-13574, 45695, -21139, -31118, -5495, 1702, 32029, 21941, 10262, -32489, 8776, 19709, -29295, -23631, 32959, 16151, -17918, -24498, 20775, 15584, 37410, 42944, 51863, 28946, 841, -27278, -41993, 18294, -40715, 3766, 5443, -2750, -15798, -31300, -33419, -5735, 20895, 24589, 50829, 43280, -28491, -22445, 30678, 19899, -13253, -41005, -24746, 30723, 50237, 18588, -27956, 3100, -28533, 24424, -9211, -65030, -31253, -17083, 19787, 23971, -2339, -22517, 624, 28846, 16524, 6060, 28550, 26983, -7023, -25534, 30789, -12673, -13141, -23562, -35510, 6737, 13251, 24154, 26787, 9004, 18956, -8647, -29922, -31885, -14488, -23970, -17404, 15689, -10091, -18272, -36545, -28841, -15047, 27262, 15725, 3403, 27402, -9758, -86287, -45113, -30998]
2810c0998J672O431J2916J7459m44j7226j741q612r141K7870k384L7219l4452
2797a431l541p309J8171O3804l6070m817k0423J9749k0670m1975l6874k1534O4549
2784b8371l3690J515J0102L2536l481k9799j4719O5037K134j289J5283l7320L4952
2771A2890n2939Q681m080K4183q499k2121p549m2630k4969M8138P8665L517l9803
2758b6516n3248Q466K172Q9641l064P55j1790j4557j4047J7072j0409j4899K2437
2745g987o584K2221K453L883l4690p190r376M6320M946l7448k8369K5788J7635
2732h398n6214j1864l4317l218K7069L1516L1543K9172K1600q855r524K5449o8841
2719c4882J9020k5536M2118J5955k0730M3289o3043M6343l5440l3850M2793J3252
$$ y = [-30998, -29326, -22895, -9979, 7480, 7036, -10190, -11931, -20543, -29684, -1814, -4198, 33021, -1431, -4972, -12281, 5890, 69694, 33624, 28807, 8384, 28133, 7463, -34512, -71386, -92920, -28371, -62061, -60546, -50444, -17908, -21389, -51188, -65907, -870, 1264, -25, 15258, -22062, 12890, -40049, -31368, -35448, -11265, -19764, -41885, -49434, -92064, -117033, -68895, 9770, 13287, -26516, -79764, -71298, -69126, 20515, 17451, 18206, 6416, -8141, -22188, -5116, -15525, -30424, -7987, -14571, 7650, 10103, 13986, -20704, -27894, -37270, 9050, 13996, -23452, -51821, -26033, -8398, -64612, -76476, -110793, -114011, -86942, -55426, -23883, 5289, 26889, 18034, 8510, 33959, -34882, -15862, -41398, 720, 16675, -4055, 39234, -23809, 22534, -12906, -46756, -3963, 9289]
2707I289J4725n1476n7950M7709N5460Q079m0716l0179K1706K7262K9107J5568
2695D8584o0500k0449J8297J7299j110O82l7435J1150n70k4130K3577K38K5594
2682A227j2057k6015J9574l2904Q583K9885Q200K8418m117n0347M5961j9584m8788
2669e1964m7809j1733P3922O7711M3718k3561l7623M7907k2819l0730J47l0457
2657b3291J6650o253l472P6570l6025m5877j3541j5012M325j2275K3550L0618
2645d033m8157L2280o165j6921K9865l0119o974k694K3695K313L075P03P2712
2632D9580l2882P963J357j1462l2380N4771K992l7523N967m103j6931M120k0320
2619b8851K9332l5258K4211M35l2680M3907Q277j5881m3929K0842l2575L5486
$$ y = [9289, 24014, -27462, -85412, -37703, 17757, 25836, -14880, -45059, -23353, 3909, 33016, 48584, -11916, -32365, -14068, 3231, 2121, 2803, -34632, -23482, -24052, -48182, -24605, -24367, 1227, -10830, -36845, -17271, -50175, -41592, -11707, -3507, 24911, 20794, -29553, 16408, -3176, -51964, -99773, -111506, -37584, 30127, 73845, 50284, 12661, 60568, 37749, 7019, 7166, -23291, -6641, -12894, -16366, 60204, 24179, -21698, -35239, -50251, -45926, -58201, -34651, -4033, -52190, -19910, -26075, -42996, -13131, -43250, -50224, -52918, -29223, -26910, -23835, -23132, 49580, 16698, 24661, 26018, 14556, -17824, 36947, 39939, 2416, 8383, 4280, -12651, -8531, -28851, 481, -34777, -10566, -10131, -42811, 1096, 9373, -6508, -50437, -29595, -62170, -26684]
2607b6684K962k5470K1426J043K8721m610m5462P9671l4915J3711J3199l2578
2595h986l0762K285L492j8149m955j2878K9288K7978P653m9093K4441J7353J6751
2582D418J823k1303r692N8944k882o4756p763M1809K1756K8239l7746j7618K0804
2569A6033k8704K871K7953j5591j0831P461k0994j6840K2187J1368L5523m4489
2557a4053j5624K2900p0456M6901K7130K2361J9153j5787l2642L5879L192j1440
2545A7514J6150j5144q0458L6232O0866L335m9134m1634J7512N357l8166M4738
2533b2832j4255l43k0377J5852O392k0773j5717L3016J6737J6734R994M27n1080
2520d6225Q822Q5857m2628o9142r771M8675K571K4473k2159K0086j3690j3771
$$ y = [-26684, -23722, -49192, -27766, -26723, 1998, -2612, -48074, 31597, -3318, 10393, 23592, -8986, -39748, -37463, -33971, -52120, -57075, -69953, -40665, -12687, -5034, -54127, -29686, -12333, 4418, 6241, -15062, -24754, 34190, 31308, -33448, -41211, 598, 22354, 50593, 12847, -4771, 16033, -12671, -9800, 18153, 2562, -8269, -808, -21802, -38642, -16455, -5087, 30436, -14053, -29677, -6777, -77233, -30332, -3202, 19159, 38312, 22525, -10117, 25762, 28954, 17514, 33664, 18520, -61938, -25706, 35160, 38495, -10639, -52273, -34761, -29404, -67570, -22832, -37087, -37430, -57807, -41955, -35563, -56336, -72053, -39037, -22300, -5566, 4428, 4855, -46225, -37403, 48454, 5826, -63316, -73087, -24412, -21841, 2632, -19527, 559, -13131, -26902]
2508b6902P749l1287K2860m310j5206K5236K2101M5323o066o567m3434J9226k5334
2495a6611M1745l1028n6520M4865O348K6403j3242l7730M5260k223J9936m6600
2483a9397P725M3550l946l7595M732j0752L9648k9063n0587M144M0655J4831O505
2470A0450o0765J1933L3842k9165J5722k0214L3500N6957o2437J6462M9255k2994
2458C2546R858m8601J7248l9722j4811O759r903J8833l738J7874K4024m6280K1824
2445a4089k8589j8474j241L2045N3352J3077m6455m2330L0918P3237j8853q851
2433B3747j4440J8904K8070p4391J5403q594o543L1817J8292m5098K9299k0998
2421d532m8813L18L3990k6321J7417Q84K4032K046o076N1749k9483L8211j9961
$$ y = [-26902, -19153, -50440, -27580, -31890, -47096, -21860, 241, 45564, 39498, 32931, -10503, 8723, -16611, 25134, -5894, -62414, -17549, -11201, 15202, 1960, -35770, 9490, 7267, 27203, -19397, -11672, 31878, 27932, -9663, -4931, -15683, 23965, -5098, -55685, -51541, -10886, 3945, 10450, -50315, -38382, -4540, -33705, -17983, -38197, -4697, 52260, -10177, 6285, 55540, 32546, 42404, -6197, 11051, -28671, -43482, -36723, -46626, -27793, -31531, -13657, 10367, -35913, -14089, -42678, -61152, -62393, -30348, 23004, 36081, -10374, -52704, -21786, 51451, 32598, 23747, 9307, 28211, 56281, -18110, -2707, -11301, -17844, 13973, 32265, -12833, 16466, -4532, -53345, -53027, -19037, -45358, -27941, -27057, -3025, -979, -7055, 44694, 15211, 53422, 33461]
2408C3461j1186m2585j1261L2668L6687k450q923l8094J0178l0840j4922Q381
2396c8886j6276K8326o0044K5508R1439r280k9151o7049Q8332J1056k7366J286
2384b105m4773j3345P9992K308p4375K620M0196j6304J1723J5029l1285M905K3302
2371b112q183k6302L4643Q565n6695j3788M2133J4084K2859m8820k2887P433K4067
2358b5003L5789K6163j778l3082K5012j8973r291J306O803m8375O6141J3898n0412
2345a1802J0909J5646l0459n6861M4518L9376r14k3429n0l2282J0864J6985M721
2332a2778K0n6035j1948K9892N9132J8176N379j3223m2589Q486J9391L624l6826
2319b9299K4850o673J6057o310N597m3834k6493J1288K5056l9796j2143P5020
$$ y = [33461, 22275, -20310, -31571, 1097, 37784, 35334, 26411, -11683, -1505, -32345, -47267, -38886, -55162, -26836, -86880, -61372, 30067, 20787, -8364, -75413, 12919, 23975, -3391, -2105, -46878, -60223, 19769, 22077, -52298, -49678, -9482, -25786, -14063, 966, -30319, -25414, -2112, -10295, -36597, -1954, 6611, -50084, -63872, -21739, -7655, 15204, -33616, -56503, -49070, -25003, 10786, 36949, 35171, 2089, 27101, 8128, -1163, 143, 6946, -41429, 24712, 38610, -11802, -893, 14753, -15706, -72567, -28049, 11327, 10413, -13016, -13066, -45348, -34484, -17499, -12778, -12758, -68793, -80741, -50849, 8283, 26459, 31838, 18615, -23974, -15488, 3903, 7527, -29299, -4449, -11122, 4935, -1375, 4222, -39612, -66105, -54817, -29761, -69557, -81700, -6680]
2307f680j5451j7691q276L5432K7970n6037q78J3933M4368L7487k9059p827o241
2294A1050K6280l8913o904K3324j3903j0869k9042L7684J634k1800Q80J7935O9931
2281F7287j6108j9412k2673J7418O995j1185K332k1023m1532j5199k615M1147
2269a4568K0256q016K9245M5980n2118K3834k3082m4186L678N877j7004L0805
2257G01N43k4609L9094k3523L9692l6897k3408K2824J4407n8768K2760N109L866
2244a8209J7031j8912k6922K0087l6823J1715q018K8672O825l0980N282K7873
2232b2379J338J6767k5427K3928J8520k8213L237K9735L7183J2306n7468L768
2220A3295k7918K0966j5531P035L6244m3230l0751k6990K1321O6935q026l5741
$$ y = [-6680, -22131, -39822, -48098, -12666, 15304, -40733, -41611, -27678, 16690, 54177, 25118, 17291, 11050, 37330, -1583, -8487, 14837, 934, -9935, -38977, -1293, 341, -21459, -20579, -2644, 67287, 51179, 31767, 9094, 26512, 33507, 22322, 24654, 3631, -37901, -53100, -55715, -14568, 5688, -2328, 26917, 72897, 20779, 44613, 21531, -22655, -18977, -13100, -30104, 701, 1244, -23365, 15729, -7794, 31898, -4999, -28407, -5583, 8824, -49944, -27184, -22075, -18209, -1178, -20090, -47012, -26925, -63748, -52033, -60051, -31379, -24554, -55534, -50252, -22379, -21041, -4274, -29701, -5773, 12747, -15466, -12229, 17506, 54689, 66995, 9527, 13295, -14623, 6343, -9188, -2153, 34091, -9139, -39890, -66880, -45559, 21376, 13350, -22391]
2208b2391j2619k4241J6693j2502n403J8288L7358j8122L0186j2610n2981L5206
2196b3138J7414K0657l793l539J0386j1441P838J755p060l3351r042j466j539
2183c6319p105N8892L2006n9853o4401O272O9953j5966J1338K3618j8398j8891
2171a8854J2667J0252J2034M5004j8798o204J7934l6637k5520M5j6100j0726j3884
2158d8787M1819J4747J0705K4974O175q4275J7192K2513k2118K931P542k8450
2146c5032J486k0345J8992n514J4393O6603m2297n4594J7630j3635L1847L6009
2134A5543J0789l4944O229J0883J4280J3897m41o0402O981k990j1023K2038J3945
2121D785l4439J4905M7409M189j1803j1457J8778o525O0719m5966q4249j3147
$$ y = [-22391, -35010, -59251, -42558, -55060, -60463, -42175, -4817, -22939, 7247, -5363, -58344, -23138, -5724, 14933, 11140, 7601, 17987, 6546, 14384, 16139, 9079, -24272, -33314, -34780, -36319, -43424, 15468, 47474, -12379, -76780, -70508, -555, -16521, -5183, 18435, 37, -18854, -6187, 4065, 16099, 61103, 42305, 36101, 54035, 17398, -8122, -8077, -24177, -34903, -48787, -6968, 7779, 18484, 43458, 49633, -34642, -17450, 5063, -17055, -14124, -6582, -35032, -33546, -53891, -34899, -40413, -26020, 40583, -1714, -56308, -38678, -52313, -20466, 15543, 26332, -8612, -2383, 8500, 22780, 36677, 36236, -24166, -17185, -20175, -31198, -9160, 4785, -29654, -14749, 32660, 36849, 25046, 13589, 32367, 25842, 86561, 40595, -43654, -56801]
2109e6801j3949J9588l000J3776J7778J8015l8764P7353j9921j9816m791j0610
2097b1142l9874P7692K7310j0330k3343k7565l6679P0683M340J0804o8322K4004
2085a2422N273m6283n755M1952L0794j9491o976l6053J8398J2724L9731k7412
2073e520L0129l8848n545j6998O2357p2361N370K3725N6035n6752k7896k495K1982
2060b6817m1924R6424k6444j3415l1212o340M2102j9876j0637K5709l7400J9713
2048c0117M166M0414j0743j8267M9993q752n9790L7515L3478m9196J2947j3647
2036a1999l7152M8694L1584n5095k6336K2925k4106J00628K0179l6280M088l3281
2024C849J9156k4724o1397M123J8767N1349k4048k424m260J6488N3775j3293k5421
$$ y = [-56801, -70750, -51162, -54162, -40386, -22608, -4593, -43357, 33996, 14075, -5741, -10532, -21142, -61016, 16676, 43986, 33656, 10313, -17252, -53931, 16752, 21092, 31896, -36426, -12422, -7149, -53432, -59187, -17235, 13559, -5932, -12908, -48961, -30563, -17839, 21892, -5520, 24609, -14239, -19784, -36782, 25575, -46786, -41416, -17691, 38344, -18408, -46304, -48799, -26817, -68741, 27683, 1239, -12176, -43388, -49728, -7626, -27502, -38139, -12430, -49830, -30117, -25951, 14463, 3720, -14547, 35446, 26694, -33096, 4419, 37897, -11299, 1648, -11999, -49151, -457, 31127, -23968, -50304, -27379, -51485, 49143, 69322, 33042, 37130, 3849, 23005, -1719, -63116, -58993, -40226, 11123, -12925, -15349, -19609, -3121, 50654, 37361, 11940]
2011A1940k9988K2964m8133J812kL1615N0348n4606l586K6402j516n931l1170
1998b9851j4246L6308j2152l5055K3759R585j6515m5588K5639N9814J7239J9017
1986C7954L1701o5339k4073o68Q373j0034M1781k7072R540k5843L4067M605q181
1973F811k6809r354j2121L1397M4082l906l4554l8495J684M5227l470K636j5552
1960a2424K5324O497n0881L9987O489J0843J2916m7340l9085K1502j3288M161
1948c5299K9943m0912M8552J6081o4035L4471Q264O992k9650j4622K1145L8330
1936A9260j798m214m8615j5623N2005P358r266k9311k6148M1161j054o948L8815
1923A5622j0819k2920L0997k1509J5996L18l0995J8873j682J0588k6195l9647
$$ y = [11940, -18048, 4916, -43217, -41405, -41407, -9792, 40556, -14050, -17636, 8766, 7250, 1319, -29851, -44097, -7789, -19941, -54996, -31237, -21652, -38167, -83755, -58116, 1698, 18937, 37954, 69655, 4316, -19757, -20425, -12052, -22086, 19695, -7377, 2163, -23680, 10387, 14992, 6811, -19998, -29352, -41473, -10076, 34006, 30100, -4454, -42949, -41265, 3962, 492, 3128, -12424, 12900, 19397, -31484, 8503, 14992, 25835, 38751, -8589, -47674, -26172, -39460, -35299, -5356, -46268, 2284, 18365, -45670, -11199, -2935, 4057, -25593, -40215, -19070, 19260, 17462, 13248, -35367, -50990, 1015, 8373, -893, -30204, -56352, -15191, -16245, -23193, 15622, 4803, -18117, 12880, -8629, 7367, 7685, -23310, -4437, -6119, 4469, -21726, -61373]
1911f1373L1071M0272l7869J4085J0954N816J111l0176j7420J1863M7662r821
1899F175J1102O22m7307M1714K9670p4547j5002Q5310o9179M0493J2251J2595
1887C3897K7523R43l8180J3285m9769j7097M6376j140K3198q165j2246l0401p246
1874a9022N4799k0699q4435J0388P7157J5055n5538k767k2648K1628l353L1808
1862B373k0994L8745l998m8263J0405K8157j5656K909K1178R193N264j4885K5080
1849C9508r157k9532l6321M3646O303j1652k6918j5324O83J7459M9134l5474J4539
1836F894L9166l4305k1302K5612J4769k5462l6054O8347P697j6587r630o3840
1824d4695O4171m776j6774L7586l2990j5001l0891k4713K1113L0489k8400k1692
$$ y = [-61373, -30302, 9970, -27899, -13814, -2860, 2956, 4067, -26109, -43529, -31666, 15996, 6175, 17277, 17899, -29408, 12306, 41976, -32571, -47573, 37737, -31442, 9051, 21302, 33897, 61420, 62363, 24183, 37468, -12301, -29398, 16978, 15838, 39036, 30871, 18625, -11776, -19022, 35777, 15078, -69357, -58969, 18188, 33243, -22295, -25062, -47710, -26082, -29435, 2373, -18621, 20124, 16126, -32137, -21732, 6425, -9231, -6322, 14856, 24049, 29313, 14428, 39508, 30351, 819, -35502, 8144, 14447, 2795, -24123, -39447, -38764, -21305, 27829, -7645, 6894, 46060, 11755, -9547, 16065, 30834, 5372, -30682, 37665, 45362, 28775, 19145, -44695, 19476, 14700, -2074, 35512, 2522, -12479, -43370, -68083, -46970, -16481, -44881, -66573]
1812f6573L9327L3823K7528k2628k8647l4197J3996L5058R956K5535J8028r557
1800D1649k109j5509K7871l0086m9463J7607l4585K5529l8608R256Q2428M046
1788C8026j7385l3922J76O4630n1459k1203L3043J0193l4286k9632K8446N2821
1776C9448l2271L7668n1378p360l558j7700p466J3470j5966L1731L1838q9008
1764g0552K4224L0647O2031j4125J8055m4480m099M2072r08n3591N518K2933l4722
1751a6997K3137o386J5305K388k1992j2865j7754J702P4482j0673J6695o902l8524
1738A616O7245L2315o9611o1011K9710L3603o555l0448o0214K2370j9538J9350
1726d1168R176J9202N1296n2187j0101J0586o0215j0036N9713J4804L6366K4543
$$ y = [-66573, -27246, 6577, 34105, 11477, -17170, -51367, -37371, -2313, 7643, 33178, 51206, 41649, 39540, 24031, 51902, 21816, -27647, -10040, -44625, -19096, -57704, -48448, 33980, 38026, 20641, -13281, -13105, 51525, 66, -21137, 11906, 22099, -12187, -41819, -13373, 39448, 7177, 44845, -6533, -13893, -17451, -35151, -42617, -29147, -45113, -13382, 18456, -70552, -46328, -15681, 46350, 32225, 50280, 5800, 1701, 43773, 42865, -10726, -5208, 17725, -16997, 6140, -246, 15059, 17447, -4545, -17410, -35164, -33462, 41020, 30347, 47042, 40140, 1616, 68861, 101176, 31565, -29446, 264, 33867, 27312, -3136, -63350, -40980, -60518, -41168, -31992, -12790, 38506, -13681, -23782, -13196, -73411, -83447, -23734, -8930, 27436, 51979]
1714E1979l0809n235m0899o0990O971N0453M4175j6563m5570J56P439k4722L3286
1701c0329L7684n33j4383l1041O0087K7143n3427K8199j0477k0796J7475O555
1689A6157l3146j6367O608N2319k0850R289K6741k936j8163l1252m2051M3217
1677a0434K3804K408n968k4366j4265K2985n828P1077k3017n5371j1805K1673
1665i107L5028l3523l3302M1807O364O948J4915k2352l4954l2765N2685k5727
1653c3983L268K6571Q576J8614l6440L3708j4465p3767P3465J0190p362l8518
1641c0143j7860J2860l336K1775O934Q678J9740j8724M259J0885r814L63K2410
1628B8027M646J6151k3007j9121Q990l4835R389j6893J5360j1672J3658K7324
$$ y = [51979, 21170, 15935, -24964, -85954, -78983, -28530, 15645, -918, -46488, -46332, -38893, -63615, -30329, 7355, 6822, -7561, -38602, 21485, 48628, -4799, 23400, 12923, -7873, 9602, 16157, -16989, -33356, -26748, 25571, 4721, 14010, 40751, 37815, 19652, -11600, -53651, -10434, 13370, 15778, 9810, -14556, -28821, -5836, -11664, 59413, 36396, -18975, -30780, -9107, 25921, -7602, -40904, 903, 7267, 14215, 29130, 6778, -28176, -60941, -8256, -33983, -30715, -4144, 4432, 23046, -13394, 20314, 5849, -67918, 5547, 15737, 8375, -30143, -48003, -35143, -38479, -16704, -9770, -1092, 18648, -76, 4183, 15068, 5254, 5617, 28027, 32673, 48824, 25817, 6696, 15686, -19149, -9760, -26653, -11293, -22965, -9307, 18017]
1616A8017k7209k1071M4042j8836l4802L7998r616J13L2212l404j5799N598k8243
1603b1000k4139M4915j5075m4614Q8808k270n8813M4660Q385K499m2243O7461
1591D8574l2510p1097L7635l6836K9950M5803o8685R169K3923L6211J5873m1190
1579c180l4287Q4543j0150k1852M4104L584J4572k9888p180l4855m6851L562P426
1566c0452L091M3627l5941k0894M3012M1932n7599M1016l4301J1077M7845K6065
1554G8478n2684m7655O665j0198m0367L8273k139j321k3266M2719j2496K0675
1542c316l9418O2730j9679l069N4767o8631j6559K7015M3003n2283j7912Q289
1530b5063K2871L3625r561m4141K626L7894j3147n19J3031p0284N7272J2380L6263
$$ y = [18017, -9192, -30263, 13779, -5057, -39859, -1861, -11477, -11364, 20848, 17444, 1645, 7243, -21000, -45139, -224, -15299, -59913, 28895, 26625, -32188, 12472, 20857, 23356, -18887, 48574, 16064, -55033, -17398, -54234, -24284, 21519, -47166, -37997, -14074, 22137, 38010, -3180, -37467, 47076, 36926, 15074, 59178, 62762, 77334, 47446, 40266, 5411, -41440, -37878, -30452, -27361, 16266, -19675, -40569, 2443, 44375, -13224, 27792, -6509, 4568, 52413, 78478, 25794, -21861, -15196, -25394, -65761, -27488, -29627, -30948, -54214, -11495, -23991, -3316, -42734, 19996, 317, -2752, 52015, -16616, -33175, -6160, 36843, -15440, -33352, -25063, -2192, 31433, 21872, -22269, -19643, 18251, 5104, 4585, 17616, -52668, 4604, 16984, 53247]
1517E3247m2843k5729p582K1163q390K9873N467n0532Q4L111q307j9758N0379
1504A83J4344m6607J6715o555M7218j9605p943p66l1073q077J8977M2367k6462
1491g284K4625L1982j2047l8087k1461N2489K0202L9050l8240l0177j3521m4382
1479c6851L5278j8050R866J3440L4659o3854L001Q428j010L219L9862L7679p4827
1466i160k7899M3015Q779O000j207k7751J3532l6854N7920J2828J5965l5543l0891
1453a1266J5622M8377l1111p5527O6034L7424k6627j0686l2770J2213K7202l6538
1441a7653M1437k7521K8907J3695k2889n448j9811K4624J2324m8242K3050j1715
1429i242J0050J2565p0352n009O0471l3350k2446L8640K3611q127M4511K5467
$$ y = [53247, 10404, -15325, -22907, -1744, -10134, 19739, 25206, -25326, -25242, -22131, -30438, -50196, 183, 14527, -32080, -15365, -21920, 25298, 5693, -2250, -3016, -34089, -42166, -23189, 19178, -7284, 17341, 49323, 37276, -811, -22272, 30217, 50419, 89469, 51229, 21052, 7531, -36851, -1573, -19623, -9757, 3683, 38342, -25512, -22511, -14083, -15093, -11874, 27988, 65667, -9160, -37059, 5956, 14735, 20735, 19528, -8223, 5309, -31545, 26375, 39203, 55168, 19625, -11266, 4356, 52733, 21622, -53905, 12129, 49553, 22926, 12240, -20530, -8317, 18885, -17653, 23784, -3737, 25170, 38865, 15976, 10528, -9283, 15341, 27665, -20577, 2473, -9242, 808, 13373, -56979, -61988, -1517, -34867, -57313, -18673, 4938, -3189, 41322, 66789]
1417F6789l4036l957n0542k390J6932L1962L781k6271J3511o822j6084q099R514
1404e712j5955k4464k182j6378K9803K2722j8867L2401J7330m239K9343j9796
1392B4006l7739j733j7520L2382J3483k7466K5630K7690k0234M6154J8064n0211
1380C2506L7712m4213m4155K4252m8258K252N9637j4195k7342J9822j658J3837
1368A0197L2427l1272J8665m9213j1311o162N4962l2856j8294k0994R274N7312
1356A2735m7431P751J8315J8445l4079J5620M1764j2741l3823k9892M5701j5263
1344a2898M484J5205J1095o2899J2757J9360K2558P302m425m8899L7821O2750
1332F4211k9370k2080j4303l036J3963k4425L7748K8476j8945k4743K8871n610
$$ y = [66789, 32753, 28796, -21746, -24136, -7204, 24758, 28539, 2268, 15779, 8957, -7127, -15226, -5712, -21667, -46131, -48313, -64691, -34888, -12166, -31033, 1368, 18698, 14459, 43802, 24006, -13733, -15466, -32986, -604, 12879, -14587, 11043, 38733, 18499, 64653, 82717, 32506, 70218, 26005, -18150, 6102, -42156, -39904, 19733, 5538, -21804, -1982, -3640, 10197, 42624, 11352, 30017, -19196, -30507, -36669, 18293, -14563, -32857, -53851, -44577, 12735, -34696, -26945, -8630, 9815, -24264, -8644, 33120, 20379, -13444, -43336, 2365, -12898, -8414, 6791, 17886, -45013, -32256, -12896, 9662, 16964, 12539, -36360, 1461, 64211, 34841, 12761, -1542, -4578, 9385, -15040, 22708, 51184, 32239, 7496, 36367, 30757]
1320C0757n1031K2778J7185l6066p707K6033l9647K1883J8022J248n5543J6922
1308c5166j4456L1873K1123O5291o7204J648j6k2046R008p036J6104n372m3030
1295d9279K3703k040m1882J6676m2054L476K8428K5334k1926J8436P9413n5041
1283a6756l0786K8359q021L1272N9243o8484K1945K3045k1308j1633m6489Q1093
1271D1480n185l3902N8898j7218m0420k4287J0315K9269J3029k0350n6861J2029
1259c3203J2442j4678r603M610J0187K2691N620j3626O0635N662l8813K5567k1884
1246A5607K8069J7177l8873k1669L442L2572J2693m7731j0812N2341J3407L4313
1234I0536k4962o129m0024l569J5086j7381J002J4369J2461N649m5831j9467j1209
$$ y = [30757, -20274, 2504, 19689, -16377, -24084, 1949, -37698, -15815, 2207, 3455, -52088, -35166, -49622, -17749, 3374, 68665, 1461, 3109, 3093, -18953, -9945, -16981, -877, -6249, -49279, -25576, -27616, -69498, -52822, -94876, -91400, -62972, -37638, -59564, -41128, 38285, -16756, -47542, -19183, -27204, 4068, 63311, -5173, 16772, 39817, 18509, 6876, -39613, 41480, 36295, 2393, 61291, 44073, 3653, -20634, -10319, 18950, 31979, 11629, -45232, -33203, -20761, -35439, -45042, -40432, -30245, -7554, -1934, -15560, 45075, 50737, 11924, 37491, 15607, 43676, 60853, 21980, 311, 3753, 36325, 49018, 1287, -9525, 42816, 56223, 90536, 65574, 59445, 19421, 15852, 30938, 13557, 14559, 28928, 41389, 47038, 1207, -18260, -29469]
1221b9469r918Q978K0806m8261L6527J5959J669K549k169R50J3576k4652k3222
1208c6677l4269j2178J07681j0010j4002j8358L2034k0263L2127r385j1397K49
1196E552j4742N2314O345k0294l4552j910O187l0927K6307o58O5272j0168j7402
1183C1324n2382j1453O8080k7696k6093m220l0677R2163K7710j314k1258j3986
1171C0198k2228j186m7365l9302Q6928o718J7246m8623l898N4750J6153n5719
1159a9764P037J4915J5748k8858p027o351R684k0196j3104N0145O8921k8792p5390
1146c3032j2584K84N1160K0418J3516L45K5341q7865J9913J3945Q083J3615M6816
1133G9955j5749o4908j3880j1124r85M5069L2281l6879k0894K8922l8176N9763
$$ y = [-29469, -39387, -30409, -9603, -57864, -21337, -5378, -3709, -1160, -3329, -2379, 11197, -13455, -36677, -70946, -83124, 24557, 14547, 545, -17813, 14221, -6042, 26085, 16700, 5303, 5552, -9190, 43124, 49469, 29175, -5377, -7287, -1100, -32027, -5720, -6378, 58894, 48726, 31324, -21058, -32511, 35569, 7873, -18220, -22440, -53117, 39046, 66756, 65442, 44184, 30198, 7970, 6784, -40581, -79883, 7045, 327, 17573, -31050, -34948, 19802, 35955, -19764, -12727, 2188, 17936, -10922, -17949, -24300, -14616, -34812, -47916, 2229, 71150, 42358, -33032, -45616, -45332, 5828, 26246, 39762, 40107, 65448, -22417, -2504, 11441, 19524, 33139, 79955, 64206, -702, -14582, -25706, -26691, 18378, 50659, 13780, -7114, 21808, -16368, 43395]
1121D3395J3376l8963j0722n680J2097K966l068K4054j8690m7295N1275l7972
1109a5227J4062J052l4679M2145L3085j6455m3194l7930L6137K6645k0532J0540
1097d351M4562k4763k1144P311L3193l0354O886m461l6632m5429M9318J6973J850
1084g041N1848J575r986j0454L8700l1023O350n25m2722j0671M0681K0710J0939
1071E8381l7230R498j6365l4067M3594M9416j6413m6870j8385j2370L7609M7830
1059F4628j7145J5568J7451l7352n0189l3906K8242P6414o1881K7483r105k4453
1047d245K1463O870J6367p3820N6309J9252M472l2311n3372k2242M1449p148L5715
1034H759k5502Q751k0906m1250R4982Q223l3038r652L8829j4246L0010j5775k5154
$$ y = [43395, 56771, 17808, 7086, 1406, 13503, 16469, 13401, 37455, 18765, -28530, 22745, -15227, -1165, -113, -34792, 7353, 40438, 23983, -19211, -57141, -21004, 5641, -14891, -4351, 40211, 15448, -5696, 1615, 34808, 4454, 11340, 6879, -29753, -75182, -25864, -8891, -7041, 44807, 46382, 36396, 25942, 64642, 33619, 39969, 39444, -3278, -13949, 26732, 47442, 58381, 21151, 30649, 14284, -19783, 23811, 73227, 56814, 9944, -8441, -20811, 16798, 64628, 47483, 63051, 80502, 43150, -7039, -40945, -12703, 63711, 1830, 29313, 20208, -4245, 17218, 24088, 40455, -33365, 22944, 42196, 46668, 14357, -39015, -61257, -19808, -26956, 8759, -16743, -7992, -28898, -70148, 24834, 33057, 19, -9633, 29196, 14950, 44960, 29185, 4031]
1021D031J8611o9164M9820m6423J8516L337K4632m1738O2131k1159J3326R421
1009B5341k2379M0378J6637l0993o8291J3837K5774R805n5273J4485M4822N421
997A9564k3527M9348q1863j4929P9399k0111j0479m465j814p587J2106K6833n153
984A7322m5893M7640K7005k4061k1698m9547J1549N5094o78m5196k6073M1087
972a3449L717l7548Q221L7922O574j7678l3638M017M0764K1909N2572m1088k3408
959H887k2285N116M4566k835j8647J8600l6998Q076J6446J8216L4838m1086j5475
946A7419J0456n6346M8653P350k4831J7371L9161j3913r623k9461n1805J3137
934c2432M0693k9994N039M9023j1127k9397J5969N978j541j6171N157K1905J8868
$$ y = [4031, 22642, -46522, 3298, -43125, -24609, -21272, 3360, -38378, 23753, 2594, 15920, 25341, 2962, 43340, 59977, 28984, -39307, -25470, 304, 10109, -45164, -30679, 14143, 19564, -3963, 45385, -36478, -51407, 27992, 7881, -2598, -7063, -8877, -16464, -4358, 22475, 17322, -28571, 19069, 46074, 22013, 315, -49232, -37683, 17411, 16733, -28463, -54536, -13449, -9732, -47280, -39059, -1137, 5437, -12241, -45879, -41862, -1098, 20811, 73383, 32295, 8887, -13398, -8282, 36284, 33449, 14802, 33402, -3596, 4480, 20926, 39142, 73980, 32894, 17419, 27875, -28471, 20182, 27532, 2701, 20072, 59233, 45320, 35697, 6236, -45569, -32432, 8261, -21733, -16694, 32329, 21202, -8195, 7774, 13752, 12211, -3960, 1197, 23102, 41970]
921D1970n6865k9924O7943l258Q551k3313m0541N942K620K5275l3154L2244j188
908c698K4339k1596L3185l0436k6299k0344k548O8474m3740K6432J3825l1011
896a3417o949o526M9832J7797k0377m0158K0683K5183L1239l1447o0633L2030
884b743L5235m9749M035O559n8730q867M2113N6794j375j9030m1350O3106k1104
871D894N077q126K2372L8211o354p9593K5499J1387K4917m5738M060J2510J5426
858B4542j7122K3295n566k7953K4302k2902K0789N8689k9514l3930p03m5044j218
845c2335l1311L4492r804L9149K8770K877k6168m264J3547L130K2000m9601k5285
832c4803K0292L638J8523j7949L733j8537P475k5960J2996J9575j0961j3721j5008
$$ y = [41970, -14895, -44819, 23124, 19866, 28417, 5104, -35437, -29495, -26875, -1600, -34754, -2510, -3698, 20641, -955, 32230, 1794, -24505, -44849, -47397, 21077, -22663, 3769, 17594, -13417, -20366, -26892, 22940, 40737, 20360, -19798, 885, 26068, 57307, 25860, -34773, -2743, 32492, -17257, -13222, -6663, -65393, -74260, -32147, 24647, 23272, 4242, -37108, 25998, 4894, 9971, 1845, 24217, 62428, 56074, -23519, 1980, 13367, 38284, -7454, -3394, 9116, 24542, 7420, 30715, 25149, -2804, 21498, -1404, 19385, 78074, 48560, 14630, 13927, -31117, -32335, -63646, -29154, -38958, 191, 28961, 31838, 5670, 1406, 14953, 18083, 40083, -9518, -34803, -14511, -10873, 7650, -10299, -6566, -25103, -17628, -43588, -30592, -11017, -21978, -35699, -50707]
819e0707O9732q785J4488n8023J4362j2623r735M5254o049K2015m0944L4337N553
806A8875l1733L247k861L2238j4747N6315p985j0945j5657q706p582n534J8398
793B3323K3570p397r4305K525Q332j1141O628r041L7544N1038O657k0286p7053
780e9606N2425M5224n290j3080m8418O0678J1980j4793j3982J8014m5692m051
768a6591J6367K8071m565m594k2548L465N3630l348k1160n28m2319J795L758q749
754a7316J8381n8449N5856L544P058K564l6722l69j8829M0564P139k7098M7443
741B3766n1323l4409K7976J5760O047k4629L0533J0555o7789j5030N7516L4452
729A3425j0106J3661J638o5920k0580O1877O0065N919q2515J3415p615N510r584
$$ y = [-50707, 19025, 10240, 24728, -33295, -18933, -31556, -41291, 3963, -2086, 19929, -21015, 13322, 18875, -12858, -9611, -12472, 19766, 5019, 61334, 53349, 42404, 26747, 18041, 10459, 4925, 23323, 46893, 39496, -54809, -52284, -43952, -55093, -48465, -57506, -19962, 31076, 37733, 17447, -59606, -7181, 38043, 32753, 19673, -28745, 31933, 43913, 29120, 15138, 33152, -12540, -16591, -224, 27847, 23282, 18688, -3860, -395, 53235, 49887, 28727, 28199, -14120, -12325, -8567, -17316, 1065, -57384, -1528, 2016, 9074, 11638, -25084, -25453, -44282, -3718, 3421, -23677, 23766, -27557, -61966, -33990, -18230, -12183, -36812, -6279, 4276, -63513, -78543, -21027, 13425, 3319, 16980, 18618, -47302, -67882, -6005, 54060, 59979, -22536, -9121, -16736, -11226, -20810]
716b0810L8508L2154j5034Q438J6059l8561Q465J5388j4767n1811O968j1328p026
703c3357L3399j0745N2071q4412K4824l376j8842O2308j3952k5853J9404K9114
691C0583k9064k175j3424N894M524l0421j900N0532m801M22j3702J5327K4849
678C6644L2039k9307m846k3499L21K68M5457k7853l8965L1860j2302k0252J8657
665H222M664n1284M781J2378M2545N3845j7145n1959j8625r087q931Q798N503
652a6295m0046N4373K1031R149k1940j1014k033j3517N609k1874J4646n313L7575
$$ y = [-20810, 17698, 49852, 34818, 43256, 59315, 20754, 29219, 44607, 29840, -21971, -15003, -26331, -33357, 42, -10703, 41368, -43044, -18220, -21596, -40438, 21870, 7918, -17935, 1469, 30583, 1519, -656, -14080, -8186, -3662, -34083, -35983, 14549, 9748, 10170, -3532, 11795, 36644, 68683, 39376, 34530, 11031, 11352, 11620, 57077, 29224, -9741, 22119, 9817, -10435, 8222, 12886, -38398, -33617, -21239, 21306, 75151, 58006, 6047, -12578, -21665, -30596, -21798, -16295, -56341, -1968, 19063, 28212, 6272, -4742, -6775, -20292, -14683, -36557, -21911, -27224, 10351]
$$ [...]
##END NTUPLES=NMR SPECTRUM
##END=
