##TITLE=1H_CG-1181-D
 CDCl3
 8 sc, 
 7.5.2024
##JCAMPDX= 6.0         $$ Bruker NMR JCAMP-DX V2.0
##DATA TYPE= NMR SPECTRUM
##DATA CLASS= NTUPLES
##ORIGIN= UXNMR, Bruker Analytische Messtechnik GmbH
##OWNER= root
$$ XWIN-NMR		Version 3.5
$$ Tue May  7 13:44:16 2024 Russian Standard Time (UT+4h)  she@DPX200
##.OBSERVE FREQUENCY= 200.1309
##.OBSERVE NUCLEUS= ^1H
##.ACQUISITION MODE= SIMULTANEOUS
##.ACQUISITION SCHEME= undefined
##.AVERAGES= 8
##.DIGITISER RES= 18
##SPECTROMETER/DATA SYSTEM= spect
##.PULSE SEQUENCE= zg30
##.SOLVENT NAME= CDCl3
##.SHIFT REFERENCE= (INTERNAL, CDCl3, 0, 16.527)
##AUDIT TRAIL= $$ (NUMBER, WHEN, WHO, WHERE, WHAT)
$$ ##TITLE= Audit trail, XWIN-NMR		Version 3.5
$$ ##JCAMPDX= 5.01
$$ ##ORIGIN= Bruker BioSpin GmbH
$$ ##OWNER= she
$$ F:/spectra/data/she/nmr/H-F/1/pdata/1/auditp.txt
$$ ##AUDIT TRAIL=  $$ (NUMBER, WHEN, WHO, WHERE, WHAT)
(   1,<2024-05-07 13:42:48.84 +0400>,<she>,<DPX200>,
      <created by zg, POWCHK disabled, PULCHK disabled
       configuration hash MD5:
       00 E9 B6 7A A2 85 ED C7 34 08 36 98 17 FE 4E 26
       data hash MD5: 16K
       0B 34 39 6C A9 A2 3A 7B DD BF B9 DF 2E 81 35 E2>)
(   2,<2024-05-07 13:42:51.25 +0400>,<she>,<DPX200>,
      <Start of raw data processing
       efp BC_mod = 2 LB = 0.24 FT_mod = 6 PKNL = 1 PHC0 = -25301.85 PHC1 = 12.58749 SI = 16K 
       data hash MD5: 16K
       01 BB 41 ED C1 EF C8 52 E2 9E BE BB EC CD C1 3A>)
(   3,<2024-05-07 13:43:07.75 +0400>,<she>,<DPX200>,
      <pk PHC0 = -152.3943 PHC1 = -3.8 
       data hash MD5: 16K
       96 9E 5A 73 23 85 E4 EF 0C F4 9B F1 BA 1A 3E D7>)
(   4,<2024-05-07 13:43:13.50 +0400>,<she>,<DPX200>,
      <abs ABSG = 5 
       data hash MD5: 16K
       6D D4 A3 48 50 92 6F 81 E5 C1 B3 BF 12 EF 57 CE>)
(   5,<2024-05-07 13:43:34.60 +0400>,<she>,<DPX200>,
      <abs ABSG = 5 
       data hash MD5: 16K
       34 38 FB AA AC 99 F8 6F 8A 25 F9 17 77 5C C0 ED>)
$$ ##END=
$$ 
$$ hash MD5
$$ 5F C7 0A B6 AF 23 51 84 00 79 A3 FC 3B 2E 13 A3
##$RELAX= 
##$RELAX= 
##$RELAX= 
##$RELAX= 
##$RELAX= 
##$RELAX= 
$$ Bruker specific parameters
$$ --------------------------
##$DU= <F:/spectra>
##$EXPNO= 1
##$NAME= <H-F>
##$PROCNO= 1
##$TYPE= <nmr>
##$USER= <she>
##$AMP= (0..31)
100 100 100 100 100 100 100 100 100 100 100 100 100 100 100 100 100 100 
100 100 100 100 100 100 100 100 100 100 100 100 100 100 
##$AQSEQ= 0
##$AQ_mod= 1
##$AUNM= <au_zg>
##$AUTOPOS= <>
##$BF1= 200.13
##$BF2= 200.13
##$BF3= 200.13
##$BF4= 200.13
##$BF5= 200.13
##$BF6= 200.13
##$BF7= 200.13
##$BF8= 200.13
##$BYTORDA= 1
##$CFDGTYP= 0
##$CFRGTYP= 5
##$CHEMSTR= <none>
##$CNST= (0..31)
1 1 145 1 1 1 1 1 1 1 1 1 1 1 1 1 1 1 1 1 1 1 1 1 1 1 1 1 1 1 1 1 
##$CPDPRG= <>
##$CPDPRG1= <>
##$CPDPRG2= <>
##$CPDPRG3= <>
##$CPDPRG4= <mlev>
##$CPDPRG5= <mlev>
##$CPDPRG6= <mlev>
##$CPDPRG7= <mlev>
##$CPDPRG8= <mlev>
##$CPDPRGB= <>
##$CPDPRGT= <>
##$D= (0..31)
0 1.2 0 0 0 0 0 0 0 0.06 0 0.03 0 0 0 0 0.0002 0 0 0 0 0 0 0 0 0 0 0 0 
0 0 0 
##$DATE= 1715074968
##$DBL= (0..7)
$$ [...]
##$SUBNAM3= <"">
##$SUBNAM4= <"">
##$SUBNAM5= <"">
##$SUBNAM6= <"">
##$SUBNAM7= <"">
##$SUBNAM8= <"">
##$SUBNAM9= <"">
##$SW= 18.0517689322627
##$SWIBOX= (0..15)
0 0 2 0 0 0 0 0 0 0 0 0 0 0 0 0 
##$SW_h= 3612.71676300578
##$TD= 16384
##$TD0= 1
##$TE= 0
##$TE2= 300
##$TE3= 300
##$TEG= 300
##$TL= (0..7)
0 120 120 120 120 120 120 120 
##$TP= (0..7)
150 150 150 150 150 150 150 150 
##$TP07= 0
##$TPNAME0= <>
##$TPNAME1= <>
##$TPNAME2= <>
##$TPNAME3= <>
##$TPNAME4= <>
##$TPNAME5= <>
##$TPNAME6= <>
##$TPNAME7= <>
##$TPOAL= (0..7)
0.5 0.5 0.5 0.5 0.5 0.5 0.5 0.5 
##$TPOFFS= (0..7)
0 0 0 0 0 0 0 0 
##$TUNHIN= 0
##$TUNHOUT= 0
##$TUNXOUT= 0
##$USERA1= <user>
##$USERA2= <user>
##$USERA3= <user>
##$USERA4= <user>
##$USERA5= <user>
##$V9= 5
##$VALIST= <valist>
##$VCLIST= <CCCCCCCCCCCCCCC>
##$VD= 0
##$VDLIST= <DDDDDDDDDDDDDDD>
##$VPLIST= <PPPPPPPPPPPPPPP>
##$VTLIST= <TTTTTTTTTTTTTTT>
##$WBST= 1024
##$WBSW= 4
##$XGAIN= (0..3)
0 0 0 0 
##$XL= 0
##$YL= 0
##$YMAX_a= 414276
##$YMIN_a= -214768
##$ZGOPTNS= <>
##$ZL1= 120
##$ZL2= 120
##$ZL3= 120
##$ZL4= 120
##$ABSF1= 16.52701
##$ABSF2= -1.524895
##$ABSG= 5
##$ABSL= 3
##$ALPHA= 0
##$AQORDER= 0
##$ASSFAC= 0
##$ASSFACI= 0
##$ASSFACX= 0
##$ASSWID= 0
##$AUNMP= <proc_1d>
##$AZFE= 0.1
##$AZFW= 0.1
##$BCFW= 0
##$BC_mod= 2
##$BYTORDP= 0
##$COROFFS= 0
##$CY= -3
##$DATMOD= 1
##$DC= 0
##$DFILT= <>
##$DTYPP= 0
##$F1P= 0
##$F2P= 0
##$FCOR= 1
##$FTSIZE= 16384
##$FT_mod= 6
##$GAMMA= 0
##$GB= 0
##$INTBC= 1
##$INTSCL= 3.70164e-10
##$ISEN= 128
##$LB= 0.24
##$LEV0= 0
##$LPBIN= 0
##$MAXI= 10000
##$MC2= 0
##$MEAN= 0
##$ME_mod= 0
##$MI= 1.114404
##$NCOEF= 0
##$NC_proc= -6
##$NLEV= 6
##$NOISF1= 3.799351
##$NOISF2= 2.8
##$NSP= 0
##$NTH_PI= 0
##$NZP= 0
##$OFFSET= 16.52701
##$PC= 1
##$PHC0= -25454.24
##$PHC1= 8.78749
##$PH_mod= 1
##$PKNL= yes
##$PPARMOD= 0
##$PSCAL= 0
##$PSIGN= 0
##$REVERSE= no
##$SF= 200.129398816782
##$SI= 16384
##$SIGF1= 3
##$SIGF2= 2
##$SINO= 5.538805
##$SIOLD= 16384
##$SREGLST= <1H.CDCl3>
##$SSB= 0
##$STSI= 16384
##$STSR= 0
##$SW_p= 3612.71676300577
##$SYMM= 0
##$S_DEV= 0
##$TDeff= 16384
##$TDoff= 0
##$TI= <>
##$TILT= no
##$TM1= 0
##$TM2= 0
##$TOPLEV= 0
##$USERP1= <user>
##$USERP2= <user>
##$USERP3= <user>
##$USERP4= <user>
##$USERP5= <user>
##$WDW= 1
##$XDIM= 16384
##$YMAX_p= 361927455
##$YMIN_p= -178432
$$ End of Bruker specific parameters
$$ ---------------------------------
##NTUPLES= NMR SPECTRUM
##VAR_NAME=  FREQUENCY,     SPECTRUM/REAL,   SPECTRUM/IMAG
##SYMBOL=    X,             R,               I
##VAR_TYPE=  INDEPENDENT,   DEPENDENT,       DEPENDENT
##VAR_FORM=  AFFN,          ASDF,            ASDF
##VAR_DIM=   16384,         16384,           16384
##UNITS=     HZ,            ARBITRARY UNITS, ARBITRARY UNITS
##FACTOR=    0.220516191357247, 1,           1
##FIRST=     3307.54056833214, 0,            0
##LAST=      -305.176194673634, 0,           0
##MIN=       -305.176194673634, -178432,     0
##MAX=       3307.54056833214, 361927455,    0
$$ Real data points
##PAGE= N=1
##DATA TABLE= (X++(R..R)), XYDATA
$$ [...]
8906 426814 378357 389744 481429 457377 450679 496949 413113 381180 402616 401050 354941 370093
8894 370093 416451 396363 356307 407093 404548 427543 361588 334654 407204 393867 309244 381294
8882 381294 431448 435532 441618 435325 454217 462404 435343 495645 512927 516980 552640 530969 555589
8869 555589 552855 532747 590375 558594 580482 664590 596314 621999 660305 604714 606751 629503
8857 629503 525420 536613 656823 666783 679139 733714 771723 722980 683513 720711 717432 808386
8845 808386 769624 749656 754131 929256 981588 902912 863690 889533 970316 910350 927558 952773
8833 952773 957066 991071 960727 933470 906822 960971 949874 896554 934214 934272 887365 880130 992599
8820 992599 1053777 1011218 1044008 1121660 1037844 1015864 1099841 1071415 1111832 1111955 1102173 1128379
8808 1128379 1126385 1189114 1220140 1203951 1238028 1207578 1212415 1244344 1170858 1237682 1238396 1282988
8796 1282988 1310744 1352221 1362010 1405750 1457124 1507452 1601945 1608527 1616727 1623336 1668185 1675378
8784 1675378 1650910 1693386 1788896 1818348 1838899 1897706 1967621 2021500 1979777 2061535 2079221
8773 2079221 2090922 2140981 2249311 2309069 2298511 2456423 2542162 2652757 2745804 2731837 2808527
8762 2808527 2966054 3069132 3147170 3334637 3538291 3613065 3767715 3968602 4246971 4519036
8752 4519036 4756239 5075824 5462409 5801822 6202356 6571740 6903619 7230590 7585510 7884026
8742 7884026 8122361 8369118 8522256 8614159 8705730 8881512 8946162 9062010 9219186 9343180
8732 9343180 9478357 9674004 9934393 10177183 10518886 10862003 11251827 11633793 12069732 12554552
8722 12554552 13148612 13767869 14486306 15330256 16198214 17157720 18208341 19362956 20711905
8713 20711905 22194425 23890466 25543948 27424432 29556232 31835452 34416333 37181508
8705 37181508 40144944 43188110 46448201 50008622 53778566 57752196 62079053 66655192
8697 66655192 71637358 77068459 82582119 88712623 95180529 101213168 105742260 108551785
8689 108551785 110554212 111577919 110513693 107197650 102228707 96486994 90724751 84248256
8681 84248256 77001365 70252868 64733887 60131727 56804718 54590113 53144911 52406850
8673 52406850 52331849 52906909 54107986 55762687 57799253 60086211 62791537 65963148 69433755
8664 69433755 73203037 77288803 81641095 86326540 91376765 97141457 103322095 109082388
8656 109082388 113566300 116198022 117864148 118768691 117468659 113307441 106819098 99429393
8648 99429393 92005646 84086570 75244579 66759943 59311882 52887915 47580278 43225200
8640 43225200 39671443 36605834 34042547 31833254 29918807 28140900 26553549 25155563
8632 25155563 23796251 22533369 21371296 20284736 19249076 18337160 17493125 16705943 15988951
8623 15988951 15355706 14745261 14168058 13670787 13265103 12855661 12460694 12158305 11922521
8614 11922521 11715964 11504138 11273556 11064823 10884383 10775725 10599753 10438459 10404596 10427653
8604 10427653 10380583 10231407 10136240 9955646 9791796 9579603 9363929 9139926 8936495 8717434
8594 8717434 8576374 8429383 8259715 8089937 7838813 7711122 7614360 7505778 7341241 7099620
8584 7099620 6900141 6717268 6588105 6443044 6331253 6232953 6206430 6174019 6156224 6128275
8574 6128275 6086181 6006409 5970560 5904519 5768420 5705739 5631526 5484437 5414057 5370781 5306458
8563 5306458 5254731 5219086 5230949 5254915 5266568 5191539 5075653 4961862 4775286 4569499 4369779
8552 4369779 4172359 4059297 3976308 3844286 3772040 3755026 3701120 3627173 3512804 3457951 3377106
8541 3377106 3256083 3229216 3251893 3178141 3048948 2999577 2959005 2929949 2880889 2760859 2718008
8530 2718008 2739515 2660811 2607017 2480252 2475762 2491294 2415401 2343271 2333266 2349897 2236989
8519 2236989 2141041 2130280 2085711 2060251 1988107 1986870 2007088 1955637 1986431 1971506 1976691 1969110
8507 1969110 2000314 1991165 1963135 1915973 1872754 1873248 1850220 1748437 1782649 1864139 1813660 1767461
8495 1767461 1794901 1803067 1745446 1778007 1754104 1740090 1729202 1708279 1826082 1812308 1822473
8484 1822473 1857928 1882732 1903311 1899253 1955394 1889843 1927807 1935790 1948416 1936985 2002671 2013305
8472 2013305 1929102 1846588 1840784 1927555 1965065 2022649 1962348 1964985 1985747 1922547 1851909 1887795
8460 1887795 1864762 1803519 1763326 1730201 1699165 1775169 1775390 1835856 1910848 1940914 1956022 1939074
8448 1939074 1865716 1896105 1940539 2024631 2017509 1958375 1884188 1876902 1868780 1829104 1899107 1830241
8436 1830241 1789399 1675962 1672171 1697394 1661813 1568753 1499768 1432492 1369926 1343276 1249904
8425 1249904 1225716 1240900 1242339 1216726 1256202 1313867 1271642 1203900 1212306 1253586 1212502 1222906
8413 1222906 1317736 1341831 1401242 1447896 1433852 1388868 1390347 1448487 1461888 1369467 1245088
8402 1245088 1239680 1191534 1136303 1104057 1088124 984846 913825 942636 952080 998528 1020271 1021037
8390 1021037 995484 880737 882602 919000 904918 903223 958064 911465 897929 953512 945991 929459
8378 929459 873394 825816 788384 892270 907784 924160 931477 935528 930039 933900 987267 962434
8366 962434 976009 986947 1055304 1106799 1093573 1142971 1195650 1221156 1230784 1281755 1223791 1167092
8354 1167092 1226412 1243628 1312535 1364286 1384812 1412203 1493119 1552609 1498576 1475582 1394319
8343 1394319 1377119 1385390 1316694 1353753 1354664 1348874 1336023 1264918 1331898 1441999 1490435 1416816
8331 1416816 1443434 1548686 1577776 1629793 1646052 1712438 1655569 1700492 1666762 1652010 1654649
8320 1654649 1618660 1605538 1599755 1595915 1540269 1607337 1658168 1644908 1614168 1697720 1720376 1742887
8308 1742887 1808796 1799971 1871357 1992433 2109604 2139925 2168370 2174060 2234302 2243136 2188217 2254971
8296 2254971 2290185 2340744 2379967 2390975 2380419 2345796 2296623 2268905 2297611 2330222 2395919
8285 2395919 2449721 2424276 2477688 2448474 2400916 2444749 2404717 2458454 2503800 2483870 2565709
8274 2565709 2568999 2549340 2600191 2608586 2613675 2558303 2501913 2543255 2611787 2648311 2595873 2620739
8262 2620739 2650688 2641860 2662970 2689971 2745342 2748105 2722011 2687548 2720552 2745826 2749111 2724231
8250 2724231 2705395 2720058 2716216 2651908 2666712 2740351 2712964 2639653 2712614 2744506 2740139 2720227
8238 2720227 2776375 2771095 2740938 2738942 2685966 2756129 2729599 2749200 2793834 2821333 2767048 2762368
8226 2762368 2858608 2876222 2898870 2988216 2971438 2984735 3027918 3105006 3244802 3286246 3341530
8215 3341530 3369466 3456522 3572584 3622931 3719376 3812454 4009004 4080884 4246833 4327346 4414918
8204 4414918 4486762 4609170 4689220 4641830 4688460 4861704 4951582 5029242 5121946 5291553 5377813
8193 5377813 5804823 6004881 5561811 5717285 5845106 6037395 6211258 6406898 6676937 6952832
8183 6952832 7160074 7467160 7812438 8150512 8449174 8807100 9147859 9629721 10042029 10491424
8173 10491424 11104254 11797274 12392768 12991092 13569448 14213579 15108879 15900986 16622844
8164 16622844 17306545 18065046 18895462 19863695 20861841 21980508 23157648 24541058 26112291
8155 26112291 27945787 29790596 31324780 32134188 32400365 32716038 33230818 33631135 33552773
8146 33552773 32902055 32162321 31715304 31620169 31836280 32360623 33123350 34128604 35301714
8137 35301714 36783861 38449870 40192763 42211440 44494538 47053773 49956680 53121164
8129 53121164 56548070 60168794 63906276 67690287 71399453 74954531 78044660 80643133
8121 80643133 83521453 86746740 90193507 93923690 97440099 100201594 101115187 100197728
8113 100197728 99232204 98908382 98584105 97253268 93842413 89204465 85230764 82298369
8105 82298369 80623227 80139239 80775498 82411866 85034923 88408261 92398116 96865852
8097 96865852 102106656 108094068 114679251 121843782 129396447 137670336 146880996 157460103
8089 157460103 169507508 182121557 193829064 203164561 209922840 216469316 223318695 228640287
8081 228640287 230049866 226757738 220449111 212610544 204577475 198102071 193216445 188161908
8073 188161908 181613592 174418422 166405111 156269868 143946472 131340762 119605533
8066 119605533 108968691 99898941 92606936 86701820 81932237 78102920 75277502 73377418
8058 73377418 72051691 71040462 69839438 68441050 67158198 66169394 65538675 64865649 64038235
8049 64038235 63238744 62847315 63095543 63664460 64283306 64321807 63784043 62867380 61206773
8040 61206773 58711680 56048083 53564071 51246565 48894840 46661558 44680187 42661586
8032 42661586 40495339 38361268 36400254 34558695 32978998 31549248 30312496 29170387
8024 29170387 28085950 27088890 26214587 25370398 24588858 23834246 23098849 22454920 21880695
8015 21880695 21358327 20901006 20487707 20205440 19980802 19827939 19745952 19724660 19739593 19749776
8005 19749776 19733811 19784837 19889385 19936460 19854176 19775767 19791133 19871914 20113268 20233757 20253962
7994 20253962 20344676 20457332 20515224 20613425 20774645 20822213 20881125 20968587 20915219 20901995 20971196
7983 20971196 21142073 21354496 21660809 21989320 22446717 23080024 23736750 24539802 25622887
7974 25622887 26708459 27921135 29241724 30700684 32413796 34265825 36289288 38449401
7966 38449401 40689016 43079745 45677114 48680201 51940208 55339232 58622513 61841182
7958 61841182 65179125 68236883 70951850 73210486 75212866 77278051 78969175 80555214
7950 80555214 82478512 85104687 88029296 90639906 92062564 91310355 89182259 86751243
7942 86751243 84822886 83937150 83319747 82371670 80204258 76603578 72462309 68985022 66568474
7933 66568474 65229216 64626521 64839763 65527808 66827296 68785437 71174034 74139667 77594642
7924 77594642 81325548 85149900 89101481 93444409 98354509 103611736 108495846 112326752
7916 112326752 114375067 115695243 117356995 119434378 121624418 122720715 121480617 117895169
7908 117895169 112441215 106547422 101541854 97660588 94272017 90722265 86520041 82061765
7900 82061765 78279698 75586211 73432046 71714888 70729664 70648243 71385977 73371676 76235233
7891 76235233 80362131 85787218 91722234 94785998 92026766 88710031 85207717 81942394
7883 81942394 79114535 76630794 73498567 69924087 66683852 64213895 62364776 60911989
7875 60911989 59408372 57225076 53674046 49113590 44519791 40378330 36859369 33978385
7867 33978385 31599533 29581250 27870843 26385301 25100240 23938931 22818781 21825232
7859 21825232 21014154 20179737 19498693 18868592 18218211 17605498 16995484 16426653 15876058
7850 15876058 15402896 14906278 14382547 13990402 13563542 13156710 12776063 12424271 11956255
7841 11956255 11791274 11606304 11410393 11186419 10940931 10734589 10515536 10272490 10054618
7832 10054618 9883325 9736877 9459988 9172046 8934940 8759964 8553829 8381855 8230045
7823 8230045 8096096 7923818 7750181 7600050 7475086 7290686 7149717 6993201 6877510 6741488
7813 6741488 6588979 6435908 6312233 6135462 6072226 5964458 5843543 5755363 5652596 5520561
7803 5520561 5680209 5500724 5240172 5205793 5142541 5079191 4974183 4898836 4818460 4776507 4737937
7792 4737937 4607295 4572033 4546180 4459345 4381789 4353837 4346065 4228626 4212642 4203606 4117142
7781 4117142 4013031 3958638 3922350 3824355 3727860 3691692 3699604 3655497 3564604 3421395 3338933
7770 3338933 3307668 3220085 3224566 3139332 3020645 3030374 2994469 2903057 2766311 2747802 2766583
7759 2766583 2748684 2779211 2745941 2760587 2674106 2732365 2739899 2652969 2681959 2681834 2594860 2551260
7747 2551260 2535044 2579562 2620531 2609474 2609408 2495974 2429824 2394481 2339485 2217120 2202980 2179992
7735 2179992 2131752 1997278 1957075 1918680 1952704 2037851 1948927 1912270 1965799 1987600 2041536
7724 2041536 2049572 2009713 2102146 2129873 2070046 2003130 2047095 1972483 1932878 1907409 1853631 1763153
7712 1763153 1719908 1687189 1669667 1627804 1563443 1477645 1428885 1387554 1365940 1352062 1306277
7701 1306277 1236867 1238065 1225042 1248094 1212829 1142154 1191628 1165330 1186417 1271941 1310028 1340838
7689 1340838 1361377 1300714 1272100 1322581 1342851 1302434 1371558 1341893 1346391 1389544 1304952 1282165
7677 1282165 1175457 1101431 1073949 1035932 961657 953481 904931 799415 829267 809832 771110
7666 771110 781354 779655 757886 720303 746878 824116 774904 679852 729363 707503 781446 717744
7654 717744 685717 695863 692477 671766 727784 779620 690206 649756 598724 605191 629276 622558
7642 622558 603828 630718 631096 666063 699571 716064 702096 681096 638094 671968 712926 717163
7630 717163 640527 624202 630645 582203 597222 604986 513538 514375 527367 566125 569904 579203 526166
7617 526166 531436 525540 462128 418206 449236 462840 511705 553198 487988 557501 480871 465878
7605 465878 498962 515602 560703 599057 571847 562142 478586 519853 557715 591911 577898 602823
7593 602823 620987 637138 620865 649325 678004 638761 685476 668150 729344 697072 702921 725747
7581 725747 749730 712329 663240 678699 661805 668478 658969 660274 613386 634078 561289 544016
7569 544016 580834 594247 559440 573401 619299 594263 619479 621091 706042 688854 673358 669120
7557 669120 676388 738545 793355 810416 867386 855651 869508 852752 823976 786657 817937 777652
7545 777652 780542 730310 704790 752778 691130 585190 570822 524082 544084 571825 483610 438603
7533 438603 519680 524083 469475 376037 436667 445484 406193 411411 419629 467301 462478 489669 485697
7520 485697 492870 473081 432576 471192 525309 555394 539070 485899 479895 442709 352927 325037
7508 325037 332846 285320 239586 254591 250180 248163 250187 199111 305269 225362 173576 194086
7496 194086 249200 231835 188757 156885 200503 127721 149791 181626 166681 102853 159906 224970
7484 224970 192657 175355 91976 118520 162790 143569 166273 205357 178012 226571 199458 201869
7472 201869 210077 183687 125645 110106 90607 7697 61816 62432 80269 89458 50601 97969
7460 97969 99197 113356 122832 108165 110564 68139 129477 208676 158385 135624 114339 135792
7448 135792 79842 77668 84639 65840 147066 176120 148799 120307 183984 169623 145814 142090
7436 142090 129698 111398 94628 67906 42075 35199 32568 94950 50879 62504 95503 71764
7424 71764 92030 104481 174482 257391 190319 98038 88394 167835 197048 144866 199084 214501
7412 214501 234922 319680 297379 272964 298862 260757 202202 179637 190874 117245 101148 83795
7400 83795 86858 114701 40720 50004 52084 9882 10741 45741 47169 78169 88287 132467 61726
7387 61726 46093 49917 115972 61976 54903 67018 48257 152344 60596 88123 86395 78143
7375 78143 79830 38915 17663 25294 41029 73050 88866 35869 7542 54708 61959 7525
7363 7525 -29287 -497 53154 86374 50943 2221 -43418 14110 10028 54727 69230 23652
7351 23652 43894 24889 17317 39135 57346 38447 3581 47912 -31344 -32021 -10259 -12658 -53635
7338 -53635 -11816 19122 -28783 64715 30918 -10143 36960 112695 95372 52646 -23322 -3740
7326 -3740 12354 12234 22956 92673 41368 33280 -5589 14800 55811 57887 -21120 -34518 -56178
7313 -56178 -86342 -76163 -4075 -10889 -7605 24481 -11151 -25362 -22594 57592 -40202 -37903 -54239
7300 -54239 -44722 -17028 -35058 -15 16561 -1620 -2297 19885 23537 -76817 -80864 6862 69247
7287 69247 73020 -876 -1497 22681 46486 7438 28114 68663 53902 65629 23460 21631 68281
7274 68281 53470 6507 18542 -9681 11981 29437 -57649 -55808 -3561 18050 89984 94365
7262 94365 93291 130655 123924 100717 120951 86975 75948 82390 57371 37711 48268 95879
7250 95879 105466 94087 114374 157777 192584 205670 156560 102878 82974 91071 100681 79936
7238 79936 35830 76747 79792 60309 24065 31498 34214 -10484 37578 66309 26483 87577
7226 87577 95010 24914 -16023 -46813 25782 117197 185825 253311 284756 259484 198099 195316
7214 195316 229706 210163 85740 32642 87849 133234 103695 64730 89731 25149 -27029
7203 -27029 44141 10533 16390 15064 25784 32614 28429 38037 50950 117416 153244 147610 124442
7190 124442 96561 43652 70922 94680 156486 149387 188715 180374 135070 173967 186635 174027
7178 174027 176135 163131 163140 91240 78135 105257 134583 164059 192667 126187 62670 45285 28670
7165 28670 34185 67637 85801 31203 86791 118062 114600 114020 109161 103752 129810 70222 49008
7152 49008 188193 197237 155681 191859 180588 95428 104435 90260 53669 78801 -20974 -25194
7140 -25194 -26630 5776 95141 156905 169830 113520 34456 20491 34412 -12426 43230 53649
7128 53649 11190 25176 57567 12231 22876 -27261 41073 84440 74938 102296 26777 35575
7116 35575 53486 33429 61640 77045 38599 24463 21465 33846 10521 -11385 16357 33145
7104 33145 34314 58395 4927 -6441 27514 4819 13606 -31288 -26035 51059 98069 27303
7092 27303 -35932 -28520 4267 -12074 23760 21340 11783 44929 55010 40027 -16070 -14301 -95022
7079 -95022 -37722 -3190 9061 -5615 -17028 -53345 -53351 -21615 27383 -8559 -37881 -4986 -70825
7066 -70825 -129181 -101426 -76283 -63520 -58066 -37672 -28177 -48343 -25364 51649 71646 3663
7054 3663 -76873 -60293 40033 5772 -78791 -73594 -50061 22126 9502 -36280 -51898 1257
7042 1257 35665 2655 -41029 -68251 -93932 -70422 3217 33764 -27854 -136656 -96789 -65538
7030 -65538 -13669 -30864 -44429 -6308 -4816 26041 40024 -28692 -54324 -38122 14354 -11964
7018 -11964 -17493 -58661 -104174 -135661 -84127 634 -29400 -21561 -31927 -40655 -18805 22552
7006 22552 -35399 -71830 -49668 -28045 -25397 -13951 4550 9291 -61108 -64182 -9340 -39771
6994 -39771 -80606 -97876 -88246 -65926 -41592 -64035 -108807 -71642 -92075 -52582 -29749 -70215
6982 -70215 -112606 -145138 -120317 -62453 -86370 -48516 28888 -30025 -45836 -33549 5777 10659
6970 10659 -37594 -10252 -76915 -116593 -27850 14927 32906 -3572 14194 -38287 -91333 -59417
6958 -59417 -56537 -29780 -73411 -94795 -60162 -79974 -13313 -56112 -47289 -27598 -47088 -74370
6946 -74370 -37336 -68030 -37389 -37982 -30250 18700 -21299 -24947 -36545 -43185 -25977 -44725 4985
6933 4985 68122 45687 1412 39387 -8661 -21953 -64339 -93297 -82659 -78492 -85498 -123846
6921 -123846 -36106 -56247 -9615 -56868 -103672 -57709 11526 -30702 -33628 5975 -27447 -57564
6909 -57564 -77917 -120941 -50983 -63741 -78948 -5807 -35661 -65148 -75080 -48045 -70322 -108209
6897 -108209 -86930 -38877 -149855 -147557 -82322 -40456 -23256 -78344 -86733 61408 22618 -86221
6885 -86221 -163889 -162450 -115971 -112460 -94855 -68625 -58258 -99387 -40286 -63331 -128625 -65876
6873 -65876 -43698 -103074 -79346 -114294 -127735 -146448 -82124 -108998 -138361 -112382 -117517 -76262
6861 -76262 -98106 -95602 -22889 -70877 -80413 -55997 2847 -74972 -111024 -102939 -61697 -34890
6849 -34890 -79355 -59900 -88330 -90011 -87297 -13310 -50690 -105772 -83545 -100780 -112058 -120741
6837 -120741 -119828 -77027 -47160 -78585 -115314 -13158 -29435 -58363 -30909 -12927 -13386 -64149
6825 -64149 19378 -23193 -39421 -90097 -158984 -96355 -55940 -87606 -27703 -11977 11006 23478
6813 23478 -1261 8853 -93267 -87973 -54058 -27733 -8648 -8517 -33773 -48783 6069 4310
6801 4310 -19802 -1281 -37851 -20751 -25527 -32460 -45641 -57373 -55143 -33014 -74022 -77868 -36594
6788 -36594 -20532 -33300 -71506 36937 5547 1095 -91465 -80320 -27586 -34010 -62616 -76056
6776 -76056 11789 -13204 4555 -18122 38762 62118 7270 1942 -3426 -40947 -122008 -46118
6764 -46118 18608 69008 46376 -2576 60280 -11571 -39778 13237 12794 -30854 -61516 -8466
6752 -8466 -35983 -113790 25503 19395 -56112 -31071 -24384 -88309 -4854 32915 -23725 -20639
6740 -20639 -14009 -2031 -44401 -63586 -63539 -3042 -14906 36984 16567 -71069 -41660 4356 12222
6727 12222 6747 -12253 27388 42979 34059 -58304 -12265 -3127 -16076 -10369 36774 82524 24059
6714 24059 -3924 -28726 -7847 -22982 -7723 18987 3227 -19799 -6290 -28967 -3659 9376
6702 9376 61732 -10525 -24585 -65299 -98476 -70843 -34450 -52523 -83790 -115632 -86544 -117614
6690 -117614 -70982 -71167 -28485 -31347 -87193 -73865 -83268 -84146 -52707 -68341 -55442 -16615 -11935
6677 -11935 65410 72281 22770 6808 20329 -61164 -80158 8040 58563 -20848 -29277 -7718
6665 -7718 37273 -17458 -58943 -77618 -62429 -48467 -39793 -8641 -40176 -36262 -41890 5963 -9793
6652 -9793 -3753 -9473 -63580 -34382 -31756 -59845 -50454 -50705 -27907 -71901 -53133 5752 7677
6639 7677 -49447 -40880 -17586 -6047 -30907 -62138 -95478 -59568 833 -62568 -91931 -74304
6627 -74304 -50899 -84228 -62814 -133046 -124049 -85322 -3761 -7729 -47206 -28744 -121256 -82442
6615 -82442 -11785 27402 116565 58646 -24142 -12802 -45516 -141675 -127464 -112930 -45906 -22491
6603 -22491 -11367 -66128 -85321 -33668 -48668 -105492 -94249 -160037 -95477 -64300 -22039 -43922
6591 -43922 -36338 -54196 -69553 -59258 -92603 -75543 -79445 -22197 -48891 -114206 -42694 -46922
6579 -46922 -59602 -9194 -32738 -62863 -86684 -104571 -150086 -97073 -106364 -95663 -40422 -35495
6567 -35495 -7215 -39428 -15242 34385 23310 -43422 -46900 5157 5717 -18624 6221 58550
6555 58550 31437 -60701 -92463 23575 20207 -44706 -94640 -63948 -93182 -100681 -93938 -94309 -98127
6542 -98127 -128750 -125396 -69854 -62035 -62577 -24889 -43169 -59024 -45900 -94817 -52492 -62232 -129594
6529 -129594 -50367 20783 -37656 -40690 -86941 -97826 2452 29499 -19873 -48393 -71473 -3378
6517 -3378 -40146 -30476 -52873 -99847 -65019 -95987 -52941 -66233 -65568 -36955 -47879 -54773 -33635
6504 -33635 -23935 -37065 -74672 -95495 -25892 -25249 -90643 -128346 -64590 -58545 -62674 -71540 -85601
6491 -85601 -93761 -65357 -60967 -115964 -94994 -75010 -85955 -100806 -75313 -48355 -31937 -13356
6479 -13356 12305 42408 25270 56505 72945 -9822 -41165 -11735 -3895 -60893 -48415 -76935
6467 -76935 -64340 -29457 -94421 -90133 -54921 -42210 -27874 -18098 27418 30452 -56178 -38668
6455 -38668 -45835 -34917 -50706 -94459 -87765 -137484 -107241 -29224 -21532 -830 -41251 -10429
6443 -10429 -29233 -76642 -68208 -71573 -31346 -35057 -42058 -17911 -19818 -13259 -42170 -85814 -45854
6430 -45854 -71766 -94785 -87917 -70428 -50626 32623 -21260 -93897 -4396 24506 -36641 -25066
6418 -25066 -11760 -95052 -131998 -69956 -82673 -55755 -52871 -33697 -51835 -37426 -44334 -10413
6406 -10413 15715 40841 55151 50421 81299 17142 -66284 -33133 17145 -5753 1781 6902
6394 6902 -35042 -50367 -20961 -22943 5243 74555 53890 46467 53004 34612 40994 -15115 -113017
6381 -113017 -106337 -138799 -145479 -74830 -19146 -39644 -6529 -8546 -52165 -56137 -57929 -50355 -27118
6368 -27118 -17093 -80060 -58906 -89592 -82490 -86635 -64760 -33994 -63019 -55925 -109582 -108378 -75610
6355 -75610 -17327 70851 29705 49603 8477 -79822 -7347 37565 8602 -14961 -18447 -54565
6343 -54565 -69643 -62571 -62307 -60430 -32248 14568 44369 70736 -31649 -11118 -37305 -67264
6331 -67264 -117002 -50822 -14840 42350 68817 102635 70522 45216 77903 14860 58935 96836
6319 96836 58945 -58765 -60870 -66306 -88140 -25127 -14522 -70447 -10961 -17525 48551 -41213
6307 -41213 -73429 -104688 -62305 -47177 -38817 -64824 -70370 -55373 -39947 -87902 -35298 -32763
6295 -32763 -54230 -68302 -98752 -22241 -87824 -39081 16319 5783 -3564 -43405 -97567 -68692
6283 -68692 -21555 -29397 -51079 -46846 -110295 -36033 -66627 -83889 -102204 -52107 -79760 -95045
6271 -95045 -90246 -91864 -72615 -74180 -90449 -59776 -18990 -71180 -33342 -11464 -42125 -96678
6259 -96678 -84259 -18092 -27854 -64233 -112941 -60317 -65771 -68495 -42771 -12300 -36892 -9553
6247 -9553 -32424 -49416 -7298 -63932 12806 36553 -29001 -68873 -118776 -86010 -48047 -3370
6235 -3370 -24569 13567 5699 12593 -41977 -72053 -71634 -52394 -40397 -96443 -64520 -69998 -79757
6222 -79757 -70771 -27851 3658 -5162 -17872 -9359 -66123 -105267 -82956 -84938 -872 63155 31258
6209 31258 -63423 -129141 -91852 -93797 -113458 -115431 -59107 -64240 -43780 -74815 -52730 -57723 -22813
6196 -22813 16815 3006 -49136 24400 12772 17222 19962 -44109 21153 -20406 -90625 -118302
6184 -118302 -69234 -64812 -110868 -102533 26246 -25980 -118063 -90502 -89809 -66750 -59701 -20111
6172 -20111 -56366 -78015 -61946 -15206 -15612 -95150 -113099 -71867 -45028 -30364 -40948 -94279
6160 -94279 -47628 -43904 -125893 -68923 -51932 -55298 -86596 -48559 -90310 -110702 -32861 -28145
6148 -28145 -101397 -79698 -77406 -40531 -116497 -129561 -130480 -89707 -137342 -140127 -138154 -94089 -32779
6135 -32779 -63119 -78065 -46657 3702 -49568 -6342 15403 23758 -38670 -70160 -31298 -28041
6123 -28041 -114647 -90453 -61463 -25447 20797 19437 -21994 -43620 -78119 -63773 -31508 -5582
6111 -5582 -27470 -46477 -121862 -26741 -39134 -17976 -15043 -4748 -55091 -43700 29652 -32995
6099 -32995 -112275 -101382 -25345 -62658 -47029 -62165 -65260 -59573 -63330 -130231 -106350 -133679
6087 -133679 -121935 -132114 -63758 -941 -34015 -72731 -86530 -9682 -7146 40699 -3760 -57065
6075 -57065 -27528 -47605 -33763 -49708 5428 -6734 -47793 -19792 -21675 -34813 -50319 14366
6063 14366 55715 49098 32741 10802 -42171 -32201 10174 74011 60200 -10417 -19148 -50704
6051 -50704 -50860 -14576 -46474 -2878 35982 50995 1895 22903 52524 -8047 22571 29305
6039 29305 -64950 -18809 44517 50093 40943 2322 -29181 13863 -51816 31557 6032 -26123
6027 -26123 84803 113318 103496 54056 50620 85517 130245 75001 46344 33005 30644 38744
6015 38744 30058 -33266 -33413 13576 45281 61527 48364 44323 10378 -15288 -56272 -29783 -9936
6002 -9936 15034 478 35617 51571 12587 64963 26998 20141 42691 46444 71047 126040
5990 126040 72578 56586 33681 101465 103240 103826 126476 165665 192571 123406 86997 76025
5978 76025 48557 127645 185376 121642 145058 104741 77968 123108 105834 27934 64503 44538
5966 44538 -45640 -70602 -76286 -3166 -4177 -24167 -33394 -34718 -95566 -132854 -51891 -12204 28865
5953 28865 8921 -42487 -9186 16065 -15005 -52304 -67726 -81437 -102782 -108449 -58392 -77469
5941 -77469 -21713 -10966 -41854 -78176 -96726 -84226 -51067 -1428 -15172 -34928 44248 89035
5929 89035 63314 43267 24252 27288 24468 9723 46300 16087 32073 -17101 -26882 -48759
5917 -48759 -62307 -23860 36277 2195 9112 80850 19347 31518 24449 8657 -12402 -1540
5905 -1540 65464 124061 66227 31705 -2457 -65945 -10629 53891 17371 17080 -12712 61419
5893 61419 55183 55062 67439 79066 17944 10706 9075 -35344 -49305 -13978 42834 -2487 614
5880 614 -45485 -70978 -65636 -55178 -10110 5714 -6588 -31608 1527 -13124 -35475 -21979
5868 -21979 -58056 25289 62235 -7272 -41053 -2211 -30111 -24486 20305 34293 48068 -46218
5856 -46218 -62570 26372 -873 -5051 -30923 17245 86700 -17054 24222 -6180 -33433 -96073
5844 -96073 -112309 -32398 -59844 -121 19987 -35844 -29493 -7023 -29377 -60959 -45966 -16023
5832 -16023 1502 466 -947 46123 38847 5994 -56972 -44633 14108 48919 9753 -16557
5820 -16557 6821 -29800 -5889 -19008 14424 -13777 2104 -73365 -38900 -18707 8482 36000
5808 36000 19196 -39352 15103 70203 31869 52440 14515 41439 -33505 -12778 34336 -1734
5796 -1734 -4607 -15357 -19228 -34326 -29705 -2453 38958 23183 20720 20721 -10619 74209 -3646 -16510
5782 -16510 28841 29909 -35832 -113615 -70086 -2770 -2737 37516 31885 5126 16918 40373 27004
5769 27004 37612 35675 12956 59216 86783 49005 18068 2822 -45133 -73029 -49688 7499
5757 7499 18245 -29535 21901 26788 -80245 -873 -332 393 34321 14782 -50401 -19534 68687
5744 68687 63575 55300 70884 48250 39719 94869 77387 78383 68220 11524 24782 81594 94869
5731 94869 61916 77178 64281 27923 -21713 -14214 -11743 -35958 25811 49587 41030 -52115
5719 -52115 -8922 64951 40765 -7201 38210 39865 94811 136153 86276 76392 65656 82226
5707 82226 71457 89818 99038 98059 108245 170033 164343 53404 100325 172107 130378 114658
5695 114658 162024 179884 190125 110174 161566 158715 132439 208697 174454 267764 335097 277396
5683 277396 327272 348390 331493 340316 338477 322093 306048 367100 317676 327663 377409 383171
5671 383171 266092 252570 387847 434006 399404 422741 433960 388488 407016 446154 560577
5660 560577 598676 553080 537935 612594 560207 527677 560517 510871 447585 387366 335509 360509
5648 360509 401488 375524 385662 397171 348558 290805 340457 368222 377966 365711 342388 347139
5636 347139 310906 303180 312974 363726 372014 365281 327398 308794 352032 289441 238251 223065
5624 223065 221990 213273 210205 209470 176362 185589 169172 196156 187725 260583 222448 167026 207506
5611 207506 193415 117880 143553 146935 172169 244343 173552 213509 170759 115745 69506 92418
5599 92418 165040 179895 71555 110346 124600 191801 199485 172438 141771 168314 128835 177973
5587 177973 190083 171631 192922 148356 130512 140792 203054 174731 168500 164600 192274 194804
5575 194804 176717 159501 192077 229792 199782 182981 184812 197187 243114 245420 218482 260924
5563 260924 293435 291463 279397 337050 318936 241913 262426 253961 301837 331074 377866 320609
5551 320609 312795 372007 386079 345076 358924 342575 385106 381574 363600 440424 462971 458745
5539 458745 467934 524132 482092 467026 505738 563156 614628 616231 615931 613611 618966 633983 613333
5526 613333 653768 626549 649605 653370 578775 581924 625012 631614 620318 648385 630715 594027
5514 594027 618739 645678 703397 732314 761666 774792 770509 824859 768648 771344 847372 885923
5502 885923 947073 937360 892531 901141 932965 904894 885359 931455 944079 988089 1046186 994913
5490 994913 1011689 1046257 1059872 1074613 1051409 1069405 1041737 1072354 1026892 1096643 1052425 1082880
5478 1082880 1180699 1247099 1214730 1242248 1313452 1357027 1331768 1353619 1407007 1464123 1490300
5467 1490300 1480115 1507273 1542952 1594333 1621354 1604552 1586165 1655932 1678056 1712900 1791112
5456 1791112 1826115 1784530 1824367 1818260 1855207 1817332 1850830 1904488 2035023 2134773 2158760
5445 2158760 2163597 2202765 2305461 2425113 2494958 2521677 2653464 2773550 2867251 2940893 3002206
5434 3002206 3085856 3147565 3221230 3309286 3417749 3563863 3723501 3807906 3960116 4239218
5424 4239218 4537564 4743990 4977941 5197034 5502082 5751543 5921288 6145744 6303476 6435098
5414 6435098 6599608 6762761 6882202 7158741 7387986 7628941 7889357 8229234 8602631 8958518
5404 8958518 9344630 9812115 10349198 11005161 11573863 12130755 12863667 13597559 14384391 15185514
5394 15185514 16033679 16866184 17669815 18572803 19571688 20776560 22177585 23747767 25602689
5385 25602689 27708850 29991573 32568529 35395395 38437650 41697864 45349847 49248413
5377 49248413 53104504 56467586 58862752 60060942 60229360 59797199 58870971 57546920 55807671
5368 55807671 53970129 52164866 50861726 50167450 50133333 50874728 52358867 54502783 57240315
5359 57240315 60586069 64492069 69042007 74114980 79888567 86251063 93083839 99901247
5351 99901247 105664230 109228563 109801007 107976425 104523089 100160581 94903167 88726800
5343 88726800 81888732 75084324 68992684 64006876 60129862 57248080 55350975 54173487
5335 54173487 53661085 53751326 54427981 55441115 56944032 58886664 61191306 63737228 66263728
5326 66263728 68308611 69097884 68303982 66274674 63515633 60333702 56624957 52403451
5318 52403451 47899573 43473294 39477183 35929601 32862066 30224136 28012983 26079373
5310 26079373 24475830 23130915 21961206 20844267 19840065 18930179 18145291 17370450 16594911
5301 16594911 15866048 15205497 14614911 13973113 13397272 12913408 12428038 12048143 11612769
5292 11612769 11234943 10932889 10580017 10296671 10072198 9912028 9735514 9569575 9465429
5283 9465429 9339793 9199117 9116488 8931239 8809337 8701986 8605904 8437773 8377056 8252963
5273 8252963 8138246 7958714 7795294 7687406 7562977 7409473 7249801 7165235 6954609 6847180
5263 6847180 6851875 6896427 6890580 6835470 6858611 6891039 6897052 6904617 6897808 6997848 7061875 7092768
5251 7092768 7117015 7177748 7187978 7172672 7189176 7162385 7176795 7117799 7091419 7125660 7150008
5240 7150008 7099212 7123564 7147651 7239219 7354120 7332603 7392914 7661840 7936299 8147963 8387337
5229 8387337 8548584 8734802 8994077 9283331 9580260 9895393 10275713 10604525 10943664 11378471
5219 11378471 11904943 12446292 13047135 13634298 14172391 14660510 14962693 15185005 15243524 15102468
5209 15102468 14908220 14757514 14394965 13987276 13825821 13564925 13389145 13263529 13361811 13619804
5199 13619804 13974594 14474070 14951769 15635106 16444863 17355826 18334209 19508397 20707232
5190 20707232 21988256 23347940 24418034 25002857 25130679 24768631 24092645 23336549 22306515
5181 22306515 21139818 19850495 18501201 17182459 16006413 15096002 14381910 13742642 13362216
5172 13362216 13127284 13014222 13078595 13149609 13379737 13671773 14058966 14493468 15003432 15440418
5162 15440418 15684344 15851103 15761107 15449084 14974501 14368989 13691919 12969834 12174334 11364874
5152 11364874 10518273 9892483 9271289 8748425 8339474 7904909 7550840 7267395 7065172
5143 7065172 6815888 6667742 6484952 6356347 6227202 6068231 5902878 5815418 5748745 5668484
5133 5668484 5533792 5513478 5401136 5310192 5266371 5265561 5294551 5305939 5350525 5345553 5354557 5374272
5121 5374272 5427863 5518528 5607503 5720661 5855173 5885510 6074147 6286969 6443759 6639734
5111 6639734 6801308 7044470 7263076 7513608 7716884 7823107 7843116 7909697 7962780 8053606
5101 8053606 8199561 8413884 8682387 8999808 9279716 9613023 9947190 10275195 10646484 11033232
5091 11033232 11397936 11845408 12334752 12870619 13367686 13862207 14337876 14815127 15401937
5082 15401937 15968676 16785685 17792685 18889216 20127386 21445279 22972080 24777179
5074 24777179 26778553 29172782 31773482 34668347 37857944 41515217 45646529 49959919
5066 49959919 54795889 59984921 65174831 69181271 70995874 71540299 71770335 72075704 72067175
5057 72067175 71607494 71072688 70935815 71806744 73836957 76476998 78651598 79810340 81021216
5048 81021216 82972071 85425078 87994105 90269537 91719888 92073311 91196944 89814023
5040 89814023 88489413 87335112 86068365 84750871 83847999 83401338 82468440 80480739 78629455
5031 78629455 77607713 77085067 76727849 76430196 76402263 77072147 78647951 80192250 79915734
5022 79915734 77311660 73482110 69569424 65469230 60810615 55432933 49754286 44419331
5014 44419331 39796124 35922809 32633465 29789220 27409083 25458861 23749327 22330098
5006 22330098 21034967 19914157 18910118 17978893 17130040 16298148 15638043 15044796 14427090
4997 14427090 13887288 13288827 12904320 12474048 12070592 11690324 11259596 10867190 10494224
4988 10494224 10210077 9989104 9774590 9486982 9258850 9028864 8742036 8561182 8401371
4979 8401371 8245987 8086953 7920824 7781458 7681940 7511792 7259215 7115309 6936880 6821858
4969 6821858 6663014 6484159 6434327 6261508 6129573 6062048 5911796 5750169 5598394 5497968
4959 5497968 5330830 5305558 5280088 5179798 5153584 5123320 5025414 4911277 4830689 4820594 4761803
4948 4761803 4728461 4672734 4662129 4630123 4549073 4467345 4534709 4562984 4504213 4479335 4443470
4937 4443470 4464161 4462490 4421390 4276615 4111208 4086095 4045038 3998369 3931148 3917568 3928110
4926 3928110 3830766 3732186 3724475 3708358 3730118 3706858 3654506 3645215 3616659 3588236 3597716 3646564
4914 3646564 3745053 3746549 3673848 3633181 3702475 3759031 3798428 3784842 3813720 3847269 3888908 3840839
4902 3840839 3832202 3795352 3719960 3643290 3541509 3539428 3546237 3459315 3456226 3437713 3460258 3482399
4890 3482399 3562641 3651752 3556909 3562054 3588620 3650592 3687695 3714062 3788917 3868420 3897049 4013222
4878 4013222 4095381 4247918 4347968 4474032 4603614 4781657 4906863 5046933 5188578 5362031
4868 5362031 5625067 5884288 6106659 6384992 6700121 6931604 7187651 7416482 7591515 7712410
4858 7712410 7818426 7973660 8115171 8314776 8574660 8850509 9165212 9468906 9710065 10110017
4848 10110017 10471680 10888649 11410501 11934213 12515832 13180895 14008679 14792702 15758991
4839 15758991 16785428 17737969 18838512 19892084 20989513 22211253 23590383 25264567
4831 25264567 27200094 29345072 31709731 34368128 37439772 40796202 44532349 48748875
4823 48748875 53394570 58165475 62765169 66373694 68299716 68604756 68001795 67127756 65980617
4814 65980617 64461933 62321432 59859343 57529318 55667368 54538119 54187393 54539730
4806 54539730 55654484 57524409 60078702 63429231 67382166 72148614 77777365 84379400
4798 84379400 91858076 99760771 106928004 111862552 113282915 111619154 108626987 105020390
4790 105020390 100869039 95656347 89266132 82249186 75436894 69446648 64454726 60520729
4782 60520729 57577296 55384969 53924273 53072173 52846392 53108094 53885855 55192230 57005224
4773 57005224 59199223 61656932 63863719 65170424 65102564 63742033 61611134 59238575
4765 59238575 56578175 53481615 49989524 46207432 42455090 39089527 36099498 33648501
4757 33648501 31604423 29846339 28450475 27291843 26218575 25319792 24405758 23473878 22514036
4748 22514036 21607038 20782539 19959032 19243962 18598859 18123204 17592698 17073734 16498178
4739 16498178 15896897 15346068 14871066 14385565 13930480 13496008 13119000 12806641 12469068
4730 12469068 12197838 12055621 11886195 11770379 11672783 11546437 11454396 11303280 11222963 11107511
4720 11107511 10790950 10454915 10159255 9878253 9651778 9520848 9338935 9103688 8827434
4711 8827434 8684530 8627037 8490088 8306172 8130698 8104125 8117006 8193480 8210812 8170095 7994927
4700 7994927 7932149 7929447 7852548 7841341 7744533 7689072 7633984 7517644 7416125 7402881 7321460
4689 7321460 7268804 7222330 7154472 7134470 7132336 7170659 7120512 7056641 7060190 7118773 7121507 7069905
4677 7069905 7070663 7110593 7078218 6995225 6920299 6922360 6836622 6790802 6786970 6695190 6659801 6628280
4665 6628280 6600720 6620037 6735734 6806036 6907636 7034505 7124585 7206633 7387633 7557939
4655 7557939 7667793 7802085 8030196 8307725 8549940 8876663 9283314 9645379 10106314 10547940
4645 10547940 11032207 11620825 12306730 13031370 13813605 14691629 15460600 16128343 16563108
4636 16563108 16733599 16687389 16645506 16568487 16355207 16018491 15601653 15193270 14918643 14810314
4626 14810314 14829557 15020659 15313823 15632782 16009330 16552525 17204138 17914625 18846127 19823047
4616 19823047 21056433 22379146 23699398 24965331 25922609 26381801 26189097 25609895 24906714
4607 24906714 24145901 23130796 21827086 20458502 19164246 17928409 16918037 16173531
4599 16173531 15511127 14987775 14614229 14422051 14326742 14216644 14194780 14271433 14425642 14666328
4589 14666328 14989189 15282731 15518104 15713210 15667113 15352698 14936767 14481019 13889875 13250865
4579 13250865 12598285 11930720 11274318 10555123 9967169 9444419 9066719 8734295 8455730
4570 8455730 8164667 7860952 7673385 7547137 7368939 7299268 7244502 7159151 7101208 7068301
4560 7068301 7049488 7074977 7205712 7260362 7327141 7498974 7737237 7923751 8100036 8374363
4550 8374363 8688053 8994691 9175304 9283553 9525750 9788525 9934893 10106581 10333115 10645383
4540 10645383 11032558 11337632 11703717 12189413 12547427 12894303 13388349 13889846 14385464
4531 14385464 14923332 15528843 16141409 16686048 17407943 18061595 18849038 19750317 20913754
4522 20913754 22338712 23900504 25750241 27755903 30043526 32541919 35393982 38639309
4514 38639309 42381241 46575118 51517376 57258076 63634426 69951511 75140841 77795000
4506 77795000 78061080 77693292 77823940 78390833 78910797 78968240 78801006 79064917 79836865 80802419
4496 80802419 80958333 80296623 80121755 81070487 83224292 85945287 88750326 91252678 92765286
4487 92765286 92769631 91425509 89776539 88812020 88661935 88751913 88576875 87518369 84900004
4478 84900004 81184750 77809874 75687129 74571965 73790402 73176698 72881023 73275825 74210210
4469 74210210 75195416 75150077 73033750 69517581 65850964 62763583 59803681 56365576 52176557
4460 52176557 47576894 43128980 39053870 35540561 32550712 30115554 27977815 26199975
4452 26199975 24748226 23452715 22302361 21250765 20203072 19196494 18358606 17499495
4444 17499495 16667947 15915729 15258722 14559643 13986380 13496718 13043479 12607092 12075647
4435 12075647 11744367 11389541 11044875 10700925 10375350 10097290 9856577 9577064 9355207
4426 9355207 9157964 9052537 8811125 8582329 8369815 8211490 8009794 7834043 7570315 7392101
4416 7392101 7199603 7081984 6979003 6775164 6675613 6505187 6359376 6226285 6074464 5971098
4406 5971098 5905456 5757051 5639483 5610572 5541671 5487990 5435147 5373905 5298177 5227979 5172917
4395 5172917 5129222 5096662 4998116 4957219 4868884 4862882 4743124 4711187 4620872 4554658 4488557
4384 4488557 4500336 4527229 4498156 4494873 4460125 4359043 4376921 4424877 4449696 4433972 4444570
4373 4444570 4413857 4450133 4502850 4579679 4660903 4694486 4717238 4781914 4860968 4879222 4956016
4362 4956016 4978298 5068468 5179318 5182788 5153516 5087331 5087586 5068825 5039059 4940548 4952988 4953185
4350 4953185 4905954 4869151 4725163 4646732 4534895 4417118 4307568 4319696 4206850 4143700
4340 4143700 4060386 3946346 3889629 3881998 3906641 3882140 3906683 3969558 4009327 4083779 4170067
4329 4170067 4320292 4523190 4647573 4716475 4876190 5001423 5045084 5135613 5128237 4968367
4319 4968367 4785782 4586043 4271553 4066841 3840199 3616900 3371541 3172319 3075276 3025075
4309 3025075 3027188 2971295 2912825 2855642 2861214 2867470 2883354 2884931 2987319 3086442 3173719 3286341
4297 3286341 3476700 3629991 3710239 3716712 3567574 3383265 3227212 2994061 2741092 2536749
4287 2536749 2363098 2191700 2064639 2027371 1960810 1967908 1931118 1870334 1877917 1908648 1912883
4276 1912883 1927321 1975896 2050842 2153617 2259575 2271676 2313058 2400073 2495023 2589660 2679538
4265 2679538 2839588 3044947 3285728 3324549 3286687 3111317 2883701 2607572 2327581 2127317
4255 2127317 1949688 1753368 1645318 1639720 1457319 1379501 1376569 1314284 1371037 1315310 1262723
4244 1262723 1292052 1341570 1266564 1299700 1315227 1328181 1381943 1445805 1504300 1505829 1479850 1519109
4232 1519109 1580795 1655466 1678428 1680712 1700750 1630769 1581375 1528578 1431784 1344726 1243423
4221 1243423 1135796 1127345 1076262 1049048 1020845 969923 953427 970026 918468 898679 870894
4210 870894 830544 808439 855684 895526 887273 847319 793888 851640 907041 902177 942380 960859
4198 960859 1000047 1097084 1127440 1139922 1149977 1135710 1188947 1191713 1155078 1135106 1196169 1199472
4186 1199472 1162104 1161958 1145893 1113015 1078421 1077169 1109684 1030981 1034833 998311 1048799 1047072
4174 1047072 1030276 994941 1039603 1072151 1058840 1072885 1089406 1166376 1157959 1151971 1201073 1248937
4162 1248937 1196872 1233646 1187708 1207419 1198974 1138468 1130419 1084713 1124478 1066306 969745 851964
4150 851964 846150 918409 909333 896483 933554 925904 824191 769836 802464 738818 748289 815065
4138 815065 799877 761434 732097 671756 641277 587280 577324 561670 577360 602971 544884 568653
4126 568653 584686 602313 553546 604555 729570 701407 650297 633884 606736 567725 542645
4115 542645 553104 557378 589166 557763 630369 593928 570009 545590 524254 580070 649121 630133
4103 630133 615993 609511 598933 604550 665063 691957 712987 798506 766234 760796 785154 799746
4091 799746 883371 947986 888468 994171 1024089 1087411 1231852 1348395 1514864 1655525 1873182
4080 1873182 2043953 2153499 2289661 2524834 2862216 3306890 3749899 4055705 4047497 3802938
4070 3802938 3579844 3315829 2903745 2507621 2202645 2066552 1869858 1724087 1629706 1584680
4060 1584680 1501354 1482888 1577632 1621526 1694575 1803603 1801754 1851738 2041792 2209030 2361845
4049 2361845 2628439 2630098 2478931 2300363 2157424 1942042 1681490 1425377 1249252 1231532
4039 1231532 1168016 1105016 988594 932660 913482 819181 780556 753299 787358 855746 770183
4028 770183 744080 742869 713606 728860 733855 699359 698601 718604 775575 720489 718075 717669 765721
4015 765721 840279 853508 824785 900112 952807 974541 1018718 971953 994375 1057567 1135880 1277161
4003 1277161 1341722 1424193 1418650 1386434 1326257 1331662 1287333 1218627 1216178 1151301 1080455 1125706
3991 1125706 1223411 1213613 1214269 1273738 1327156 1406868 1499254 1573823 1659200 1818654 1973923 2184810
3979 2184810 2360140 2347372 2144855 1948027 1768354 1553460 1356882 1229999 1125524 1094278
3969 1094278 987768 791520 732937 753722 711426 694939 668936 614401 519249 505319 561605
3958 561605 482557 495743 547684 633307 559318 531256 548719 587158 542969 488757 557763 585272
3946 585272 557111 528826 513787 518610 471762 431657 364820 379229 387001 445774 426348 381096
3934 381096 386899 390094 472170 434800 438321 456671 518973 515919 521627 601562 586200 526907 537328
3921 537328 553522 626123 697258 730470 780921 837768 930428 999692 990188 1040474 1101546 1256376
3909 1256376 1358320 1405949 1520564 1579343 1505066 1480832 1358627 1251715 1204192 1169670 1068472
3898 1068472 1015297 1011994 1026680 1042520 1094469 1077007 1050849 1129271 1229247 1276126 1265373 1286225
3886 1286225 1227551 1225083 1231689 1255448 1288027 1333001 1429958 1485350 1500435 1599113 1727479 1807298
3874 1807298 1880469 2022481 2138436 2330401 2546152 2727095 2940141 3187859 3415904 3618316
3864 3618316 3939629 4315782 4727553 5178811 5817013 6372551 6617673 6614592 6149419 5618200
3854 5618200 5001815 4394424 3842176 3429241 3157764 2876701 2578755 2463051 2396946 2253884
3844 2253884 2098596 2031889 1924131 1840746 1794579 1721057 1667513 1562756 1431592 1420156 1362186
3833 1362186 1344123 1300446 1346734 1315531 1261487 1256033 1211560 1251018 1167307 1237256 1302659 1293527
3821 1293527 1289971 1291996 1262389 1282688 1280517 1179900 1205839 1176207 1158434 1187642 1264702 1330731
3809 1330731 1321802 1242988 1267358 1256506 1266090 1282116 1271818 1295152 1304542 1400553 1416033 1437914
3797 1437914 1468258 1426323 1436448 1504477 1574118 1590059 1631986 1688545 1754801 1736709 1710349
3786 1710349 1748541 1814209 1832706 1848858 1911541 1885202 1864700 1855708 1977155 2039419 2064336
3775 2064336 2078232 2028018 2107386 2117574 2176816 2289832 2281022 2302622 2354699 2404963 2471356
3764 2471356 2466837 2402293 2520173 2559585 2584245 2708672 2703036 2695219 2766034 2902737 2936952
3753 2936952 2936227 2934751 2986611 3047755 3083709 3194005 3227918 3270527 3321698 3456952 3569423
3742 3569423 3707017 3779340 3888480 4020785 4218691 4323806 4491797 4634755 4806062 5107237
3732 5107237 5368575 5595503 5893293 6136088 6504605 6897165 7335482 7826327 8515013 9250129
3722 9250129 10132083 11147980 12223021 13528560 14970471 16521286 18279348 19720176
3714 19720176 19968598 19492152 19071807 18794045 18709678 18771244 18915798 19073390 19327866 19580762
3704 19580762 19997435 20440778 20929805 21417426 22025396 22673002 23401424 24131409 25051793
3695 25051793 26054776 27102956 28242730 29633883 31104813 32811944 34773947 36911714
3687 36911714 39145136 41716743 44640025 48304368 52688907 58335939 65240750 73665996
3679 73665996 83681716 95150714 108024303 122554025 138043986 152859919 163991781
3672 163991781 174639336 188642551 207315509 231782261 262410544 299163051 339321706
3665 339321706 361927455 344976235 316511431 286009407 246555550 206460321 172831993
3658 172831993 147111084 126531771 109904586 96155108 85261758 76437073 69335924
3651 69335924 63268514 58222135 53898536 50059923 46674852 43674173 40945046 38551025
3643 38551025 36413659 34451266 32621958 31047876 29486072 28046815 26712133 25439164
3635 25439164 24290137 23288718 22336760 21516478 20810151 20135375 19518158 18988044 18379270
3626 18379270 17962687 17529055 17236345 16880943 16596109 16360287 16085959 15800763 15615421
3617 15615421 15403010 15249566 14951250 14594845 14131389 13617450 13079826 12604605 12111977
3608 12111977 11633742 11202713 10707455 10219328 9892225 9587111 9322625 8994710 8700814
3599 8700814 8444161 8233090 7995670 7828488 7613974 7444295 7345599 7174173 6975803 6796831
3589 6796831 6745539 6638122 6520714 6536123 6417016 6367079 6318888 6202161 6176200 6136504 5998030
3578 5998030 5880153 5815412 5682981 5622799 5553009 5420833 5310719 5143021 5107489 5079309
3568 5079309 5002726 4767608 4711077 4679238 4549198 4502517 4466038 4351020 4314346 4249820 4190082
3557 4190082 4109107 4047414 3987855 3914607 3909587 3797017 3772206 3737776 3676760 3658366 3545709
3546 3545709 3460333 3396139 3351593 3388088 3332433 3240294 3174297 3135509 3117098 3184943 3155571
3535 3155571 3101336 3041247 2969513 2896560 2735606 2633349 2626160 2500827 2400089 2346885 2308472
3524 2308472 2208692 2108292 2062896 2041811 2007308 1994000 1968682 1926943 1884860 1789331 1657706
3513 1657706 1633743 1562479 1510892 1492494 1526466 1506962 1431160 1349538 1344808 1330073 1337314 1299043
3501 1299043 1242547 1238070 1158491 1177218 1125351 1032740 980319 917235 856864 838685 820375 792288
3489 792288 772929 775754 710786 653678 661728 646107 748868 742446 705266 775946 797693 797389
3477 797389 867611 953324 915569 852272 831897 875631 883098 816475 852732 862971 879992 889538
3465 889538 878461 951133 923855 874914 875820 884245 856922 844061 783961 763024 840892 849606
3453 849606 783344 806166 749982 770957 873946 903223 835964 770697 701335 700396 677196 659578
3441 659578 654448 659795 687597 644177 719299 722068 746342 725228 713128 663919 723711 764035
3429 764035 764313 736568 739864 767676 753155 717722 717004 623664 705253 751357 802875 809389 750423
3416 750423 736087 812589 837460 799070 817146 798237 822786 821277 862422 844726 823264 765441
3404 765441 735357 695342 713739 713007 784150 785230 802774 854654 807505 785558 754310 738697
3392 738697 735109 674687 676380 679521 671702 701743 658551 653672 703324 718361 660050 666301 695960
3379 695960 728795 729849 805281 796761 732334 754052 761944 851740 932906 906454 867319 880962
3367 880962 891606 963046 961655 1046402 1147397 1210221 1304595 1455278 1625981 1765687 1856635
3356 1856635 1991959 2110821 2228625 2415180 2554286 2636834 2744768 2833724 2853466 2787481
3346 2787481 2615742 2277992 1949197 1755488 1595913 1441505 1324867 1147040 1023803 960516
3336 960516 939475 870843 857209 762451 704086 709608 690177 693062 690117 629482 569074 616956
3324 616956 527918 507729 532967 551414 490577 506821 501949 484824 445125 424291 428722 410005
3312 410005 431185 385783 377369 330501 337751 389317 404676 349957 410766 446068 433678 469582
3300 469582 451861 459805 483986 486216 480493 561384 559242 500775 489963 471532 458108 447443
3288 447443 504465 434120 379149 308048 312061 363085 377202 396741 382783 391612 382139 352202
3276 352202 343821 334455 334201 282092 263739 292471 270873 332221 348131 303929 322174 403224
3264 403224 373903 374666 374495 390020 391691 349048 323445 316691 305847 342815 325402 297943 271791
3251 271791 314919 328025 349595 408298 403439 332199 339122 395881 379958 376809 371792 399160
3239 399160 400037 401430 353008 304064 324550 344754 400764 393675 404973 354011 335667 408443
3227 408443 389645 356160 309587 365878 453970 390029 378790 378397 434461 460349 430733 445284
3215 445284 423259 410499 414018 432489 452760 405044 432760 508624 509427 551858 545857 513071
3203 513071 480515 474021 450390 500096 497288 480440 464010 553639 619486 589095 553867 515495
3191 515495 532395 536431 523902 532338 603038 590402 548963 501970 467840 473840 542963 552869
3179 552869 525069 545435 581844 544748 516233 577534 636550 608225 615968 648024 564102 580174
3167 580174 605236 618995 650421 606577 630439 620620 670453 651668 684840 729880 730897 707095
3155 707095 709991 771315 778721 740935 647589 646697 719635 686908 673663 722433 676801 730553
3143 730553 729127 746785 739945 747100 748810 808002 836130 815226 769747 748799 764615 785380
3131 785380 773184 815784 859758 855616 915042 883259 862625 854880 888595 893069 844581 816297
3119 816297 912187 929005 1011404 991526 929856 946165 1004176 1013088 1038246 1077894 1116899 1144266
3107 1144266 1157032 1196698 1201180 1199890 1197176 1207703 1170269 1227618 1308940 1293530 1249030 1266214
3095 1266214 1313837 1361158 1402171 1451634 1409870 1382997 1386130 1450753 1480334 1544957 1505453 1636956
3083 1636956 1630845 1631749 1674398 1696907 1737185 1746632 1754062 1825035 1874663 1861483 1819248 1922508
3071 1922508 1998170 1998809 2108994 2152554 2195642 2304890 2416772 2538668 2576159 2709904 2810491
3060 2810491 2893850 3045140 3122356 3231534 3402778 3599236 3783596 4011977 4181749 4249505
3050 4249505 4225301 4215480 4233293 4269263 4229186 4215160 4301818 4432091 4570657 4744177 4919356
3039 4919356 5215262 5363677 5522746 5600919 5698700 5724454 5712810 5649994 5699148 5785764 5890210
3028 5890210 6051787 6255513 6454951 6673794 6979320 7285429 7451541 7468220 7292070 6874493
3018 6874493 6550129 6226958 5936427 5726111 5549389 5484497 5425336 5364834 5327695 5394514
3008 5394514 5407871 5342111 5306592 5198800 5043688 4856119 4677235 4550080 4386755 4362457
2998 4362457 4312662 4320531 4385062 4322381 4405994 4460956 4381249 4303060 4128301 3913473 3704550
2987 3704550 3602601 3520888 3424845 3320263 3198982 3193017 3084028 3052409 3059206 2997930 2932429
2976 2932429 2900892 2850263 2796016 2824851 2793605 2735131 2813086 2819264 2822927 2831569 2819916 2853018
2964 2853018 2870158 2859267 2849713 2829312 2917476 2900988 2930837 2936141 2848894 2881991 2914813 2864900
2952 2864900 2821212 2918069 2959209 2937364 2950134 2938227 2885929 2873674 2899950 2982113 3056219
2941 3056219 2971898 2976028 2976361 2969271 3019632 2965284 3038692 3069949 2982614 2974518 2974505 2988301 2967560
2928 2967560 2954124 2993410 3044365 3030263 3049401 3006908 2912196 2964434 2996221 2997896 3012587 2968107
2916 2968107 3015479 3012502 2937051 2974756 2965990 2905252 2921720 2953698 2966792 2961310 3013632 3115299
2904 3115299 3107383 3112558 3120134 3186121 3192231 3182402 3145416 3188739 3235445 3235658 3295854 3319507 3332122
2891 3332122 3350636 3374600 3472627 3523463 3466547 3421493 3408805 3451605 3381333 3356311 3403418
2880 3403418 3364842 3290652 3264555 3350598 3296343 3264481 3285019 3273126 3333630 3348001 3373539
2869 3373539 3328433 3338711 3372905 3354371 3354165 3314393 3372117 3466989 3475025 3478369 3534728 3501538
2857 3501538 3550143 3666915 3707662 3788765 3833417 3876544 3930395 3929775 4035055 4196781 4339531
2846 4339531 4473721 4543370 4697834 4853564 4943895 4968874 5055726 5172540 5351703 5459047
2836 5459047 5613149 5813108 6090816 6382634 6689193 7035612 7389257 7709192 8030721 8355450
2826 8355450 8553314 8722141 9002873 9208228 9320757 9317203 8991482 8532955 7975473 7444993
2816 7444993 6950360 6449233 6102199 5821410 5604548 5441634 5271139 5120219 4964501 4909217
2806 4909217 4762042 4739292 4724196 4694016 4707097 4581257 4513174 4538005 4482644 4412064 4422776
2795 4422776 4474799 4400914 4353546 4436929 4453925 4396955 4341094 4311176 4340179 4359651 4377894
2784 4377894 4410818 4342098 4260537 4340075 4327220 4284531 4270833 4302149 4339480 4368384 4323713
2773 4323713 4322761 4315370 4328078 4294395 4248843 4294958 4340215 4364367 4402049 4437710 4404984 4464589
2761 4464589 4507230 4428968 4415693 4499501 4519202 4460378 4355393 4342322 4369436 4447602 4467606
2750 4467606 4474288 4402093 4363423 4333479 4405026 4423459 4393942 4362289 4406385 4403932 4478937 4476735
2738 4476735 4418570 4472618 4422316 4416859 4339086 4418837 4502930 4556832 4539207 4499326 4505848 4505160
2726 4505160 4558712 4571463 4610503 4559923 4557928 4611016 4590899 4580442 4563675 4568811 4560280 4533639
2714 4533639 4632929 4580776 4557610 4617799 4690749 4693998 4732429 4764612 4730268 4819898 4857845 4915430
2702 4915430 4911852 4901908 4962650 5034549 5071109 5118706 5061025 5137963 5084673 5076330 5083348 5063371
2690 5063371 5055034 5092533 5126316 5183911 5220720 5267722 5281080 5270533 5227668 5251166 5308277 5307652
2678 5307652 5379069 5441585 5498673 5542219 5623115 5672364 5655775 5715441 5799683 5798924 5894247 5948304
2666 5948304 6015400 6075712 6161312 6203102 6294743 6381686 6429804 6466046 6582494 6642111 6766240
2655 6766240 6849844 6916604 6986077 7068394 7190139 7331704 7435039 7540931 7613087 7759708
2645 7759708 7949081 8116540 8264740 8275334 8284635 8346018 8361944 8360673 8446630 8532376 8656973
2634 8656973 8714955 8816184 8944495 9014631 9147251 9339389 9456689 9571608 9667970 9770966
2624 9770966 9917582 10054912 10185417 10384859 10552214 10751168 10892962 11106258 11348031 11584627
2614 11584627 11756075 12063647 12359380 12543237 12770761 12880910 13019040 13097098 13177557 13290139
2604 13290139 13454236 13593995 13789739 13979628 14258536 14559703 14845752 15182105 15550334
2595 15550334 15902799 16197482 16476866 16829727 17239934 17622964 17953025 18367539 18838923
2586 18838923 19296386 19777490 20257747 20699032 21130987 21587593 22015597 22398081 22817002
2577 22817002 23163234 23518614 23758608 24090068 24434202 24764656 25180783 25523431 25960202
2568 25960202 26423875 26831051 27227808 27735355 28188776 28742913 29222420 29745020 30362281
2559 30362281 30939255 31625095 32379901 33066548 33853948 34707596 35540202 36502398 37511975
2550 37511975 38529184 39638640 40802897 42134785 43447593 44827300 46370053 48076938
2542 48076938 49847485 51679348 53546849 55534098 57537528 59607116 61738411 63943538
2534 63943538 66183592 68505330 70916317 73304034 75778498 78304311 80701851 82963806
2526 82963806 85064452 86838807 88314015 89238253 89638133 89534896 88790429 87344796 85301028
2517 85301028 82708672 79678174 76539962 73489338 70532594 67783524 65240017 62942740
2509 62942740 60775882 58892710 57191705 55547517 54003784 52566775 51198602 49925366
2501 49925366 48724344 47664640 46599147 45571613 44589190 43628538 42669912 41809101 40850021
2492 40850021 39831542 38980595 38156026 37364665 36475839 35675047 34892958 34133967 33361229
2483 33361229 32598395 31897341 31205202 30480524 29847210 29306835 28783305 28338150 27779455
2474 27779455 27259637 26871940 26516219 26097697 25733090 25354520 24994160 24634558 24299860
2465 24299860 24066135 23843751 23592373 23329255 23096991 22863177 22630874 22454104 22384603 22232694
2455 22232694 22154755 22015522 21920914 21907591 21681043 21377170 20986547 20527684 20140160 19723836
2445 19723836 19357052 19016931 18695945 18467628 18191280 17963786 17851657 17747701 17623298
2436 17623298 17459256 17389363 17325574 17323028 17345306 17383545 17398942 17386369 17414481 17437415 17462554
2425 17462554 17590406 17746736 17984064 18269640 18580540 18872047 18924269 18580286 18092837 17470830
2415 17470830 16812441 16206227 15649671 15283521 14887939 14561190 14272832 14021949 13821438
2406 13821438 13612071 13431405 13355830 13246065 13182296 13064053 13021711 12986613 12944735 12918551
2396 12918551 12899545 12837205 12843830 12867419 12909824 12977204 12974855 13038035 13187027 13188894 13059051
2385 13059051 12879289 12553166 12181755 11901087 11681088 11477810 11259525 11065564 10934426
2376 10934426 10852681 10744253 10567188 10404761 10362059 10292129 10186684 10117227 10016386 9934136
2366 9934136 9858617 9799970 9684531 9636962 9587340 9524001 9468172 9419297 9331500 9279328 9129720
2355 9129720 8995556 8899511 8806985 8743662 8679121 8653925 8585388 8445274 8355904 8306640 8251640
2344 8251640 8193305 8097393 8037145 7964176 7948919 7943557 7821773 7729994 7717674 7730840 7670764
2333 7670764 7591722 7512381 7481381 7310923 7302421 7336470 7251122 7247911 7199598 7112197 7060080 6953401
2321 6953401 6873890 6804752 6741544 6646621 6629677 6611517 6525521 6449221 6390783 6398764 6326093 6312284
2309 6312284 6231204 6218945 6193089 6188613 6157812 6138325 6142830 6050998 6027021 6033443 6032737 6089437
2297 6089437 6055031 6002242 5974433 5962690 5905168 5899421 5970595 6042074 5987925 6009510 6043312 6044411
2285 6044411 6074519 6054916 6073106 6104581 6224710 6270811 6270864 6317235 6358871 6411605 6437479 6438230
2273 6438230 6515608 6611730 6698487 6779250 6809384 6880985 6932307 7018195 6998841 7058488 7169311
2262 7169311 7287424 7401388 7411805 7578798 7610353 7677533 7918258 7971646 8022101 8191313
2252 8191313 8326899 8456834 8587832 8765591 8852985 8995325 9211559 9419560 9634432 9859204
2242 9859204 10025993 10110104 10250311 10447897 10644975 10823013 10997591 11159421 11312846 11562005
2232 11562005 11782815 11998562 12349002 12621313 12998847 13412336 13883134 14240143 14615935
2223 14615935 14995646 15336079 15841597 16279564 16719791 17132694 17589282 18054526 18499489
2214 18499489 18967946 19395806 19823275 20315918 20746035 21153932 21567091 21917161 22252474
2205 22252474 22538719 22860639 23207237 23533957 23957824 24457136 25001841 25513712 26015759
2196 26015759 26615481 27171910 27833908 28552869 29224646 30025339 30714016 31429707 32216766
2187 32216766 33003245 33715672 34309696 34920203 35388049 35659911 35805839 35736504 35589492 35229577
2177 35229577 34647383 34079648 33660563 33380952 33120576 32964308 33033859 33094785 33334159 33531622
2167 33531622 33729972 34088657 34392600 34692705 35006190 35243361 35551515 35764665 35924058
2158 35924058 36057893 36033856 35911760 35601647 35261693 34762264 34114762 33499819 32881503 32163308
2148 32163308 31317635 30525426 29786757 29205659 28618198 28042368 27508532 27130941 26793335
2139 26793335 26447850 26203054 25894071 25624389 25396397 25104889 24690333 24175257 23668743
2130 23668743 23112582 22463187 21864876 21159122 20464100 19689866 18976673 18116357 17401188
2121 17401188 16750375 16123409 15559034 15080979 14560814 14116277 13643101 13251864 12974032
2112 12974032 12714262 12368511 12072813 11721687 11431369 11248730 10957855 10724014 10479965
2103 10479965 10238942 10011068 9808399 9588034 9293124 9047628 8864342 8601073 8456162
2094 8456162 8236823 8091818 7883872 7617713 7471564 7319112 7106752 7012746 6930359 6828557
2084 6828557 6644144 6518216 6395144 6243840 6137159 6039996 5948930 5885047 5853129 5786581
2074 5786581 5665133 5525897 5471872 5403989 5390911 5282053 5169137 5087996 5018655 4950358 4862728
2063 4862728 4746055 4698873 4557893 4502183 4457488 4336935 4325632 4173536 4067773 4013050
2053 4013050 3955860 3836431 3736303 3674156 3599697 3526614 3526979 3476713 3436709 3437778 3382624 3324852
2041 3324852 3255595 3179353 3140464 3142403 3099988 3082442 2998606 2945411 2913942 2877379 2781096 2731412
2029 2731412 2684627 2597917 2558008 2497130 2410760 2420940 2358449 2286733 2291736 2243580 2260206 2148359
2017 2148359 2166115 2189434 2108758 2018537 2003762 2008791 1962350 1895600 1879300 1843140 1863897 1813378
2005 1813378 1811727 1766388 1692635 1656693 1570277 1665230 1672865 1648685 1649550 1645214 1601514 1512535
1993 1512535 1470503 1417362 1437830 1421678 1429450 1435167 1413631 1367013 1364974 1318244 1240879 1220871
1981 1220871 1246803 1281785 1253087 1181072 1130739 1212464 1217274 1226727 1226458 1162695 1142452 1077921
1969 1077921 1065100 1059329 1068135 1056903 1024914 1045457 1028803 988712 1063215 1079278 1065527 1125124
1957 1125124 1105347 1029820 1031191 981505 921205 929106 877172 861066 838376 887013 950445 907195
1945 907195 872870 955998 874035 838724 898957 936357 919773 915753 841763 783345 855597 872089
1933 872089 855552 847185 782980 762812 796904 813707 853848 825017 826165 763661 729113 718321
1921 718321 761906 768610 843057 858641 859888 836617 847898 795693 739338 769924 701343 772322
1909 772322 782200 783722 705043 743551 769553 786410 757186 734029 777407 832714 742177 738500
1897 738500 767349 735127 749069 752384 801508 710194 659588 765932 711050 654687 663078 683745
1885 683745 720407 732666 698718 629451 590436 609610 618384 626333 653530 707257 712370 720225
1873 720225 656055 631370 599046 583867 644189 676438 645046 637253 629022 674302 678292 639620
1861 639620 603508 578945 570044 514310 552677 583018 547988 464688 476393 452949 543970 548936
1849 548936 515155 465834 502278 530926 458070 427237 446320 432132 480670 496293 512703 464326
1837 464326 413763 426353 403905 383923 389446 418662 391505 423489 419822 392732 404158 361125
1825 361125 373505 332584 280125 353338 343842 282850 328724 314158 308708 311007 311210 268080 251202
1812 251202 284892 306192 312573 290917 282834 282451 294128 343293 352471 270300 282926 339827 329159
1799 329159 281600 306125 202069 240655 287172 218369 285752 277767 293587 302781 257066 237978
1787 237978 264210 350300 369796 301033 186855 233863 252689 275108 249358 178337 178569 174461
1775 174461 230590 185322 166379 248099 323636 280919 238649 224986 254582 262909 265529 212662
1763 212662 239240 196846 144214 179062 152445 198310 247442 241693 196626 172516 200647 221925
1751 221925 244963 257491 169055 90535 138673 150367 113233 166030 124896 110865 146751 95508
1739 95508 108513 114988 110964 106941 202791 169754 161275 172715 134944 99408 103046 83983 41037
1726 41037 183502 193977 175197 120593 75422 145132 181244 143407 164339 102711 79092 109391
1714 109391 147609 141637 79915 128447 71640 20295 90191 122320 67755 65253 82250 169035
1702 169035 156850 113027 145314 165331 158771 184481 87113 -7265 37882 22576 77360 61059
1690 61059 44017 -19971 73114 37838 55936 -5876 -13104 37748 44666 55108 21352 43333
1678 43333 80354 62705 12810 23086 -2489 7599 65727 118693 89202 29964 26525 62609
1666 62609 100376 90412 112681 154236 141088 98791 34183 7151 18159 92411 114656 164751
1654 164751 103859 76624 114657 87594 76815 12916 20246 20863 43656 62942 11709 15554
1642 15554 -51380 -16257 49584 -15052 -91976 -43082 -28236 -2700 -19573 -96192 -9783 21722
1630 21722 -63057 -124847 -49049 -57373 741 1670 -14457 -7947 -15734 879 -55740 6092 2931
1617 2931 -44988 -44968 -25277 -37394 -29255 20380 27518 50788 21025 37137 66834 48470 46337
1604 46337 17443 59185 82935 67703 38350 23441 18213 62583 65993 41361 30503 3391
1592 3391 55562 22596 26724 38436 8397 9431 -10762 -85067 -55671 2683 -9631 -32927
1580 -32927 -32866 27441 -51204 -59800 -55403 -25354 -5573 -24363 -5008 40606 -6278 -64374 -110581
1567 -110581 -62690 -34299 19360 39018 758 -70516 -47687 -51951 -17366 13021 32446 40192
1555 40192 41333 20824 -5607 -18628 -48660 -44975 -51875 18209 -10140 -51262 -95465 -116318
1543 -116318 -62133 -30064 -45724 29533 29308 -21061 -70419 -105146 -64270 -38315 -39439 -29655
1531 -29655 -59562 -25499 -5371 -47554 -24208 -27273 1633 -39337 -103823 -127216 -59711 -41630
1519 -41630 -55109 -2122 -1395 28220 45916 52854 -49863 -51366 -12711 -31209 -22351 16413 56071
1506 56071 43022 42901 15619 3844 844 -50080 28231 -19523 -32290 -40258 -26793 -1947 -20807
1493 -20807 35895 81036 107998 104424 61047 54782 19270 36380 87096 89419 123425 76641
1481 76641 -8319 -14470 -76388 -3271 17230 -61860 -31402 -26659 80930 136885 56703 45569
1469 45569 92034 73370 63699 193354 183629 150249 171526 171438 222843 176546 215124 200282 176270
1456 176270 228071 318872 208589 217172 290526 331491 382261 415770 456761 525327 537634 499466
1444 499466 480133 487236 478354 414767 472333 546784 509159 431252 445479 514690 570149 586128
1432 586128 631509 639297 611240 570975 575119 605586 655275 595775 681313 779040 823937 761384
1420 761384 753489 802979 874195 979555 1076237 1135274 1189489 1214881 1316467 1417806 1573904
1409 1573904 1692248 1853994 2009309 2236425 2568687 2853517 3030947 3190076 3372480 3531263
1399 3531263 3794269 3963490 4182737 4522703 4980382 5494152 6023472 6593041 7277040 7999486
1389 7999486 8587377 8875542 9360380 10156644 10681777 10460004 9357927 7796390 6504972
1380 6504972 5578977 4888460 4274191 3763603 3313033 3054386 2834858 2656043 2438392 2233042
1370 2233042 2045890 1906754 1827447 1705659 1521766 1426323 1319699 1223518 1150430 1124484
1360 1124484 1131769 1066217 964147 1009067 955666 876846 799283 735446 659917 672464 678052 596574
1348 596574 520015 482926 503160 479236 469792 467809 541805 528695 486186 433346 460118 420407
1336 420407 481961 465812 441310 436833 435163 415504 445393 425300 412986 459558 538348 506508
1324 506508 427797 452510 420492 399447 331385 335909 330563 270479 229296 298638 269475 264428
1312 264428 292800 220192 239485 184803 147878 240801 260661 222993 211099 191815 188633 227944
1300 227944 255128 276875 226812 215498 194762 76919 124584 186733 143556 150455 164991 208243
1288 208243 202434 160237 137577 152169 159926 164280 176240 120771 149909 163217 202881 194943
1276 194943 155651 176234 182184 127801 130955 99603 129305 102468 100162 79625 114913 68997
1264 68997 72362 134249 123878 41386 29502 86994 132473 102474 37845 68682 66414 60275
1252 60275 49901 -12970 -4017 74891 61705 1565 567 15789 29049 95121 64089 36202
1240 36202 -41726 -18590 13005 19230 -31061 -81301 21047 10674 -52328 18771 56443 29114
1228 29114 20518 74042 66569 22137 15399 41320 14696 25 -18937 -89334 -118144 -15994
1216 -15994 -91537 -72743 17240 34408 17425 -35479 -98893 -85411 -51378 -81990 -18621 31195
1204 31195 -917 -51398 -85668 -38686 -336 -1718 15910 21835 37534 9611 51531 17111
1192 17111 -12288 -39926 -115630 -78843 -81670 -110168 -141749 -108094 -88818 -19317 49289 111937
1180 111937 6368 -80584 -58562 -100387 -36754 -17866 -21783 -41200 -17829 -28929 30101 3076
1168 3076 -3742 62389 30046 -6940 -20790 35592 2676 3854 67904 -87383 -78239 -9802
1156 -9802 -13424 57333 48575 42420 37659 14877 54919 26375 -16353 -36535 -103966 -60676 -7541
1143 -7541 -22061 -22581 24510 -56627 -85796 -66997 -58637 -46008 -13902 -6041 -6399 -5089 -13716 -18033
1129 -18033 -61043 -46092 769 58939 99 18510 -56333 -76885 -52719 -49806 -28004 -51402
1117 -51402 -86531 -35471 -22688 -46120 927 -17375 -62398 -17162 1922 7277 -34877 -24948
1105 -24948 -26260 -37063 43347 22417 64223 14399 -59570 -26892 -34560 -38342 -107155 4969
1093 4969 32027 -28907 -79505 -130928 -74473 -81863 -24908 38264 -7949 -68317 -51017 -75786
1081 -75786 -76194 -11557 -30048 -46081 -21684 -63597 -59198 -103884 -118235 -92986 -1405 -42524
1069 -42524 -123946 -93213 -4925 -16297 -33159 -41716 -90974 -82183 -72289 -75020 -70478 -82160 -89455
1056 -89455 -112748 -44738 -116955 -18798 -25023 -85989 -92588 -107285 -127910 -93071 -9953 -79581
1044 -79581 -76453 -30240 -81760 -114426 -53991 -77891 -102582 -83345 -42741 -51513 8767 -29841
1032 -29841 -75303 -72818 -47347 -77479 -60084 -23171 -36042 -88092 -77387 -26233 -9742 -44257
1020 -44257 -27913 -2333 -38508 -6610 -6112 -38801 -19443 -20192 -11591 -40917 -89228 -95409 -80287
1007 -80287 -77100 -68957 -54752 -17368 -49764 -21620 -16577 -18332 3880 -15133 -34824 -100478 -66221
994 -66221 10515 49486 2178 -6591 24327 -1733 24806 -7734 72329 59797 14731 24738
982 24738 18894 100096 10833 17501 24037 7922 -4060 70180 17843 -5426 -19516 33098 784
969 784 -82900 -48607 -36891 -4038 -18893 19029 -79437 -136692 -10297 -17913 -59440 -56649 -43384
956 -43384 -18403 -13435 -23616 -12315 -12036 -28664 8599 44734 -7988 -72871 -35485 -9752 49
943 49 -113328 -81599 -111757 -66923 -26714 19614 -6955 -41100 -10793 -10037 -101 -22957 -58673
930 -58673 -23392 -64266 -37762 -40374 -63839 -112197 -66930 26327 -39905 -58492 -31648 -15276
918 -15276 -13620 2814 -6061 -18514 -44240 40803 43740 11022 18323 36065 -51764 -73502 1968
905 1968 13984 -8802 6221 -19127 -64554 -28803 -18619 -46310 -96863 -51361 -36553 -45038
893 -45038 -45754 -13738 10772 -40530 -36726 3175 36549 -3330 -60291 -73931 -25314 -47713 -90165
880 -90165 -41492 4821 73068 30766 15390 1764 -14258 43647 30792 -23288 -78464 -46392
868 -46392 -66798 -29109 16103 22386 -497 3792 -12349 -47130 -106890 -31343 -28720 -42602 -43941
855 -43941 -63331 -51719 -66959 -63116 -23765 -64272 -10726 -7563 -34989 -7151 11359 -22310
843 -22310 -44575 -90994 -117286 -104710 -95893 -48228 -66085 -90608 -106722 -84003 -78647 -104646
831 -104646 -72163 -2274 -28389 -54509 -46757 -33624 10885 -12217 33952 -8218 -54767 -40751
819 -40751 -69036 -96628 -72836 -62739 -97931 -45379 17779 -21391 -4304 30721 48261 35997
807 35997 -32821 -21044 -23893 -35537 -21989 6484 22404 2301 1210 19237 8382 22447
795 22447 18722 25063 4983 -40504 -29272 8671 56640 53581 2316 -35378 64786 48641
783 48641 -41878 -63618 -86091 -71266 -44257 62183 92538 48894 25539 28727 -13028 -27003
771 -27003 -43396 63507 13766 -14601 -96550 -100876 -98699 -111394 -52200 2897 -81211 -56216
759 -56216 -35292 -36379 -62769 -30990 -7459 -61426 -24847 41741 46532 24494 35834 11484
747 11484 -17835 -18366 -25792 -62641 -16168 8850 22833 11826 7254 -4865 -27973 -30225 -47315
734 -47315 -51215 -56858 -8954 -2680 45461 14995 13413 -26937 -31180 21233 11557 4857 34761
721 34761 -32992 -56473 17366 31772 55354 31889 1463 25302 46399 -54051 -86275 -45935
709 -45935 -12012 5136 -20092 -4578 -19060 -24992 42501 -18658 -26112 -4009 -66359 -50642
697 -50642 -7601 -33392 15669 92477 -2053 -36005 60838 65299 43076 44902 49368 -36803 24806
684 24806 -36655 10307 50530 52900 79726 69881 13382 42151 852 16502 42525 86626
672 86626 61855 47088 37594 17639 84381 77996 65408 45883 -28602 -36281 -98040 -96828 -23696
659 -23696 50965 1180 -50955 -14932 -8290 -21875 -26826 -46039 3609 34139 -9757 31362
647 31362 -20344 -10958 -32194 -42386 -30844 -47135 5217 35882 9004 51855 88766 46248
635 46248 66721 35274 -824 -16411 -44576 -71435 -68614 -28959 43048 5686 -123024 -57382
623 -57382 -47865 -91868 -120584 -52889 -9759 -16937 -17561 -7234 -24155 -64894 -64501 -27172 26188
610 26188 56041 47128 716 50800 52270 74876 63760 22693 17842 48183 36711 -4895 46913
597 46913 46001 -6100 -22612 -11746 -20150 -29728 -41804 -29021 -35846 -38453 -62039 -28043 -4507
584 -4507 16708 -30470 66472 30818 27283 105581 53604 14540 23886 43765 7248 -57371 -26099
571 -26099 -24178 -4290 50894 59741 -8976 -26484 -27875 -12498 6880 24780 6907 -9237 -43657
558 -43657 -11690 10815 17980 -17304 -23077 28662 59383 35502 16202 35410 49564 33765
546 33765 -16054 -12053 58022 56055 18693 1835 14396 33628 24434 27999 -31367 38383 54671
533 54671 99951 -50931 -16413 39153 19266 24074 35305 70990 30299 10431 -26427 51578
521 51578 139332 147668 112236 51696 -6500 20017 74015 83719 18467 31961 45959 34806
509 34806 9854 633 3639 23285 -7295 19042 920 -4477 -33281 8194 21106 15042 69981
496 69981 69596 66405 82477 128304 100687 40314 6664 47941 28643 62603 63699 45497 21381
483 21381 -5899 -21709 39513 2389 20172 61750 21129 19343 55288 60614 60880 -4721 19097
470 19097 26748 67885 105387 95862 60905 86583 83109 62316 103842 73864 37529 7494 -42564
457 -42564 39465 75000 33645 -16145 26879 -11568 -22322 -55104 -5407 28482 25665 22521
445 22521 39087 112176 122897 89409 83756 97790 7572 46249 109376 113456 81695 67132
433 67132 113666 101816 16497 51047 59154 42158 62196 35063 -19559 32639 59256 40294
421 40294 -20943 42158 46896 62426 14208 92090 105827 82042 80959 86394 49201 54385 34745
408 34745 56403 126038 127523 117858 114648 61364 67989 98316 -21971 -11090 67866 29910 -28450
395 -28450 -18355 9465 12282 58463 36181 29759 114443 138993 109160 82664 71278 53576
383 53576 29876 2497 19028 -32140 43067 130121 144700 79503 35592 13760 50132 38144
371 38144 19375 61046 96265 118146 61286 30588 33247 14825 11675 29482 73552 106239
359 106239 198365 139481 66003 -7193 26917 26246 -45620 -1590 36871 90155 51782 54677
347 54677 60471 70608 69168 104527 125398 177142 101560 15750 48452 57367 63944 116695 107756
334 107756 95920 132410 101029 67107 31089 101803 85669 85756 116371 137963 106381 77957
322 77957 57104 73987 92984 43312 6644 87017 103670 60258 -13665 29770 19781 74319
310 74319 91896 39590 82024 50184 92564 73209 39461 25606 158580 160705 145658 86026
298 86026 68681 26497 7848 45321 126395 88716 52625 85331 100762 82563 39623 58060
286 58060 62459 93293 97768 102980 87182 44435 51620 -10926 7713 1095 -52729 -30226 12824
273 12824 51036 1593 14066 22332 45079 63017 50406 96001 83419 38274 -4746 18103
261 18103 54586 33828 19496 17227 -4145 98237 153837 167978 113764 87388 117826 117597
249 117597 21345 16524 92454 80120 116669 151957 154516 136428 108402 126402 75950 70394
237 70394 84080 66411 132167 119864 95956 63229 89689 90579 81627 56188 65596 87274 39278
224 39278 -1885 53281 35720 23249 57448 68472 25294 24909 24133 68278 71209 114895 78161
211 78161 94342 91556 90234 81810 84776 152784 141918 97202 79903 50223 6687 -29570 11415
198 11415 25137 88887 32950 33926 84320 142138 220800 162150 152669 205854 172142 94195 88392
185 88392 118354 122424 126103 128829 106003 61718 19044 33190 37877 88296 155285 129335 107241
172 107241 76159 102100 83332 97980 193395 96458 80381 72913 125629 112469 79658 109211
160 109211 108826 125528 191435 112693 109934 68413 41243 59341 71895 27652 37862 73106
148 73106 50501 65323 51112 67900 34167 9854 73149 99737 142337 105078 63954 108724
136 108724 151027 153810 93300 74495 49442 46652 70085 97575 28812 14952 20172 -312
124 -312 24815 72960 32060 29550 53508 53263 79031 103625 94381 50813 67135 90122 146363
111 146363 96571 65775 93645 130041 103201 80909 60229 56683 108392 114829 71844 66553
99 66553 56977 54352 81300 101889 59172 21050 19810 76674 116064 127976 81495 69727 53820
86 53820 91281 77094 88323 128759 89450 95521 83222 82693 135682 110812 119129 113622 77372
73 77372 122339 147740 143930 128465 122276 74511 91837 96031 145660 103645 119781 153900 154296
60 154296 128766 81313 78765 77062 107582 120813 79383 91082 85556 59386 69134 135431 138461
47 138461 90432 86337 121275 106866 106947 98906 73320 112094 119316 113955 116106 110998 110268 101427
33 101427 130780 109602 57381 71940 105786 102091 43878 50834 86482 83928 88843 71752 98662
20 98662 80972 60094 137876 106979 44897 75080 126404 62739 16660 63382 92693 116287
8 116287 104409 81043 92532 111106 108131 123648 146461 142250
0 142250
$$ Imaginary data points
##PAGE= N=2
##DATA TABLE= (X++(I..I)), XYDATA
16383 -1544845 -1534499 -1528935 -1492961 -1444828 -1383695 -1392500 -1371012 -1329094 -1297311 -1295569 -1265934 -1209885
16371 -1209885 -1197481 -1140768 -1129177 -1103620 -1067982 -1075297 -1057167 -979970 -928242 -938771 -925859
16360 -925859 -894314 -890171 -841758 -804007 -774341 -772139 -761824 -785863 -757517 -714782 -677429 -648630
16348 -648630 -612398 -588175 -570505 -552244 -506975 -467061 -472412 -468864 -444879 -338137 -349624 -311141
16336 -311141 -297196 -249450 -243446 -232960 -203006 -196908 -188549 -159828 -124156 -118712 -89059 -49052
16324 -49052 10840 54142 40004 71830 94817 138837 155617 119551 137168 159031 222138 231391
16312 231391 212087 222070 254005 308427 382163 415894 446929 441853 404356 428331 493438 507794
16300 507794 522771 531416 544813 586665 620735 644550 585635 611399 624261 695282 712737 724445
16288 724445 734618 735280 752440 774742 830778 818173 850770 911720 949821 914115 924580 981687
16276 981687 1011946 1046514 1096591 1097661 1029521 1090823 1103941 1134013 1172993 1169921 1164093 1156705
16264 1156705 1167903 1168382 1211623 1240208 1246817 1240500 1276648 1282751 1300198 1327348 1333897 1355990
16252 1355990 1406674 1438416 1416468 1407520 1470716 1499002 1507327 1493648 1461198 1464756 1546608 1620253
16240 1620253 1618593 1548271 1589983 1580914 1577554 1605981 1629853 1705774 1664362 1669964 1708919 1653467
16228 1653467 1678122 1703616 1750843 1756120 1750932 1761413 1807043 1844052 1821829 1766854 1794450 1819212
16216 1819212 1891049 1905818 1869913 1885664 1889742 1905890 1954170 1976890 1902289 1955305 1942189
16205 1942189 1920723 1922003 1947355 2003615 1982724 2084581 2121775 2101335 2120764 2081264 2132106
16194 2132106 2117078 2133438 2171082 2131518 2107822 2111497 2055348 2107357 2179265 2196733 2212485
16183 2212485 2182232 2157242 2198649 2179140 2270702 2219466 2242190 2289178 2228551 2221694 2224522 2278682
16171 2278682 2313343 2277322 2249214 2225788 2268719 2305625 2307500 2302616 2265383 2327669 2357953 2361990
16159 2361990 2342034 2362782 2306911 2300730 2304680 2365832 2310923 2318127 2373250 2407713 2428129 2444611
16147 2444611 2452073 2431702 2483189 2518159 2449348 2466723 2436359 2421030 2413980 2423935 2466555 2397394
16135 2397394 2420190 2446246 2450533 2510753 2454985 2486274 2454268 2441941 2449716 2426996 2505914 2469591
16123 2469591 2509126 2544029 2504630 2495233 2505572 2522564 2528549 2486376 2487346 2456908 2482306 2528386
16111 2528386 2541172 2563224 2580101 2542307 2543486 2544635 2479340 2510041 2555681 2589017 2615420 2590639
16099 2590639 2599440 2548485 2515150 2547611 2561581 2490253 2507137 2499460 2478623 2493231 2478603 2513111
16087 2513111 2594366 2554181 2523800 2500971 2560310 2545669 2601869 2628000 2547077 2558911 2544456
16076 2544456 2562500 2613001 2616891 2610604 2573231 2602823 2659673 2630661 2645284 2714502 2726733 2670434
16064 2670434 2656439 2626762 2641221 2667439 2677133 2603100 2596438 2548655 2567287 2554374 2570124 2593397
16052 2593397 2579742 2590409 2582992 2613999 2661087 2556966 2568682 2617670 2589794 2581071 2617404
16041 2617404 2647561 2629363 2616057 2544379 2614719 2599854 2674791 2693153 2679627 2706686 2669550
16030 2669550 2735850 2670322 2582074 2574390 2607044 2615075 2624400 2625852 2648477 2632623 2586074 2624588
16018 2624588 2601134 2632937 2650825 2617541 2588251 2538013 2581276 2625655 2474853 2487822 2578255
16007 2578255 2558035 2567663 2591700 2596355 2631341 2699439 2718127 2693260 2660998 2662802 2678042 2665077
15995 2665077 2706678 2655759 2629608 2636670 2585394 2612432 2647899 2607782 2589290 2592631 2643586 2643346
15983 2643346 2626075 2729595 2703372 2650953 2653410 2699411 2586201 2604988 2638071 2629096 2697248
15972 2697248 2632531 2601890 2662519 2687591 2637265 2652030 2670416 2667726 2726234 2660877 2674639
15961 2674639 2688352 2647021 2644024 2624278 2673996 2660044 2701121 2704729 2608162 2647360 2655986 2612345
15949 2612345 2619266 2642658 2694800 2650264 2614844 2608075 2659752 2648969 2642610 2660644 2631947 2621944
15937 2621944 2620102 2649596 2670464 2612629 2562575 2651077 2679371 2690716 2740429 2678344 2689635
15926 2689635 2683548 2694270 2664085 2661487 2706572 2652182 2626257 2614932 2666648 2644887 2697911 2709665
15914 2709665 2719697 2712292 2759783 2746113 2740901 2650489 2630441 2692252 2675448 2667472 2653984 2666054
15902 2666054 2676622 2713764 2614880 2663930 2731443 2688423 2691424 2665371 2568955 2602006 2570028
15891 2570028 2623665 2657535 2719739 2685433 2671308 2734006 2685628 2629069 2611006 2626723 2612536
15880 2612536 2635305 2648074 2651550 2661116 2750400 2741798 2722533 2635484 2698649 2707430 2701679 2731007
15868 2731007 2726261 2730477 2705969 2711819 2654609 2620524 2670640 2703132 2707030 2704007 2761257 2783402
15856 2783402 2755940 2701481 2712273 2692649 2754582 2746872 2653946 2708072 2732345 2681582 2663276
15845 2663276 2653524 2642751 2670404 2747221 2691868 2688434 2750258 2714558 2736344 2787029 2753281 2712622
15833 2712622 2777992 2801671 2832578 2787764 2770436 2728632 2700409 2672211 2701234 2691279 2679158
15822 2679158 2632553 2590436 2651469 2675635 2691196 2691669 2625371 2672024 2732640 2716123 2702313 2713682
15810 2713682 2671779 2663956 2675968 2632336 2624367 2624175 2691419 2755548 2803853 2772873 2690242 2711324
15798 2711324 2691507 2770459 2737204 2729495 2667667 2701863 2688220 2647222 2584824 2633990 2682061
15787 2682061 2683083 2776973 2705421 2691182 2729392 2757886 2767499 2734339 2716699 2698102 2710854 2741458
15775 2741458 2767940 2732292 2690352 2667221 2727713 2747276 2700096 2628618 2678299 2671559 2638264
15764 2638264 2675404 2685816 2748286 2754463 2746151 2720323 2729523 2725121 2726622 2679467 2743556 2721840
15752 2721840 2716439 2752839 2730932 2707406 2701860 2708527 2699307 2677059 2684519 2701356 2735398 2710714
15740 2710714 2766509 2795587 2792670 2772225 2737187 2703818 2675250 2660932 2727272 2746371 2755763 2726758
15728 2726758 2706620 2690339 2718420 2672999 2675933 2669163 2678324 2636116 2643375 2685102 2641884 2607562
15716 2607562 2599597 2695566 2722600 2649267 2680718 2661472 2750614 2785338 2787317 2855577 2834233 2804925
15704 2804925 2842741 2805705 2777387 2730344 2756432 2755990 2734279 2748893 2739673 2767032 2800248 2767716
15692 2767716 2678130 2721802 2704204 2707235 2696264 2726617 2710979 2704880 2713648 2791568 2795781 2808268
15680 2808268 2764844 2762014 2783058 2784956 2734531 2712453 2792028 2832653 2806845 2758865 2744018 2726327
15668 2726327 2711057 2766545 2801087 2756103 2705491 2763092 2776134 2725329 2760312 2832710 2813461
15657 2813461 2797859 2766368 2736098 2735758 2776162 2684277 2711080 2731250 2756343 2765260 2750975 2781877
15645 2781877 2778815 2788001 2730137 2752907 2755670 2782069 2779388 2796559 2776702 2726521 2755630 2776477
15633 2776477 2780146 2808109 2779259 2777688 2730882 2745905 2799566 2817442 2780071 2780945 2780109 2726066
15621 2726066 2634422 2668162 2732034 2704963 2756095 2737932 2641748 2693271 2744954 2741733 2729757
15610 2729757 2742888 2829994 2867300 2846328 2846140 2869695 2837926 2833758 2837464 2795073 2761493 2718489
15598 2718489 2717097 2708900 2744278 2812430 2797800 2750123 2745250 2823258 2886927 2792845 2727678 2869504
15586 2869504 2859284 2791034 2806611 2785857 2778787 2814726 2751968 2793258 2719514 2724419 2750285 2769432
15574 2769432 2741565 2749378 2778309 2781347 2781007 2802868 2804949 2795276 2780939 2758345 2755188 2780758 2779815
15561 2779815 2818418 2798560 2794430 2787823 2758917 2706441 2759972 2772603 2829773 2868895 2784074 2743606
15549 2743606 2783004 2868895 2843841 2801559 2783552 2764386 2729630 2795924 2811370 2807813 2711121
15538 2711121 2803336 2813544 2775512 2795922 2880719 2867257 2806649 2814225 2786384 2748747 2752394 2739531
15526 2739531 2771573 2810223 2827141 2807647 2763337 2769065 2785053 2752840 2788805 2792613 2758696 2737124
15514 2737124 2730051 2697661 2810539 2806150 2810710 2811186 2835228 2894358 2882000 2842791 2807847 2717504
15502 2717504 2741347 2814042 2836179 2850273 2814551 2851409 2806951 2775910 2760937 2769742 2787133
15491 2787133 2766742 2811839 2783381 2809409 2831015 2845926 2823132 2812174 2838925 2772523 2808956
15480 2808956 2818335 2769688 2816685 2806606 2816502 2843204 2843180 2824695 2856088 2881579 2817252 2874477
15468 2874477 2848596 2793453 2807685 2812474 2815714 2859153 2884957 2867447 2838997 2800658 2773809 2798330
15456 2798330 2810061 2823485 2867877 2804794 2817188 2886673 2838340 2843887 2832164 2884530 2933475
15445 2933475 2816985 2769997 2819238 2871984 2834990 2818897 2833495 2836534 2774100 2792200 2834278
15434 2834278 2765640 2803125 2805703 2851783 2803571 2809533 2793983 2846237 2833104 2811906 2816785 2779406
15422 2779406 2789240 2802491 2819757 2870690 2824993 2844685 2874322 2865286 2819649 2861981 2859566 2822950
15410 2822950 2802301 2804690 2831262 2864626 2880710 2831330 2823425 2847921 2883730 2916495 2899419 2807726
15398 2807726 2789216 2789615 2831487 2863425 2805346 2774521 2899079 2916407 2876838 2859140 2818364
15387 2818364 2819953 2808227 2899965 2891794 2856232 2858944 2859057 2847361 2835712 2879108 2805265 2861628
15375 2861628 2879703 2836075 2868371 2873434 2853161 2901674 2842507 2851294 2810196 2820732 2813425 2879088
15363 2879088 2944218 2906658 2865217 2863388 2853947 2819758 2823456 2770990 2793560 2787176 2790191 2798248
15351 2798248 2843676 2760012 2749425 2722543 2728369 2736867 2774479 2825396 2770205 2748613 2784680 2825615
15339 2825615 2820210 2786726 2859107 2862985 2884781 2923798 2883033 2873698 2832096 2839142 2904743 2859413
15327 2859413 2881500 2893998 2904918 2870419 2899320 2883733 2892455 2842647 2788986 2739214 2780047
15316 2780047 2885895 2867522 2900423 2851043 2858706 2875861 2850095 2850425 2900855 2836327 2892755 2868558
15304 2868558 2890057 2943968 2898373 2871220 2920297 2866897 2799574 2788130 2797846 2801718 2867853 2846618
15292 2846618 2808365 2778166 2777479 2801373 2845888 2843771 2879088 2894993 2846751 2870724 2832892 2927841
15280 2927841 2895676 2835430 2831048 2789507 2909357 2889638 2895912 2886941 2837861 2865324 2926454 2879213
15268 2879213 2900875 2849564 2867344 2904261 2918475 2897460 2904513 2861869 2844541 2916549 2852399
15257 2852399 2793693 2810165 2869146 2922285 2927998 2931995 2910059 2815293 2874608 2909809 2928208 2973013
15245 2973013 2880490 2801120 2867919 2826282 2780346 2893787 2940537 2900711 2900474 2814349 2802685
15234 2802685 2855622 2922612 2883669 2834633 2840879 2929863 2937324 2864660 2880124 2905926 2883106 2849942
15222 2849942 2869464 2873408 2921988 2910074 2882080 2852012 2883848 2914302 2839922 2817439 2820087 2915628
15210 2915628 2922279 2912565 2865826 2945126 2933200 2874830 2869376 2811911 2857131 2857454 2932962 2901148
15198 2901148 2908246 2881600 2845875 2873887 2845262 2897565 2895485 2874215 2864957 2958626 2906842 2826052
15186 2826052 2862555 2941489 2878538 2852449 2887991 2862622 2874745 2879156 2944864 2980403 2983598 2970869
15174 2970869 2856940 2853234 2903236 2887364 2866755 2840326 2829374 2858934 2868184 2892290 2846023
15163 2846023 2842647 2829637 2865254 2933211 2908042 2911051 2885367 2799980 2864668 2871728 2790719 2859722
15151 2859722 2913475 2893648 2881407 2887353 2913172 2905257 2846777 2802467 2821654 2864285 2890056 2861372
15139 2861372 2948638 2955349 2876657 2888574 2930800 2910688 2919302 2917473 2903729 2924669 2898271 2877827
15127 2877827 2895418 2902254 2922419 2943664 2938026 2963259 2875128 2858172 2892298 2845607 2854228 2927350
15115 2927350 2864846 2835405 2872405 2902823 2918285 2916348 2906909 2937687 2973060 2997299 2951220 2882364
15103 2882364 2878590 2907893 2891716 2920336 2944865 2989728 3012581 2948979 2963954 3027650 3002769
15092 3002769 2959445 2890363 2930247 2932517 2943472 2963896 2985826 2989726 2948029 2884347 2964789 2966135
15080 2966135 3003038 2979669 2928137 2969172 2941538 2950731 2938386 2953254 2942333 2942820 2886079 2906648
15068 2906648 2943254 2905916 2988525 2944327 2923561 2914506 2898147 2909512 2960514 2938791 2909115
15057 2909115 2833963 2865392 2938551 2908058 2911572 2967292 2996581 3015879 2967769 2860194 2867133
15046 2867133 2900069 2980045 2957105 2995803 2971144 2968742 2988805 3006611 2970876 2932076 2982119
15035 2982119 2965774 2926845 2957940 2936042 2962899 3019248 2998713 2945365 2911645 2966186 2905857
15024 2905857 2956051 3033033 3011915 2999126 2954767 2935557 2956386 3008125 2971174 2953478 2982152
15013 2982152 2926230 2896983 2962213 2984701 2986261 3029681 3009927 2990156 2982329 2989572 2934729 2930407
15001 2930407 2998900 2931470 2961093 2917335 2883735 2947183 2911301 2955835 2993838 3007730 2993805
14990 2993805 3009781 2947773 2915765 2930345 2933683 3053979 3028981 3005591 3002284 2980288 2940844
14979 2940844 2999444 2954369 2962312 2953258 2990264 2966774 2996131 2975987 3000566 2985706 3011918 3055940
14967 3055940 3026908 2972575 3028765 3029337 3015213 2997435 2934651 2937706 2906164 2965757 2965817 3029206
14955 3029206 3033432 3004366 2990620 2976221 2966614 2944243 2901785 2896889 2987578 3039371 3025247 3021787
14943 3021787 2969285 2942213 2940613 2972233 2951758 2924977 2975454 2952911 2910619 2905962 2938297 2989002
14931 2989002 2986395 2962264 2941579 2984905 2952764 2951049 2945570 3047976 3029873 3017185 2999351 3024003
14919 3024003 3033387 2990675 3078533 3032611 3020807 3042312 3079095 3036389 2996362 3060450 3031898
14908 3031898 2978974 2921624 2973896 2995834 2981278 3016123 3067032 3045353 2994362 3033065 3021923
14897 3021923 3023315 3026728 3029031 3009312 3017959 2985736 2998872 3025621 2967736 3036935 3083766 3048573
14885 3048573 3050227 3026649 2959539 2961492 2988283 3040104 3095030 3054442 3062554 3082258 2971963 2963100
14873 2963100 2980629 2936457 2960646 3006849 3006083 2933996 2969681 2983212 2954310 2925378 2983069 2997616
14861 2997616 2931244 3020286 3055005 2993143 2989794 2993118 2980195 2949650 2915596 2974946 2982554 2999709
14849 2999709 2997489 3056173 3050787 3043070 3049630 3068605 3040484 3037965 3022011 3048195 3087763 3079497
14837 3079497 3063678 3017203 3046262 3097340 3092798 3057854 3072321 3066330 3104219 3085011 3041986 3086307
14825 3086307 3081374 2989895 3048971 3114983 3101199 3105059 3090156 3042054 3028200 3100027 3059824 3058459
14813 3058459 3065769 3071370 3123412 3078113 3009678 3037519 3038282 3044828 3130831 3069044 3061637 3060575 3014689
14800 3014689 3055009 3051986 2946255 3008491 3055483 3013868 3045545 3102930 3066080 3018611 3008707
14789 3008707 3053820 3039449 3083563 3106210 3082589 3073188 3028626 3037783 3053596 3058393 3086839 3032844
14777 3032844 2959499 3008930 2974545 3023123 3061740 3078574 3095910 3045710 2971666 3011595 3015936
14766 3015936 3052554 3063784 3087108 3037631 3011479 2990757 3044397 3054956 3040033 3098780 3066787
14755 3066787 3084953 2984391 3008012 3037334 3101931 3074463 3049014 3037823 3028968 3073612 3038486
14744 3038486 3005729 3026822 3006869 2965661 2962311 2940254 2976620 3069672 3007718 3099428 3122725
14733 3122725 3063011 3058511 3044178 3022496 3000149 3014210 3013470 3052304 3100737 3068293 2994402 2970048
14721 2970048 2991373 3017872 3083203 3097907 3063474 2990422 3011622 3025017 3021409 3065167 3000178
14710 3000178 3017393 2995391 3080040 3111634 3103122 3113070 3089160 3043625 3070925 3126858 3109464 3115183
14698 3115183 3042610 3051217 3053242 2995726 3007581 2955551 2971487 3012538 2990905 2960188 2991041 3040704
14686 3040704 3033424 3097233 3093700 3098208 3086182 3024786 3030005 3010630 3044725 3130707 3053223 3046219
14674 3046219 3025980 3072585 3101215 3105830 3083372 3058198 3062716 3041859 3048450 3123700 3107733 3068512
14662 3068512 3092143 3069076 3143052 3143926 3148633 3139990 3061902 3099353 3116226 3042766 3115812 3052044
14650 3052044 2983046 3036804 3071669 3078456 3107567 3069955 3144000 3062653 3077890 3122310 3070303
14639 3070303 3032165 3063582 3092748 3134399 3191409 3115923 3027054 3075929 3088721 3045951 3099379
14628 3099379 3087492 3086354 3066327 3050965 3061839 3058851 3126244 3100453 3099043 3131089 3152049 3057398
14616 3057398 3042824 3121346 3150680 3144541 3122177 3099658 3095336 3105669 3060192 3057228 3043318 3048969
14604 3048969 3016827 3082972 3086239 3135177 3116204 3160378 3227528 3176674 3152960 3152783 3112754 3131439
14592 3131439 3111898 3098125 3110626 3119561 3083953 3022064 3092952 3166721 3156708 3132128 3188936
14581 3188936 3155718 3131194 3122609 3186948 3161972 3070537 3111074 3096105 3098859 3101722 3142844 3194395
14569 3194395 3203916 3148760 3138022 3079762 3064456 3097674 3081533 3128919 3139003 3141317 3077044 3054826
14557 3054826 3082261 3128890 3101480 3160220 3154050 3141443 3153684 3165825 3201423 3203379 3125654 3098883
14545 3098883 3135132 3191691 3198831 3145518 3129176 3115922 3140930 3136337 3090983 3132696 3145872 3094848
14533 3094848 3109726 3150992 3155128 3093114 3122768 3129662 3199318 3197347 3151317 3104597 3108761 3123069
14521 3123069 3162309 3126620 3130207 3190182 3209898 3144575 3189040 3217053 3203991 3180780 3216259
14510 3216259 3194008 3192920 3193644 3152823 3097823 3115762 3131061 3103360 3120819 3104002 3072545 3173995
$$ [...]
##END NTUPLES=NMR SPECTRUM
##END=
