##TITLE=1H_CG-1181-C5
 CDCl3
 8 sc, 
 3.5.2024
##JCAMPDX= 6.0         $$ Bruker NMR JCAMP-DX V2.0
##DATA TYPE= NMR SPECTRUM
##DATA CLASS= NTUPLES
##ORIGIN= UXNMR, Bruker Analytische Messtechnik GmbH
##OWNER= root
$$ XWIN-NMR		Version 3.5
$$ Fri May  3 14:20:02 2024 Russian Standard Time (UT+4h)  she@DPX200
##.OBSERVE FREQUENCY= 200.1309
##.OBSERVE NUCLEUS= ^1H
##.ACQUISITION MODE= SIMULTANEOUS
##.ACQUISITION SCHEME= undefined
##.AVERAGES= 8
##.DIGITISER RES= 18
##SPECTROMETER/DATA SYSTEM= spect
##.PULSE SEQUENCE= zg30
##.SOLVENT NAME= CDCl3
##.SHIFT REFERENCE= (INTERNAL, CDCl3, 0, 16.4268)
##AUDIT TRAIL= $$ (NUMBER, WHEN, WHO, WHERE, WHAT)
$$ ##TITLE= Audit trail, XWIN-NMR		Version 3.5
$$ ##JCAMPDX= 5.01
$$ ##ORIGIN= Bruker BioSpin GmbH
$$ ##OWNER= she
$$ F:/spectra/data/she/nmr/H-F/1/pdata/1/auditp.txt
$$ ##AUDIT TRAIL=  $$ (NUMBER, WHEN, WHO, WHERE, WHAT)
(   1,<2024-05-03 14:18:59.03 +0400>,<she>,<DPX200>,
      <created by zg, POWCHK disabled, PULCHK disabled
       configuration hash MD5:
       00 E9 B6 7A A2 85 ED C7 34 08 36 98 17 FE 4E 26
       data hash MD5: 16K
       FD AC 48 3B 85 00 EC BD 2E 7A 75 CE 3A 39 1A AC>)
(   2,<2024-05-03 14:19:01.40 +0400>,<she>,<DPX200>,
      <Start of raw data processing
       efp BC_mod = 2 LB = 0.24 FT_mod = 6 PKNL = 1 PHC0 = -25298.03 PHC1 = 10.38731 SI = 16K 
       data hash MD5: 16K
       C0 38 5F 8C EA 53 31 4B F3 19 A6 EB 7D 3A 0D AF>)
(   3,<2024-05-03 14:19:17.14 +0400>,<she>,<DPX200>,
      <pk PHC0 = 1.898443 PHC1 = -3.2 
       data hash MD5: 16K
       5C 3B E9 AC 00 6E CB AE 45 B7 CE A7 4E D1 99 78>)
(   4,<2024-05-03 14:19:20.17 +0400>,<she>,<DPX200>,
      <abs ABSG = 5 
       data hash MD5: 16K
       CD 5A AC D7 DB E7 5E A7 F3 8C B9 4F 22 B1 D7 5B>)
$$ ##END=
$$ 
$$ hash MD5
$$ BE E0 4F 42 DC 8E 3C 9A 59 91 33 0F 57 AA ED BC
##$RELAX= 
##$RELAX= 
##$RELAX= 
##$RELAX= 
##$RELAX= 
##$RELAX= 
$$ Bruker specific parameters
$$ --------------------------
##$DU= <F:/spectra>
##$EXPNO= 1
##$NAME= <H-F>
##$PROCNO= 1
##$TYPE= <nmr>
##$USER= <she>
##$AMP= (0..31)
100 100 100 100 100 100 100 100 100 100 100 100 100 100 100 100 100 100 
100 100 100 100 100 100 100 100 100 100 100 100 100 100 
##$AQSEQ= 0
##$AQ_mod= 1
##$AUNM= <au_zg>
##$AUTOPOS= <>
##$BF1= 200.13
##$BF2= 200.13
##$BF3= 200.13
##$BF4= 200.13
##$BF5= 200.13
##$BF6= 200.13
##$BF7= 200.13
##$BF8= 200.13
##$BYTORDA= 1
##$CFDGTYP= 0
##$CFRGTYP= 5
##$CHEMSTR= <none>
##$CNST= (0..31)
1 1 145 1 1 1 1 1 1 1 1 1 1 1 1 1 1 1 1 1 1 1 1 1 1 1 1 1 1 1 1 1 
##$CPDPRG= <>
##$CPDPRG1= <>
##$CPDPRG2= <>
##$CPDPRG3= <>
##$CPDPRG4= <mlev>
##$CPDPRG5= <mlev>
##$CPDPRG6= <mlev>
##$CPDPRG7= <mlev>
##$CPDPRG8= <mlev>
##$CPDPRGB= <>
##$CPDPRGT= <>
##$D= (0..31)
0 1.2 0 0 0 0 0 0 0 0.06 0 0.03 0 0 0 0 0.0002 0 0 0 0 0 0 0 0 0 0 0 0 
0 0 0 
##$DATE= 1714731538
##$DBL= (0..7)
120 120 120 120 120 120 120 120 
##$DBP= (0..7)
150 150 150 150 150 150 150 150 
##$DBP07= 0
##$DBPNAM0= <>
##$DBPNAM1= <>
##$DBPNAM2= <>
##$DBPNAM3= <>
##$DBPNAM4= <>
$$ [...]
##$SUBNAM3= <"">
##$SUBNAM4= <"">
##$SUBNAM5= <"">
##$SUBNAM6= <"">
##$SUBNAM7= <"">
##$SUBNAM8= <"">
##$SUBNAM9= <"">
##$SW= 18.0517689322627
##$SWIBOX= (0..15)
0 0 2 0 0 0 0 0 0 0 0 0 0 0 0 0 
##$SW_h= 3612.71676300578
##$TD= 16384
##$TD0= 1
##$TE= 0
##$TE2= 300
##$TE3= 300
##$TEG= 300
##$TL= (0..7)
0 120 120 120 120 120 120 120 
##$TP= (0..7)
150 150 150 150 150 150 150 150 
##$TP07= 0
##$TPNAME0= <>
##$TPNAME1= <>
##$TPNAME2= <>
##$TPNAME3= <>
##$TPNAME4= <>
##$TPNAME5= <>
##$TPNAME6= <>
##$TPNAME7= <>
##$TPOAL= (0..7)
0.5 0.5 0.5 0.5 0.5 0.5 0.5 0.5 
##$TPOFFS= (0..7)
0 0 0 0 0 0 0 0 
##$TUNHIN= 0
##$TUNHOUT= 0
##$TUNXOUT= 0
##$USERA1= <user>
##$USERA2= <user>
##$USERA3= <user>
##$USERA4= <user>
##$USERA5= <user>
##$V9= 5
##$VALIST= <valist>
##$VCLIST= <CCCCCCCCCCCCCCC>
##$VD= 0
##$VDLIST= <DDDDDDDDDDDDDDD>
##$VPLIST= <PPPPPPPPPPPPPPP>
##$VTLIST= <TTTTTTTTTTTTTTT>
##$WBST= 1024
##$WBSW= 4
##$XGAIN= (0..3)
0 0 0 0 
##$XL= 0
##$YL= 0
##$YMAX_a= 300048
##$YMIN_a= -658808
##$ZGOPTNS= <>
##$ZL1= 120
##$ZL2= 120
##$ZL3= 120
##$ZL4= 120
##$ABSF1= 16.44989
##$ABSF2= -1.602013
##$ABSG= 5
##$ABSL= 3
##$ALPHA= 0
##$AQORDER= 0
##$ASSFAC= 0
##$ASSFACI= 0
##$ASSFACX= 0
##$ASSWID= 0
##$AUNMP= <proc_1d>
##$AZFE= 0.1
##$AZFW= 0.1
##$BCFW= 0
##$BC_mod= 2
##$BYTORDP= 0
##$COROFFS= 0
##$CY= -3
##$DATMOD= 1
##$DC= 0
##$DFILT= <>
##$DTYPP= 0
##$F1P= 0
##$F2P= 0
##$FCOR= 1
##$FTSIZE= 16384
##$FT_mod= 6
##$GAMMA= 0
##$GB= 0
##$INTBC= 1
##$INTSCL= 3.70164e-10
##$ISEN= 128
##$LB= 0.24
##$LEV0= 0
##$LPBIN= 0
##$MAXI= 10000
##$MC2= 0
##$MEAN= 0
##$ME_mod= 0
##$MI= 1.114404
##$NCOEF= 0
##$NC_proc= -6
##$NLEV= 6
##$NOISF1= 3.799351
##$NOISF2= 2.8
##$NSP= 0
##$NTH_PI= 0
##$NZP= 0
##$OFFSET= 16.42675
##$PC= 1
##$PHC0= -25296.13
##$PHC1= 7.18731
##$PH_mod= 1
##$PKNL= yes
##$PPARMOD= 0
##$PSCAL= 0
##$PSIGN= 0
##$REVERSE= no
##$SF= 200.129418883281
##$SI= 16384
##$SIGF1= 3
##$SIGF2= 2
##$SINO= 5.538805
##$SIOLD= 16384
##$SREGLST= <1H.CDCl3>
##$SSB= 0
##$STSI= 16384
##$STSR= 0
##$SW_p= 3612.71676300577
##$SYMM= 0
##$S_DEV= 0
##$TDeff= 16384
##$TDoff= 0
##$TI= <>
##$TILT= no
##$TM1= 0
##$TM2= 0
##$TOPLEV= 0
##$USERP1= <user>
##$USERP2= <user>
##$USERP3= <user>
##$USERP4= <user>
##$USERP5= <user>
##$WDW= 1
##$XDIM= 16384
##$YMAX_p= 339089128
##$YMIN_p= -473613
$$ End of Bruker specific parameters
$$ ---------------------------------
##NTUPLES= NMR SPECTRUM
##VAR_NAME=  FREQUENCY,     SPECTRUM/REAL,   SPECTRUM/IMAG
##SYMBOL=    X,             R,               I
##VAR_TYPE=  INDEPENDENT,   DEPENDENT,       DEPENDENT
##VAR_FORM=  AFFN,          ASDF,            ASDF
##VAR_DIM=   16384,         16384,           16384
##UNITS=     HZ,            ARBITRARY UNITS, ARBITRARY UNITS
##FACTOR=    0.220516191357247, 1,           1
##FIRST=     3287.47596828573, 0,            0
##LAST=      -325.240794720043, 0,           0
##MIN=       -325.240794720043, -473613,     0
##MAX=       3287.47596828573, 339089128,    0
$$ Real data points
##PAGE= N=1
##DATA TABLE= (X++(R..R)), XYDATA
$$ [...]
6591a41554M629L1133k06786Q3195P8201p383n632R8584p0598q7260J43378k6543
$$ -141554 -136925 -105792 -312578 -229383 -151182 -158565 -164197 -65613 -136211 -223471 -80093 -106636
6579a06636k4810Q5660J2245o5178j65057J30501l9662j04530O7716J36761r8949
$$ -106636 -131446 -45786 -33541 -98719 -263776 -133275 -172937 -277467 -209751 -72990 -171939
6568a71939r6113J28069J08662O7929n6041q9525n8661J029K124L418q1376K04708
$$ -171939 -268052 -139983 -31321 36608 -19433 -108958 -167619 -166590 -164466 -161048 -242424 -37716
6556c7716o4103O3399n9783j66926J03206J44711P5680j90980m6963J3107M0329
$$ -37716 -101819 -38420 -98203 -265129 -161923 -17212 58468 -132512 -179475 -166368 -126039
6545a26039J11066j082J4775k0061j1486j9122O8647N3186j07550j8209l5908
$$ -126039 -14973 -16055 -1280 -21341 -32827 -51949 16698 69884 -37666 -55875 -91783
6534i1783l3537K7058J3162j2127p1248N4231N7824J02546q4338l6304p4523P1678
$$ -91783 -125320 -98262 -85100 -97227 -168475 -114244 -56420 46126 -38212 -74516 -149039 -77361
6522g7361M3455l6975N4646k1667M136P1457l3872N816R260J14196Q925r9605
$$ -77361 -33906 -70881 -16235 -37902 -33766 37691 3819 9635 18895 133091 142016 42411
6510D2411j54674L7093Q0076l6215n5731r4117p358k2295m5563Q0218J31017L2032
$$ 42411 -112263 -75170 4906 -31309 -87040 -181157 -188515 -210810 -256373 -176155 -45138 -13106
6498a3106o2968p4250M9325J27226j34690J9696J4147L6655m4376K3908l7759
$$ -13106 -76074 -150324 -100999 26227 -108463 -88767 -74620 -37965 -82341 -58433 -96192
6487i6192m8870J22055J9259o5032q7931l5750K7429K2792j32964L5354J43231
$$ -96192 -145062 -23007 -3748 -68780 -156711 -192461 -165032 -142240 -275204 -239850 -96619
6476i6619J794k0414R3584J9491o3570O1238K3710j6811m094l3371q6530j32630
$$ -96619 -94825 -115239 -21655 -2164 -65734 -4496 19214 2403 -1691 -35062 -121592 -254222
6464b54222K37809l4939j52873j3104O0779P4112M304l9970K3714P1180o6868
$$ -254222 -16413 -51352 -204225 -217329 -156550 -82438 -78134 -118104 -94390 -23210 -90078
6453i0078r880L1815l8967O6909J48649p3512k08096l2730O8979J07684N1500
$$ -90078 -99958 -68143 -107110 -40201 108448 34936 -173160 -205890 -136911 -29227 22273
6442B2273N9318j4139K5921j09636M0572O7592j22188j33824N2611P5831j13159
$$ 22273 81591 67452 93373 -16263 24309 91901 -30287 -164111 -111500 -35669 -148828
6431a48828n6592J59124K9193m9675J9888K6305l4386j8128j5747Q4507K4459
$$ -148828 -205420 -46296 -17103 -66778 -46890 -20585 -54971 -73099 -88846 -4339 20120
6420B0120k016p8290k8380P0359J2979j28109o4381N8488L4535J17203n6425n0384
$$ 20120 18104 -60186 -88566 -18207 -5228 -133337 -197718 -139230 -104695 12508 -43917 -94301
6408i4301N7476P9285j05478K9889R3480L0873j00288j20474m146K2253l6176
$$ -94301 -36825 42460 -63018 -33129 60351 91224 -9064 -129538 -133684 -111431 -147607
6397a47607L7274m0701N4351Q3233Q426q1136q5256M3242k4201J14659k5154j9054
$$ -147607 -110333 -151034 -96683 -13450 -5024 -86160 -171416 -128174 -152375 -37716 -62870 -81924
6385h1924O0405L208q7150k2240m1088J69488p5949j84717O2372J99314j01069
$$ -81924 -21519 -18311 -105461 -127701 -168789 699 -75250 -259967 -197595 1719 -99350
6374i9350J4264j3584K47938p5076k11108Q785J6502J35239m2313L4341k7126
$$ -99350 -85086 -98670 149268 74192 -136916 -128131 -111629 23610 -18703 15638 -11488
6363a1488j22908L9007Q2956J1235L9097j45200n9556m2993N2392K8999L3575
$$ -11488 -134396 -95389 -12433 -1198 37899 -107301 -166857 -209850 -157458 -128459 -94884
6352i4884k6369O6851K0067l9054M1081q5699J29729M1864q8552q7838L9577J4113
$$ -94884 -121253 -54402 -34335 -73389 -32308 -118007 11722 53586 -34966 -122804 -83227 -69114
6340f9114R4122Q5633k5244O83q9131j10319n0755J34230r6363j0935R3958J6229
$$ -69114 25008 110641 85397 86080 -3051 -113370 -164125 -29895 -126258 -137193 -43235 -27006
6328b7006r4108J9781n0023J5098K5322m8899J20475J46426m6838k3318m0189
$$ -27006 -121114 -101333 -151356 -136258 -110936 -159835 -39360 107066 60228 36910 -3279
6317c279j42324r9578J25617K8400O2825N5475n4014j07785K4190k2404M2706
$$ -3279 -145603 -245181 -119564 -91164 -28339 27136 -26878 -134663 -110473 -132877 -90171
6306i0171j05406J8622l2761m5164R1836J67464j97477l0144J00173N4978R4000
$$ -90171 -195577 -176955 -209716 -254880 -163044 4420 -193057 -223201 -123028 -68050 25950
6295B5950m9947q2146n2306J2972O250N5257k1864m7181j4805o2976k757M5510
$$ 25950 -23997 -106143 -158449 -145477 -139227 -83970 -105834 -153015 -167820 -230796 -233553 -188043
6283a88043N4600m9132J5057P3970n1945l2406J9995J07623P7760K07545j3801
$$ -188043 -133443 -182575 -167518 -93548 -145493 -177899 -157904 -50281 27479 235024 221223
6272B21223j15749p0420m9283q7331R2839J0044j09225o8658M7037O0524N681
$$ 221223 105474 35054 -14229 -101560 -8721 1323 -107902 -176560 -129523 -68999 -63318
6261f3318o8490q7464J43130N4248J71521j11129k09203n0285R7919J55331j42807
$$ -63318 -131808 -219272 -76142 -21894 149627 38498 -170705 -220990 -123071 32260 -110547
6250a10547J7981O458n2900P7200J05287J262M2024j29730p2343O065m4241l9306
$$ -110547 -92566 -86108 -139008 -61808 43479 44741 86765 -42965 -115308 -109243 -153484 -192790
6238a92790k652N5840J29341K0948j05860l9225n8191M5716P6979Q1841N9353
$$ -192790 -195442 -139602 -10261 10687 -95173 -134398 -192589 -146873 -69894 11947 71300
6227G1300P4954q0145k08607Q5543j2753K7428n1822O4155K2917p293M8677o5376
$$ 71300 146254 66109 -142498 -56955 -69708 -42280 -94102 -29947 -7030 -14323 34354 -31022
6215c1022M056m8907q5256N2461j44603J53666N5348r9544N930l4812m0295r3354
$$ -31022 -26966 -75873 -161129 -108668 -253271 -99605 -44257 -143801 -137871 -172683 -212978 -306332
6203c06332Q0049J55502K3644k8656j6311o0692O306J03623Q9688j2116m1392
$$ -306332 -226283 -70781 -47137 -75793 -92104 -152796 -146490 -42867 46821 34705 -6687
6192f687l8863j05671K2159k826J8436p5225N4214J15094m3164q6093K6722J47330
$$ -6687 -45550 -151221 -129062 -131888 -113452 -188677 -134463 -19369 -62533 -148626 -121904 25426
6180B5426l4036l9006M8724l6041l2544J30087K6513J9556P5205j7197j19156
$$ 25426 -8610 -47616 1108 -34933 -67477 62610 89123 108679 183884 166687 47531
6169D7531p8371l4646p0757Q1911k6164O2532M4014l0363m1421j23646n2345J30429
$$ 47531 -30840 -65486 -136243 -54332 -80496 -17964 26050 -4313 -45734 -169380 -221725 -91296
6157i1296Q1650j98785J08780R9057J2616q2395k7624r1743J09769J67600n3921
$$ -91296 -9646 -208431 -99651 -594 12022 -70373 -97997 -189740 -79971 87629 33708
6146C3708O7527O6232j4807K4910j40904j45370o542o767p453P3485J05086j10342
$$ 33708 101235 167467 152660 177570 36666 -108704 -115246 -122013 -129466 -55981 49105 -61237
6134f1237k1335k6788K3868J33129j2725K1488P416O7962j68273J6196Q7236m8370
$$ -61237 -82572 -109360 -85492 47637 34912 56400 63816 131778 -36495 -20299 66937 18567
6122A8567k4026k0178J15319K5782j23677l5995r731l4092R5086j0236l310q820
$$ 18567 -5459 -25637 89682 115464 -8213 -44208 -53939 -88031 7055 -3181 -6491 -15311
6110a5311R3821J69959r6579l4883q9340R7187J78227J21423P8590J7692K4968
$$ -15311 78510 248469 151890 117007 27667 124854 303081 424504 503094 520786 545754
6099E45754l0739m0947k08654o8891Q6884n1100j45446K0860j30704O3824J2686
$$ 545754 515015 474068 265414 196523 283407 232307 86861 107721 -22983 40841 53527
6088E3527p9509J04956k5215M0730j88635n657N5847R5913M6526l7226k8364J04682
$$ 53527 -25982 78974 53759 94489 -94146 -99803 -43956 51957 98483 61257 32893 137575
6076A37575N6774j34199j41483L8191J01687l6759m9623q6775q0287K3889O162
$$ 137575 194349 60150 -81333 -43142 58545 21786 -27837 -114612 -194899 -171010 -164848
6065a64848k435J73116k3514j90704k1838J21752N5677M995l6482R6380M0026
$$ -164848 -167283 5833 -17681 -208385 -230223 -108471 -52794 -47799 -84281 12099 52125
6054E2125P0358l7016j29829L3344P8882J9785m2081l9246p9941J2468k976l0551
$$ 52125 122483 85467 -44362 -11018 67864 87649 45568 6322 -73619 -61151 -64127 -94678
6042i4678J02535m1703r8740q2893R1526J28807j0268P9551M906q448N7340n0294
$$ -94678 7857 -33846 -132586 -215479 -123953 4854 -5414 74137 79043 70595 127935 77641
6030G7641l4132J3965j03102J10367N1417L7489j50209J02358N5362j67897k6946
$$ 77641 43509 57474 -45628 64739 116156 153645 3436 105794 161156 -6741 -33687
6019c3687P0054q8969m220p3912R1072N84P3543N5040j95407J00216o8737q354
$$ -33687 36367 -52602 -56822 -130734 -39662 -39078 34465 89505 -105902 -5686 -74423 -82777
6007h2777J94365J2912j30348J24658n666q8512L9144o5073r2111J75273j06222
$$ -82777 111588 124500 -5848 118810 113144 24632 63776 -1297 -93408 81865 -24357
5996b4357O782o0835J27199j0799m4104q6847q9516K00334J09929l4548m0076
$$ -24357 -17575 -78410 48789 37990 -6114 -92961 -182477 17857 127786 93238 53162
5985E3162k2731J22251J08730j51483j50329J14001Q6732P9203o9628n9653j6114
$$ 53162 30431 152682 261412 109929 -40400 73601 160333 239536 169908 110255 94141
5974I4141K5640J34638j28988J22231p2660j05487l948j264l6929r7691K19568
$$ 94141 119781 254419 125431 247662 175002 69515 65567 64303 27374 -70317 149251
5963A49251k2505J27528r8118K4233J4528J2851L6947M7647p927j41205n4675
$$ 149251 126746 254274 156156 180389 194917 207768 244715 292362 284435 143230 88555
5952H8555J34765J3099r4643m4060n743l5033Q691J85272j17246m348J7705j14457
$$ 88555 223320 236419 141776 97716 91973 56940 65631 250903 133657 129309 147014 32557
5940C2557M6837q001K0934J0773R401J1050M7756O4442L5523k5818l4404N5453
$$ 32557 79394 71393 92327 103100 112501 123551 171307 235749 271272 245454 211050 266503
5928B66503r353m5009P6895P2880p3852p2212j42800J35614K455n1388j6865k9878
$$ 266503 257150 212141 289036 361916 288064 215852 73052 208666 211121 159733 142868 112990
5916A12990j24982J44022J46945j19153k9770Q7009p5757R9852r7479J36133R3259
$$ 112990 -11992 132030 278975 159822 130052 217061 141304 241156 143677 279810 373069
5905C73069J9462j61872r1658Q4775p5125l6899M3002o4267N7262m4431m7429
$$ 373069 392531 230659 139001 223776 148651 111752 154754 90487 147749 103318 55889
5894E5889K13084K1029J07850m8107r1138M2211P442J36774j9464N9183k08449
$$ 55889 268973 290002 397852 349745 258607 300818 308260 445034 425570 484753 276304
5883B76304l7716J04107l0511M2772P280l1283r4781l629p2763K10296l2446j3011
$$ 276304 238588 342695 312184 354956 362236 330953 236172 232543 159780 370076 337630 324619
5871C24619l6962O626l6540o5553j7757J20330J04375k1398J18892j34891n6764
$$ 324619 287657 294283 257743 192190 174433 294763 399138 377740 496632 361741 304977
5860C04977K09840k0595j99058K9290P0921L6013N9440J11014j78780l5544m5492
$$ 304977 514817 494222 295164 324454 395375 431388 490828 601842 423062 387518 342026
5849C42026q2627L8356O3303P9715N4548j57383n4839N5461O154L6669N7564P4288
$$ 342026 259399 297755 361058 440773 495321 337938 283099 338560 344714 381383 438947 513235
5837E13235m9735N0639J24123J32446p9939o5696J8813m9800J5654J18505r2328
$$ 513235 463500 514139 638262 770708 690769 625073 643886 594086 609740 728245 635917
5826F35917o9893N938l1242p937O2824L1896J993J35616r461m3726J08457K4980
$$ 635917 566024 571962 540720 532783 595607 627503 629496 765112 755651 711925 820382 845362
5814H45362J7368l3675m0612p5192Q4050r0361J56721J01356q96o5349l5609K6847
$$ 845362 862730 829055 788443 713251 797301 706940 863661 965017 964121 898772 863163 890010
5802H90010J54023j06092K7011R011L9824O4778j04855p8911M53l2635n447L8513
$$ 890010 1044033 937941 964952 973963 1013787 1078565 973710 894799 895252 862617 857170 895683
5790H95683J6180N466K1509M7015L5722k6699q779J38291j64360j59353n6954
$$ 895683 911863 917329 938838 985853 1021575 994876 986097 1124388 960028 800675 743721
5779G43721R7330K3810m9441n562J06811m6981P3762O213K6668n4602M7156K897
$$ 743721 841051 864861 815420 809858 916669 869688 943450 949663 976331 921729 968885 971782
5767I71782J3737k3m6635j37564J20746M1625r5909l3069L9165L2611J09051j18097
$$ 971782 985519 985496 938861 801297 922043 963668 867759 834690 873855 906466 1015517 897420
5755H97420j50884J28424r9403k4462j47606J35216P4048j3783Q5549N3481r2916
$$ 897420 746536 874960 775557 751095 603489 738705 812753 798970 884519 938000 845084
5744H45084M6424J45371r2873K3160J33896m8460O2221j4414L6871Q062p3787
$$ 845084 891508 1036879 944006 967166 1101062 1052602 1114823 1100409 1137280 1145342 1071555
5733A071555o4467n964J05319J45998j3004j76885n8053J6943K7450j0693K8622
$$ 1071555 1007088 1001124 1106443 1252441 1239437 1062552 1004499 1021442 1048892 1038199 1066821
5722A066821N020J2943K376J13677Q2009o4122R5350J23326r3540r6600P9362
$$ 1066821 1071841 1084784 1087160 1200837 1282846 1218724 1314074 1437400 1343860 1247260 1326622
5711A326622J26305j84587j0159M1795j218k2842r6316k2839j2931N0846n3196
$$ 1326622 1452927 1268340 1258181 1299976 1298758 1275916 1179600 1156761 1143830 1194676 1141480
5700A141480M3392L7533N902O8412L7872P6744J08629P1115M0256o2297N3908
$$ 1141480 1184872 1222405 1228307 1296719 1334591 1411335 1519964 1591079 1631335 1569038 1622946
5689A622946K4557l194O8206O4528r1622p3004R9377p1109J10334l5805l6050
$$ 1622946 1647503 1644309 1712515 1777043 1685421 1612417 1711794 1640685 1751019 1715214 1679164
5678A679164l7695J5355J52226O592n9280J6244J38901O7410m6219J31289K65493
$$ 1679164 1641469 1656824 1809050 1815642 1756362 1772606 1911507 1978917 1932698 2063987 2329480
5667B329480n9208O6580J35571o5263j15427l79R6862r7604M2555J51510n4829
$$ 2329480 2270272 2336852 2472423 2407160 2291733 2291354 2388216 2290612 2333167 2484677 2429848
5656B429848q511M0967P8250J07023R3396J05692J33438J92760J45485K04544
$$ 2429848 2421337 2462304 2540554 2647577 2740973 2846665 2980103 3172863 3318348 3522892
5646C522892J92246R4824L07520K82539q5593m8716r3918r5105q1915j94186k66621
$$ 3522892 3715138 3809962 4117482 4400021 4314428 4265712 4171794 4076689 3994774 3800588 3533967
5635C533967j9030o3546q5335J2010J464p7407o2490M7650o2509J9925J36065
$$ 3533967 3514937 3451391 3366056 3378066 3379530 3302123 3239633 3287283 3224774 3244699 3380764
5624C380764R5485l0784J93888M0981J22192J867K9664Q3732J68190m4775M9322
$$ 3380764 3476249 3445465 3639353 3680334 3802526 3804393 3834057 3917789 4085979 4041204 4090526
5613D090526J27363j47793P3131j5319K13383N9270J41p4645J24708J25921m5726
$$ 4090526 4217889 4070096 4143227 4127908 4341291 4400561 4400702 4326057 4450765 4576686 4530960
5602D530960J92275N0594J33376J55241J78543J09746K89915R2319P3530L02008
$$ 4530960 4723235 4773829 4907205 5062446 5240989 5350735 5640650 5732969 5806499 6108507
5592F108507k675J08448o8267p1913L2733J15788K43769J40556o7237l6877Q1778
$$ 6108507 6105832 6214280 6146013 6074100 6106833 6222621 6466390 6606946 6539709 6502832 6584610
5581F584610J79189J19132K24326K45349K03181J18055K99827J93173L20443L16810
$$ 6584610 6763799 6882931 7107257 7352606 7555787 7673842 7973669 8166842 8487285 8804095
5571H804095J60649J4591K30913J83489N0337L00875J34367R1582j9385M6895
$$ 8804095 8964744 8979335 9210248 9393737 9444074 9744949 9879316 9970898 9951513 9998408
5561I998408Q6097K96169j666J40807K08428J83517K08749K50568L13290J93520
$$ 9998408 10084505 10380674 10379008 10519815 10728243 10911760 11120509 11371077 11684367 11877887
5551A1877887N37031N95340L88133M88789L92630M93791O60558O40683N54658
$$ 11877887 12414918 13010258 13398391 13887180 14279810 14773601 15434159 16074842 16629500
5542A6629500M44570M48041M63827M74465N44616M99935N62340N83359P60962
$$ 16629500 17074070 17522111 17985938 18460403 19005019 19504954 20067294 20650653 21411615
5533B1411615P74215P66482P25765O04285O74284J001045J122364J407382J466731
$$ 21411615 22185830 22952312 23678077 24282362 24956646 25957691 27080055 28487437 29954168
5524B9954168J549726J951108K062995K309089K747841L201999L498602L785283
$$ 29954168 31503894 33455002 35517997 37827086 40574927 43776926 47275528 51060811
5516E1060811M182030L950835L046872J441576l51001j821879k557296k497847
$$ 51060811 55242841 59193676 62240548 63682124 63331123 61509244 58951948 56454101
5508E6454101j914289j444069j036468n94182l82599l13508j17038M34239J192705
$$ 56454101 54539812 53095743 52059275 51465093 51082494 50768986 50651948 51086187 52278892
5499E2278892J823204K356553K973663L411713M110951M846050N905559O928520
$$ 52278892 54102096 56458649 59432312 62844025 66954976 71801026 77706585 84635105
5491H4635105P688695P407071N566011J789540k807990o485082q361769q439102
$$ 84635105 92323800 99730871 105296882 107086422 104278432 97793350 89431581 80992479
5483H0992479p456100o292016n195205m223087l514924l004759k514168j916572
$$ 80992479 73536379 67244363 62049158 57826071 54311147 51306388 48792220 46875648
5475D6875648j248498p43770m07987K39541R41063J273821J949772K596491L059875
$$ 46875648 45627150 44883380 44475393 44714934 45655997 46929818 48879590 51476081 54535956
5466E4535956L421712L268826K178000K26062k120483m104958n004135m903246
$$ 54535956 57957668 61226494 63404494 63630556 61510073 57405115 52400980 47497734
5458D7497734m457400m050661l380879k901367k570082k438918k290484k098694
$$ 47497734 43040334 38989673 35608794 32707427 30137345 27698427 25407943 23309249
5450B3309249j848318j399241j193820j041156r38399o64849o11701m34918k70828
$$ 23309249 21460931 20061690 18867870 17826714 16888315 16223466 15611765 15176847 14906019
5441A4906019k14056j65156Q7832N4363j8118m9581n5343j99308l22250k80935
$$ 14906019 14691963 14526807 14614639 14669002 14650884 14601303 14545960 14346652 14024402 13743467
5431A3743467j17432j85021k90115l06215j78525k37285l04983j71130k25833
$$ 13743467 13626035 13441014 13150899 12844684 12666159 12428874 12123891 11952761 11726928
5422A1726928k59352k42269k2067M4631L9827J13787K02777K51418J92035L59531
$$ 11726928 11467576 11225307 11203240 11247871 11287698 11401485 11604262 11855680 12047715 12407246
5412A2407246L70062L47739M74324L67632N76235M66338O80927N55938N10340
$$ 12407246 12777308 13125047 13599371 13967003 14543238 15009576 15690503 16246441 16756781
5403A6756781K16886l48515o82709p57817n17543m38768l47331k71035n6302J21625
$$ 16756781 16973667 16625152 15942443 15184626 14667083 14228315 13880984 13609949 13553647 13675272
5393A3675272M196J41284J30818J96648L74583L26519L42212N48582N71370N00316
$$ 13675272 13679468 13820752 13951570 14148218 14522801 14849320 15191532 15740114 16311484 16811800
5383A6811800N15605K94046M21710P04882N69644M99303L70846M46317M77856
$$ 16811800 17327405 17621451 18043161 18748043 19317687 19816990 20187836 20634153 21112009
5374B1112009K54653M83814O43210N30402L13977J66858J05346J14426L55294
$$ 21112009 21366662 21850476 22493686 23024088 23338065 23504923 23610269 23724695 24079989
5365B4079989O65153N41905N18955P59320J111424J319912J377801J601149J810319
$$ 24079989 24745142 25287047 25806002 26565322 27676746 28996658 30374459 31975608 33785927
5356C3785927J948899K110425K437734K244658J908365J103846J85451r25336
$$ 33785927 35734826 37845251 40282985 42527643 44436008 45539854 45725305 44799969
5348D4799969j674332k066480k034747j675588j510410j074257m28122j14075
$$ 44799969 43125637 41059157 39024410 37348822 35838412 34764155 34336033 34221958
5340C4221958K82923O52885P53504J056814J118182J410743J926056K227411K671890
$$ 34221958 34504881 35157766 35911270 36968084 38086266 39497009 41423065 43650476 46322366
5331D6322366L283268L609069M204404M551435M482561L694841K143915n40415
$$ 46322366 49605634 53214703 57419107 61970542 66453103 70147944 72291859 71751444
5323G1751444l027160n013176n569048n234713m842465m200121l562180l037098
$$ 71751444 68724284 63711108 58142060 52907347 48064882 43864761 40302581 37265483
5315C7265483k306382j802865j519220r29118o59414l63415L9280L67828P55268
$$ 37265483 34959101 33156236 31637016 30707898 30048484 29685069 29724349 30092177 30847445
5306C0847445R43156J243773J537051J771743J922922J948243J520182M55447
$$ 30847445 31790601 33034374 34571425 36343168 38266090 40214333 41734515 42189962
5298D2189962o37511j871441k603225k872420k971184k707234k338218j972384
$$ 42189962 41552451 39681010 37077785 34205365 31234181 28526947 26188729 24216345
5290B4216345j871168j795488j394584j219542j076930q74609p06365p38570n43010
$$ 24216345 22345177 20549689 19155105 17935563 16858633 15984024 15277659 14539089 13996079
5281A3996079m63663l28505k94705m28877l29974n1349k70156j28189n4690j01865
$$ 13996079 13532416 13203911 12909206 12480329 12150355 12099006 11828850 11700661 11645971 11544106
5271A1544106j19122n5054o9503o3038n3684k6402Q1372m5532q8051r0722m4217
$$ 11544106 11424984 11369930 11300427 11237389 11183705 11157303 11238675 11193143 11105092 11014370 10970153
5260A0970153J28052o0208n0229j182J02998M0661O4752J24877k1372j02841M6155
$$ 10970153 11098205 11037997 10987768 10986586 11089584 11130245 11194997 11319874 11298502 11195661 11241816
5249A1241816K86110K1611Q6141J47819K23668K4131K6212K08415J50793K15185
$$ 11241816 11527926 11549537 11635678 11783497 12007165 12031296 12057508 12265923 12416716 12631901
5239A2631901J87390J58630K53969J34364J72751K77243K48616K13008L75819
$$ 12631901 12819291 12977921 13231890 13366254 13539005 13816248 14064864 14277872 14653691
5230A4653691L01768K08711K48051L90063L93300L93447L57865M62744N70254
$$ 14653691 14955459 15164170 15412221 15802284 16195584 16589031 16946896 17409640 17979894
5221A7979894N69018N20594M94958O22616Q75396R30307J115666J272801J329378
$$ 17979894 18548912 19069506 19564464 20187080 21062476 21992783 23108449 24381250 25710628
5212B5710628J377973J700724J804450K244177K427291K773086L314011L882061
$$ 25710628 27088601 28789325 30593775 32837952 35265243 38038329 41352340 45234401
5204D5234401M590461N213837N770957N130452K683596m82076k526944l165642
$$ 45234401 49824862 55038699 60809656 65940108 68623704 68141628 65614684 62449042
5196F2449042k565328j609230m45205L17079J441363K245082L157095L081729
$$ 62449042 59883714 58274484 57829279 58146358 59587721 61832803 64989898 68071627
5188F8071627J801530J95199k57357O38834J771142K645750K889685K007992k63852
$$ 68071627 69873157 70068356 69810999 70449833 72220975 74866725 77756410 79764402 79500550
5179G9500550k493300l669911l500737k494143j385641j42134R54023N70513o33663
$$ 79500550 77007250 73337339 69836602 67342459 65956818 65814684 66768707 67339220 66705557
5170F6705557k418280l048105k490066j283245j18030R53620K028598K798735
$$ 66705557 64287277 61239172 58749106 57465861 57347831 58301451 60330049 63128784
5162F3128784L280471K097189q21236m370337o693680o724737n994601n255416
$$ 63128784 66409255 68506444 67685208 63314871 56621191 49896454 43901853 38646437
5154C8646437m284838l596928l039609k632752k419730j927578j689843j436979
$$ 38646437 34361599 30764671 27725062 25092310 22672580 20745002 19055159 17618180
5146A7618180j301254r25722q68469q64328p72668p45188m90197m25671m01851
$$ 17618180 16316926 15391204 14522735 13658407 12885739 12140551 11650354 11224683 10822832
5137A0822832n16729l04565k32248k23698k33712j95802k99840j07940j29058
$$ 10822832 10306103 10001538 9769290 9545592 9311880 9116078 8816238 8708298 8579240
5128H579240k21271j6435j59115l74360k53689q8276k39357j14746k42030j81563
$$ 8579240 8357969 8341534 8182419 7808059 7554370 7466094 7226737 7111991 6869961 6688398
5118F688398k6765j59229M4392n5893j39248q6604k1231j25988j81694M741p2362
$$ 6688398 6661633 6502404 6546796 6490903 6351655 6265051 6243820 6117832 5936138 5940879 5868517
5107E868517j08614J4353j04617J24308K1935j25982j19553j8832o2021L4558
$$ 5868517 5759903 5774256 5669639 5793947 5815882 5689900 5570347 5551515 5489494 5524052
5097E524052l2730j03414j08303K1143J20425K8235j83923j41126n6617R3817
$$ 5524052 5491322 5387908 5279605 5300748 5421173 5449408 5265485 5124359 5067742 5161559
5087E161559J33181Q1254j4691p6441q675j04792L6057L707m1277J65240M0687
$$ 5161559 5294740 5375994 5361303 5284862 5276187 5171395 5207452 5211159 5169882 5335122 5375809
5076E375809m3957J14525j9948j16213K7256O1554M1301K741m8813K6443J33621
$$ 5375809 5331852 5446377 5426429 5310216 5337472 5399026 5440327 5443068 5394255 5420698 5554319
5065E554319J1920j53558j1996m7502j8913N0802J10123Q7471o6915l3190L561
$$ 5554319 5566239 5412681 5400685 5353183 5334270 5385072 5495195 5582666 5515751 5482561 5486122
5054E486122O6868J32437J23512R8690j23174J11982J21738J46013Q2489K3398
$$ 5486122 5552990 5685427 5808939 5907629 5784455 5896437 6018175 6164188 6246677 6270075
5044F270075J21084J43192J03009R6166n5643k0722J05070J65150J05388J9565
$$ 6270075 6391159 6534351 6637360 6733526 6677883 6657161 6762231 6927381 7032769 7052334
5034G052334J7304K5156L2347j0850J55952K37227j3859J20833K12858Q0720K20394
$$ 7052334 7069638 7094794 7127141 7116291 7272243 7509470 7495611 7616444 7829302 7910022 8130416
5023H130416M5331J56700K85943J67428K87525J61773J92705J95739J98855J98371
$$ 8130416 8175747 8332447 8618390 8785818 9073343 9235116 9427821 9623560 9822415 10020786
5013A0020786O9282J21021Q6708k2912J56471J80970J04147j9454J80629J18134
$$ 10020786 10090068 10211089 10297797 10274885 10431356 10612326 10716473 10697019 10877648 10995782
5003A0995782J72815J99953J78311K94106J56088L39980M54441L83592M02596
$$ 10995782 11168597 11368550 11546861 11840967 11997055 12337035 12791476 13175068 13577664
4994A3577664N10807K35138L56916M49222L81536L69780L79837K65774K47229
$$ 13577664 14088471 14323609 14680525 15129747 15511283 15881063 16260900 16526674 16773903
4985A6773903L93161L73350L38909O05477N54357N43183Q13589Q51029J027116
$$ 16773903 17167064 17540414 17879323 18484800 19039157 19582340 20395929 21246958 22274074
4976B2274074J346831J678599J610456J800991K219580K406974K646487K916440
$$ 22274074 23620905 25299504 26909960 28710951 30930531 33337505 35983992 38900432
4968C8900432K884078K871026L092848L610373M067133M664568M680515L905328
$$ 38900432 41784510 44655536 47748384 51358757 55425890 60090458 64770973 68676301
4960F8676301K303224k65409k829727m086927m160049l839604l226224k456697
$$ 68676301 70979525 70714116 67884389 63797462 59637413 55797809 52571585 50114888
4952E0114888j632790q74562k62555L50961J147448J780918K546323L286822L832891
$$ 50114888 48482098 47607536 47344981 47695942 48843390 50624308 53170631 56457453 60290344
4943F0290344M243356M800881N037519N600386O558286P592466P882324O465610
$$ 60290344 64533700 69334581 74372100 79972486 86530772 94123238 102005562 108471172
4935A08471172L057540k138275o655987r089780r647538q859735p698014o499532
$$ 108471172 111528712 109390437 102734450 93644670 83997132 75137397 67439383 60939851
4927F0939851n650732m517136l498105k833561k102881j317292n93108j73206
$$ 60939851 55289119 50771983 47273878 44440317 42337436 41020144 40427036 40253830
4919D0253830K53434P60027J300006J799840K267606K622643K672901K753622
$$ 40253830 40507264 41267291 42567297 44367137 46634743 49257386 51930287 54683909
4911E4683909K137031R11162j202476l208877m443097m733204m292806l966727
$$ 54683909 56820940 57732102 56529626 53320749 48877652 44144448 39851642 35884915
4903C5884915l695310l146747k652495k513521k019242j851324j531464j254570
$$ 35884915 32189605 29042858 26390363 23876842 21857600 20006276 18474812 17220242
4895A7220242r98261r10461p21998n90408l86253k51848j42554O2457j58436j22282
$$ 17220242 16221981 15311520 14589522 13999114 13612861 13361013 13218459 13280916 13122480 13000198
4885A3000198r2235j89323j24260l79964k75692j13646k61561l63192l92734j47630
$$ 13000198 12907963 12718640 12594380 12214416 11938724 11825078 11563517 11200325 10807591 10659961
4875A0659961l33160j81500j72449k02632j55062m3368j02676R9371K01926R5014
$$ 10659961 10326801 10145301 9972852 9770220 9615158 9571790 9469114 9568485 9770411 9865425
4865I865425J56601N08704J33124L00339M76944M28982M65163M2639j69608k33616
$$ 9865425 10022026 10530730 10663854 10964193 11441137 11870119 12335282 12377921 12208313 11974697
4855A1974697j27172j82517j29031j08834k15391j11078j8075q3567j9266j04571
$$ 11974697 11847525 11665008 11535977 11427143 11211752 11100674 11082599 10999032 10979766 10875195
4845A0875195J51350L33572L32597K77981L31819J24715J99469K25716L36642
$$ 10875195 11026545 11360117 11692714 11970695 12302514 12427229 12626698 12852414 13189056
4836A3189056K62175L87114M26543M70439M06524K82193K83484J19536j07264
$$ 13189056 13451231 13838345 14264888 14735327 15141851 15424044 15707528 15827064 15719800
4827A5719800j00368k05162k64958j35845r0250P372k1932j05075k7465P5607
$$ 15719800 15619432 15414270 15149312 15013467 14923217 14930589 14908657 14803582 14776117 14851724
4817A4851724m1267L5762K51576J85476K76625L20992K32080L70392L47625L75418
$$ 14851724 14810457 14846219 15097795 15283271 15559896 15880888 16112968 16483360 16830985 17206403
4807A7206403M32394L24640J54256J09547K43662R5889m4268l09523k95980k26428
$$ 17206403 17638797 17963437 18117693 18227240 18470902 18566791 18522523 18213000 17917020 17690592
4797A7690592j96285O41L03268K61930L51360Q37140Q74454R38354J046817J340925
$$ 17690592 17494307 17494948 17798216 18060146 18411506 19248646 20123100 21061454 22108271 23449196
4787B3449196J272987J409437J511442J480575J926528K076599K476804K646579
$$ 23449196 24722183 26131620 27643062 29123637 31050165 33126764 35603568 38250147
4779C8250147K762969L008746K654087J872749O21136j007913k042022k548952
$$ 38250147 41013116 44021862 46675949 48548698 49169834 48161921 46119899 43570947
4771D3570947k609174k362531j936929j448576j057940n74479j49907K58182N88212
$$ 43570947 40961773 38599242 36662313 35213737 34155797 33581318 33431411 33689593 34277805
4762C4277805R40942J257075J629035K286078K571382K740837L440020L957529
$$ 34277805 35218747 36475822 38104857 40390935 42962317 45703154 49143174 53100703
4754E3100703M620438N237547N642920N397004L860087P03443k752038m904070
$$ 53100703 57721141 62958688 68601608 73998612 77858699 78562142 75810104 70906034
4746G0906034n945487n607544n194904m816634l961616l355901k762270k298731
$$ 70906034 64960547 59353003 54158099 49341465 45379849 42023948 39261678 36962947
4738C6962947j838096j432071j035980n89028k44171j83274K60055O75748R28807
$$ 36962947 35124851 33692780 32656800 32067772 31823601 31640327 31900382 32576130 33504937
4729C3504937J291477J456503J949875K049771J668923J434052K92914q93238
$$ 33504937 34796414 36252917 38202792 40252563 41921486 43355538 43648452 42755214
4721D2755214j998231k676106k689383k401551k320487k211296k039274j591844
$$ 42755214 40756983 38080877 35391494 32989943 30669456 28458160 26418886 24827042
4713B4827042j412774j314149r76271r44585q25463p50919o51113l69255k34379
$$ 24827042 23414268 22100119 21123848 20179263 19353800 18602881 17951768 17582513 17348134
4704A7348134j79735j46297K6189Q330L6335R4656J84796K17435K77229K25962
$$ 17348134 17168399 17022102 17048291 17056621 17092956 17187612 17372408 17589843 17867072 18093034
4694A8093034K79517L12848J54908K3039R0476R0231p6580J19356K31078K10066
$$ 18093034 18372551 18685399 18840307 18863346 18953822 19044053 18967473 19086829 19317907 19527973
4684A9527973J09699p4927N0098Q5282J91968K53594L17328M53442M95882P73343
$$ 19527973 19637672 19562745 19612843 19698125 19890093 20143687 20461015 20914457 21410339 22183682
4674B2183682O94104N76247Q17795Q07331R76924J053495R84682J290404J336781
$$ 22183682 22877786 23454033 24271828 25079159 26056083 27109578 28094260 29384664 30721445
4665C0721445J840864J857296K004588J967008K029119K125955K431065K665685
$$ 30721445 32562309 34419605 36424193 38391201 40420320 42546275 44977340 47643025
4657D7643025L054401L868789M629005N434603O109151N560192L671596M87004
$$ 47643025 50697426 54566215 59195220 64629823 70738974 76299166 79970762 80457766
4649H0457766k326333l355418l007881k125412j004850L04018J373052K435217
$$ 80457766 78131433 74776015 71768134 69642722 68637872 68941890 70314942 72750159
4641G2750159K889216J933070L97400q42204j099228l90484M32016J494632K343829
$$ 72750159 75639375 77572445 77969845 77127641 76028413 75637929 76069945 77564577 79908406
4632G9908406K550517J515481o14380k592191l564632l225526k066189j075901
$$ 79908406 82458923 83974404 83360024 80767833 77203201 73977675 71911486 70835585
4624G0835585n97576r08837j950234k938100l412705k849191j684622p32749K61642
$$ 70835585 70238009 69329172 67378938 64440838 61028133 58178942 56494320 55761571 56023213
4615E6023213J224795K073280K496019J997510k35176k999772n009767n700060
$$ 56023213 57248008 59321288 61817307 63814817 63579641 60579869 55570102 49870042
4607D9870042n304744m409943l826588l295209k560675k241908j918282j672609
$$ 49870042 44565298 40155355 36328767 33033558 30472883 28230975 26312693 24640084
4599B4640084j211078r05382n29148l47759l46276o09374q32989q07546p53359
$$ 24640084 23429006 22523624 21994476 21646717 21300441 20691067 19858078 19050532 18297173
4590A8297173q95305r88647j009675r24890o14508m51003m02428l08086k67961
$$ 18297173 17401868 16413221 15403546 14478656 13864148 13413145 13010717 12702631 12434670
4581A2434670k57728L1194Q0886p856J77893L09662K60238J63824O4675J8718
$$ 12434670 12176942 12208136 12289022 12281166 12459059 12768721 13028959 13192783 13257458 13276176
4571A3276176m2540p1102k75658m93611o77575n87188n11713m24652k70819j82167
$$ 13276176 13233636 13162534 12886876 12393265 11715690 11128502 10616789 10192137 9921318 9739151
4561I739151l42468j25636k1229k82709l01852n1797o7570l1106j4570l0735p4350
$$ 9739151 9396683 9271047 9249818 8967109 8665257 8613460 8545890 8514784 8500214 8469479 8395129
4550H395129J33286J7671n6712M2561m990l34521m04112k06942j68971j55942
$$ 8395129 8528415 8546086 8489374 8531935 8526945 8192424 7788312 7581370 7412399 7256457
4540G256457R1872l6923j64206k57307k82747j52537p9793O6713o0001M7453j23417
$$ 7256457 7348329 7311406 7147200 6889893 6607146 6454609 6374816 6441529 6381528 6428981 6305564
4529F305564n4492m7872j09419j72112j67097r688o0659o1379J05026r8222m5642
$$ 6305564 6251072 6203200 6093781 5921669 5754572 5744884 5684225 5622846 5727872 5629650 5584008
4518E584008j44888o3126j56713r8413j3546M2169l9364p0636j7714p3651Q3280
$$ 5584008 5439120 5375994 5219281 5120868 5107322 5149491 5110127 5039491 5021777 4948126 5031406
4507E031406n6502J00390L2935p2696K377K3952r3474O5760J07652K07987Q8010
$$ 5031406 4974904 5075294 5108229 5035533 5037910 5061862 4968388 5034148 5141800 5349787 5437797
4496E437797q1812j2009m0116J11718r312j8118O285L7141Q0747J06252K548J55779
$$ 5437797 5355985 5343976 5303860 5415578 5406266 5388148 5394433 5431574 5512321 5618573 5621121 5776900
4484E776900L69200K43127L07763K28880K57472J97683K66049K39302J98198K08833
$$ 5776900 6146100 6389227 6696990 6925870 7183342 7381025 7647074 7886376 8084574 8293407
4474H293407J80031N3044j47454O8025j0084j856K03596k534J33362J65764L830
$$ 8293407 8473438 8526482 8379028 8447053 8436969 8435113 8638709 8636175 8769537 8935301 8939131
4463H939131J22822p2250P7030Q0847L25128L86062L07349M44482M31802M78122
$$ 8939131 9061953 8989703 9066733 9147580 9472708 9858770 10166119 10610601 11042403 11520525
4453A1520525O68165Q24548J056999J027704J183459P86011j2523o20819j193836
$$ 11520525 12188690 13013238 14070237 15097941 16281400 17067411 17054888 16434069 15240233
4444A5240233j409568j278434j099054r28144p43199p18847m92673m07156l16046
$$ 15240233 13830665 12552231 11453177 10525033 9781834 9062987 8570314 8163158 7847112
4435G847112l20801r7137k1680M5411j6889J60197P9617J73358K11391K05408
$$ 7847112 7526311 7429174 7407494 7452905 7436016 7596213 7675830 7849188 8060579 8265987
4425H265987M35631L95890K74413N70214M76051K63527P74064J063026J083984
$$ 8265987 8701618 9097508 9371921 9942135 10418186 10681713 11455777 12518803 13602787
4416A3602787J174055J045077M54861l55939j174326j354898j261731j070556
$$ 13602787 14776842 15821919 16276780 15920841 14746515 13391617 12129886 11059330
4408A1059330q82835q13538o38734l31710m92479k56433j50780k62249l3880p7944
$$ 11059330 10176495 9362957 8724223 8392513 7900034 7643601 7492821 7230572 7196692 7118748
4398G118748l221J01281J29121L52180L94534L33278L39572O19815N09796M64194
$$ 7118748 7115527 7216808 7345929 7698109 8092643 8425921 8765493 9385308 9895104 10359298
4388A0359298M32088M71097Q95608J104032J114421J218933Q49435j18270r28710
$$ 10359298 10791386 11262483 12158091 13262123 14376544 15595477 16444912 16326642 15397932
4379A5397932j459849j504243j282980j050301r94280p29935o80329n96674n58742
$$ 15397932 13938083 12433840 11150860 10100559 9106279 8376344 7696015 7099341 6540599
4370F540599m47979l71539j49791j42279j21362l818q004N7460J81049J93438
$$ 6540599 6092620 5721081 5571290 5429011 5307649 5303831 5295827 5353287 5534336 5727774
4360E727774J08130K72347L43533K99586K90850M48075M13115L26600M52968L79366
$$ 5727774 5835904 6108251 6451784 6751370 7042220 7490295 7903410 8230010 8682978 9062344
4350I062344J94792j08837m54879n35694l98072n40383l86129k92115k57178j80518
$$ 9062344 9257136 9148299 8693420 8157726 7759654 7219271 6833142 6541027 6283849 6103331
4340F103331k17742k86837l28547l4251j70095j79680k9657n0520o525k3815n1364
$$ 6103331 5885589 5598752 5270205 5235954 5065859 4886179 4856522 4806002 4799477 4775662 4724298
4329D724298l7892j61609m0960J09487N1709o3783o1114n4417J4407o8272l6988
$$ 4724298 4686406 4524797 4483837 4593324 4645033 4581250 4520136 4465719 4480126 4411854 4374866
4318D374866L07192J36387K4l3612J78238K32102J35846L60942J65538N1056J29942
$$ 4374866 4682058 4818445 4818469 4784857 4963095 5195197 5331043 5691985 5857523 5908579 6038521
4307F038521q4936J9471p0909k07718j92384j70367j58221j48052j56792j83260
$$ 6038521 5953585 5973056 5902147 5694429 5502045 5331678 5173457 5025405 4868613 4685353
4297D685353l5023q8764j34246J2290J4345o5644M5120j2391P9997m3549j195
$$ 4685353 4650330 4561566 4427320 4439610 4453955 4388311 4433431 4421040 4501037 4457488 4456293
4286D456293Q3624K02090J51417N5206N98O1965n804N6751J61590J52476j19361
$$ 4456293 4539917 4742007 4893424 4948630 4949228 5011193 5005389 5062140 5223730 5376206 5256845
4275E256845J5604J85307o7778j07366j94022k48185k32552N2910l2400k30023
$$ 5256845 5272449 5457756 5389978 5282612 5088590 4840405 4607853 4660763 4628363 4398340
4265D398340M9293j5189K5737J34103K267p200O2627L6612J07208N1666L7885
$$ 4398340 4447633 4432444 4458181 4592284 4594551 4587351 4649978 4686590 4793798 4845464 4883349
4254D883349j15543L817p2708l2684J69541l2546Q4387p7407p6258j8243N6727
$$ 4883349 4767806 4771623 4698915 4666231 4835772 4803226 4887613 4810206 4733948 4715705 4772432
4243D772432J00773K24766K09843j878M227J05705O2279J85336M4162K1052L3169
$$ 4772432 4873205 5097971 5307814 5305936 5310163 5415868 5478147 5663483 5707645 5728697 5761866
4232E761866J06561J20306j01742p3005l3061P154j21332N8741O1029K291M0015
$$ 5761866 5868427 5988733 5886991 5813986 5780925 5788079 5666747 5725488 5786517 5788808 5828823
4221E828823J3192J88812K02425K34361K73768L19570L83457M69477M89797N45060
$$ 5828823 5842015 6030827 6233252 6467613 6741381 7060951 7444408 7913885 8403682 8948742
4211H948742L78261N44864N48383N71052N46480Q02761R38975J147580R15783
$$ 8948742 9327003 9871867 10420250 10991302 11537782 12340543 13279518 14427098 15342881
4202A5342881K17330p51910j064500p82686m33456k97290k71584j54109k18841
$$ 15342881 15560211 14808301 13743801 12961115 12527659 12230369 11958785 11804676 11585835
4193A1585835j09236J20374K11683J30567K83252M28457N80267P10456P47404
$$ 11585835 11476599 11596973 11808656 11939223 12222475 12650932 13231199 13941655 14689059
4184A4689059Q65899J044303J243061P52000m09048j247421j188343q67912p05832
$$ 14689059 15554958 16599261 17842322 18594322 18185274 16937853 15749510 14881598 14175766
4175A4175766m88368m90148k77757k78850j25907j187j02934J4116Q6387Q9648
$$ 14175766 13687398 13197250 12919493 12640643 12514736 12513549 12410615 12424731 12511118 12600766
4165A2600766j173Q0879P2259J28748L11964L4462N0673J49741R4064L0719K5817
$$ 12600766 12599593 12680472 12752731 12881479 13193443 13227905 13278578 13428319 13522383 13553102 13578919
4154A3578919Q9702J606J8304K82514Q9217P9447K75474L70418K91092M43811
$$ 13578919 13668621 13670227 13688531 13971045 14060262 14139709 14415183 14785601 15076693 15520504
4144A5520504N84531N42168N38409P47870O63266M38142P43618N73910M12302
$$ 15520504 16105035 16647203 17185612 17933482 18596748 19034890 19778508 20352418 20764720
4135B0764720M98579L39439K70275R1302J42294K45342J33481L7233J10583K86329
$$ 20764720 21263299 21602738 21873013 21964315 22106609 22351951 22485432 22522665 22633248 22919577
4125B2919577N16930K55944L71420M94278N07046O47434P74987Q36597Q45558
$$ 22919577 23436507 23692451 24063871 24558149 25065195 25712629 26487616 27324213 28169771
4116B8169771Q34587R79509R79711R78406Q71066Q26425P62937R13072P97536
$$ 28169771 29004358 29983867 30963578 31941984 32813050 33639475 34402412 35315484 36113020
4107C6113020Q46845R75056J083937J291956J446256J563667J664154J901756
$$ 36113020 36959865 37934921 39018858 40310814 41757070 43320737 44984891 46886647
4099D6886647K123008K705471L288685L871497M617843N463790O561958P341731
$$ 46886647 49009655 51715126 55003811 58875308 63493151 68956941 75518899 82860630
4091H2860630Q193205R081933R969751J1192977J3219144J6176175J9973722K4365999
$$ 82860630 91053835 100135768 110105519 121298496 134517640 150693815 170667537 195033536
4083A95033536K9531835L0257951K0784178M607783j3747726k7768744l3359894
$$ 195033536 224565371 254823322 275607500 280215283 266467557 238698813 205338919
4076B05338919k9659700k3690002j9138985j5584291j2688554j0288624q457282
$$ 205338919 175679219 151989217 132850232 117265941 104577387 94288763 85831481
4069H5831481p219486o066251m947578l941386l088822k149130j200786o46028
$$ 85831481 78611995 72545744 67598166 63656780 60567958 58418828 57218042 56572014
4061E6572014M8769R13309J737767K428131L178681M088892N186091N899140O690982
$$ 56572014 56620783 57534092 59271859 61699990 64878671 68967563 74153654 80052794 86743776
4052H6743776P704258Q592332R639532J1244665J3470508J6683533K0392812K4790404
$$ 86743776 94448034 103040366 112679898 123924563 137395071 154078604 174471416 199261820
4044A99261820K8567854K1887434N464548m033032j2586693k7166435l2849141
$$ 199261820 227829674 249717108 255181656 251148624 238561931 211395496 178546355
4037A78546355k7681904k2149346j7939474j4499104j2099351j0115587q514113
$$ 178546355 150864451 128715105 110775631 96276527 84177176 74061589 65547476
4030F5547476p054628n842790n046698m471351l683689k983511k467362j952433
$$ 65547476 58492848 52650058 47603360 43132009 39448320 36464809 33997447 32045014
4022C2045014j522835j281564j004854q05616p01431m38970l45773k31389k31053
$$ 32045014 30522179 29240615 28235761 27430145 26728714 26289744 25943971 25712582 25481529
4013B5481529j03872K8728j83681j15842j43894k28697r2566J81178K04237P32619
$$ 25481529 25377657 25406385 25222704 25106862 24962968 24734271 24641705 24822883 25027120 25759739
4003B5759739O94939j84955j331144j537617j113474n39012o49515m74811j48974
$$ 25759739 26454678 26269723 24938579 23400962 22287488 21748476 21098961 20624150 20475176
3994B0475176J45361M81513N68934O45374P40297J080396J287632J749791K261306
$$ 20475176 20620537 21102050 21670984 22316358 23056655 24137051 25424683 27174474 29435780
3985B9435780K745597L354112M004648L174813n91863m600862n389789m268303
$$ 29435780 32181377 35535489 39540137 42714950 42123087 37522225 32132436 27864133
3977B7864133l583250k884487k382174k035699j639112j263933q94369p92572
$$ 27864133 24280883 21396396 19014222 16978523 15339411 14075478 13181109 12388537
3969A2388537o71122n13121l85803m85242k92421k50715j63128l25718j44638
$$ 12388537 11717415 11204294 10818491 10333249 10040828 9790113 9626985 9301267 9156629
3960I156629k36917k58771k32441k32299j32703k65062k10566j20410j97470R960
$$ 9156629 8919712 8660941 8428500 8196201 8063498 7798436 7587870 7467460 7269990 7279950
3950G279950r9699j61663M1689j8600j15547L8630J7570M3520J66561L5879K6953
$$ 7279950 7180251 7018588 7060277 7041677 6926130 6964760 6982330 7025850 7192411 7228290 7255243
3939G255243J0988J6213K2261j24068J367l4803j03078j85795q4713J90253J84284
$$ 7255243 7266231 7282444 7304705 7180637 7182004 7147201 7044123 6858328 6773615 6963868 7148152
3928G148152L9516K89288L15533L80024N84400P41701K14093m00898o02257m47300
$$ 7148152 7187668 7476956 7792489 8172513 8756913 9498614 9712707 9311809 8709552 8262252
3918H262252l56585l34628k01851j72398p7111j76403n7036j59478k91039l0881
$$ 8262252 7905667 7571039 7369188 7196790 7119679 6943276 6886240 6726762 6435723 6404842
3908F404842k18548p3777p2835m2949m5846o4310M1141k5547L24836J88426Q6958
$$ 6404842 6186294 6112517 6039682 5996733 5950887 5886577 5927718 5902171 6227007 6415433 6502391
3897F502391J51371L08969L31506J34746J00252J87013J12574J75568J28116J16028
$$ 6502391 6653762 6962731 7294237 7428983 7529235 7716248 7828822 8004390 8132506 8248534
3887H248534P1033j08949K3458J02363O7985J31484L5667j9443l6624P8807K28101
$$ 8248534 8319567 8210618 8234076 8336439 8404424 8535908 8571575 8552132 8515508 8594315 8822416
3876H822416J33685J60427K16079K43485L14553L11320J28935L30035L14513K6481
$$ 8822416 8956101 9116528 9332607 9576092 9890645 10201965 10330900 10660935 10975448 11001929
3866A1001929J62462P7190K3812J26386o5385j48400q3192j09959J34842q2900
$$ 11001929 11164391 11241581 11265393 11391779 11326394 11177994 11094802 10984843 11119685 11036785
3856A1036785J10495K44169K34163K70526L73663L48796M79256O26694O83907
$$ 11036785 11147280 11391449 11625612 11896138 12269801 12618597 13097853 13724547 14408454
3847A4408454N90593N60880M78570M26832J28837K48291K13401K26670M9420J00506
$$ 14408454 14999047 15559927 16038497 16465329 16594166 16842457 17055858 17282528 17331948 17432454
3837A7432454l1250P0733J23313Q5874R5254K4083K85829N12598M28892N76203
$$ 17432454 17401204 17471937 17595250 17681124 17776378 17800461 18086290 18598888 19027780 19603983
3827A9603983Q64406O91935J003435J124676R28093J070994J075335R77884R13100
$$ 19603983 20468389 21160324 22163759 23288435 24216528 25287522 26362857 27340741 28253841
3818B8253841R50820P09272O18549Q20054P48839P07176P53681R56921J100258
$$ 28253841 29204661 29913933 30532482 31352536 32101375 32808551 33562232 34519153 35619411
3809C5619411J292630J682503K027649K684415L468878M307372N034596N973740
$$ 35619411 36912041 38594544 40622193 43306608 46775486 51082858 56117454 62091194
3801F2091194P028681Q183125R440508J0316528J1220101J2583374J4297434J7325270
$$ 62091194 69119875 77303000 86743508 97060036 108280137 120863511 135160945 152486215
3793A52486215K1830717K7284007L2749903L7814104M2866104K4058078j9829746
$$ 152486215 174316932 201600939 234350842 272164946 315031050 339089128 319259382
3786C19259382m8538049m5945499l6005196k9606852k4554158k0218684j6476134
$$ 319259382 270721333 224775834 188770638 159163786 134609628 114390944 97914810
3779I7914810j3208148j0778119r325817q055040o882552n333777m423531l609173
$$ 97914810 84706662 73928543 64602726 56547686 49665134 44331357 39907826 36298653
3771C6298653k931972k281375j866928j437863j111262j047345r55114j034137
$$ 36298653 33366681 31085306 29218378 27780515 26669253 25621908 24666794 23632657
3763B3632657r82811q15799q61673p86447q14196p73351p20499q20714r83540
$$ 23632657 22649846 21834047 20972374 20185927 19371731 18598380 17877881 17057167 16073627
3754A6073627r11371r23942j014015r90823p83353o95901o15461m79112m25762
$$ 16073627 15162256 14238314 13224299 12233476 11450123 10754222 10138761 9659649 9233887
3745I233887l69350k60964j17612J28704J70405m3136o6890J39037J96926o3434
$$ 9233887 8864537 8603573 8485961 8614665 8785070 8741934 8675044 8814081 9011007 8947573
3735H947573P5374o9483j30102J09365j92305j31639o0571k21771l65913j98745
$$ 8947573 9022947 8953464 8823362 8932727 8740422 8608783 8548212 8326441 7960528 7761783
3725G761783m55133n95742n11909l55193l64909j73594q3916p5214n6105O449
$$ 7761783 7306650 6710908 6198999 5843806 5478897 5305303 5221387 5146173 5090068 5096517
3715E096517J0410p5533R7753m3085R719R8909k74126k43621j64591j98001l00159
$$ 5096517 5106927 5031394 5129147 5086062 5095781 5194690 4920564 4676943 4512352 4314351 4014192
3704D014192j84763j87031k20305j65390k05120j30147j69207P0441k208P5721
$$ 4014192 3829429 3642398 3422093 3256703 3051583 2921436 2752229 2822670 2820462 2896183
3694B896183o4764J49301J88010j581L883r5477J72087N36k2346m843Q3139j93286
$$ 2896183 2831419 2980720 3168730 3167149 3171032 3075555 3247642 3248178 3225832 3220989 3304128 3110842
3682C110842k31322j19106n5782o0188j29968K7678m4676p5092J2600J40806K03944
$$ 3110842 2879520 2760414 2704632 2644444 2514476 2542154 2497478 2422386 2434986 2575792 2779736
3671B779736K8374Q2365R4887o0288m2717k23074Q3447J44547o7838j47888q1476
$$ 2779736 2808110 2890475 2985362 2925074 2882357 2659283 2742730 2887277 2819439 2671551 2590075
3660B590075J6562j78967k15595j64950j0208j8761j6743p3844j95692k7527O2788
$$ 2590075 2606637 2427670 2212075 2047125 2036917 2018156 2001413 1927569 1731877 1704350 1767138
3649A767138j3393J33006q588P1481J81406N3839q1975j43459N9075o7449J4314
$$ 1767138 1753745 1886751 1878163 1949644 2131050 2184889 2102914 1959455 2018530 1951081 1965395
3638A965395N8744n1737O325j14058j90285j36147k09769q6632j29521o1503j13105
$$ 1965395 2024139 1972402 1978727 1864669 1674384 1538237 1328468 1241836 1112315 1050812 937707
3627I37707j95097j02971k3786Q1161J25631K07355J25314o956j01267J95486
$$ 937707 742610 639639 615853 697014 822645 1030000 1155314 1148358 1047091 1242577
3617A242577J09432J19028P9847R9669Q5061n0495k7865m0504j93943k96j16012
$$ 1242577 1352009 1471037 1550884 1650553 1735614 1685119 1657254 1616750 1422807 1422511 1306499
3606A306499j26676J56835j60775L1492k0256J65488L1580n3439Q084k6485J38881
$$ 1306499 1179823 1336658 1175883 1207375 1187119 1352607 1384187 1330748 1338832 1312347 1451228
3595A451228K06578k1835P1546m3123K0537Q693p6566r1800j09106m6950k2323
$$ 1451228 1657806 1635971 1707517 1664394 1684931 1693624 1617058 1525258 1416152 1369202 1346879
3584A346879r9050r5666j02666k0688R803j45645R2612P6401j20659P6751J27590
$$ 1346879 1247829 1152163 1049497 1028809 1038612 892967 985579 1061980 941321 1018072 1145662
3573A145662L822J18803l8083O2677J67869J34419M2644j4072J40502K521q7838
$$ 1145662 1149484 1268287 1230204 1292881 1460750 1595169 1637813 1623741 1764243 1766764 1678926
3562A678926p1788q3669n9989j7817j31175n399N33j97347j7529k1755K0704m2740
$$ 1678926 1607138 1523469 1463480 1445663 1314488 1309089 1309622 1112275 1094746 1072991 1093695 1050955
3550A050955J00974R8801Q8361o1267k7233p347N3554J34379Q2792P9521P7504
$$ 1050955 1151929 1250730 1339091 1277824 1250591 1243244 1296798 1431177 1513969 1593490 1670994
3539A670994P6407j23951j21416q0247j4957N9406j43824J18512Q3095J6726L5274
$$ 1670994 1747401 1623450 1502034 1421787 1406830 1466236 1322412 1440924 1524019 1540745 1576019
3528A576019r4136L5324M794k8860m2967P8781K00999J73411K2871M5439P4871
$$ 1576019 1481883 1517207 1522001 1493141 1450174 1528955 1729954 1903365 1926236 1971675 2046546
3517B046546o455J27670J65519J41108J08334J09360P0021J61106J85287L4296
$$ 2046546 2040091 2167761 2333280 2474388 2582722 2692082 2762103 2923209 3108496 3142792
3507C142792k75806k78846k21834j99042M683p5273j87718J1103J3382J9452L742
$$ 3142792 2866986 2588140 2366306 2167264 2171947 2096674 1908956 1920059 1933441 1952893 1956635
3496A956635k8235J12813l4185q8248j82761J07874k3688K8938k04609k1001J17761
$$ 1956635 1928400 2041213 2007028 1918780 1736019 1843893 1820205 1849143 1644534 1623533 1741294
3485A741294j7282l0457J5403k196J7136N1821R6729O1104Q9733K96199L0178
$$ 1741294 1724012 1693555 1708958 1706762 1723898 1775719 1872448 1933552 2023285 2319484 2349662
3474B349662J17010L34021L14073J56975j96382j16010j30814k99827r0485j94804
$$ 2349662 2466672 2800693 3114766 3271741 3075359 2959349 2828535 2528708 2438223 2243419
3464B243419j94391m5781R3559L9551j17204N5426j2146l7460J24599K57836J36525
$$ 2243419 2049028 2003247 2096806 2136357 2019153 2074579 2062433 2024973 2149572 2407408 2543933
3453B543933K99602J89716Q5903j39219k97502Q4500j00535j39277k64903m3120
$$ 2543933 2843535 3033251 3119154 2979935 2682433 2766933 2666398 2527121 2262218 2219098
3443B219098j28376l5606j64285o1685j15847j07717j25966o2374L5093j90724
$$ 2219098 2090722 2055116 1890831 1829146 1713299 1605582 1479616 1417242 1452335 1261611
3433A261611p0825J08042J01491L320q119M7260L7791j933K9177J60473J09553
$$ 1261611 1190786 1298828 1400319 1403639 1395520 1442780 1480571 1478638 1507815 1668288 1777841
3422A777841Q4398R916m1547P8211J36666N4228j8300q781O4529M4511N5050Q7407
$$ 1777841 1862239 1872155 1830608 1908819 2045485 2099713 2081413 2072632 2137161 2181672 2236722 2324129
3410B324129P9753K02409L11614J85050L91608N49913P2160l24113n23850k68980
$$ 2324129 2403882 2606291 2917905 3102955 3494563 4044476 4116636 3792523 3268673 2999693
3400B999693l51767j72576k80201j35387L5290j20932j55324k21665m3488k7450
$$ 2999693 2647926 2475350 2195149 2059762 2095052 1974120 1818796 1597131 1553643 1526193
3390A526193j3653K7983j37065o7982o7958j03711M9533L0871j88129J1107J58510
$$ 1526193 1512540 1540523 1403458 1335476 1267518 1163807 1213340 1244211 1056082 1067189 1225699
3379A225699Q4328J7564J5794l3549q2448K7039Q7519J3197j36800M7814P5992
$$ 1225699 1310027 1327591 1343385 1309836 1227388 1254427 1341946 1355143 1218343 1266157 1342149
3368A342149k0627J03068j40027j88963J8535Q047M6204m8163N6707K33398r0086
$$ 1342149 1321522 1424590 1284563 1095600 1114135 1122182 1168386 1120223 1176930 1410328 1320242
3357A320242L1025Q6644m7579K8002J17609l9660P976J66494q6213J9468J00467
$$ 1320242 1351267 1437911 1390332 1418334 1535943 1496283 1504259 1670753 1584540 1604008 1704475
3346A704475n1414l2915k6892M6189K724j49923N4907J32451P1031O6827N3872
$$ 1704475 1653061 1620146 1593254 1639443 1642167 1492244 1547151 1679602 1750633 1817460 1871332
3335A871332P0537K8410L7484k1918j5330m2018k13559J98298J12642M5460l6669
$$ 1871332 1941869 1970279 2007763 1985845 1970515 1928497 1714938 1913236 2025878 2071338 2034669
3324B034669L9057r9555p9434r646q447k672j04948l8265n1170l8671Q1007J25970
$$ 2034669 2073726 1974171 1894737 1885091 1876644 1873972 1769024 1730759 1679589 1640918 1721925 1847895
3312A847895j91884N2339Q816k822l7084n8199j0873Q4143R4826N9297Q3018n4532
$$ 1847895 1656011 1708350 1717166 1714344 1677260 1619061 1608188 1692331 1787157 1846454 1929472 1874940
3300A874940P8814L3288m1153l2405o7557P6692J19439j18596l0226J31367P5990
$$ 1874940 1953754 1987042 1945889 1913484 1845927 1922619 2042058 1923462 1893236 2024603 2100593
3289B100593J4854k214n4333J5575j26945O52N3180m0939J65716J9929L6458K7552
$$ 2100593 2115447 2113233 2058900 2074475 1947530 1948182 2001362 1960423 2126139 2146068 2182526 2210078
3277B210078P6408k7756Q4374P8893O692J7260O5551j2810J4191q1510k7084p9099
$$ 2210078 2286486 2258730 2343104 2421997 2428689 2445949 2511500 2498690 2512881 2431371 2404287 2325188
3265B325188p7074P6683j06855R9161Q2269O8025Q5071L6122J5082K5794J24399
$$ 2325188 2248114 2324797 2217942 2317103 2399372 2467397 2552468 2588590 2603672 2629466 2753865
3254B753865J5799L9274L4231K9213n8524l7163P8436l2563J909O6637P4357q7331
$$ 2753865 2769664 2808938 2843169 2872382 2813858 2776695 2855131 2822568 2824477 2891114 2965471 2878140
3242B878140j8576J8368j12636n2207J39991R2623R620r871j7702J3931O8114
$$ 2878140 2859564 2877932 2765296 2713089 2853080 2945703 2955323 2945452 2927750 2941681 3009795
3231C009795O4929J77078J0605j1349J2335m6559N0765J78762o8596m4695k6413
$$ 3009795 3074724 3251802 3262407 3251058 3263393 3216834 3267599 3446361 3377765 3333070 3306657
3220C306657p8536o7840P8202K6783P7444l533n816J19777K5852l5757p613K5529
$$ 3306657 3228121 3160281 3238483 3265266 3342710 3339177 3333361 3453138 3478990 3443233 3435620 3461149
3208C461149J71432K3572q5484Q1389R8786J05075J2064N7787j04646l638M0834
$$ 3461149 3632581 3656153 3570669 3652058 3750844 3855919 3867983 3925770 3821124 3817486 3858320
3197C858320n7093o4818J19902J49251j9683j03430L7559P2305j7367J33935l025
$$ 3858320 3801227 3736409 3856311 4005562 3985879 3882449 3920008 3992313 3974946 4108881 4105856
3186D105856k9590K08913O2719R7373j1977j65147j3887J45192p2979q7419J81997
$$ 4105856 4076266 4285179 4347898 4445271 4433294 4268147 4254260 4399452 4326473 4239054 4421051
3175D421051J86770M3839m7552J02854P0523r5643J24364o9714K5181J36189Q4600
$$ 4421051 4607821 4651660 4604108 4706962 4777485 4681842 4806206 4736492 4761673 4897862 4982462
3164D982462J7468J5674M262k3470J17738O055q196J14934P0715P7380J82077
$$ 4982462 4999930 5015604 5019866 4996396 5114134 5120189 5111993 5226927 5297642 5375022 5557099
3153E557099l1034m4818O0181J12818J26800M3707J7103N7048O1947l2577J91655
$$ 5557099 5526065 5481247 5541428 5654246 5781046 5824753 5841856 5898904 5960851 5928274 6119929
3142F119929J30833J14655k8779q598J57627K76612J65427O7497K15686K84703
$$ 6119929 6250762 6365417 6336638 6328040 6485667 6762279 6927706 6995203 7210889 7495592
3132G495592J09327J78480K33552J14325J62867K83103K84333K36862J59458L22497
$$ 7495592 7604919 7783399 8016951 8131276 8294143 8577246 8861579 9098441 9257899 9580396
3122I580396K84612K26839K87197L04165M90471M38134M47398L45886L79565L91546
$$ 9580396 9865008 10091847 10379044 10683209 11173680 11611814 12059212 12405098 12784663 13176209
3112A3176209L18798L70465K45638K84181J96253q5534K0862j71257j68981k58088
$$ 13176209 13495007 13865472 14111110 14395291 14591544 14506010 14526872 14355615 14186634 13928546
3102A3928546l02827l23450k22940m46105m17209l22554l32447l98125k86190
$$ 13928546 13625719 13302269 13079329 12633224 12216015 11893461 11561014 11162889 10876699
3093A0876699k37493j90225k07233k28477j08677p128j16119j89180k71142n2871
$$ 10876699 10639206 10448981 10241748 10013271 9904594 9897466 9781347 9592167 9321025 9268154
3083I268154M7446O9583j17251j26120m3057j36409l8164n6333J0311l9099p3265
$$ 9268154 9315600 9385183 9267932 9141812 9098755 8962346 8924182 8867849 8878160 8839061 8765796
3072H765796J2596K5168j41037p7911r4943K1372O197M0529Q8400J13892o878
$$ 8765796 8778392 8803560 8662523 8584612 8489669 8511041 8517238 8557767 8646167 8760059 8753181
3061H753181M093J36940o7267R5055M5204J14418J13338j32831k5117j5015J20993
$$ 8753181 8757274 8894214 8826947 8922002 8967206 9081624 9194962 9062131 9037014 9021999 9142992
3050I142992L0132j23377l6981O0477L3096J19118O4509m990L4963K2637J63283
$$ 9142992 9173124 9049747 9012766 9073243 9106339 9225457 9289966 9284976 9319939 9342576 9505859
3039I505859J06050k1825q7636P5446J03332J44252J9729j07416P8358P5977J03227
$$ 9505859 9611909 9590084 9502448 9577894 9681226 9825478 9845207 9737791 9816149 9892126 9995353
3028I995353K5962M4493o5698j16391j21771O7125N8185q8035J62454N2200K0400
$$ 9995353 10021315 10065808 10000110 9883719 9761948 9829073 9887258 9799223 9961677 10013877 10034277
3017A0034277Q3600j37406J26965J15186M957l5614Q0755L6894N8074N4308j05595
$$ 10034277 10117877 9980471 10107436 10222622 10227579 10191965 10272720 10309614 10367688 10421996 10316401
3006A0316401O2928J3857K9359J59427k1166Q647r4792R0698Q1672o4999N5364
$$ 10316401 10379329 10393186 10422545 10581972 10560806 10569453 10474661 10565359 10647031 10582032 10637396
2995A0637396Q4557l4689P7563K8541J43P7704p3413J49383l6237r6444J14744
$$ 10637396 10721953 10687264 10764827 10793368 10793511 10871215 10797802 10947185 10910948 10814504 10929248
2984A0929248J29312P0137j02648n4740P8604l0250k7545o077k1699M1698m2676
$$ 10929248 11058560 11128697 11026049 10971309 11049913 11019663 10992118 10986041 10964342 11006040 10963364
2973A0963364q6048k419n897J39421M6547r9008J8346M8922p1099O8056P0602
$$ 10963364 10877316 10874897 10869000 11008421 11054968 10955960 10974306 11023228 10952129 11020185 11090787
2962A1090787R1246q314q9768M7076p4146P2910n7380m8956K90J30004K2082q4449
$$ 11090787 11182033 11173719 11083951 11131027 11056881 11129791 11072411 11023455 11023745 11153749 11175831 11091382
2950A1091382l6642j06991N7198N1513J01508N95N6501N2891Q1509L3691P2874
$$ 11091382 11054740 10947749 11004947 11056460 11157968 11158563 11215064 11267955 11349464 11383155 11456029
2939A1456029K6561R4678L955R3438p8093J12947M6295Q2256P9129p4151J8881
$$ 11456029 11482590 11577268 11581223 11674661 11596568 11709515 11755810 11838066 11917195 11843044 11861925
2928A1861925L896N0496K669j9964J6230J29322R4922P6133O2492L8928J05461
$$ 11861925 11865821 11916317 11918986 11899022 11915252 12044574 12139496 12215629 12278121 12317049 12422510
2917A2422510j0337K46786P0787j3018J90330o4171J72684O6164P9959p666O6097
$$ 12422510 12412173 12658959 12729746 12716728 12907058 12842887 13015571 13081735 13161694 13154028 13220125
2906A3220125J38563P4107o1722P3423o1491l205M8420L5673J07322J02925J05786
$$ 13220125 13358688 13432795 13371073 13444496 13383005 13379800 13428220 13463893 13571215 13674140 13779926
2895A3779926N9342J36731J78484J19981J6332o1955P1964M153P6109J13991O6623
$$ 13779926 13839268 13975999 14154483 14274464 14290796 14228841 14300805 14304958 14381067 14495058 14561681
2884A4561681K72858N7582r255R0961J34157M1054L0784Q5113j1004P3899K5389
$$ 14561681 14834539 14892121 14882866 14973827 15107984 15149038 15179822 15264935 15253931 15327830 15353219
2873A5353219Q5262J16272l5493l0379K4716o5824L7072k380O5412J53311R6520
$$ 15353219 15438481 15554753 15519260 15488881 15513597 15447773 15484845 15482465 15547877 15701188 15797708
2862A5797708J61380j4667k9349J18975J21861k1442k4107j17772p5465K27205
$$ 15797708 15959088 15944421 15915072 16034047 16155908 16134466 16110359 15992587 15917122 16144327
2852A6144327K63289J5546Q2673R0769j36032M0801J38234N7752p0719l026P9589
$$ 16144327 16407616 16423162 16505835 16596604 16460572 16501373 16639607 16697359 16626640 16623614 16703203
2841A6703203Q6798n7181j4506L9132l30P336j7202Q9842q0205M6370L6893M7697
$$ 16703203 16790001 16732820 16718314 16757446 16757116 16764452 16747250 16837092 16756887 16803257 16840150 16887847
2829A6887847j0073M6717L1018P1982J16341N3668k3547Q8253R8641J40206Q6676
$$ 16887847 16877774 16924491 16955509 17027491 17143832 17197500 17173953 17262206 17360847 17501053 17587729
2818A7587729J15270J9425r4953R5570k915j5962J89086Q4481n9272P3302J75006
$$ 17587729 17702999 17722424 17627471 17723041 17720126 17704164 17893250 17977731 17918459 17991761 18166767
2807A8166767K6601n4088M9837n1020N221K18837R3824J16215J40905J13512J08846
$$ 18166767 18193368 18139280 18189117 18138097 18143318 18362155 18455979 18572194 18713099 18826611 18935457
2796A8935457M0152J96573J74408M4844K59895J83100J26023l599J12767K31127
$$ 18935457 18975609 19172182 19346590 19391434 19651329 19834429 19960452 19956853 20069620 20300747
2786B0300747J45434Q0844K07834J96331j00028K10142Q3527K59782K97479K21373
$$ 20300747 20446181 20527025 20734859 20931190 20831162 21041304 21124831 21384613 21682092 21903465
2776B1903465J34268J92494L06735L82835L02276L39615N14564M97877L91555
$$ 21903465 22037733 22230227 22536962 22919797 23222073 23561688 24076252 24574129 24965684
2767B4965684N34116N58804O51926P74696P90685N81671L08464j14447l76498
$$ 24965684 25499800 26058604 26710530 27485226 28275911 28857582 29166046 29051599 28675101
2758B8675101l44881k71572k45359j93910p9338R5565P4531J40443k754J72118
$$ 28675101 28330220 28058648 27813289 27619379 27540041 27635606 27710137 27850580 27847826 28019944
2748B8019944L57028L38663K97034K64444M85022N65667M92794N46446O21979
$$ 28019944 28376972 28715635 29012669 29277113 29762135 30327802 30820596 31367042 31989021
2739C1989021N67939P26691N42093O56657P47025R69347J083207J306697J327804
$$ 31989021 32556960 33283651 33825744 34482401 35229426 36198773 37281980 38588677 39916481
2730C9916481J369489J082718K42325o51741r33270o13959n41546l97029j07088
$$ 39916481 41285970 42368688 42611013 41959272 41026002 40412043 39870497 39473468 39366380
2721C9366380O4264j11876Q0483L63120K76075K07199K36976K92241K59741O14238
$$ 39366380 39430644 39318768 39399251 39762371 40038446 40245645 40482621 40774862 41034603 41648841
2711D1648841M93125L27278M63329M31292O94306P08142N72502O76390P91085
$$ 41648841 42141966 42469244 42932573 43363865 44058171 44766313 45338815 46015205 46806290
2702D6806290Q28548R19382J054905J110436R84388J109262R61139L92257K52489
$$ 46806290 47634838 48554220 49609125 50719561 51703949 52813211 53774350 54166607 54419096
2693E4419096j7949J58119L10962K28385L06831M67277M88386M76913N03628N11252
$$ 54419096 54401147 54559266 54870228 55098613 55405444 55872721 56361107 56838020 57341648 57852900
2683E7852900O25962O80371P23449P01419Q82866R03935R53308R72337J049141
$$ 57852900 58478862 59159233 59882682 60584101 61466967 62370902 63324210 64296547 65345688
2674F5345688J192231J071925J212575J294834J122891J242650J287008J105487
$$ 65345688 66537919 67609844 68822419 70117253 71240144 72482794 73769802 74875289
2666G4875289J233683J213866J232474J131811J135695J180905J233184J155022
$$ 74875289 76108972 77322838 78555312 79687123 80822818 82003723 83236907 84391929
2658H4391929J272740J167601J275226J521065J347836J462482J613357J754131
$$ 84391929 85664669 86832270 88107496 89628561 90976397 92438879 94052236 95806367
2650I5806367J687452J767292J876967J937620J920492K073176K042889K133033
$$ 95806367 97493819 99261111 101138078 103075698 104996190 107069366 109112255 111245288
2642A11245288K362940K230617K458028K727231K794194K990205L324389L458304
$$ 111245288 113608228 115838845 118296873 121024104 123818298 126808503 130132892 133591196
2634A33591196L974248M346804M573857N123429N609057O221890O852672P502712
$$ 133591196 137565444 141912248 146486105 151609534 157218591 163440481 170293153 177795865
2626A77795865P945288Q523384R130373R606758J0126767J0523695J0701249J0797683
$$ 177795865 185741153 194264537 203394910 213001668 223128435 233652130 244353379 255151062
2618B55151062J0534331J0250554R562370Q565325O481272L884541R10316k661525
$$ 255151062 265685393 275935947 285498317 294063642 300544914 304429455 305339771 302678246
2610C02678246o407710r455552j1302068j2233340j2251175j1859722j1402762
$$ 302678246 296270536 286814984 275512916 263279576 251028401 239168679 227765917
2603B27765917j0453005r604370q872222p989641p250362o501293n753654n376303
$$ 227765917 217312912 207708542 198836320 190846679 183596317 177095024 171341370 165965067
2595A65965067m804497m214922l885902l301733l116730k934190k650145k554582
$$ 165965067 161160570 156945648 153059746 149758013 146641283 143707093 141056948 138502366
2587A38502366k471392k518244k283977k298152k423741k366990k366452k602102
$$ 138502366 136030974 133512730 131228753 128930601 126506860 124139870 121773418 119171316
2579A19171316k636547k506780k421488k392028k395747k134490j916832j877661
$$ 119171316 116534769 114027989 111606501 109214473 106818726 104684236 102767404 100889743
2571A00889743j568628j321481j010003o16348m42038l62611q86633j914353k656253
$$ 100889743 99321115 97999634 96989631 96373283 95931245 95568634 94682001 92767648 90111395
2562I0111395k834844k682057k112190k168409k228011j952943j832858j665038
$$ 90111395 87276551 84594494 82482304 80313895 78085884 76132941 74300083 72635045
2554G2635045j384099j274918j285437j120582p98090o73943p56515p42289m60380
$$ 72635045 71250946 69976028 68690591 67570009 66771919 66097976 65341461 64599172 64138792
2545F4138792l11241N9282N5040J29820J99257N29920Q95356J108540J374961
$$ 64138792 63827551 63886833 63941873 64071693 64270950 64800870 65696226 66804766 68179727
2536F8179727J830522K248536K370939J523923n83896k899512l666010l396774
$$ 68179727 70010249 72258785 74629724 76153647 75569751 72670239 69004229 65607455
2528F5607455l125880k779465k436006k115414j688288j504364j301686j130889
$$ 65607455 62481575 59702110 57266104 55150690 53462402 51958038 50656352 49525463
2520D9525463r68522p22820p50828o39281m76757l44762l58099j88943n9479K5471
$$ 49525463 48556941 47834121 47083293 46444012 45967255 45622493 45264394 45075451 45015972 45041443
2510D5041443m8324R2595J51967J80159K93339L56253O29666Q36264R79543P17251
$$ 45041443 44993119 45085714 45237681 45417840 45711179 46067432 46697098 47533362 48512905 49230156
2500D9230156k29672j167005j852560k020536j664879j447245j261960r91750
$$ 49230156 49000484 47833479 45980919 43960383 42295504 40848259 39586299 38594549
2492C8594549q20972r04207o45647o44186m98857m27959m62561m26435m91445
$$ 38594549 37773577 36869370 36223723 35579537 35080680 34652721 34190160 33763725 33272280
2483C3272280k74691j96644k03314l00744j85880k32917k49184l24112k36066
$$ 33272280 32997589 32800945 32597631 32296887 32111007 31878090 31628906 31304794 31068728
2474C1068728j28128j18200k23125r3766p5310j93789j34471j14480j54162o8002
$$ 31068728 30940600 30822400 30599275 30505509 30430199 30236410 30101939 29987459 29833297 29765295
2464B9765295j15085j30563k39497j29342p8707q2801k12572j85022r5738j62535
$$ 29765295 29650210 29519647 29280150 29150808 29072101 28989300 28776728 28591706 28495968 28333433
2454B8333433r7029j60609j55917r8195j88623j48631j80819j44350l6582j26003
$$ 28333433 28236404 28075795 27919878 27821683 27633060 27484429 27303610 27159260 27122678 26996675
2444B6996675k09727j35760j76363p0008k37236j57340j04061k8229r5724l22118
$$ 26996675 26786948 26651188 26474825 26404817 26167581 26010241 25906180 25877951 25782227 25460109
2434B5460109r0434j30662j55132j59552j55489k4076o2735j58987j31408j73758
$$ 25460109 25369675 25239013 25083881 24924329 24768840 24744764 24682029 24523042 24391634 24217876
2424B4217876k6130j14154k576k38502k97314p8215m7791j61663j43743j15446
$$ 24217876 24191746 24077592 24075016 23836514 23539200 23460985 23413194 23251531 23107788 22992342
2414B2992342r1108j57186n6282j49614k00147j22829j72794r4616j57257j97406
$$ 22992342 22901234 22744048 22687766 22538152 22338005 22215176 22042382 21947766 21790509 21593103
2404B1593103j10004k6400j92515j03975j00829J68913L2619k31492j5730P940
$$ 21593103 21483099 21456699 21264184 21160209 21059380 21228293 21260912 21029420 21013690 21021630
2394B1021630N7535j53068q20P5775P4403o403O2415J21700O6035J95750J58045
$$ 21021630 21079165 20926097 20925277 21001052 21075455 21069052 21131467 21253167 21319202 21514952 21672997
2383B1672997M2777j46610q420J05310p593M6320Q5518J53328J31714J26901J8364
$$ 21672997 21715774 21569164 21560744 21666054 21658461 21704781 21790299 21943627 22075341 22202242 22220606
2372B2220606J24822J66910N6002J64041J87421J67590J88034L02019K57119K49155
$$ 22220606 22345428 22512338 22568340 22732381 22919802 23087392 23275426 23577445 23834564 24083719
2362B4083719M4907L31114K40373J62276K68837L48117J81798K45888M53164M21226
$$ 24083719 24128626 24459740 24700113 24862389 25131226 25479343 25661141 25907029 26360193 26781419
2352B6781419L98524K97688K51073M92967N32984L98963N86832M75875L49045
$$ 26781419 27179943 27477631 27728704 28221671 28754655 29153618 29740450 30216325 30565370
2343C0565370K76944L39035M43999K95347J04419J41240K13635K68192K93556
$$ 30565370 30842314 31181349 31625348 31920695 32025114 32166354 32379989 32648181 32941737
2334C2941737K62161K32225M70971N17663L80933N93401P55164P34818P86557
$$ 32941737 33203898 33436123 33907094 34424757 34805690 35399091 36154255 36889073 37675630
2325C7675630N83201N52454M91800N16145P00057P58278P53477P96765J002178
$$ 37675630 38258831 38811285 39303085 39819230 40519287 41277565 42031042 42827807 43829985
2316D3829985R72077J230737J374181J268185J420504J479647J569167J480522
$$ 43829985 44802062 46032799 47406980 48675165 50095669 51575316 53144483 54625005
2308E4625005J425329J289264J130108J064865J203909J118533R57171Q87476
$$ 54625005 56050334 57339598 58469706 59534571 60738480 61857013 62814184 63701660
2300F3701660R17510O02047N76492O42624P01813N51023Q94654O64111Q10778
$$ 63701660 64619170 65221217 65797709 66440333 67142146 67693169 68587823 69251934 70062712
2291G0062712J039468J027073J055031J250023J504819J702102K102515K238033
$$ 70062712 71102180 72129253 73184284 74434307 75939126 77641228 79743743 81981776
2283H1981776K570761K557204K658419K938472K942854K959029L018089K910472
$$ 81981776 84552537 87109741 89768160 92706632 95649486 98608515 101626604 104537076
2275A04537076K820643K353390J825514P44058m28814j734093k912577l228891
$$ 104537076 107357719 109711109 111536623 112280681 111851867 110117774 107205197 103976306
2267A03976306k993606k662706j999235j333933q38596l07096J51550M96849Q53467
$$ 103976306 100982700 98319994 96320759 94986826 94148230 93841134 93992684 94489533 95343000
2258I5343000R78872J358220J656609J566746J534788J804500J725120J776301
$$ 95343000 96321872 97680092 99336701 100903447 102438235 104242735 105967855 107744156
2250A07744156J560169J368337J030339O42285k03032j068581j769464j990944
$$ 107744156 109304325 110672662 111703001 112345286 112142254 111073673 109304209 107313265
2242A07313265k194920k519463l110734l438271l437000l138170k842387k441937
$$ 107313265 105118345 102598882 99488148 96049877 92612877 89474707 86632320 84190383
2234H4190383j990181j561994j181778j033122o31665m02268n00553k20408j65088
$$ 84190383 82200202 80638208 79456430 78423308 77791643 77389375 76888822 76668414 76503326
2225G6503326l50385n98623q20448r44094j330663j624826j800456k041046k567709
$$ 76503326 76152941 75554318 74733870 73789776 72459113 70834287 69033831 66992785 64425076
2216F4425076k602734k930340k974572k758820k476317k354037k235135k051038
$$ 64425076 61822342 58892002 55917430 53158610 50682293 48328256 46093121 44042083
2208D4042083j791013j797869j499853j457820j245120j161847r03873r13490
$$ 44042083 42251070 40453201 38953348 37495528 36250408 35088561 34184688 33271198
2200C3271198q85290o72787p39851n92205o41338o13025n74095o48650p31843
$$ 33271198 32385908 31713121 30973270 30381065 29739727 29126702 28552607 27903957 27172114
2191B7172114r06943p79175p64222p95186p87020p15149p33429q37683n68532
$$ 27172114 26265171 25485996 24721774 23926588 23139568 22424419 21690990 20853307 20284775
2182B0284775m57739n22845n38177m96784n90798l36850l52995l80426n13989
$$ 20284775 19827036 19304191 18766014 18269230 17678432 17341582 16988587 16608161 16094172
2173A6094172k60327k86568k78954j73414k50905k96019l55945l40786j22499
$$ 16094172 15833845 15547277 15268323 15094909 14844004 14547985 14192040 13851254 13728755
2164A3728755j88686k50719j85695q5641k46835j48611k01986j65708k44522m19311
$$ 13728755 13540069 13289350 13103655 13018014 12771179 12622568 12420582 12254874 12010352 11591041
2154A1591041j75483k50640j99071j78216j30061k38185k36186j66333k77643
$$ 11591041 11415558 11164918 10965847 10787631 10657570 10419385 10183199 10016866 9739223
2145I739223l63960j26626k58101l6783k44442k48934j38090j54008o8514k8691
$$ 9739223 9375263 9248637 8990536 8953753 8709311 8460377 8322287 8168279 8099765 8071074
2135H071074k57962j78233j60497l3898L18p1550j98794j37100m1567j28933k7783
$$ 8071074 7813112 7634879 7474382 7440484 7440802 7369252 7170458 7033358 6991791 6862858 6835075
2124F835075q5630j02457j08270j24367q3386k60107q8807j44069j99781r8950
$$ 6835075 6749445 6646988 6538718 6414351 6330965 6070858 5982051 5837982 5638201 5539251
2114E539251k15354m3494j87454k53340r8718p9633j22375j6556J6395k00640
$$ 5539251 5323897 5280403 5092949 4839609 4740891 4661258 4538883 4522327 4538722 4338082
2104D338082j38321N3610O8488j02023L6087N7789o35p8987j51052o676J0093
$$ 4338082 4199761 4253371 4321859 4219836 4255923 4313712 4313077 4234090 4083038 4076362 4086455
2093D086455j28385j83597N489o6350r0436o3407o6403j28207K6606k16878j57538
$$ 4086455 3958070 3774473 3779962 3713612 3623176 3559769 3493366 3365159 3391765 3174887 3017349
2082C017349L0436J01934k1057k8711k32L0735m2570N660j4965M0882m455p2348
$$ 3017349 3047785 3149719 3128662 3099951 3099719 3130454 3087884 3093544 3078579 3119461 3115006 3042658
2070C042658J0459l439l355r5116l3171m8114q7719P211M410K4423o1387p7882
$$ 3042658 3053117 3049678 3046323 2951207 2918036 2869922 2782203 2789414 2793824 2818247 2756860 2678978
2058B678978m4357j0531j80799J5794K4161N9656Q3405L844L0806l4330M0j41054
$$ 2678978 2634621 2624090 2443291 2459085 2483246 2542902 2626307 2630151 2660957 2626627 2626667 2485613
2046B485613q4195l1595J6173j8815L1522M5756J6898k22299m7828j9464O2505
$$ 2485613 2401418 2369823 2385996 2367181 2398703 2444459 2461357 2239058 2191230 2171766 2234271
2035B234271P797j12485n3498J19220J09639L7873q0830j24255J63730n5802k8043
$$ 2234271 2242068 2129583 2076085 2195305 2304944 2342817 2261987 2137732 2301462 2245660 2217617
2024B217617o8715P1513j3209l3154L9481L4398j09133q8524q664m3404R8576
$$ 2217617 2148902 2220415 2207206 2174052 2213533 2247931 2138798 2050274 2041610 1998206 2096782
2013B096782o0111M387k2427k9749K6o7054l1479Q4655P0628l8951n5067j4892
$$ 2096782 2036671 2041058 2018631 1988882 1988908 1921854 1890375 1975030 2045658 2006707 1951640 1936748
2001A936748J10627J8527q8536m875L5609l6038j11297O0225L5592M4239k6171
$$ 1936748 2047375 2065902 1977366 1972491 2008100 1972062 1860765 1920990 1956582 2000821 1974650
1990A974650j13465m0858N8237M1376r2559K426p6870r8230j9297J77511R0925
$$ 1974650 1861185 1820327 1878564 1919940 1827381 1829807 1752937 1654707 1635410 1812921 1903846
1979A903846j57792j2650p458j80740J48232Q7070q3501m4160J24020J17068j32604
$$ 1903846 1746054 1733404 1725946 1545206 1693438 1780508 1697007 1652847 1776867 1893935 1761331
1968A761331n8064j0497r3250J02213n3605j6846j35020M5482J54740k18948n4775
$$ 1761331 1703267 1692770 1599520 1701733 1648128 1631282 1496262 1541744 1696484 1477536 1422761
1957A422761Q6125P1300L0706R9064j31689j89669j00783J05199P4571L4147J04710
$$ 1422761 1508886 1580186 1610892 1709956 1578267 1388598 1287815 1393014 1467585 1501732 1606442
1946A606442q4875k03493q299O537K5237N8573j14128j42743K1837m2310O5569
$$ 1606442 1521567 1318074 1309775 1316312 1341549 1400122 1285994 1143251 1165088 1122778 1188347
1935A188347L5r6685p5386J25436k5270p4447l7910q73Q5111L6144p5614j31483
$$ 1188347 1188382 1091697 1016311 1141747 1116477 1042030 1004120 1003247 1088358 1124502 1048888 917405
1923I17405j06104O4512j0824J46820p2566j37084k3843j1676j06077K5247J8082
$$ 917405 811301 875813 864989 1011809 939243 802159 778316 766640 660563 685810 703892
1912G03892o9106N2558J27409K8141L0239l0012j04693j0962j2456Q7521l8738
$$ 703892 634786 687344 814753 842894 873133 843121 738428 727466 715010 802531 763793
1901G63793Q7984q720j6407r2206q9941J1059r8102n3608K4272K5632L209l9559
$$ 763793 851777 843057 826650 734444 644503 655562 557460 503852 528124 553756 556965 517406
1889E17406k3126R2602m1056p8255j8617Q2152J53668q3290M5888q2334R0179
$$ 517406 494280 586882 545826 467571 448954 531106 684774 601484 647372 565038 655217
1878F55217j09799k5686M5690M577L8913l146r3573L5494o1685p9057q4744k4350
$$ 655217 545418 519732 565422 569999 608912 605766 512193 547687 486002 406945 322201 297851
1866B97851J14032o1268K7892K6712k5713M575Q6712n9296K5692q7285M3178K3704
$$ 297851 411883 350615 378507 405219 379506 384081 470793 411497 437189 349904 393082 416786
1854D16786O9187O7250q169l9183r8482O0683J6278m5396j62801j45158R5953
$$ 416786 485973 553223 545054 505871 407389 468072 484350 438954 276153 130995 226948
1843B26948K52142k08526j55331J62653p6026m1247J41094P1654M0744k6627Q536
$$ 226948 479090 270564 115233 277886 201860 160613 301707 373361 414105 387478 396014
1832C96014j31620L1277O989j4677O43M257k9876K3574K7948k9348j25997J1643
$$ 396014 264394 295671 302660 287983 288626 292883 263007 286581 314529 285181 159184 170827
1820A70827O3797l8309L4227M3409m6490K1722l9081J2981p3441j36013K38503
$$ 170827 234624 196315 230542 273951 227461 249183 210102 223083 149642 13629 252132
1809B52132n2994k5094k5308P3969l8998J5432j2721q6481O0095k542j05898r433
$$ 252132 199138 174044 148736 222705 183707 199139 186418 99937 160032 157490 51592 42159
1797D2159L0654J6613k4295r1604M9522O152K3929J7498q8851j55694R4442R7487
$$ 42159 72813 89426 65131 -26473 23049 29201 53130 70628 -18223 -173917 -79475 18012
1785A8012P1497M904q7755K5090m7369Q7058Q4496m4324K1999J10476J2799j20432
$$ 18012 89509 94413 6658 31748 -15621 71437 155933 111609 133608 244084 256883 136451
1773A36451j30291p4089n32J25642J4944n3351K0996j62655K1551P8974n7096
$$ 136451 6160 -67929 -68461 57181 72125 18774 39770 -122885 -101334 -22360 -79456
1762g9456J23459N0907j3625j3888J7733J679p2014n3766n5449K320j6591J85226
$$ -79456 44003 94910 81285 67397 85130 86809 14795 -38971 -94420 -92100 -108691 76535
1750G6535J50614j72924p5997L36o3527L1105J41575n9040r5462K2103J56927
$$ 76535 227149 54225 -21772 -21436 -84963 -53858 87717 28677 -66785 -44682 112245
1739A12245o3027n5980k2024L9357k7909o0701N229j53803R4405J61400j59129
$$ 112245 49218 -6762 -28786 10571 -17338 -78039 -72810 -226613 -132208 29192 -129937
1728a29937K4979K28526j76274j3065j308J6297J1176j10865N8777j23263k5753
$$ -129937 -104958 123568 -52706 -65771 -67079 -50782 -39606 -150471 -91694 -214957 -240710
1717b40710p0395O3581l3329k526Q7555r4191K9118k4376R1845k4579p6183K7758
$$ -240710 -311105 -247524 -280853 -283379 -195824 -290015 -260897 -285273 -193428 -218007 -294190 -266432
1705b66432j7703K05718l1207k6824M5218L3704r4484L8152j10806q5785J56252
$$ -266432 -284135 -78417 -109624 -136448 -91230 -57526 -152010 -113858 -224664 -310449 -154197
1694a54197o8758J3449O6921J8802o5701k5127k2076n9741J41634J18057m2717
$$ -154197 -222955 -209506 -142585 -123783 -189484 -214611 -236687 -296428 -154794 -36737 -79454
1683g9454q3090j17096J16626J6829n5592j9118j3428N7083n9526k2917J49122
$$ -79454 -162544 -279640 -163014 -146185 -201777 -220895 -234323 -177240 -236766 -259683 -110561
1672a10561p6735K583J1255m5938p9684j3676k556K5775J51445J9548j01953J1364
$$ -110561 -187296 -184713 -173458 -219396 -299080 -312756 -315312 -289537 -138092 -118544 -220497 -209133
1660b09133m6440J30828m145P4501L094r1334L031L726o5682m3J1772o3763R3416
$$ -209133 -255573 -124745 -128890 -54389 -51295 -142629 -139598 -135872 -201554 -201597 -189825 -253588 -160172
1647a60172J49791o7472p1257n3495M5213L4079M1718Q39j06728R153n2792J06731
$$ -160172 -10381 -77853 -149110 -202605 -157392 -123313 -81595 -80756 -187484 -178331 -231123 -124392
1635a24392N0617J7715j04187N7839P198L4685n7050K1239n588n308O8726p4364
$$ -124392 -73775 -56060 -160247 -102408 -95210 -60525 -117575 -96336 -101924 -107232 -38506 -112870
1623a12870R102L912K0544K3589J5029n7050K8135l0122n9242o1080m8367K21270
$$ -112870 -103768 -99856 -79312 -55723 -40694 -97744 -69609 -99731 -158973 -220053 -268420 -47150
1611d7150K6654m2191n7603P7233L5625j01932J32904M6848J22558Q9483j84413
$$ -47150 -20496 -62687 -120290 -43057 -7432 -109364 23540 70388 192946 282429 98016
1600I8016p5674J63052p5980K3925l5814R8550J54j30081O3957J14344n4563j36997
$$ 98016 22342 185394 109414 133339 97525 196075 196229 66148 130105 244449 189886 52889
1588E2889J05304K180m7532M7031L7160J2682R832m9723J28004J08074L4637j90473
$$ 52889 158193 160373 112841 159872 197032 209714 219546 169823 297827 405901 440538 250065
1576B50065q128J26194K4601J11358J3658j60608N7844P8388j11138J70011P9134
$$ 250065 241937 368131 392732 504090 517748 357140 414984 493372 382234 552245 631379
1565F31379j38289q1320r904M8914J13518J58317m4824m4276k7560M6228P4571
$$ 631379 493090 411770 401866 450780 564298 722615 677791 633515 605955 652183 726754
1554G26754M0076n2360q6301J1872J92164n5134j06773P0967N9978k9667q2674
$$ 726754 766830 714470 628169 640041 832205 777071 670298 741265 801243 771576 688902
1543F88902K0810N9929J76108O9516k693p546J32965J10411m1402J9250J61262
$$ 688902 709712 769641 945749 1015265 1012572 1005026 1137991 1248402 1207000 1226250 1387512
1532A387512N9482o3750M6572q4611n7875P1970J6656j6314p7045M1414J35658
$$ 1387512 1446994 1383244 1429816 1345205 1287330 1359300 1375956 1359642 1282597 1324011 1459669
1521A459669O5649J21519P298m4360O9546j0289J66772J03943J7564J61896J09285
$$ 1459669 1525318 1646837 1654135 1609775 1679321 1669032 1835804 1939747 1957311 2119207 2228492
1510B228492J26021R9905J71165J21994j966N1708J19218J08535K04402J02120
$$ 2228492 2354513 2454418 2625583 2747577 2745611 2797319 2916537 3025072 3229474 3331594
1500C331594M916J34887Q8391K45830K81260K25295L41024M97761M63821N22019
$$ 3331594 3336510 3471397 3559788 3805618 4086878 4312173 4653197 5150958 5614779 6136798
1490F136798N68447N57525N84879Q12220R67781J084698J080135J315143J461798
$$ 6136798 6705245 7262770 7847649 8659869 9627650 10712348 11792483 13107626 14569424
1481A4569424J752702K158097K792438L467824M228500M654222M735094j210351
$$ 14569424 16322126 18480223 21272661 24740485 28968985 33623207 38358301 37147950
1473C7147950o734514n758472m292870l185298k577974k021293j797622j358070
$$ 37147950 30413436 24654964 20362094 17176796 14598822 12577529 10779907 9421837
1465I421837j044884r61894r24471n72789o67075l61636m37135o76672m24666
$$ 9421837 8376953 7415059 6490588 5917799 5250724 4889088 4451953 3775281 3350615
1456C350615k58166l39233j50665l4674j39333j90144j1473j45046j36485k03578
$$ 3350615 3092449 2753216 2602551 2567877 2428544 2238400 2226927 2081881 1945396 1741818
1446A741818j16979M4326j13023k3679j05743j25653j77396j44165m1897m1874
$$ 1741818 1624839 1669165 1556142 1532463 1426720 1301067 1123671 979506 937609 895735
1436H95735J3915j40869k17845q8016J00997q2278n3322N3810j19171M8942P905
$$ 895735 909650 768781 550936 462920 563917 481639 428317 482127 362956 411898 419803
1425D19803K9695N4923M9330l4269L140j38398l9527J25976O6073l5928j31647
$$ 419803 449498 504421 553751 519482 522622 384224 344697 470673 536746 500818 369171
1414C69171M5841l905j18474j62411J8872j6507k2278K9727M2553k5710j16986
$$ 369171 415012 411107 292633 130222 149094 132587 110309 140036 182589 156879 39893
1403C9893M5692Q0658M0555j5385p2011Q102L298O4018q2266l555M6722M1850
$$ 39893 85585 166243 206798 191413 119402 127504 130802 194820 112554 108999 155721 197571
1391A97571j03616j20896m9444o8720j4451r8110j0231J36132Q5892q1494J59514
$$ 197571 93955 -26941 -76385 -145105 -159556 -257666 -267897 -131765 -45873 -127367 32147
1380C2147q1011k8409M7247j819m5535m672J05231L7675j23263J43685m3702o8102
$$ 32147 -48864 -77273 -30026 -31845 -77380 -82052 23179 60854 -62409 81276 37574 -30528
1368c0528l2518m2200P54p5036k9860N1343q0684l2676K2917M961J4741R917O7701
$$ -30528 -63046 -105246 -104492 -179528 -209388 -158045 -238729 -271405 -248488 -243527 -228786 -218869 -151168
1355a51168o2316M2530J31691K7349j43790P4894M785l2844o7339J04726n4665
$$ -151168 -213484 -170954 -39263 -11914 -155704 -80810 -76025 -108869 -176208 -71482 -126147
1344a26147r2447K0417j14265q1808L8210N4250M1408K2192L6420p320p3250J03798
$$ -126147 -218594 -198177 -312442 -394250 -356040 -301790 -260382 -238190 -201770 -209090 -282340 -178542
1332a78542L1464O2634K1540m3933o7805j37810K8084N0304P6238r62J7286n5430
$$ -178542 -147078 -84444 -62904 -106837 -174642 -312452 -284368 -234064 -157826 -158788 -141502 -196932
1320a96932m6096j02209m010J18062N8884j1710j55350K2890n2451K5694J38216
$$ -196932 -243028 -345237 -349247 -231185 -172301 -184011 -339361 -316471 -368922 -343228 -205012
1309b05012j33037k524K05036N8703K6223p1381m7666M1292K6994r9953K3777
$$ -205012 -338049 -340573 -135537 -76834 -50611 -121992 -169658 -128366 -101372 -201325 -177548
1298a77548O8805O5952o7335l7756K8394j37168o9602P4534n5039l8873M4848
$$ -177548 -108743 -42791 -110126 -147882 -119488 -256656 -326258 -251724 -306763 -345636 -300788
1287c00788l0074j42751O7755M8576j3680J13989J0273Q3062j04399L2450J44168
$$ -300788 -330862 -473613 -405858 -357282 -370962 -256973 -246700 -163638 -268037 -235587 -91419
1276i1419q4010j96826K4336L5606N8638K0704M9568P1647j28649p8948M8919
$$ -91419 -175429 -372255 -347919 -312313 -253675 -232971 -183403 -111756 -240405 -319353 -270434
1265b70434k0493o0164J8344J23977j5781L3106J32397j23696j9647j11283J98543
$$ -270434 -290927 -351091 -332747 -208770 -224551 -191445 -59048 -182744 -202391 -313674 -115131
1254a15131K3071p1360r078q7988K0297m4869O4404l3114N716R5708j28739n3522
$$ -115131 -92060 -163420 -172498 -260486 -240189 -285058 -220654 -253768 -248052 -152344 -281083 -334605
1242c34605M4438K0589j0029O6825r0704k505J50388J8063J18415O4341j79884
$$ -334605 -290167 -269578 -279607 -212782 -303486 -305991 -155603 -137540 -19125 45216 -134668
1231a34668q6671l51n7683J5183j08518J49284K8604m6014P4263j5068l1683k8139
$$ -134668 -221339 -221690 -279373 -264190 -372708 -223424 -194820 -240834 -166571 -181639 -213322 -241461
1219b41461l2652K3926O3578o7793j0480q375j0471K1572n3690Q7417Q045P5103
$$ -241461 -274113 -250187 -186609 -254402 -264882 -273257 -283728 -262156 -315846 -228429 -220384 -145281
1207a45281o9700m4312J65806R5419j4722J01706p1005q1493J6533K4324q944
$$ -145281 -214981 -259293 -93487 1932 -12790 88916 17911 -63582 -47049 -22725 -31669
1196c1669J29446o860k04445j54086l4248J05587J83243j09845j89329n6971R0215
$$ -31669 97777 90917 -113528 -267614 -301862 -196275 -13032 -122877 -312206 -369177 -278962
1185b78962l5294J16520k1054k816P5099r7891q9025P3522N4800n580l6220r0966
$$ -278962 -314256 -197736 -218790 -221606 -146507 -244398 -333423 -259901 -205101 -210681 -246901 -337867
1173c37867l608m0269J0676j0822J10603O697Q6869M3003L2273o4954l9585n7344
$$ -337867 -341475 -381744 -371068 -381890 -271287 -264590 -177721 -134718 -102445 -167399 -206984 -264328
1161b64328p627O2298k1911K8620J21265l0949n2791J27240L1417n872r187k14270
$$ -264328 -271955 -209657 -231568 -202948 -81683 -112632 -165423 -38183 -6766 -12638 -21825 -236095
1149b36095K1718O0103O4160p5422K2330q2247p5635M3579N2112q925J4028j1102
$$ -236095 -214377 -154274 -90114 -165536 -143206 -225453 -301088 -257509 -205397 -214322 -200294 -211396
1137b11396M3366j7653p1912J07168m9005Q1576n7775l1230N6333R210O1509m8478
$$ -211396 -168030 -185683 -257595 -150427 -199432 -117856 -175631 -206861 -150528 -141318 -79809 -128287
1125a28287O0582j67555q7058k4743N6454J35412K7278p5283o8440k2154L2536
$$ -128287 -67705 -235260 -322318 -347061 -290607 -155195 -127917 -203200 -271640 -293794 -261258
1114b61258L6435M6330l4465n3549M7377Q1442j17132j2757Q3947O2095m9340
$$ -261258 -224823 -178493 -212958 -266507 -219130 -137688 -254820 -267577 -183630 -121535 -170875
1103a70875M8626q4701j02398J15649J5653r0835l626m9186K9893J56531n8789
$$ -170875 -122249 -206950 -309348 -193699 -178046 -268881 -272507 -321693 -291800 -135269 -194058
1092a94058r0723J776J5963M3424Q5824j20888m2819J27772k8754M4336Q3294
$$ -194058 -284781 -283005 -267042 -223618 -137794 -258682 -301501 -173729 -202483 -158147 -74853
1081g4853o3862p4960L6595K2846j90603O1582J62321N7114m8638l6391m851j27188
$$ -74853 -138715 -213675 -177080 -154234 -344837 -283255 -120934 -63820 -112458 -148849 -153700 -280888
1069b80888j11218J21438Q0747O8745J5104L5295j73466N8164O7777R2422j52689
$$ -280888 -392106 -270668 -189921 -121176 -106072 -70777 -244243 -186079 -118302 -25880 -178569
1058a78569r3582M3771n4698J44346J29274P999l8717j40236j31431r7206J11966
$$ -178569 -272151 -228380 -283078 -138732 -9458 -1459 -40176 -180412 -311843 -409049 -297083
1047b97083l6057l4946R5572J7619Q3144p3104L871J40376K189L8606M915j1517
$$ -297083 -333140 -368086 -272514 -254895 -171751 -244855 -240984 -100608 -98419 -59813 -54898 -66415
1035f6415j92531j1346L7979k3031K3188m1716J11754J17291n7884n8447r4258
$$ -66415 -258946 -270292 -232313 -255344 -232156 -273872 -162118 -44827 -102711 -161158 -255416
1024b55416J6235N4685K7073L5582o7579l6634j653R0217j905N1108k2500R0555
$$ -255416 -239181 -184496 -157423 -121841 -189420 -226054 -227707 -137490 -139395 -88287 -110787 -20232
1012b0232P7942l9720k5150J1021j78242J81040M4845l4742n5161q8463j3934
$$ -20232 57710 17990 -7160 3861 -174381 6659 51504 16762 -38399 -126862 -140796
1001a40796k8213k2135k4176M3664O7449l334J7466q575j63073O7459O3897o474
$$ -140796 -169009 -191144 -215320 -171656 -104207 -107541 -90075 -98650 -261723 -194264 -130367 -136841
989a36841P8081l1920Q6771j9015k14264J15845l4667K2853O3466k5641L7777
$$ -136841 -58760 -90680 -3909 -22924 -237188 -121343 -156010 -133157 -69691 -95332 -57555
978e7555J64256l7924k05603m9150M8570k609k2805Q7492m0801o4918J15263J8387
$$ -57555 106701 68777 -136826 -185976 -137406 -140015 -162820 -75328 -116129 -181047 -65784 -47397
966d7397l3111r5729N3523l4812Q8716R5106l3954k792K8619j22233r1086O7046
$$ -47397 -80508 -176237 -122714 -157526 -68810 26296 -7658 -10450 18169 -104064 -195150 -128104
954a28104o68m09q3477q7273K8597J65527m4863m7877n3872k4022K788J14270
$$ -128104 -128772 -129181 -212658 -299931 -271334 -105807 -150670 -198547 -252419 -276441 -273653 -159383
942a59383L8655P0077K3998o8414J8381j14086K3802J40971J04573o0548j77195
$$ -159383 -120728 -50651 -26653 -95067 -76686 -190772 -166970 -25999 78574 18026 -159169
931a59169p042Q3588l2845j1906P5302j64866J9600R6019q7031r3703J48990L086
$$ -159169 -166211 -82623 -115468 -127374 -52072 -216938 -197338 -101319 -188350 -282053 -133063 -129977
919a29977R6963J0297L6280m5842j11506K3627M7147q520J2306M5605P438o3087
$$ -129977 -33014 -22717 13563 -32279 -143785 -120158 -73011 -81531 -69225 -23620 -16182 -79269
907g9269l4838O8830P0475q4051N8780l1309o3495N6402M6574j19104j8225J37544
$$ -79269 -114107 -45277 25198 -58853 -73 -31382 -94877 -38475 8099 -111005 -129230 8314
895H314r9933l2141Q0366J00674j85850l2678J1971N728j4236K4231N4649l4726
$$ 8314 -91619 -123760 -43394 57280 -128570 -161248 -149277 -143549 -157785 -133554 -78905 -113631
883a13631N5171L9010N3066p2451m1886M1337N5602N1920j61702o4124O263K8127
$$ -113631 -58460 -19450 33616 -38835 -80721 -39384 16218 68138 -93564 -157688 -151425 -123298
871a23298L9959P8996J2191q9396J4810Q0238p7781O499K5318R8232q9555N6286
$$ -123298 -83339 -4343 7848 -81548 -66738 13500 -64281 -57782 -32464 65768 -23787 32499
859C2499O045k3201Q5819j30559l456m0838J645j22289L6614P5731j8370o8526
$$ 32499 38544 15343 101162 -29397 -32853 -73691 -72046 -194335 -157721 -81990 -100360 -168886
847a68886Q0263M1l8238M9579L829l6704P5838O4367Q6644r466n5468l0494k6102
$$ -168886 -88623 -88582 -126820 -77241 -73412 -110116 -34278 30089 116733 107267 51799 21305 -4797
834d797L8575j184n5636n8060J7339p3277k152l498J35394o6712q4472J9970P5921
$$ -4797 33778 32594 -23042 -81102 -63763 -137040 -139192 -142690 -7296 -74008 -158480 -138510 -62589
821f2589k6938L6309l3245Q8171q4620n3766N8652J00168o1977O644k14J21264
$$ -62589 -89527 -53218 -86463 1708 -82912 -136678 -78026 22142 -39835 -33191 -33405 87859
809H7859J0851j18574K877q3939l7831J96578k0452p00J2719o050j39728n4728
$$ 87859 98710 -19864 -16987 -100926 -138757 57821 37369 36669 49388 43338 -96390 -151118
797a51118N277o4281J34775O8703Q0232j07751M6201J36132j95649p2811Q8090
$$ -151118 -145841 -210122 -75347 -6644 73588 -34163 12038 148170 -47479 -120290 -32200
$$ [...]
##END NTUPLES=NMR SPECTRUM
##END=
