##TITLE=1H_CG-1181-32
 CDCl3
 8 sc, 
 23.11.2023
##JCAMPDX= 6.0         $$ Bruker NMR JCAMP-DX V2.0
##DATA TYPE= NMR SPECTRUM
##DATA CLASS= NTUPLES
##ORIGIN= UXNMR, Bruker Analytische Messtechnik GmbH
##OWNER= root
$$ XWIN-NMR		Version 3.5
$$ Thu Nov 23 15:45:39 2023 Russian Standard Time (UT+4h)  she@DPX200
##.OBSERVE FREQUENCY= 200.1313
##.OBSERVE NUCLEUS= ^1H
##.ACQUISITION MODE= SIMULTANEOUS
##.ACQUISITION SCHEME= undefined
##.AVERAGES= 8
##.DIGITISER RES= 18
##SPECTROMETER/DATA SYSTEM= spect
##.PULSE SEQUENCE= zg30
##.SOLVENT NAME= CDCl3
##.SHIFT REFERENCE= (INTERNAL, CDCl3, 0, 15.413)
##AUDIT TRAIL= $$ (NUMBER, WHEN, WHO, WHERE, WHAT)
$$ ##TITLE= Audit trail, XWIN-NMR		Version 3.5
$$ ##JCAMPDX= 5.01
$$ ##ORIGIN= Bruker BioSpin GmbH
$$ ##OWNER= she
$$ F:/spectra/data/she/nmr/H-F/1/pdata/1/auditp.txt
$$ ##AUDIT TRAIL=  $$ (NUMBER, WHEN, WHO, WHERE, WHAT)
(   1,<2023-11-23 15:44:51.04 +0400>,<she>,<DPX200>,
      <created by zg, POWCHK disabled, PULCHK disabled
       configuration hash MD5:
       00 E9 B6 7A A2 85 ED C7 34 08 36 98 17 FE 4E 26
       data hash MD5: 16K
       07 D3 20 E7 A7 9E BF 88 49 8C 76 C8 FF F1 D1 3E>)
(   2,<2023-11-23 15:44:53.65 +0400>,<she>,<DPX200>,
      <Start of raw data processing
       efp BC_mod = 2 LB = 0.24 FT_mod = 6 PKNL = 1 PHC0 = -24229 PHC1 = 10.45269 SI = 16K 
       data hash MD5: 16K
       6A B3 38 C6 B3 DB 78 02 F3 DD C2 2A A1 B4 14 84>)
(   3,<2023-11-23 15:45:04.21 +0400>,<she>,<DPX200>,
      <pk PHC0 = -0.04632018 PHC1 = 1.599999 
       data hash MD5: 16K
       BD BA 6B 4F 50 9B B3 4D 74 46 00 98 70 D2 E5 39>)
(   4,<2023-11-23 15:45:07.09 +0400>,<she>,<DPX200>,
      <abs ABSG = 5 
       data hash MD5: 16K
       8E 00 D3 36 7E 65 4F 21 85 AA B7 B8 A4 F8 EB 4F>)
$$ ##END=
$$ 
$$ hash MD5
$$ CD 26 3F D1 B5 4A FB 25 72 B3 AB E7 8D 97 F9 C0
##$RELAX= 
##$RELAX= 
##$RELAX= 
##$RELAX= 
##$RELAX= 
##$RELAX= 
$$ Bruker specific parameters
$$ --------------------------
##$DU= <F:/spectra>
##$EXPNO= 1
##$NAME= <H-F>
##$PROCNO= 1
##$TYPE= <nmr>
##$USER= <she>
##$AMP= (0..31)
100 100 100 100 100 100 100 100 100 100 100 100 100 100 100 100 100 100 
100 100 100 100 100 100 100 100 100 100 100 100 100 100 
##$AQSEQ= 0
##$AQ_mod= 1
##$AUNM= <au_zg>
##$AUTOPOS= <>
##$BF1= 200.13
##$BF2= 200.13
##$BF3= 200.13
##$BF4= 200.13
##$BF5= 200.13
##$BF6= 200.13
##$BF7= 200.13
##$BF8= 200.13
##$BYTORDA= 1
##$CFDGTYP= 0
##$CFRGTYP= 5
##$CHEMSTR= <none>
##$CNST= (0..31)
1 1 145 1 1 1 1 1 1 1 1 1 1 1 1 1 1 1 1 1 1 1 1 1 1 1 1 1 1 1 1 1 
##$CPDPRG= <>
##$CPDPRG1= <>
##$CPDPRG2= <>
##$CPDPRG3= <>
##$CPDPRG4= <mlev>
##$CPDPRG5= <mlev>
##$CPDPRG6= <mlev>
##$CPDPRG7= <mlev>
##$CPDPRG8= <mlev>
##$CPDPRGB= <>
##$CPDPRGT= <>
##$D= (0..31)
0 1.2 0 0 0 0 0 0 0 0.06 0 0.03 0 0 0 0 0.0002 0 0 0 0 0 0 0 0 0 0 0 0 
0 0 0 
##$DATE= 1700739890
##$DBL= (0..7)
120 120 120 120 120 120 120 120 
##$DBP= (0..7)
150 150 150 150 150 150 150 150 
##$DBP07= 0
##$DBPNAM0= <>
##$DBPNAM1= <>
##$DBPNAM2= <>
##$DBPNAM3= <>
##$DBPNAM4= <>
$$ [...]
##$SUBNAM3= <"">
##$SUBNAM4= <"">
##$SUBNAM5= <"">
##$SUBNAM6= <"">
##$SUBNAM7= <"">
##$SUBNAM8= <"">
##$SUBNAM9= <"">
##$SW= 18.0517328524113
##$SWIBOX= (0..15)
0 0 2 0 0 0 0 0 0 0 0 0 0 0 0 0 
##$SW_h= 3612.71676300578
##$TD= 16384
##$TD0= 1
##$TE= 0
##$TE2= 300
##$TE3= 300
##$TEG= 300
##$TL= (0..7)
0 120 120 120 120 120 120 120 
##$TP= (0..7)
150 150 150 150 150 150 150 150 
##$TP07= 0
##$TPNAME0= <>
##$TPNAME1= <>
##$TPNAME2= <>
##$TPNAME3= <>
##$TPNAME4= <>
##$TPNAME5= <>
##$TPNAME6= <>
##$TPNAME7= <>
##$TPOAL= (0..7)
0.5 0.5 0.5 0.5 0.5 0.5 0.5 0.5 
##$TPOFFS= (0..7)
0 0 0 0 0 0 0 0 
##$TUNHIN= 0
##$TUNHOUT= 0
##$TUNXOUT= 0
##$USERA1= <user>
##$USERA2= <user>
##$USERA3= <user>
##$USERA4= <user>
##$USERA5= <user>
##$V9= 5
##$VALIST= <valist>
##$VCLIST= <CCCCCCCCCCCCCCC>
##$VD= 0
##$VDLIST= <DDDDDDDDDDDDDDD>
##$VPLIST= <PPPPPPPPPPPPPPP>
##$VTLIST= <TTTTTTTTTTTTTTT>
##$WBST= 1024
##$WBSW= 4
##$XGAIN= (0..3)
0 0 0 0 
##$XL= 0
##$YL= 0
##$YMAX_a= 395868
##$YMIN_a= -488409
##$ZGOPTNS= <>
##$ZL1= 120
##$ZL2= 120
##$ZL3= 120
##$ZL4= 120
##$ABSF1= 15.48136
##$ABSF2= -2.570489
##$ABSG= 5
##$ABSL= 3
##$ALPHA= 0
##$AQORDER= 0
##$ASSFAC= 0
##$ASSFACI= 0
##$ASSFACX= 0
##$ASSWID= 0
##$AUNMP= <proc_1d>
##$AZFE= 0.1
##$AZFW= 0.1
##$BCFW= 0
##$BC_mod= 2
##$BYTORDP= 0
##$COROFFS= 0
##$CY= -3
##$DATMOD= 1
##$DC= 0
##$DFILT= <>
##$DTYPP= 0
##$F1P= 0
##$F2P= 0
##$FCOR= 1
##$FTSIZE= 16384
##$FT_mod= 6
##$GAMMA= 0
##$GB= 0
##$INTBC= 1
##$INTSCL= 3.70164e-10
##$ISEN= 128
##$LB= 0.24
##$LEV0= 0
##$LPBIN= 0
##$MAXI= 10000
##$MC2= 0
##$MEAN= 0
##$ME_mod= 0
##$MI= 1.114404
##$NCOEF= 0
##$NC_proc= -5
##$NLEV= 6
##$NOISF1= 3.799351
##$NOISF2= 2.8
##$NSP= 0
##$NTH_PI= 0
##$NZP= 0
##$OFFSET= 15.41304
##$PC= 1
##$PHC0= -24229.05
##$PHC1= 12.05269
##$PH_mod= 1
##$PKNL= yes
##$PPARMOD= 0
##$PSCAL= 0
##$PSIGN= 0
##$REVERSE= no
##$SF= 200.130021746089
##$SI= 16384
##$SIGF1= 3
##$SIGF2= 2
##$SINO= 5.538805
##$SIOLD= 16384
##$SREGLST= <1H.CDCl3>
##$SSB= 0
##$STSI= 16384
##$STSR= 0
##$SW_p= 3612.71676300578
##$SYMM= 0
##$S_DEV= 0
##$TDeff= 16384
##$TDoff= 0
##$TI= <>
##$TILT= no
##$TM1= 0
##$TM2= 0
##$TOPLEV= 0
##$USERP1= <user>
##$USERP2= <user>
##$USERP3= <user>
##$USERP4= <user>
##$USERP5= <user>
##$WDW= 1
##$XDIM= 16384
##$YMAX_p= 321688807
##$YMIN_p= -671860
$$ End of Bruker specific parameters
$$ ---------------------------------
##NTUPLES= NMR SPECTRUM
##VAR_NAME=  FREQUENCY,     SPECTRUM/REAL,   SPECTRUM/IMAG
##SYMBOL=    X,             R,               I
##VAR_TYPE=  INDEPENDENT,   DEPENDENT,       DEPENDENT
##VAR_FORM=  AFFN,          ASDF,            ASDF
##VAR_DIM=   16384,         16384,           16384
##UNITS=     HZ,            ARBITRARY UNITS, ARBITRARY UNITS
##FACTOR=    0.220516191357247, 1,           1
##FIRST=     3084.61206262085, 0,            0
##LAST=      -528.104700384927, 0,           0
##MIN=       -528.104700384927, -671860,     0
##MAX=       3084.61206262085, 321688807,    0
$$ Real data points
##PAGE= N=1
##DATA TABLE= (X++(R..R)), XYDATA
$$ [...]
7871F3145l5567m2858J6549j8997L4208j6970Q054m9170J776K3539k1524M6008
7859H193p500k8229R400j3418L700j9654k423O6311Q219k1525L8411m3469n581
7846g565O5905P690N856m3462o8022l2209N8803k0463K1047k2840L286R085k9626
7833e2515n6088N5358R0875j118P5L3100p850o0688p228j1708K1362L9838m3061
7820C52j5126k290J6149k8254o1710K6632K4365k6677N4684j7124J2746k2544
7808c8797M609K4600K1350m9096k6928J11328l0712L2313n0191k2987N1099Q200
7796C4788r188o6349Q674O819r26L7631l0251L8196l76M2305l182o0349J2818
7783A0610j8110p0126J8629R8794Ok5080j6756J9736n7511P008M6391J7605l9607
$$ y = [63145, 27578, -15280, 1269, -17728, 16480, -490, 7564, -41606, -39830, -16291, -37815, 8193, 693, -27536, -18136, -31554, -27854, -47508, -49931, 16380, 24599, 3074, 41485, -1984, -7565, 58340, 66030, 71886, 28424, -39598, -71807, -13004, -33467, -12420, -35260, -31974, -22889, -52515, -108603, -53245, 37630, 36512, 36587, 69687, 61837, 1149, -6079, -17787, 3575, 43413, 352, -14774, -17064, -915, -29169, -90879, -64247, -39882, -66559, -11875, -28999, -16253, -38797, -34188, -9588, 11762, -37334, -64262, 47066, 16354, 48667, -1524, -24511, 26588, 34788, 25600, -40749, -32075, -25256, -26182, 11449, -18802, 19394, 19018, 61323, 58141, -2208, 10610, -7500, -77626, -58997, 39797, 39803, 14723, -2033, 17703, -39808, -32800, 13591, 31196, -8411]
7770h411K636M9242J9211L039m5221L3147k3749j3899k4450j645M5266l0621J3089
7757A7634K3856J3423o7381p945O0872r085O208k5261J9645j6101L0500K0894
7745F7259R994J655k5425L0895k0932m0250L1066j653R303k6617J7007J1255k6983
7732C6574k0298j1872L8876K3872o1072J4761L0251k0930l2606L6618J7560m787
7720D6947m0549k6689J9255Q7570o5257m1845K6560N085m1029M5028p630o8810
7708f1364K1496j5882M6272K7353m2780m3145K835L1555k5846m1892K6289L8350
7696c6759j3046K6004K0857k463L5685l1960J9058m096J0149k7034k8831k0382
7684e2818R280K4098L3908m6676P8063J2579o4881Q902K2340L8898j4491l68J271
$$ y = [-8411, -5775, 43467, 62678, 65717, 20496, 53643, 29894, 15995, -8455, -10100, 35166, 4545, 17634, 41490, 54913, -12468, -20413, 40459, 31374, 37582, 12321, 31966, 15865, 46365, 67259, 77253, 78908, 53483, 84378, 63446, 23196, 54262, 52609, 61912, 35295, 52302, 63557, 36574, 16276, 4404, 43280, 67152, 6080, 20841, 51092, 30162, -2444, 34174, 51734, 46947, 6398, -20291, -1036, 86534, 21277, -20568, 5992, 11077, -29952, 15076, 7446, -61364, -39868, -55750, -9478, 17875, -24905, -68050, -65215, -33660, -59506, -101398, -75109, -36759, -49805, -23801, -2944, -5407, 30278, -1682, 17376, 13280, 23429, -3605, -32436, -52818, -43538, -19440, 14468, -32208, 45855, 58434, -6447, 2455, 24795, 63693, 49202, 48834, 50105]
7671E0105m3796k7704J274k940l688O791L0603j8755l377K4215P984j2174J707
7658A0245q1132L3878O5990k0504Q039L901j1128J339m7117l634L6780j1557R629
7645e271J6693R128m5659j3914J7018Q6176l7901k331K0886l8965k8621N616p0648
7632h7793N0898O6914n1855m7081j8753K1913J6448K9408O9715j8173J449n932
7620B7158o5638J4340j7973J4317N0114j9511k7435J2470p680j4500K0540j3347
7608b7145l5497J1262M1009L4777j1240o1155P722P462J8028k1526m2093j4233
7596i2629M0493J658R974k5236k1255M646j5398M7756o332l006K4413o2469q080
7583a05465M0934L1720O98k5670j2355O9816J8311n5390j3451N784L2116K3149
$$ y = [50105, 6309, -21395, -20121, -23061, -26749, -19958, 10645, -8110, -11487, 12728, 20712, 8538, 10245, -70887, -37009, 28981, 8477, 16516, 20417, 9289, 10628, -36489, -40123, -3343, -14900, -5271, 11422, 20550, -25109, -39023, -22005, 64171, 26270, 23939, 44825, 5860, -22761, -17145, -87793, -36895, 30019, -21836, -68917, -87670, -65757, -49309, -19901, 49814, 31641, 33090, 27158, -38480, -24140, -42113, -27796, 22318, 2807, -24628, -12158, -19838, -34338, -13798, -27145, -62642, -51380, -10371, 24406, 13166, -47989, -40267, -32805, -14777, -36303, -78396, -92629, -52136, -50478, -40504, -65740, -86995, -82349, -97747, -49991, -56323, -59329, -34916, -97385, -105465, -64531, -32811, -32113, -57783, -70138, -322, 17989, -37401, -50852, -45068, -12952, 10197]
7571A0197j512j0570J9319k6675k3681k5880J2233K3373J6269M3046L433p5646
7559c6094k6625J0696L5414q914o482J9970r444l5056N346J8644r826l1692J5883
7546e8180O4750M2120o2309n366N1045p685k4352K1005m0333L1295j1511l3274
7534c2795J9348O3856p3392j7617l223M3959o1478j468k625L4574k183j9443K7072
7521b5415L3107l593p4306J9867k2564P876o668J010l9707J1543j143L8117o694
7508f8570N4262J0461o833J4237O507j1588m4689j908P0659j6874r343K3477j6948
7495B850K4697m2951k32K4594J9l6943k5367N3696K413m7456K7384k6446K8905
7482a4837K5985m5610j8757k9551M9577o019j7433J9173L8090l6173p125l879
$$ y = [10197, 8685, -1885, 17434, -9241, -32922, -58802, -46569, -23196, -6927, 36119, 39552, -36094, -62719, -52023, -16609, -25523, -32005, -12035, -21479, -56535, -51189, -32545, -42371, -74063, -58180, 6570, 48690, -13619, -18985, 32060, 24375, 23, 21028, -19305, 11990, 479, -32795, -13447, 50409, -22983, -40600, -43823, 136, -61342, -62810, -65435, -30861, -33044, -52487, -25415, 7692, 4099, -70207, -50340, -72904, -65028, -71696, -70686, -110393, -98850, -99993, -61876, -68570, -14308, -3847, -10680, 3557, 10064, -1524, -46213, -48121, 22538, 5664, -3679, 19798, 2850, 27547, -15404, -15636, 8958, 8977, -27966, -53333, 363, 2776, -44680, -17296, -43742, -14837, 11148, -34462, -53219, -82770, -33193, -39212, -56645, -37472, 618, -35555, -42680, -46559]
7470d6559J4441k5316J7075L0917J1102n2957K4965P26m3745M8969L5167l0896
7458a6111j3302J6933K1289J8505j2898L468l4200r99M670J040m1160L2729k2304
7445d2340n0619N1497Q682k9006n335P04Q4655j2981j8690K1402m029l0394l014
7432b9468J7790Q851k1176j6267L375q334N1048j5838n889n075j3389K8139L1265
7419B5032m3007J655j634r246L7134m0180j8127J5698q275p4739J9542N1784N2382
7406H019Q465l8153j1238k1913j8831n558J2552J1270M6391N798l3666p141N6603
7393A2598N466k5654k7435r543l0912P7796L7787p5894N783M5689j6247M0875
7381D0309k4436j1051n0910n4510J5963L3172K162R82K4764J4558o294k032N9317
$$ y = [-46559, -32118, -57434, -40359, -9442, 1660, -51297, -26332, -25606, -69351, -20382, 14785, -16111, -29413, -12480, 8809, 27314, 14416, 17884, -16316, -17315, -12645, -11605, -52765, -20036, -42340, -92959, -41462, -32780, -61786, -67121, -66417, 18238, 5257, -13433, 7969, 3940, -26454, -29468, -11678, -2827, -24003, -40270, -36895, -45229, 5819, -10019, -15908, -20983, -34372, -6233, 25032, -17975, -16320, -17954, -27200, 9934, -30246, -48373, -32675, -40950, -115689, -96147, -44363, 8019, 16484, -21669, -32907, -54820, -73651, -79209, -66657, -55387, -8996, -3198, -36864, -44005, 12598, 18064, -7590, -35025, -44568, -75480, 2316, 40103, -35791, -30008, 15681, -566, 40309, 15873, 4822, -46088, -100598, -84635, -51463, -49301, -48319, -23555, -8997, -15291, -17323, 41994]
7368D1994k0962k8545P985k2637L4512p714k9045L4571k253k5864K843q105M3446
7355B0226J1706n478M2718q752o2713r588M3872n0628J1198M1343l0327m4742
7343d1165N9716N1023l1113l0136j7263j2778j3000k0091K2968K9688j2233K5985
7331A1601J0337j208m0533m7283Q983L5073J9949n3490k2858K4998L3440N9679
7319C8688K856n3692K7037n595K0440o0290k17K5742J0017j6258j2642q491l314
7306c5719J285K8896l1751N4500K8456o9905m4766j9022N6249J9437J3865j8629
7294a7104m6199L4616L6418k9113J1537M458K7260k8786j6771K0898k6789L9662
7282A0087l7227p055N588N371O980n2566k2814M7466K0012Q017n375k6797O508
$$ y = [41994, 21032, -7513, 472, -22165, 12347, 4633, -24412, 10159, 7906, -17958, -15115, -23220, 20226, 31932, 26454, 69172, 60420, -2293, -11881, 31991, -18637, -7439, 33904, 3577, -41165, 18551, 69574, 38461, 8325, -8938, -21716, -34716, -54807, -31839, -2151, -14384, 11601, 21938, 20730, -19803, -67086, -58103, -23030, -3081, -56571, -79429, -54431, -20991, 38688, 41544, -12148, 14889, 9294, 29734, -30556, -30773, -5031, 4986, -11272, -23914, -32405, -35719, -34434, -5538, -37289, 17211, 45667, -24238, -69004, -88026, -31777, -12340, 1525, -17104, -63303, -28687, 7731, -21382, -9845, -5387, 21873, -6913, -23684, -2786, -29575, 10087, -27140, -34195, -28607, -23236, -16256, -68822, -91636, -44170, -24158, -16141, -21516, -48313, -41805]
7269d1805j1029J7976k7555L6257k6066q147J132L4932k1220j504k8578J1451
7257f4156N7649k016j7375o0477L8619J3909k691N152m945p83r301P822L4365
7244d228j5926K9005j5085p494m3629K271J881N820j0375j8707O4684K6538q023
7231F732p11Q770L2797n4857j0866m526K5490l26k8223m4463L2477K7646j6256
7218b6316L2384K9794j6073p5074L7866L135l9372j1412N7592j3260k2399k9158
7206g2293j2898J1496J6856J151L5510O572k0346n0505J6924l890P265J0061M249
7193d9848m2167N4394K5362l1769J9263N674l7744k7973N3783M371m9942Q580
7181f8016J4858R606o395N3821k7731l6251K1796m5911J6840J9052L749K5256
$$ y = [-41805, -52834, -34858, -62413, -26156, -52222, -60369, -59237, -24305, -45525, -47029, -75607, -64156, -6507, -8523, -25898, -86375, -47756, -33847, -36538, -31386, -36331, -37114, -46415, -38593, -4228, -20154, 8851, -6234, -13728, -57357, -55086, -53205, -47385, -57760, -76467, -11783, 14755, 6732, 6021, 14791, 47588, -7269, -18135, -22661, 2829, 2503, -25720, -70183, -37706, -10060, -26316, 6068, 35862, 19789, -55285, -17419, -14284, -53656, -65068, -7476, -20736, -43135, -72293, -85191, -73695, -56839, -55688, -20178, -13606, -33952, -84457, -67533, -71423, -64158, -54097, -49848, -92015, -37621, -12259, -44028, -24765, -19091, -56835, -84808, -31025, -26654, -76596, -68016, -53158, -43552, -49947, 3874, -23857, -60108, -38312, -84223, -67383, -48331, -44582, -19326]
7169a9326O365K640l8275n370J3338M2777n540K136K457m3184M706K8023L9607
7156C0354k1246m5352j6727K2979l3829J3023K6036k1893K9278m83L4437k6901
7144a0324o760k5519l5698P659J7188J0672J031k280N8561m161l9783K1810m1550
7131d9154J4617K8084o974J9391l1953m7285k4832O0943L1379m9131j1427M4272
7119b2070K0021o4399j1821L3423M8970J9593N1416q3666j3177L7032l0410o578
7107b1666j1335K1804L3928l6525J7855j1362J2362K9556k1928l5183j013J926
7095b1581L0256l8492j1098p571M1251L423k002L9512K536m4253l6583m6533N0998
7082d0137j297J0177j2243n8522K7950L5125J3691j9762m0349M8857L3254o344
$$ y = [-19326, -12961, -10321, -48596, -53966, -40628, 2149, -3391, -1255, 1202, -41982, -37276, -9253, 30354, 9108, -36244, -52971, -29992, -63821, -50798, -24762, -46655, -17377, -17860, 16577, -10324, -17084, -42603, -78301, -70642, -53454, -42782, -41751, -44031, 14530, 10369, -29414, -7604, -49154, -34537, -6453, -13427, 5964, -25989, -73274, -98106, -37163, -5784, -54915, -66342, -22070, -2049, -66448, -78269, -44846, 4124, 23717, 75133, -8533, -21710, 15322, -15088, -21666, -33001, -11197, 22731, -13794, 4061, -7301, 5061, 34617, 12689, -22494, -23507, -21581, 8675, -29817, -40915, -48486, -7235, -3812, -5814, 33698, 36234, -8019, -44602, -91135, -40137, -41434, -31257, -43500, -102022, -74072, -38947, -25256, -45018, -85367, -36510, -3256, -9600]
7070i600l392j1963K1384j0483j4636P213m837J7505m8227L0467k9358k2685M3048
7057c5564N174j1929j28K0822L5968k1293m6512N759j0548j2101R266P2108J0975
7044B1997l5077j0229N304k9224O614k7438q936K8381K3275k5135K0454L7211
7032G197M8355m6405j4796k0260P187r771K774k3908K1794K5415L0609j7177m5763
7019c4749O646K7994J4042M211K8614p3061l0306K4199j1233M1077J9834l6870
7007a9602P42L8393l4253n929l0756P8023J5346l3650j0613k4413k5139J4852
6995c6999n1010k0218L4901J8967j840L506K5932m8314R794J2670k8061L261k0138
6982i7549M0412K2507K8426j3342o550J5052l4375O075j5049N1648o705n359n0588
$$ y = [-9600, -12992, -24955, -3571, -14054, -28690, -21477, -26314, -8809, -57036, -26569, -55927, -78612, -35564, -30390, -42319, -42447, -21625, 14343, -6950, -53462, -47703, -58251, -70352, -61086, 11022, 21997, -13080, -23309, -18005, -47229, -40615, -68053, -76989, -48608, -25333, -50468, -30014, 7197, 55552, 9147, -5649, -25909, -18722, -28493, -25719, -49627, -27833, -2418, 28191, 11014, -34749, -28103, -109, 13933, 18144, 46758, -26303, -56609, -32410, -43643, -2566, 17268, -19602, -18860, 19533, -14720, -20649, -51405, 26618, 41964, 8314, -2299, -26712, -51851, -36999, -88009, -108227, -73326, -54359, -56199, -52693, -26761, -75075, -65281, -52611, -80672, -77411, -97549, -57137, -34630, -6204, -19546, -26096, -11044, -45419, -39344, -54393, -2745, -9450, -14809, -65397]
6969f5397p732J5026q034M1718R693p550O9389l2476K1277K6698o0224l5696J7062
6956a6246n294R399k1709K0993N4147k915q0824m0162O598L016j5086Pm9030K0286
6942a16820P9325K6108L4627p1535P507j0789j1048N6133L051m5718j606l3449
6930h4214J872k652O2861P494k3868m7986o590O0558L4813K1951m0783k3088m0068
6917g9700M4042J2785r562J5086l1065J590L0570k6989M5294k8840j1544l0563
6905f8896K6800N3308p6103J6488j778J1399j2644J8659k061J7487L1354Q882
6893B2895n8942m4071J9937L2985N4263o44L4078Q363l9886n3936m1161l4813
6881a00932l4810m5O1355N9648J9436k2971k9507j3570p217N1608J0k4368O0460
$$ y = [-65397, -73129, -58103, -66137, -24419, -14726, -22276, 47113, 14637, 35914, 62612, 2388, -33308, -16246, -21540, -12141, -33850, -12857, 41290, 38375, -42449, -82611, -76013, -72997, -88083, -88076, -137106, -116820, -37495, -11387, 23240, -48295, -40788, -51577, -62625, -6492, -3441, -49159, -50765, -84214, -82342, -84994, -22133, -14639, -38507, -86493, -93083, -32525, 2288, 24239, -16544, -39632, -79700, -35658, -22873, -32435, -17349, -48414, -46824, -16254, -43243, 2051, -26789, -38333, -68896, -42096, 11212, -64891, -48403, -50181, -38782, -51426, -32767, -34828, -17341, 14013, 22895, -36047, -80118, -60181, -27196, 27067, 26423, 60501, 68864, 28978, -24958, -66119, -100932, -135742, -135787, -74432, -14784, 4652, -18319, -47826, -61396, -68613, -17005, -16995, -41363, 19097]
6868A9097O2590j9047n9103k5184j6454J8587L1099k1385J7246J2136q026j82
6856A1374l6088M8789J4956k0732o3033l5810N7033J5488k1334J5965j8831J7584
6844a4639r797J6666j875K1670J9105l6518k0359N9522l1251k9831J7745j08r774
6831a9444p7749P0221O2021l4397L2908q167J1178o0957L8189P4774p9434p344
6819A799L6100m871k7121k2726M8317q05m1467o701J2508J6639L9357j3644j0929
6806B6456K9040M0625l441k4109O791j1272M079k4679j1158j698J7538k1160N3214
6793H0226l9361P950p095K9545j0376j8213K8552n612k2074J0552k6501L4170
6781F1763J3575K427j9885k6376K101Q575K828J6385J8575J9383P894P299m525
$$ y = [19097, 81687, 62640, 3537, -21647, -38101, -19514, 11585, -9800, 7446, 19582, 11556, 11374, -24714, 24075, 39031, 18299, -44734, -80544, -23511, -8023, -29357, -13392, -32223, -14639, -24436, -7770, -9645, 12025, 31130, -5388, -25747, 33775, 2524, -27307, -9562, -9670, -19444, -97193, -26972, 35049, 652, 33560, 25393, 36571, -24386, 13803, 88577, 9143, 1799, 37899, 33028, 5907, -16819, 31498, 30693, -10774, -17475, -4967, 11672, 51029, 37385, 26456, 55496, 96121, 92680, 68571, 75362, 64090, 68169, 43490, 32332, 30634, 48172, 27012, 80226, 40865, 48815, 41720, 71265, 60889, 42676, 71228, 65616, 43542, 54094, 27593, 61763, 75338, 77765, 57880, 31504, 33605, 42180, 45008, 61393, 79968, 99351, 107245, 114544, 110019]
6768A10019K7322J4934m6009K5142k1997R00r206M2569J5108p605K3212j6637
6756A57752l8236k1246L7794p354M5565L2820J5303k4966j2878l650N6363j674
6744B35593J2507J1796Lk4884J421L5668J4212L1785J1696L1431k6422J2777o739
6731C40844k3141m090j7165k0069L7019q1943J8957j2373L4309L4221J4004M2520
6719C63093j1792O3515N3271K5145K0795K4896O8480J1407l5699J0591l1308l5903
6707E26491J2347l3985n6249m3226l4419j4479l4405r069M2032M7596n3069M7240
6695C96805k1527l6468O6345k1134L5487L7213j4695K5962L4498M3496J725n9620
6683D88087k3785k6409qm7928M1762r074q1048k4251r24K5820K5265k5266L7484
$$ y = [110019, 137341, 152275, 106266, 131408, 109411, 110311, 101105, 143674, 158782, 151177, 174389, 157752, 119516, 98270, 136064, 128710, 174275, 207095, 222398, 197432, 184554, 180904, 237267, 235593, 248100, 259896, 259899, 235015, 236436, 272104, 286316, 318101, 329797, 361228, 334806, 347583, 340844, 317703, 313613, 296448, 276379, 313398, 231455, 250412, 238039, 272348, 306569, 320573, 363093, 351301, 414816, 468087, 493232, 514027, 538923, 607403, 618810, 583111, 593702, 562394, 526491, 538838, 504853, 448604, 405378, 370959, 356480, 322075, 313006, 355038, 402634, 349565, 396805, 375278, 338810, 405155, 384021, 419508, 456721, 442026, 467988, 502486, 545982, 547707, 488087, 464302, 437893, 437885, 389957, 431719, 422645, 341597, 317346, 316422, 342242, 367507, 342241, 379725]
6670C79725r13l4163K5817j8506M3404n0521M9782J1897l0276k7598M2243L4922
6658D25813R171N9360k5826M9061p461o67j5808p409Q616j9402m8919P4487M569
6645E05585m3791p988J5820K4668J5918K2421m0750N165l4018N72K6630l2100
6633D58132L3594o46K3832k6648K1833J4374l854N988l068K339J0411m969L0349
6620E61667K9605J845J4429j0649m3673q056O0444k453j0812l4530k7539J1118
6608E41396j3562J0051L1472l5180j0470K1142N9957m247M1919L0658k259j4510
6596F56367j2780N937M4217K8068m6338O6100O760n7441R8577M308j8323K7573
6584H03025k136l2126j950j0383L1566P412k9638N408J5103q464J6080j0484J6997
$$ y = [379725, 378812, 344649, 370466, 351960, 395364, 344843, 394625, 406522, 376246, 348648, 390891, 425813, 434984, 494344, 468518, 517579, 510118, 509451, 493643, 486234, 494850, 475448, 426529, 501016, 505585, 461794, 453806, 469626, 494294, 510212, 532633, 491883, 497048, 463030, 463602, 490232, 458132, 491726, 491080, 514912, 488264, 510097, 524471, 520617, 526605, 523537, 525876, 536287, 531318, 561667, 591272, 593117, 607546, 596897, 553224, 545168, 605612, 603159, 592347, 557817, 530278, 541396, 527834, 537885, 569357, 534177, 523707, 544849, 604806, 600559, 642478, 673136, 670877, 656367, 643587, 649524, 693741, 721809, 675471, 741571, 748331, 690890, 789467, 793775, 775452, 803025, 800889, 768763, 766813, 756430, 787996, 795408, 765770, 771178, 786281, 777817, 793897, 783413, 800410]
6571H00410j8104l0445M9563O3585k9072k5146J33334J9670Q2941O2527k5056
6560A084207L3391K4054M032K7109r197j3209J9167J1343Q171M417o8808Q583
6548A133260m3206m9693N0212J3257l609N483K4127m558O3693l2833N6166Q199
6536A220498M5375J4904R7314J01394L5480O8226P6892J04608L7596O1716K846
6525A866849m7475n0900m5552n4194K4158p620L4527L5784M916N8994J23040R0194
6513B032721N3567M6692r05L7918L3849P5128J44436J52826J68784P0383O3436
6502B878835L2044J8760K1812M852m6284K4042P5124M0500P6364O9245J20079
6491C315373J01844J41441J24050O7882O4266Q7223R6083O0906R9505O7360N3646
$$ y = [800410, 782306, 751861, 801424, 865009, 835937, 810791, 944125, 963795, 1046736, 1109263, 1084207, 1117598, 1141652, 1145684, 1172793, 1163596, 1150387, 1169554, 1180897, 1189068, 1193485, 1124677, 1133260, 1090054, 1040361, 1090573, 1103830, 1100221, 1105704, 1129831, 1125273, 1188966, 1156133, 1212299, 1220498, 1265873, 1280777, 1378091, 1479485, 1514965, 1583191, 1660083, 1764691, 1802287, 1864003, 1866849, 1819374, 1768474, 1722922, 1668728, 1692886, 1685266, 1719793, 1755577, 1760493, 1819487, 1942527, 2032721, 2086288, 2132980, 2132075, 2169993, 2203842, 2278970, 2423406, 2576232, 2745016, 2815399, 2878835, 2910879, 2929639, 2951451, 2956303, 2910019, 2934061, 3009185, 3049685, 3126049, 3195294, 3315373, 3417217, 3558658, 3682708, 3750590, 3814856, 3902079, 3998162, 4059068, 4158573, 4225933, 4279579]
6480D279579J35390J34884O0825J13538J31370R3463Q9410J55916Q3471J04608
6470E382454J39892J30621J66433J89828J11228J52772J82773J67090J61373J98926
6460F983390K19364J98780K43058K31387L26461K92173K62233L31595L86840L34661
6450I809942K90061L22062L87993M41282M90798N33728N63922O41216P06034Q56606
6440A5043644R30912J027941J224704J374677J694032J998809K465176K966653
6432B8726548L540768M240648M623620M433835L187397J126182j165080k697073
6424D6016845l238762l195697k617448k094134j536056j130964o56440k62959
6416C1284385J95096N12235J046218J479580J894765K532093L289048M230034
$$ y = [4279579, 4414969, 4549853, 4610678, 4724216, 4855586, 4949049, 5038459, 5194375, 5277846, 5382454, 5522346, 5652967, 5819400, 6009228, 6120456, 6273228, 6456001, 6623091, 6784464, 6983390, 7202754, 7401534, 7644592, 7875979, 8202440, 8494613, 8756846, 9088441, 9475281, 9809942, 10100003, 10422065, 10810058, 11251340, 11742138, 12275866, 12839788, 13481004, 14187038, 15043644, 15974556, 17002497, 18227201, 19601878, 21295910, 23294719, 25759895, 28726548, 32267316, 36507964, 41131584, 45565419, 48752816, 49878998, 48713918, 46016845, 42778083, 39582386, 36964938, 34870804, 33334748, 32203784, 31547344, 31284385, 31479481, 31991716, 33037934, 34517514, 36412279, 38944372, 42233420, 46463454]
6408D6463454N372683O791926Q124553R164328Q978615O613836J938697l384639
6400I0063453p370125q933215q787772p571494o270447n046796m029637l217201
6392C8836766k561369j890560j433243r66407m43921k7163M05028R81166J574676
6383C4474973K316887L091200L777571M328053M234724K860380L18933k340713
6375E3062008m317612n036010m931433m412489l792046l192450k726708k347161
6367B2306099j970442j636054j411052j319443j021273q64481p31455o00189n02624
6358A2249086m76127l23030k24161j97064j08894j25239j30339j60078l12556
6349A0191598m38492l79328l43990k66877k79105k10696k83263k60500k06316
$$ y = [46463454, 51836137, 58628063, 66752616, 75916944, 84895559, 91509395, 93448092, 90063453, 82693328, 73760113, 64972341, 57400847, 51130400, 46083604, 42053967, 38836766, 36275397, 34384837, 32951594, 31985187, 31541266, 31514103, 31919131, 32900297, 34474973, 36791860, 39883060, 43660631, 47988684, 52223408, 55083788, 55402721, 53062008, 48744396, 43708386, 38776953, 34364464, 30572418, 27379968, 24653260, 22306099, 20335657, 18699603, 17288551, 15969108, 14947835, 14083354, 13351899, 12751710, 12249086, 11772959, 11449929, 11225768, 11028704, 10919810, 10794571, 10664232, 10504154, 10191598, 9753106, 9373778, 9029788, 8762911, 8483806, 8273110, 7989847, 7729347, 7523031]
6340G523031j74237k23207j16690j44145j06213r4682k8115q601M569J1490m9376
6329F593824n9593J20264J43936K31101L02351L66825N68281O54129Q03085P05602
6319A0429805M10979L888m12190p33023q19389p19909n74598m25738l39412k73680
6309F546733j93668j41123m1965k5058O114q1606o8952n8719L2156J45451J75449
6298F294812K11005K05534J62417O7501J31752K01803K43569M21216N97957Q20851
6288I358417P59613N09602l0183m91597p68406q88129o42621m68804l33035l37787
6278F667070j54604n6071j46653j92487k40918j94650p3693n4231L627N6848N1555
6267E665793J6337l5518k8196m6162n4164o5067M5777P2151J68907K01921K91960
$$ y = [7523031, 7348794, 7125587, 7008897, 6864752, 6758539, 6663857, 6635742, 6627141, 6631710, 6643200, 6593824, 6534231, 6654495, 6798431, 7029532, 7331883, 7698708, 8266989, 8921118, 9724203, 10429805, 10840784, 10844672, 10432482, 9699459, 8880070, 8160161, 7585563, 7159825, 6820413, 6546733, 6353065, 6211942, 6169977, 6144919, 6151033, 6069427, 6000475, 5941756, 5973912, 6119363, 6294812, 6505817, 6711351, 6873768, 6941269, 7073021, 7274824, 7518393, 7939609, 8537566, 9358417, 10118030, 10627632, 10597449, 10105852, 9337446, 8449317, 7806696, 7337892, 7004857, 6667070, 6512466, 6456395, 6309742, 6117255, 5876337, 5681687, 5607994, 5553763, 5557390, 5614238, 5665793, 5682130, 5646612, 5618416, 5572254, 5518090, 5453023, 5498800, 5570951, 5739858, 5941779, 6233739]
6256F233739M17430K18851l6757k59099m16513l08330k60654j89423j30759J9672
6246E288157O3984J22749K21116J54723J47716J64714l980j76979k66026l31118
6236E385056k66066k51834k16361j41311j79674r3945j1654O033J4106M3352K27286
6225D514988K25187K32439J62427n658k21172j34563j01950k6855M0273O3368
6215D748484J836n7183n8907j26174j57312j58716j43151j32682r2876J979k143
6204C823155J5791K0925j344J01970O6790j0154n7736n2166N6194N1537N3602
6193D068564Q7531Q9913O8465K4450o1092k9277k5072n176l1081j6227K1020J8136
6181D210154J04838r81J01056R0648J16856J03964O2750J05642O2754Q4680J04449
$$ y = [6233739, 6651169, 6870020, 6833263, 6574164, 6157651, 5849321, 5588667, 5399244, 5268485, 5288157, 5352141, 5474890, 5696006, 5850729, 5998445, 6163159, 6159179, 5982200, 5716174, 5385056, 5118990, 4867156, 4650795, 4509484, 4329810, 4235865, 4224211, 4230244, 4244350, 4287702, 4514988, 4740175, 4972614, 5135041, 5129383, 4908211, 4773648, 4671698, 4644843, 4685116, 4748484, 4750320, 4693137, 4634230, 4508056, 4350744, 4192028, 4048877, 3916195, 3823319, 3825298, 3823155, 3838946, 3859871, 3858527, 3960497, 4027287, 4017133, 3959397, 3907231, 3963425, 4014962, 4068564, 4156095, 4246008, 4314473, 4338923, 4277831, 4248554, 4223482, 4218306, 4187225, 4170998, 4192018, 4210154, 4314992, 4314011, 4415067, 4505715, 4622571, 4726535, 4789285, 4894927, 4957681, 5042361, 5146810]
6170E146810P0967M8243R9901J35437J0850r492O1578R6196R8970J18392J05453
6159E983305J38505J17899O6319J34075J83716J07993J31184J87191J78960K27745
6149G456892K20438K04111J84464K08763K53282K57053K97999K73285K45975K26424
6139I828686L13344L45734M27989L63465L75699L85292M65954N01626N97923O68677
6129A4274389O76593Q35410Q77171J096968J227277J444207J691663K016235K553291
6120B6693204L215627M029737M914875N826661O445012N557895K426964j239629
6112E7870346l472880l903268l154127j982794q10035L78201J575305K692378
6104D9193126L833285L463032J564326j44779l78626O94424K208795L487623L717413
$$ y = [5146810, 5217777, 5266020, 5365921, 5501358, 5512208, 5502716, 5564294, 5660490, 5759460, 5877852, 5983305, 6121810, 6239709, 6306028, 6440103, 6623819, 6731812, 6862996, 7050187, 7229147, 7456892, 7677330, 7881441, 8065905, 8274668, 8527950, 8785003, 9083002, 9356287, 9602262, 9828686, 10142030, 10487764, 10915753, 11279218, 11654917, 12040209, 12506163, 13007789, 13605712, 14274389, 14950982, 15786392, 16663563, 17760531, 18987808, 20432015, 22123678, 24139913, 26693204, 29908831, 33938568, 38853443, 44680104, 51125116, 56683011, 59109975, 57870346, 54397466, 50494198, 47340071, 45357277, 44547242, 44925443, 46500748, 49193126, 53026411, 56489443, 58053769, 57908990, 57530364, 58224788, 60433583, 63921206, 67638619]
6095F7638619K323675m08559k916059m066736l704878k512376j131434L72735
6087E5594987J467629J059865j014428k961069l379101k518910j190075K83037
6079D7341935J654964L060732M297746M840484L272265p17544m771435o831926
6071E2147221o807363o015795m990614m018091l328642k779018k272964j825512
6063B0109222j551877j288835j219874j032478q82296p98034o96037p26322n33734
6054A1379735n19606m18493l92107l80861l86016k98868k90456k86930j91549
6045H214849j98712j98627j76760j41235k23884k20849k26117j82001j47794j92313
6035F306557k04049j57468j51314j41745j83517j08933j12400k04654j32681n8760
$$ y = [67638619, 69962294, 69553735, 66637676, 62570940, 58866062, 56353686, 55222252, 55594987, 57062616, 58122481, 57108053, 54146984, 50767883, 48248973, 47058898, 47341935, 48996899, 52057631, 56355377, 61195861, 64468126, 63750582, 58979147, 52147221, 45339858, 39324063, 34333449, 30315358, 26986716, 24207698, 21934734, 20109222, 18557345, 17268510, 16048636, 15016158, 14133862, 13335828, 12639791, 11913469, 11379735, 10860129, 10441636, 10049529, 9668668, 9282652, 8983784, 8693328, 8406398, 8214849, 8016137, 7817510, 7640750, 7499515, 7275631, 7054782, 6828665, 6646664, 6498870, 6306557, 6102508, 5945040, 5793726, 5651981, 5468464, 5359531, 5247131, 5042477, 4909796, 4851036]
6025D851036j35975r3341j15239r0684p8894p5812q6122q2096j06655j21937l0958
6014C833323m0103L1451r777o6852l5912j3562k2306k0089L7334p0866k1109J6484
6002C618016n914l3997l5578l5981l8956j3807m7543o0952r0669p0253p1205J1909
5990C125070R157l8554l7527j9325m25O1924L81j3957j1907P1026Q9735P3188
5978C308786M0850K3754M4921p3029k0452k215q8410m4717J1004m3221N581Q201
5966C171053L7350p152L8Q7033M1507L3179l1857q42J350O455O4395R2636J09255
5953C604400M6269N4979R5272K2987K5283P7N1184k066K2825R8766M0307N6852
5941D117135J27324L5757J00994J51391J62294P7545J19485P7578J4181K5767
$$ y = [4851036, 4715061, 4621720, 4506481, 4415797, 4336903, 4261091, 4174969, 4092873, 3986218, 3864281, 3833323, 3793220, 3824671, 3814894, 3748042, 3712130, 3698568, 3676262, 3656173, 3693507, 3622641, 3601532, 3618016, 3612102, 3578105, 3542527, 3506546, 3467590, 3453783, 3406240, 3345288, 3254619, 3184366, 3113161, 3125070, 3134227, 3095673, 3058146, 3038821, 3038396, 3100320, 3100701, 3086744, 3074837, 3145863, 3235598, 3308786, 3349636, 3373390, 3418311, 3345282, 3324830, 3322615, 3234205, 3189488, 3200492, 3157271, 3162852, 3171053, 3208403, 3201251, 3201289, 3288322, 3329829, 3363008, 3331151, 3330309, 3331659, 3338114, 3402509, 3495145, 3604400, 3650669, 3705648, 3800920, 3823907, 3849190, 3849267, 3900451, 3898385, 3921210, 4019976, 4060283, 4117135, 4244459, 4280216, 4381210, 4532601, 4694895, 4772440, 4891925, 4969503, 4983684, 5009451]
5931E009451J9N4928O3150o28J23550Q0452O7316P7945J39168J05137J10871J73519
5919F004878J05895J03586J11708J85106J45931J11152J31354J96253J68036K52905
5909G516804J74302J67267J94026K22925K40840K12741K31599L18044L27439L43962
5899I949949L13804L08620L62914L80168L66046M27172M82723N54509P02784P01552
5889A4550241P93898R73863J026989J175174J335280J571192J776748K234839
5881B5438224K717652L345817M144434M894127N542006N621839M650187K150539
5873E8504825r82747l479055m416234m240791l729264k992811k294115j682011
5865C4687797j157716o65547k72201J86599O93627J138747J588243K285205L042806
$$ y = [5009451, 5009470, 5064398, 5127548, 5126920, 5250470, 5330922, 5398238, 5476183, 5615351, 5720488, 5831359, 6004878, 6110773, 6214359, 6326067, 6511173, 6657104, 6768256, 6899610, 7095863, 7263899, 7516804, 7691106, 7858373, 8052399, 8275324, 8516164, 8728905, 8960504, 9278548, 9605987, 9949949, 10263753, 10572373, 10935287, 11315455, 11681501, 12108673, 12591396, 13145905, 13848689, 14550241, 15344139, 16318002, 17344991, 18520165, 19855445, 21426637, 23203385, 25438224, 28155876, 31501693, 35646127, 40540254, 46082260, 51704099, 56354286, 58504825, 57522078, 54043023, 49626789, 45385998, 41656734, 38663923, 36369808, 34687797, 33530081, 32864534, 32592333, 32778932, 33472559, 34611306, 36199549, 38484754, 41527560]
5856D1527560M062591N328213O740480Q398747R865830J0138083P810526K636529
5848I6508559l469137p971474r633785r237072p918583o607093n417920m313298
5840D1940197l532920k848594k241775j728568j208883p63731l60847J31875N51612
5831B9938366J075603J695043K273674K956324L573851L687284K996174R50600
5823D9146919j704405l738211m626471m518866l998294l369164k844507k386747
5815B1960254k064137j686864j444445j303541j053301r23253q11879o73606o14004
5806A1385224n07337m66340m62715l99535m09466l04080l15654k63743j83444
5797H072910j89761q9390j09629j52013j48311j96462k10784k04356j94864j57612
$$ y = [41527560, 45590151, 50918364, 57658844, 66057591, 75923421, 86061504, 93872030, 96508559, 93039422, 85067948, 75434163, 66197091, 58278508, 51671415, 46253495, 41940197, 38407277, 35558683, 33316908, 31588340, 30379457, 29615726, 29254879, 29386754, 29938366, 31013969, 32709012, 34982686, 37939010, 41512861, 45200145, 48196319, 49146919, 47442514, 43704303, 39077832, 34558966, 30560672, 27191508, 24347001, 21960254, 19896117, 18209253, 16764808, 15461267, 14407966, 13484713, 12672834, 11999228, 11385224, 10877887, 10411547, 9948832, 9549297, 9139831, 8835751, 8520097, 8256354, 8072910, 7883149, 7793759, 7684130, 7532117, 7383806, 7187344, 6976560, 6772204, 6577340, 6419728]
5787F419728j51530j43707j33658j39527p7535q9538M0547l5048j31666q910p8937
5776E470219j2341j5092n8193j0642O6500M4070k7895n5508L9296o0653l6794
5765E342967K049r9217n1557k4692l168O2255J22763J13041K22096K72248J68153
5754F126938L0292r8857j12557j35922j10420K7485R394Q4392J73220K73656K39122
5743F506743J57989j15093k20916j13497m7617p5870j3441R4739J28026k9261
5733F271802j20829k31237k58751k50009j29029r6052j17898j19031m9015k4977
5723D874974Q0873J99673J52549Q0882Q2064J90258R3109P8101l0426k33486l35315
5712E233256k81538k63635k41201j46638k06014j13999q3749j19905j33571k8340
$$ y = [6419728, 6268198, 6124491, 5990833, 5851306, 5773771, 5684233, 5724780, 5689732, 5558066, 5549156, 5470219, 5457878, 5442786, 5384593, 5373951, 5440451, 5484521, 5456626, 5401118, 5440414, 5379761, 5342967, 5345016, 5245799, 5194242, 5169550, 5166382, 5228637, 5351400, 5464441, 5686537, 5958785, 6126938, 6157230, 6058373, 5945816, 5809894, 5699474, 5726959, 5736353, 5820745, 5993965, 6267621, 6506743, 6664732, 6549639, 6328723, 6215226, 6167609, 6091739, 6078298, 6173037, 6301063, 6271802, 6150973, 5919736, 5660985, 5410976, 5281947, 5185895, 5067997, 4948966, 4899951, 4874974, 4955847, 5155520, 5308069, 5388951, 5471015, 5661273, 5754382, 5832483, 5802057, 5568571, 5233256, 4951718, 4688083, 4446882, 4300244, 4094230, 3980231, 3896482, 3776577, 3643006, 3614666]
5702C614666p059j9287M5694N2555R8287J37191J84735J60095J75775J31851P5068
5691D649571r6361j51148j36574j03370j39637j34222m7945l2756p4713n55N4729
5680C787019M3255K6343l3770L2753J10921Q9797J89892J95559K00763L57808
5670E000340M26972L96595L87389K01586N6939o0609j23142j43955p3255n5622
5660F013238l0412m6524q3240k8643o1129j23906p1530r6395r4299m4527K7869
5649E360502m2529k6049K5062K2693J40008K10174K22918J84712K18581J22818
5639F438890L4964p1038r0709K0920P4629R8467m8486r8365p2778o5600n1276
5628F169618l0211j12727j00356n0538l8247m6585n0824J0830Q645M3889M2473
$$ y = [3614666, 3607607, 3588320, 3634014, 3686569, 3784856, 3922047, 4106782, 4266877, 4442652, 4574503, 4649571, 4553210, 4402062, 4265488, 4162118, 4022481, 3888259, 3840314, 3807558, 3732845, 3732290, 3787019, 3830274, 3856617, 3822847, 3855600, 3966521, 4056318, 4246210, 4441769, 4642532, 5000340, 5427312, 5823907, 6211296, 6412882, 6469821, 6409212, 6286070, 6142115, 6068860, 6013238, 5982826, 5936302, 5853062, 5824419, 5763290, 5639384, 5567854, 5471459, 5377160, 5332633, 5360502, 5317973, 5291924, 5316986, 5339679, 5479687, 5689861, 5912779, 6097491, 6316072, 6438890, 6473854, 6402816, 6312107, 6333027, 6407656, 6506123, 6457637, 6359272, 6286494, 6220894, 6169618, 6139407, 6026680, 5926324, 5875786, 5837539, 5790954, 5740130, 5750960, 5759605, 5803494, 5845967]
5617E845967J2835J03827J71710K25154K07577J47701M8048M4068R5493J13571
5607G015951J13690K02171J28018O4054J20143J70281J95815Q6400J93943J77209
5597H467675J43250K20732K38521L08503L32920K61720L15749M19272L77331L92394
5587A1478067M18788M52511M95917M90000O33800O19357P05424P73095Q94960
5578A6961919R22507J217249J375805J515933J814937K202287K812963L508433
5570C2332033M419608N424730O493143P168828O472679L272909j043179l894883
5562F0645868m620122l795754k434583j106138K25486J506871K641072L147505
5554E6210205J813201l09827j451800j204632J32943J710654L167554M223704
$$ y = [5845967, 5858802, 5962629, 6134339, 6359493, 6567070, 6714771, 6762819, 6806887, 6902380, 7015951, 7129641, 7331812, 7459830, 7523884, 7644027, 7814308, 8010123, 8096523, 8290466, 8467675, 8610925, 8831657, 9070178, 9378681, 9711601, 9973321, 10289070, 10708342, 11085673, 11478067, 11896855, 12349366, 12845283, 13335283, 13969083, 14588440, 15293864, 16066959, 16961919, 17884426, 19101675, 20477480, 21993413, 23808350, 26010637, 28823600, 32332033, 36751641, 42176371, 48669514, 55838342, 62311021, 65583930, 64540751, 60645868, 56025746, 52229992, 49795409, 48689271, 48914757, 50421628, 53062700, 56210205, 58023406, 57713579, 56261779, 55057147, 55190090, 56900744, 60068298, 64292002]
5546F4292002L912190J879052j004301l279515l786838k977873j702483k37079
5538E7095155M44959p25058k674148l767082l522771k422781j228311l0367J168908
5529D4338504K389077L464969L983608K920121j82730l769507n740471n977013
5521D1426558n332912m420580l639179l046207k498256k021800j672047j417834
5513A7377743j182483j081774q81122p77967p72266o34824o47422m84934m37293
5504A0477658m22157l90255k73999k95226k39974k05668k66884j66021q3818l5060
5494H098596k9116n3616j72493l00274l57160l36669k77149k50627k18481k16309
5484E886702j90254k26603j49447j47473j60147j01570j69546r5533j08349o4554
$$ y = [64292002, 68204192, 70083244, 69078943, 65799428, 62012590, 59034717, 57332234, 57095155, 57540114, 56815056, 54140908, 50373826, 46851055, 44428274, 43199963, 43169596, 44338504, 46727581, 50192550, 54176158, 57096279, 56913549, 53144042, 47403571, 41426558, 36093646, 31673066, 28033887, 24987680, 22489424, 20467624, 18795577, 17377743, 16195260, 15113486, 14232364, 13454397, 12682131, 12047307, 11399885, 10914951, 10477658, 10055501, 9665246, 9391247, 9096021, 8856047, 8650379, 8383495, 8217474, 8133656, 8098596, 8069480, 8015864, 7843371, 7543097, 7185937, 6849268, 6572119, 6321492, 6103011, 5886702, 5696448, 5469845, 5320398, 5172925, 5012778, 4911208, 4741662, 4646129, 4537780, 4473226]
5474D473226j12075j50792j27388r9125r4309j00185q5057o4911o3180m7681k9654
5463C498869n8542n3222j00852p8949l6544j8102k3194o4188o8741l2692j21652
5452B842191r903L7635l6904m7623j0202m1692j22188j11513l0662j8610q3035
5441B367494k3018o28j1180J6112L3019M7913l3766j9498m0904o9059J3042k1527
5429B258000j9049p4878r1522j8914o3479l4449n4203M7281n2769j7005n9382
5418A819631l2196M3421q3886k282J766k9588m1238P969o708r891j6807J3690
5406A663881J3510l3567j02846j2726J113k6946j8857J4122P3627K568m6069M240
5394A532050N3064m8282k0196P283j3416j6112J0222m9527m5715M6087o7876k3480
$$ y = [4473226, 4361151, 4210359, 4082971, 3983846, 3889537, 3789352, 3704295, 3639384, 3576204, 3528523, 3498869, 3440327, 3387105, 3286253, 3207304, 3170760, 3152658, 3129464, 3065276, 2996535, 2963843, 2842191, 2832288, 2869923, 2833019, 2785396, 2775194, 2733502, 2611314, 2499801, 2469139, 2450529, 2367494, 2344476, 2343848, 2332668, 2348780, 2381799, 2429712, 2395946, 2376448, 2335544, 2266485, 2279527, 2258000, 2238951, 2164073, 2072551, 2053637, 1990158, 1955709, 1901506, 1948787, 1896018, 1879013, 1819631, 1787435, 1830856, 1746970, 1744688, 1746454, 1716866, 1675628, 1683597, 1676889, 1666998, 1650191, 1663881, 1677391, 1643824, 1540978, 1528252, 1529365, 1502419, 1483562, 1497684, 1571311, 1573879, 1527810, 1532050, 1585114, 1536832, 1516636, 1523919, 1510503, 1494391, 1504613, 1455086, 1409371, 1455458, 1387582, 1364102]
5382A364102K5989n3139j8785k48l3801j6188q717K9719k8565o0189M6710k2585
5370A224303o2675K8308M545K8419J6676l3586j2185m4168k731j1678n3421k8386
5358A053421m4592J8294l2747q8259j538L9366r296k4220J117K0275o1465n7161
5346H13195l8J8059k8688j0760R268K581k2426J353K6452L475j3293j4374p6807
5333G07997P0780o135k2949P8617L0331l1003j8068j6351o4550j7266n3705L8985
5321F96683r512j4133k1080p218j2259l7474K6157Q1536n9697L924P666n6034
5309E98559k2350K665M2289j9127L6366J0659J1209J1490K4988n2599K2122P3773
5297G40044Q371K7269n5259m3157k3666j2145N3044l4879l2584K516l0732j2069
$$ y = [1364102, 1390091, 1336952, 1318167, 1317919, 1284118, 1267930, 1259213, 1288932, 1260367, 1200178, 1246888, 1224303, 1161628, 1189936, 1194481, 1222900, 1239576, 1205990, 1193805, 1149637, 1146906, 1135228, 1081807, 1053421, 1008829, 1027123, 994376, 906117, 904579, 943945, 934649, 910429, 911546, 931821, 870356, 813195, 813157, 831216, 802528, 791768, 801036, 803617, 781191, 782544, 808996, 812471, 799178, 784804, 707997, 778777, 772642, 749693, 828310, 858641, 827638, 809570, 793219, 728669, 711403, 657698, 696683, 687171, 673038, 651958, 644740, 632481, 595007, 621164, 702700, 643003, 646927, 654593, 598559, 576209, 578874, 621163, 602036, 638402, 649061, 660270, 671760, 696748, 644149, 666271, 740044, 748415, 775684, 720425, 677268, 653602, 641457, 694501, 659622, 627038, 629554, 598822, 586753]
5285E86753l4350N2136l7798J3732N250o866l912k8922l1603k0955O2186q977
5273E46674N124O496J2133J2970K2503M0935m4494K9471K1051m0146L0374k1926
5261F21165Q283R539j9036m9550J4127j7986k9011j438L0270o860j9194L4861
5249E75170L237j2466L7888l1000L6451M4832O8981L8620K2191L0658o567k4726
5237G83269l2242m3594L3532M323K3065P795r4136Q1163N2822L1999m1106k1241
5225G85649r0752j1564R9089N9680j9797K906l7698M2891m6013j7145K2525K1345
5213H11116O355J2347m1828k3682j2265m6709K776O1012J4401j7869k0890P8932
5201H23696L2278l1196j0055n642n6848L309M3206n4060L023n1466J3292J124
$$ y = [586753, 552403, 604539, 566741, 580473, 585723, 578857, 574945, 546023, 514420, 493465, 555651, 546674, 551798, 558294, 570427, 583397, 605900, 646835, 602341, 631812, 652863, 612717, 643091, 621165, 629448, 638987, 619951, 570401, 584528, 566542, 537531, 536093, 566363, 559503, 540309, 575170, 578407, 565941, 603829, 572829, 609280, 654112, 723093, 761713, 783904, 814562, 807995, 783269, 751027, 707433, 740965, 745288, 768353, 776148, 682012, 763175, 815997, 847996, 806890, 785649, 694897, 683333, 782422, 842102, 822305, 825211, 787513, 830404, 784391, 767246, 789771, 811116, 817471, 829818, 787990, 764308, 752043, 705334, 708110, 769122, 783523, 765654, 744764, 823696, 855974, 824778, 814723, 809081, 752233, 755542, 798748, 744688, 747711, 696245, 709537, 710661]
5189G10661m9075J7250k1200k1512l043j5962M4606j2339o5025L4673j568r314
5177F08152L3462r675L0141j5146M6661J838j1476k5850M3318j5724k7098j4913
5165F43690K5434J3377j579k612M5922m9890L960O9629K332q7201K8671L483K6912
5152G22128M0018M170N7426P5537J0808L9525K7130J8866n0484M1679J1132J0511
5140A008446L2364M3242R6687K1571P7659N8010O8960L45N3055N3709Q6751R2132
5128A692931M7368J24779J58791J49050K10435K48734L61066M39913O92369Q59758
5118D985194J049376J420254J481376M90123p34862j367870j219801j005642p82664
5109D315484n22069l45895l13028k72617k21040j44065j83574j00364o9902j04954
$$ y = [710661, 661586, 678836, 657636, 636124, 633081, 617119, 661725, 649386, 584361, 619034, 617466, 608152, 641614, 631939, 662080, 646934, 693595, 695433, 683957, 658107, 701425, 685701, 658603, 643690, 669124, 682501, 680922, 678310, 724232, 674342, 678302, 747931, 750263, 663062, 691733, 695216, 722128, 762146, 766316, 823742, 899279, 910087, 949612, 976742, 995608, 945124, 986803, 997935, 1008446, 1040810, 1084052, 1180739, 1202310, 1279969, 1337979, 1406939, 1407284, 1460339, 1514048, 1600799, 1692931, 1740299, 1865078, 2023869, 2172919, 2383354, 2632088, 2993154, 3433067, 4125436, 4985194, 6034570, 7454824, 8936200, 9426323, 8691461, 7323591, 6103790, 5098148, 4315484, 3793415, 3447520, 3134492, 2861875, 2640835, 2496770, 2313196, 2212832, 2142930, 2037976]
5099B037976l2532N098Q0761J47652J59291L2969j28540j88711j30516j48190
5089A835258j63481j00488q5846p1853p3215o6268k2870m5821p6170O3040O0570
5078A252856n166k7813l870l2942r929q989N8264L9289j3551K8704K91N9619l2887
5065A303876q172L789L1297K5005P7711J8479N2924Q2959M7799P1286R3544K20053
5053B020550K43468K58041L20589M77015N95837P66891J085001J096529M03335
5044G267256n55512r78559r96481p52581n68080m34469l21204k31230j92299j83936
5034B052905j52800o7346j37944r362M38N1020J7875N9545J42360J73097K32555
5023B362343K40911P1072j86935k30906k44460k73409j32445j09798p2849o8397
$$ y = [2037976, 2005444, 2010542, 2091303, 2238955, 2398246, 2431215, 2302675, 2113964, 1983448, 1835258, 1671777, 1571289, 1485443, 1413590, 1340375, 1274107, 1251237, 1205416, 1129246, 1192286, 1252856, 1247690, 1219877, 1216007, 1183065, 1173136, 1164147, 1222411, 1261700, 1248149, 1276853, 1277144, 1336763, 1303876, 1295704, 1299493, 1330790, 1355795, 1433506, 1451985, 1504909, 1587868, 1635667, 1706953, 1800497, 2020550, 2264018, 2522059, 2842648, 3319663, 3915500, 4682391, 5767392, 6863921, 7267256, 6711744, 5733185, 4736704, 3984123, 3416043, 2981574, 2660370, 2429140, 2236841, 2052905, 1900105, 1832759, 1694815, 1685453, 1685891, 1736911, 1754786, 1814331, 1956691, 2129788, 2362343, 2603254, 2674326, 2487391, 2256485, 2012025, 1738616, 1606171, 1496373, 1423524, 1355127]
5013A355127j43478n2166K6423l5248p0526m6029o4571L0322j6699o2448j0559
5002I10148K6871l0146m2966P635P2898J0243o0539j2842k2930j5985K5906k1700
4990H46593k6688j4722N0860m002k029L7121N061J394m6612m081k4335K0019m069
4977H34510l6759J4946J2312k1912K799M5395n0553j6977j3173M8270J9459O3546
4965I01863J8988n697J369j6499q585M2791J5658j3557L8155K5362m5113K2887
4953I77622L3306N5299P1194L1769Q6095J58056J77426J05988J04008p647j66935
4942A626181j33924j10258p5995n860o7021p6578j4210L000N8901o1701j9265
4931A123270K4554Q34L6309r885o29l260j2576m2937k8903K7751m1391L507Q6868
$$ y = [1355127, 1211649, 1159483, 1185906, 1150658, 1080132, 1034103, 969532, 999854, 983155, 920707, 910148, 937019, 906873, 863907, 871542, 944440, 954683, 894144, 881302, 858372, 842387, 868293, 846593, 819905, 805183, 856043, 852041, 850012, 887133, 892194, 893588, 846976, 842895, 818560, 838579, 834510, 797751, 812697, 825009, 803097, 805896, 851291, 800738, 783761, 770588, 818858, 838317, 901863, 920851, 915154, 916523, 900024, 891439, 934230, 949888, 936331, 974486, 999848, 954735, 977622, 1010928, 1066227, 1137421, 1169190, 1255285, 1413341, 1590767, 1696755, 1800763, 1793116, 1626181, 1492257, 1381999, 1306004, 1300144, 1233123, 1156545, 1142335, 1145335, 1204236, 1142535, 1123270, 1147824, 1148658, 1184967, 1175082, 1174453, 1171193, 1158617, 1115680, 1086777, 1114528, 1073137, 1076644, 1163512]
4918A163512n3079p4267K7476J2674l8626L488L3188l3895p0377m8106L7135L6964
4906I96087O8364J0316j3046L1947O5971P2675L1869Q6844J23628P7073Q5965
4895A637693o9060r0458J9144o4925p7400m1816p9386l3884K3571o4603K0165
4884A179041j4456K1583k0604K5605l9259n9516K3560k4864n2950P580Q3773J28323
4872A257816P8346Q2267Q4884J21535J7834m0947K1832J26824O8119o621n6897
4861A754992N485k932k6975N150k4184l4063k9498k1659l8392m9186r9624m0320
4849A398794o6952k0438M2943K0977r167q3317p4694K9365J39430J88310K19375
4838A784626J94428K05366K55697J27986R4854J4458j40845k63526j56425j46852
$$ y = [1163512, 1110433, 1036166, 1063642, 1076316, 1037690, 1041178, 1074366, 1040471, 970094, 921988, 959123, 996087, 1064451, 1074767, 1061721, 1093668, 1159639, 1232314, 1264183, 1351027, 1474655, 1551728, 1637693, 1568633, 1478175, 1497319, 1432394, 1354994, 1313178, 1233792, 1199908, 1223479, 1158876, 1179041, 1164585, 1186168, 1165564, 1191169, 1151910, 1092394, 1115954, 1091090, 1038140, 1045720, 1129493, 1257816, 1336162, 1418429, 1503313, 1624848, 1642682, 1601735, 1623567, 1750391, 1818510, 1811889, 1754992, 1760477, 1757545, 1730570, 1735720, 1711536, 1677473, 1647975, 1626316, 1587924, 1538738, 1439114, 1398794, 1331842, 1311404, 1354347, 1375324, 1366157, 1282840, 1208146, 1237511, 1376941, 1565251, 1784626, 1979054, 2184420, 2440117, 2568103, 2662957, 2677415, 2536570, 2273044, 2116619, 1969767]
4828A969767j51740j12211p6136k8791K6798J23696R8413O5230P8111r033k7787
4817A956317M4154J41353K13047K02042J76787K30140K29606K27336J45633J13100
4807C679515O5734n7230j7907l13Q6274J42780O9700P5982J56936K74355L49724
4796D825550K72289J27748Q4897P910m2973K9251P0683K2182L300P3142N1189
4785E525168Q4514R1328J26122P3247O1523Q0829J36276J76101J84743J08888
4775F648739J28185P4589J01957M6232J1138J08334Q7956J54740R3638R9254J73905
4764G728667J67107J29732K16515L32566L04176K68620K11503L53357K95281L08560
4754A0316084L47995L42150M05658N33146N01952N89608O38117O07276N78178
$$ y = [1969767, 1818027, 1705816, 1629680, 1600889, 1627687, 1751383, 1849796, 1915026, 1993137, 1984104, 1956317, 2000471, 2141824, 2354871, 2556913, 2733700, 2963840, 3193446, 3420782, 3566415, 3679515, 3745249, 3688019, 3670112, 3669799, 3756073, 3898853, 3968553, 4044535, 4201471, 4475826, 4825550, 5097839, 5225587, 5310484, 5318394, 5275421, 5304672, 5375355, 5397537, 5400837, 5473979, 5525168, 5609682, 5701010, 5827132, 5900379, 5961902, 6042731, 6179007, 6355108, 6539851, 6648739, 6776924, 6851513, 6953470, 6999702, 7010840, 7119174, 7207130, 7361870, 7455508, 7554762, 7728667, 7895774, 8025506, 8242021, 8574587, 8878763, 9147383, 9358886, 9712243, 10007524, 10316084, 10664079, 11006229, 11411887, 11945033, 12446985, 13036593, 13674710, 14281986, 14860164]
4745A4860164N95715O36050O16188O49455N90078O56501P97398Q79545R16947
4736B1198041R04450R28633J011455J029375J142489J312323J410872J416329
4728C0353967J440463J518185J812931J991216K294019K607251L164889L744897
4720D8927818M535456N298916O546391Q302797J0850465J4383615J9542428K5774128
4712A44162014L2794008M1254943N3228685M5301696M947461l4658818m8792089
4705B38237900m4125989l4895808k7157052k1388258j6428769j3051501j0413249
4698G0777274q419009o842901n727875m802719m081460l467323l032260k591829
4690C1811898k249698j955354j752354j449496j277782j084479r31270r41296
$$ y = [14860164, 15455879, 16091929, 16708117, 17357572, 17947650, 18604151, 19401549, 20281094, 21198041, 22102491, 23031124, 24042579, 25071954, 26214443, 27526766, 28937638, 30353967, 31794430, 33312615, 35125546, 37116762, 39410781, 42018032, 45182921, 48927818, 53463274, 58762190, 65308581, 73611378, 84461843, 98845458, 118387886, 144162014, 176956022, 218210965, 271439650, 316741346, 321688807, 287029989, 238237900, 194111911, 159216103, 132059051, 110670793, 94242024, 81190523, 70777274, 62358265, 55515364, 49787489, 44984770, 40903310, 37435987, 34403727, 31811898, 29562200, 27606846, 25854492, 24404996, 23127214, 22042735, 21111465, 20170169]
4682B0170169q55936p99110n77995n17856n28763n56227o45331o36436n56388
4673A4496127n97366o13360n69460n88321m82119m49188l28456k77502k96651
4664A0293704k79500l47712m22137k45182l25944k89303k08483k06245o6419k1
4654G902758r5809j97377k02992j91337j75016j32830j48436k02742k08860k98636
4644F048723k68323k31536j96906j55040j27270j16283j40791j22274o1902j29952
4634D498446j16690j35631n6766n5332o0312p6366j73611r3889j54230j23975
4624C451644j64960j76049j76677p8450P6784J36766J25967j5027n9093p9265
4614C041640o7660l6872j46813j94707j30321j62374n8420P4779J29771J83309
$$ y = [20170169, 19314233, 18515123, 17937128, 17419272, 16890509, 16334282, 15688951, 15052515, 14496127, 13898761, 13285401, 12715941, 12127620, 11645501, 11196313, 10867857, 10590355, 10293704, 10014204, 9666492, 9244355, 8999173, 8673229, 8383926, 8175443, 7969198, 7902779, 7902758, 7806949, 7609572, 7406580, 7215243, 7040227, 6907397, 6758961, 6556219, 6347359, 6048723, 5780400, 5548864, 5351958, 5196918, 5069648, 4953365, 4812574, 4690300, 4628398, 4498446, 4381756, 4246125, 4189359, 4134027, 4073715, 3997349, 3823738, 3729849, 3575619, 3451644, 3286684, 3110635, 2933958, 2855508, 2932292, 3069058, 3195025, 3179998, 3120905, 3041640, 2973980, 2937108, 2790295, 2595588, 2465267, 2302893, 2244473, 2319252, 2449023, 2632332]
4604B632332J01208J18485Q0218J15878J01429j3021o3587j59859j17214M0582
4594B836451K9302P1361J23222N3725n2971j07721o8660k21758l32554l72294
4584A958103l56495j66448o6143O0515J52552J62032J76038R6475J17214J04820
4574B238663K7381j00562j46252o3921n0798o2181R009p7316q1129r0040j31462
4563A471392o2263p4158p6138p8030q6273j5997j841K035m5686j6484k9735k8089
4551I58733j9999K0148k2005k5586M4844L2263J8800O1115J52985O2082J0673
4540A294053M997o723l2659k0140o376m6982m9140k3305L2454O697q4080j1080
4528A057716m0992n0432o1987m1056l037l7753j3085j8492O7207K7065K9159j0291
$$ y = [2632332, 2733540, 2852025, 2932243, 3048121, 3149550, 3136529, 3072942, 2913083, 2795869, 2836451, 2865753, 2937114, 3060336, 3114061, 3061090, 2953369, 2884709, 2662951, 2330397, 1958103, 1601608, 1435160, 1369017, 1429532, 1582084, 1744116, 1920154, 2016629, 2133843, 2238663, 2266044, 2165482, 2019230, 1955309, 1904511, 1842330, 1851339, 1774023, 1692894, 1602854, 1471392, 1409129, 1334971, 1258833, 1180803, 1094530, 1078533, 1076692, 1078727, 1033041, 1016557, 986822, 958733, 938734, 958882, 936877, 911291, 956135, 988398, 1007198, 1068313, 1221298, 1283380, 1294053, 1299050, 1292327, 1259668, 1239528, 1233152, 1186170, 1137030, 1113725, 1146179, 1152876, 1068796, 1057716, 1016724, 966292, 904305, 863249, 860212, 822459, 809374, 790882, 858089, 885154, 914313, 904022]
4516I04022j0948N777O0756l1781L5806P5158m1150r631p783J1038p5891j18181
4504G97192m1154p45J5783l1503q6641k5580J2030L4454Q479Q31k6789m6890n0040
4491E59427m8573L2061J7983K045k5770q585K4030L7644N4530k5519P449j5575
4479F11147M9661n432L850j8330l8759K409k5241K6102k2406N1203k44o4227K4377
4466E94110N4154j6329L9360M5172Q810k1802k2946k9156j050j0039j0474M0677
4454F70487O7046K2004n6415m7031j4850p6654m467N6710L016j9707j7662R020
4442E91497L510J8177R987k5766O0285j531n1041N50K1760N5497m9077L0313M2944
4429G07105L9153M3025O980p188l9792n2454J563j4767j3280n7715j5397K8386
$$ y = [904022, 893074, 898851, 959607, 927826, 963632, 1038790, 997640, 988009, 980226, 991264, 915373, 797192, 756038, 755293, 771076, 739573, 652932, 627352, 639382, 673836, 682315, 683146, 656357, 609467, 559427, 510854, 542915, 560898, 562943, 537173, 528588, 552618, 590262, 644792, 619273, 626722, 611147, 660808, 655376, 659226, 640896, 602137, 604546, 579305, 605407, 583001, 634204, 633960, 569733, 594110, 648264, 631935, 671295, 716467, 725277, 703475, 680529, 651373, 650323, 640284, 629810, 670487, 737533, 759537, 703122, 656091, 641241, 564587, 560120, 616830, 619846, 600139, 582477, 591497, 595007, 613184, 623171, 597405, 657690, 656159, 605118, 605668, 627428, 682925, 633848, 664161, 707105, 746258, 789283, 796263, 789075, 749283, 696829, 698392, 683625, 670345, 612630, 597233, 625619]
4417F25619N7018j8196M1164J3684k8229J3947L7206n3342j2935N194P885j1465
4405F77550j6561J8352j1638P5251L8882M6647Q1871P8007R2853R9019J42618
4394A322851J99839K45077K81546O6548j11596k40912k47292j56610j50076r6023
4384A113352j09828q0002j00595p5590K1116o9517r741m211j6962M510j0535L1334
4372F93331m1296L360j3363n5951J850N6184l9522m4313q104K2221o7202l2138
4360D75057K7169k8561N972j2678N457j8583k0579M5086j055k1469R390l7308
4348D27898p753o864j4818N9818k7697n9006j1861K2307O8225j3284j5720k3494
4336C97751O4279O76p4087k1687N5710m94J3057k0693J4614l0113j1116K0469
$$ y = [625619, 682637, 664441, 705605, 719289, 691060, 705007, 742213, 688871, 675936, 681130, 689015, 677550, 660989, 679341, 667703, 742954, 781836, 828483, 910354, 988361, 1081214, 1180233, 1322851, 1522690, 1767767, 2049313, 2115861, 2004265, 1763353, 1516061, 1359451, 1209375, 1113352, 1003524, 923522, 822927, 747337, 768453, 698936, 689195, 684984, 668022, 672532, 661997, 693331, 652035, 655395, 642032, 586081, 587931, 644115, 604593, 560280, 552176, 574397, 507195, 475057, 502226, 473665, 479637, 466959, 472416, 453833, 433254, 478340, 477285, 455816, 465206, 427898, 420145, 413281, 398463, 458281, 430584, 371578, 359717, 382024, 450249, 436965, 421245, 397751, 462030, 462706, 388619, 366932, 422642, 422148, 435205, 414512, 429126, 399013, 387897, 408366]
4324D08366M1635K1342O7782m0736m8438J338m0153P759l0072o761L714M81K2442
4311D08699r478l6195K205k956O4817m832r8926L088M9035l0648J2601q25m9097
4298C07488m0515M3942j8624p324n1330m539j0878N7127J2806j9378M9939n3407
4286B65307K2592O3385n238k5826m374J9279J872j6910J010l9959N3216K7411
4274C61765j7235k8432m6826P954M3744K4445r48k7368q267o8740M7638M2390
4262C30120o291J2501j8718O998J2249m5192n922N4907j0496O833J5627k5770
4250C26846l822l7127J2810l6089J4544M2115J0793j1507Q429K9970M2902K3189
4238D23053n8817r821P2533L1154l6552j4289j5250N5655o1451k6273p970j3663
$$ y = [408366, 450001, 471343, 539125, 498389, 449951, 451289, 411136, 418895, 388823, 382062, 385776, 386257, 408699, 399221, 363026, 365231, 362275, 427092, 422260, 323334, 326422, 375457, 344809, 357410, 356585, 307488, 266973, 310915, 292291, 284967, 233637, 229098, 218220, 275347, 288153, 268775, 318714, 265307, 287899, 351284, 346046, 320220, 315846, 335125, 336997, 320087, 321097, 281138, 334354, 361765, 344530, 316098, 269272, 277226, 320970, 345415, 344467, 317099, 308832, 240092, 287730, 330120, 323829, 336330, 317612, 324610, 336859, 291667, 285745, 340652, 330156, 336989, 352616, 326846, 323024, 285897, 298707, 262618, 277162, 319277, 330070, 318563, 326992, 356962, 399864, 423053, 364236, 354415, 426948, 458102, 421550, 407261, 392011, 447666, 386215, 359942, 351972, 338309]
4226C38309K1251j1112q758k6243J7090o4742N4276M7793j8424m962j037K1829
4214C65270M2976j5942m1445O5114L9025p3864n2860K3892O997J8572m9474P00
4202C28961l3289J2948J3373n0933K2607K8827n6468K1714K6412M1264K1443J5038
4190C91897O336K5322o0732n961k5978J7461L258o423l4949k1510j0879L0070
4178C07912k3959J1799l2251P3044j387m8654M4561q599M7152k2222n538J7534
4166C59392k3806j1063R174K27K446j3267k9547K1124O3446l8854J0726m9975
4154C00023L259J5601L9300m6074Q596L3884j1207J6555L173L3710l5876j0106
4142C50838l0009k675P3896M1036k9472n0696M8916n5171Q398k7032l2129O215
$$ y = [338309, 359560, 348448, 339690, 313447, 330537, 265795, 320071, 367864, 349440, 344478, 343441, 365270, 408246, 392304, 350859, 415973, 454998, 381134, 328274, 352166, 359163, 377735, 328261, 328961, 295672, 308620, 321993, 271060, 293667, 322494, 266026, 287740, 314152, 355416, 376859, 391897, 398233, 423555, 362823, 356862, 330884, 348345, 351603, 345180, 310231, 288721, 277842, 307912, 283953, 295752, 263501, 336545, 335158, 286504, 331065, 322466, 369618, 347396, 341858, 359392, 335586, 324523, 333697, 333924, 336370, 323103, 293556, 314680, 378126, 339272, 349998, 300023, 303282, 318883, 358183, 312109, 320705, 354589, 343382, 359937, 363110, 396820, 360944, 350838, 320829, 318154, 392050, 433086, 403614, 352918, 401834, 346663, 355061, 328029, 295900, 302115]
4130C02115L2695K562j0091L611L0477j5388j0258O469K7360J9837M2910N6606
4118D88905o706l0224m2760n3843J4502N8439n5069K4638N903K0665K2561r2413
4106C54598l9789N1517K0517L6511k7588N742j8201l6737J7563j2716L1183k2983
4094C59617L5293n9068l525M4870o766J2454m32J9308N737j0204m2481J5695R631
4081C80129o0354k3276L5161M9821k2946K0651J7556M8848K775k7890k2826o9317
4069C28332O1494L8534r847j9828m6925L1400L5951j9188P0914l5194j8776q6105
4057C30762K8420K4206M0099J5600l2062j8597l7985O0542K680L9504q502L3788
4045D78455J4350l3892p7138L2703K1510k7890J7203j1159k9233K6321Q5563K5987
$$ y = [302115, 334810, 337372, 327281, 330892, 361369, 345981, 335723, 342192, 369552, 389389, 432299, 488905, 482199, 451975, 409215, 355372, 369874, 428313, 373244, 397882, 403785, 424450, 447011, 354598, 314809, 366326, 386843, 423354, 395766, 401508, 383307, 346570, 364133, 351417, 382600, 359617, 394910, 335842, 332317, 377187, 370421, 382875, 382443, 401751, 407488, 397284, 354803, 370498, 380129, 319775, 296499, 331660, 381481, 358535, 379186, 396742, 445590, 448365, 420475, 397649, 328332, 389826, 428360, 418513, 398685, 351760, 383160, 419111, 399923, 470837, 435643, 416867, 330762, 359182, 383388, 423487, 439087, 407025, 388428, 350443, 410985, 413665, 453169, 444667, 478455, 492805, 458913, 381775, 414478, 435988, 408098, 425301, 414142, 384909, 411230, 496793, 522780]
4033E22780Q332m9123J3751J3291k5786l0886N0259K8759k0706J6350q165j7130
4021E01726l0770K6438n933J4872j6313N1221m1599J5459l893j7573L7395p835
4009E23195m993M6439l95K51L151O246J8927J5885o3312K1626N1411k7399p7490
3996E13542j6457O3772j8737J0018o199M0922k8436M0873R761j0012K3766r435
3984F13378m4772L4142j7397L8077n8J825M0864K4264k0606o474j2259N7285J232
3971G09501m0104j8113K2942j5132r382Q1506l0285j159K7314N140K8663k1549
3959G39342n3169M5428M885P483M2037K2176N0186K4429o0613p5155j2823J8215
3947G52421O9034J7006l2558o4808o723O9960K7434j4210N6739j9541J6042J4836
$$ y = [522780, 531112, 481989, 495740, 509031, 483245, 452359, 502618, 531377, 510671, 527021, 518856, 501726, 470956, 497394, 491461, 506333, 490020, 541241, 499642, 515101, 511208, 493635, 531030, 523195, 518202, 564641, 564246, 564497, 567648, 573894, 592821, 608706, 545394, 567020, 618431, 591032, 513542, 497085, 560857, 542120, 552138, 545939, 586861, 558425, 599298, 609059, 599047, 622813, 613378, 568606, 602748, 585351, 623428, 623370, 625195, 666059, 690323, 669717, 663243, 650984, 708269, 709501, 669397, 651284, 674226, 659094, 649712, 731218, 700933, 699774, 727088, 732228, 760891, 739342, 686173, 731601, 736486, 743969, 786006, 808182, 858368, 882797, 822184, 747029, 734206, 752421, 821455, 838461, 805903, 741095, 734372, 804332, 831766, 817556, 874295, 854754, 870796, 885632]
3935H85632N944P145j2421K7389l7446o0338L0889O3906P924j978Q204N277K1592
3922I51719l4387l0940L5156M7490p336j4576j9849J8582J6474N7707K528q6221
3910I36347L4376O0285K9484k3639l0625n6070M9209K6289L1914O8755R265j3932
3898A121658j9526l8086J5762J3860J2139j462M0808n6054j9362J9219k2433J9731
3886A086254K7629k292k6880J2910j8270k4756P7638J9808k8335K1204Q858k162
3874A151606N1348l7548O0582L9787j5508j9877N3000O3286K4150J1999Q1241
3863A464066j668O3943j3052n5036J6477M8038Q1414P8529O0991m7384L9000P3814
3851A809132P5022K6963L6043P2328R5646N8856L3088J49103O4858O6709J19081
$$ y = [885632, 891576, 898721, 886300, 913689, 876243, 815905, 846794, 910700, 918624, 916646, 924850, 930127, 951719, 917332, 886392, 921548, 969038, 961702, 947126, 927277, 945859, 962333, 1020040, 1022568, 936347, 970723, 1031008, 1060492, 1036853, 1006228, 950158, 999367, 1025656, 1057570, 1126325, 1135590, 1121658, 1102132, 1064046, 1079808, 1093668, 1105807, 1104345, 1145153, 1089099, 1069737, 1088956, 1066523, 1086254, 1113883, 1111591, 1084711, 1097621, 1079351, 1054595, 1132233, 1152041, 1123706, 1144910, 1153768, 1151606, 1202954, 1165406, 1225988, 1265775, 1250267, 1230390, 1283390, 1346676, 1370826, 1382825, 1464066, 1462398, 1526341, 1513289, 1458253, 1474730, 1522768, 1604182, 1682711, 1743702, 1696318, 1735318, 1809132, 1884154, 1911117, 1947160, 2019488, 2115134, 2173990, 2207078, 2356181, 2421039, 2487748, 2606829]
3840B606829J09687K68075J92538J90696K48825L33685L97979N18578O15915O86348
3830F169155P69445Q44006Q26316O07121J42722l39158o00523p66513q02839p41151
3820F108581o84690n32024m33392l85301l56382k81997j96189k04618k29235j22095
3810B682658j19588j22370j13721j01577o6351n0075m1938p1577j2695m4970l4860
3799A902936q2710n6404J3908J85o271J925o1653q7505n0692l3029L1270J8677
3787A590637L1628r869l1666r4150M3683k6503J0051j2706j03986L7215L5294
3776A469628O6059j5796n7902K5426k7166K7537k3350O875j2727j8470J3074K015
3764A455203l0744m2368J2670n331K4187j2330J1785k2995K3507J4293l6972L8313
$$ y = [2606829, 2716516, 2984591, 3177129, 3367825, 3616650, 3950335, 4348314, 4866892, 5482807, 6169155, 6938600, 7782606, 8608922, 9216043, 9358765, 9019607, 8419084, 7652571, 6849732, 6108581, 5423891, 4891867, 4458475, 4073174, 3716792, 3434795, 3238606, 3033988, 2804753, 2682658, 2563070, 2440700, 2326979, 2225402, 2159051, 2108976, 2067038, 1995461, 1982766, 1937796, 1902936, 1820226, 1763822, 1777730, 1777915, 1771644, 1773569, 1711916, 1624411, 1573719, 1540690, 1571960, 1590637, 1622265, 1612396, 1580730, 1486580, 1530263, 1503760, 1513811, 1501105, 1397119, 1434334, 1469628, 1535687, 1519891, 1461989, 1487415, 1460249, 1487786, 1464436, 1471311, 1458584, 1440114, 1453188, 1455203, 1424459, 1382091, 1394761, 1389430, 1413617, 1401287, 1413072, 1390077, 1413584, 1427877, 1390905, 1429218]
3752A429218J8189J3026k3597j7963j8923M0169r776L012P1264N555J4192K3055
3740A547421N9253K942l7662k8428j8262M4614Q5657R320o9106K7534K1574L062
3728A647919K4165j8446n60K35L1199J949O9289J6633j1818o428M7836P5586O310
3715A883869J2659M4076L4766M1753J9789l761k1445L2199P7963l5392O8536L7689
3703B192701P3170K8368L7913N3623M5888P3897L1702Q8757K429J11980J19854
3692B860282O8210R5876J73428J88034J69928K39337L64606L23254M53891N21982
3682E458828N95444P40206Q45669N09751L6001m72537o92970n31190n32707m14990
3672E541505k53526j84717j71970j34752p51N3143Q5079J63649K60383L48853
$$ y = [1429218, 1447407, 1460433, 1436836, 1418873, 1399950, 1440119, 1430343, 1433355, 1504619, 1510174, 1524366, 1547421, 1606674, 1609616, 1571954, 1543526, 1525264, 1569878, 1655535, 1664855, 1595749, 1623283, 1644857, 1647919, 1672084, 1653638, 1653078, 1653313, 1684512, 1686461, 1755750, 1772383, 1760565, 1754137, 1801973, 1877559, 1883869, 1896528, 1940604, 1975370, 2017123, 2036912, 2033151, 2011706, 2043905, 2121868, 2086476, 2155012, 2192701, 2265871, 2294239, 2332152, 2385775, 2431663, 2505560, 2537262, 2626019, 2628448, 2740428, 2860282, 2928492, 3024368, 3197796, 3385830, 3555758, 3795095, 4159701, 4482955, 4936846, 5458828, 6054272, 6794478, 7640147, 8149898, 8185899, 7713362, 7020392, 6489202, 5956495, 5541505, 5287979, 5103262, 4931292, 4796540, 4795789, 4848932, 4934011, 5097660, 5358043, 5706896]
3662E706896J33240l2049j17405j09107K4919O3701J44583K39010L72161M33696
3652F859645O12419Q39970J032424J354826J566137J589467P61035m82167j295320
3643A2838436j496554j282663j060004p64780o03702n04749k99240j79846k0119
3634F626779M9090J10853K95514M48424K83144j02193n16770m35524l57878k75314
3624F126125j28876p6122k7605O3821J98403K87394M23382M96453N70710O84386
3614H618071O03677J71957k96294o44849p03330o13139m54049m08426k54131j86968
3604E832519j76299r6665N289K8827Q5271J93566J12499m121k04867k10117k07586
3593E358316j58159r3320p0785o2581j4683L650J3193k700K1286N3807l0366J2531
$$ y = [5706896, 5840136, 5808087, 5690682, 5581575, 5606494, 5670195, 5814778, 6053788, 6425949, 6859645, 7472064, 8312034, 9344458, 10699284, 12265421, 13854888, 14615923, 14133756, 12838436, 11341882, 10059219, 8999215, 8234435, 7630733, 7125984, 6826744, 6646898, 6626779, 6675869, 6786722, 7082236, 7530660, 7813804, 7711611, 7194841, 6759317, 6401439, 6126125, 5997249, 5921127, 5893522, 5957343, 6155746, 6443140, 6866522, 7362975, 7933685, 8618071, 9221748, 9393705, 9097411, 8452562, 7749232, 7136093, 6682044, 6273618, 6019487, 5832519, 5656220, 5559555, 5564844, 5593671, 5678942, 5872508, 5985007, 5980886, 5776019, 5565902, 5358316, 5200157, 5106837, 5036052, 4973471, 4958788, 4962438, 4975631, 4972931, 4994217, 5048024, 5017658, 5030189]
3581E030189M3199Q1102R2135Q4934l0016o726Q2450J20746J08876M2453Q4160
3570E733502J30716L6071J03114R8234R1145J13273J37720J02614J22502J38400
3560F807291J12811J99676J77546J24755J99155K08417K47932K17893K57129K64459
3550H817064K36217L10759L16973L68245M16174M61102M18808N90272N68674N99718
3540A3104006O56221P17925O17408O39630O46378O40176N06148L40454J63004
3531A8031350r9220l17855m83935o95537p69989p50681p84923p18655o14774n97621
3521A2198160n29483l98147l77297l32813l89386l17618k59338l06843k30359
3512I056876k09892k03162j72430j68552j96772j84270j41356j36749j25839o8295
$$ y = [5030189, 5073388, 5154490, 5246625, 5331559, 5301543, 5294817, 5377267, 5498013, 5606889, 5649342, 5733502, 5864218, 5900289, 6003403, 6101637, 6192782, 6306055, 6443775, 6546389, 6668891, 6807291, 6920102, 7119778, 7297324, 7422079, 7621234, 7829651, 8077583, 8295476, 8552605, 8817064, 9053281, 9364040, 9681013, 10049258, 10465432, 10926534, 11345342, 11935614, 12504288, 13104006, 13760227, 14478152, 15095560, 15735190, 16381568, 17021744, 17527892, 17868346, 18031350, 17932130, 17614275, 17130340, 16434803, 15664814, 14914133, 14129210, 13410555, 12795781, 12198160, 11668677, 11270530, 10893233, 10560420, 10171034, 9853416, 9594078, 9287235, 9056876, 8846984, 8643822, 8471392, 8302840, 8106068, 7921798, 7780442, 7643693, 7517854, 7449559]
3502G449559j46447j68710j18462j44946j40900j42967j36480k18560j43897r3056
3492E995134j05553k04563o5806r4480j59221j10258o1902l0816q2855j31465
3482D948215j29183m5912l9761p1062r7819j17702j23029p6585j5344r4455j06944
3471D030419n5358o0647J1028m0230j21061m8138m4393n0733o1134o6618m537
3460C488598k2034l2201l1992j7783j0305l6970J9382K910j4200j3157P1234j6183
3448C387299p3597q7161o8867m4193r1236p0755l1162l1014l3945n8556k2691
3437B774122j1898m3525j6332j281k6087J9229m2384p3982m3695K8629L1298k3652
3425B570442m4688k0936J4191K7560L7677n5753m5363k7759J1572n5079L0528
$$ y = [7449559, 7303112, 7134402, 7015940, 6870994, 6730094, 6587127, 6450647, 6232087, 6088190, 5995134, 5889581, 5685018, 5619212, 5524732, 5365511, 5255253, 5193351, 5162535, 5079680, 4948215, 4819032, 4773120, 4733359, 4662297, 4564478, 4446776, 4323747, 4247162, 4231818, 4137363, 4030419, 3975061, 3914414, 3925442, 3885212, 3764151, 3716013, 3671620, 3620887, 3559753, 3493135, 3488598, 3466564, 3434363, 3402371, 3384588, 3374283, 3337313, 3356695, 3359605, 3345405, 3332248, 3403482, 3387299, 3313702, 3226541, 3157674, 3113481, 3022245, 2951490, 2920328, 2889314, 2855369, 2796813, 2774122, 2762224, 2718699, 2702367, 2701086, 2674999, 2694228, 2651844, 2577862, 2534167, 2562796, 2594094, 2570442, 2525754, 2504818, 2519009, 2546569, 2584246, 2528493, 2483130, 2455371, 2466943, 2411864, 2442392]
3414B442392k6899m8235o2186k8744p9091j1480j3991M376q946J4176j8897m8270
3402B114205P870j163k3993q580o561P4243k5595p8044m2942m4472K1428n302
3390A981094K430L2329k9011M4589l0910k8921J2054p6786J5471j014j8997m9342
3378A852986K5200o0602L6775r7024J2370L1761l776P1063j5800l8864N2681K9477
3366A896247n7700q426o3622j0794L1691q231k7674j5045J7973n1193K4155o024
3354A721357j9971m3929k8231l0112N169K6835q7823k5035L2110L4124L3709m905
3342A613298k0782l0021k5622J7818M044M101k1987l9650L0047m021J7889l1898
3330A513216j8146l4575K570J5082n83J8024n1905m047k7499P263Q435j3067P265
$$ y = [2442392, 2415493, 2367258, 2305072, 2276328, 2197237, 2185757, 2171766, 2176142, 2167196, 2181372, 2162475, 2114205, 2122075, 2120912, 2096919, 2088339, 2081778, 2156021, 2130426, 2052382, 2009440, 1964968, 1986396, 1981094, 1983524, 2015853, 1986842, 2031431, 2000521, 1971600, 1983654, 1906868, 1922339, 1921325, 1902328, 1852986, 1878186, 1817584, 1854359, 1757335, 1769705, 1801466, 1797690, 1868753, 1852953, 1814089, 1866770, 1896247, 1838547, 1830121, 1766499, 1755705, 1787396, 1779165, 1751491, 1736446, 1754419, 1703226, 1727381, 1721357, 1701386, 1657457, 1629226, 1599114, 1604283, 1631118, 1543295, 1518260, 1550370, 1584494, 1618203, 1613298, 1592516, 1562495, 1536873, 1554691, 1558735, 1562836, 1540849, 1501199, 1531246, 1527225, 1545114, 1513216, 1495070, 1460495, 1463065, 1478147, 1477564, 1495588, 1443683, 1439636, 1412137, 1419400, 1427835, 1414768, 1422033]
3317A422033j1298j0736k8863n2856M4481m8560K6192n9588j5102o796j1770J04509
3305A351646P433o703M5113o851L7907m9160K7493J046l3197O9782l6724k1208
3293A386577k604m892p68P1186k3107j8771J4793M8788q493k0407N9083J4716
3281A516101j566j7830p632K6849K7588n4369L3511j6291L1887O6763L6486J8119
3269A659616k3757l009J293M4532Q2858K7749k1708l457N3956M3124m5759K4794
3257A840232J9194O1570M170R089K1271L100L6297k4184M5191M8179L7781M1023
3245B142913J8725J6068J2533J01828M3818R827O1315K4303O3230Q2628N1770
3234B628958P366N6668J12809L5213J27786J24926Q0262P6693R1971R9281P7567
$$ y = [1422033, 1410735, 1399999, 1371136, 1318280, 1362761, 1314201, 1340393, 1280805, 1265703, 1258907, 1247137, 1351646, 1359079, 1352376, 1397489, 1390638, 1428545, 1379385, 1406878, 1407924, 1374727, 1444509, 1407785, 1386577, 1383973, 1379081, 1378313, 1449499, 1426392, 1407621, 1422414, 1471202, 1462709, 1442302, 1501385, 1516101, 1514535, 1496705, 1489073, 1515922, 1543510, 1489141, 1522652, 1506361, 1538248, 1605011, 1641497, 1659616, 1635859, 1632850, 1634143, 1678675, 1761533, 1789282, 1767574, 1764117, 1818073, 1861197, 1815438, 1840232, 1859426, 1920996, 1925166, 1934255, 1955526, 1958626, 1994923, 1970739, 2015930, 2064109, 2101890, 2142913, 2161638, 2177706, 2190239, 2292067, 2335885, 2345712, 2407027, 2431330, 2494560, 2577188, 2628958, 2636324, 2692992, 2805801, 2841014, 2968800, 3093726, 3173988, 3250681, 3342652, 3441933, 3519500]
3223C519500J13431O9975P0359N8593J3234J14054J8038R269Q8097P0560J3011
3212D158121P7855P4803o823N3223M0846Q7045J04088Q8104J46836J34366J47602
3201E106066J60497J75002K02393K21028K57156K89801K60437K39882K07362J15031
3191G234655o8264j56104j77343k51043k32277k10789j88314j43512o2389k2603
3181E722017n0598J8853R1885N2786R7063N8617J04072J23846J40882J09821R4251
3170F563495J15774J17001N0187Q8588L2909n5540r4104q4400p5113j18577j66522
3159F373698k23482k02935k41394j96504j91827j03420o7746j75847n3015o417
3149D911111K9062J5607p1409j7829l9396j3553p8372k1753n831j12950j19599
$$ y = [3519500, 3632931, 3702906, 3773265, 3831858, 3845092, 3959146, 3977184, 3986453, 4074550, 4145110, 4158121, 4235976, 4310779, 4303956, 4357179, 4398025, 4485070, 4589158, 4677262, 4824098, 4958464, 5106066, 5266563, 5441565, 5643958, 5864986, 6122142, 6411943, 6672380, 6912262, 7119624, 7234655, 7166391, 7010287, 6832944, 6581901, 6349624, 6138835, 5950521, 5807009, 5744620, 5722017, 5671419, 5690272, 5782157, 5834943, 5932006, 5990623, 6094695, 6218541, 6359423, 6469244, 6563495, 6679269, 6796270, 6846457, 6935045, 6967954, 6912414, 6818310, 6733910, 6658797, 6540220, 6373698, 6150216, 5947281, 5705887, 5509383, 5317556, 5214136, 5146390, 4970543, 4917528, 4911111, 4940173, 4955780, 4884371, 4866542, 4827146, 4813593, 4735221, 4713468, 4707637, 4594687, 4475088]
3138D475088j04399j77961j71169j51131k13399j43773j34787j11584j44057j49649
3128B973179o7821j18050r3717o6039p7112p1711m323r1709p2920n5112k2631
3117B232034l6356j5261n8084r0505k3958l960m8022r4175p7720j7774j4838n6764
3105A694617j8902o4484l0126n4534j5237n902n5330j3466n6181n5333J1697m403
3093A332416m0759k1396n1157j7112J2299n7969l7882L7372k6069j1961N7250
3082A175032m9956P124n2697m0276n5653M8673N703o947K613m1509j6528R149
3070I84728K5779l0332o5647o3869Q947m2171k4638Q570j6693r911l3895p644
3058G33224L0015Q739k2056N2874o3735j0143O030n2401R644o2520L7088m0251
$$ y = [4475088, 4370689, 4192728, 4021559, 3870428, 3657029, 3513256, 3378469, 3266885, 3122828, 2973179, 2905358, 2787308, 2693591, 2627552, 2550440, 2478729, 2474406, 2382697, 2309777, 2254665, 2232034, 2195678, 2180417, 2122333, 2031828, 2007870, 2003910, 1955888, 1861713, 1783993, 1766219, 1751381, 1694617, 1675715, 1611231, 1581105, 1526571, 1511334, 1505432, 1450102, 1436636, 1380455, 1325122, 1336819, 1332416, 1291657, 1270261, 1219104, 1201992, 1214291, 1156322, 1118440, 1155812, 1129743, 1117782, 1175032, 1125076, 1132200, 1079503, 1039227, 983574, 1032247, 1037950, 1031003, 1033616, 992107, 975579, 984728, 1010507, 980175, 914528, 850659, 859606, 817435, 792797, 801367, 784674, 774763, 740868, 733224, 763239, 771978, 749922, 802796, 739061, 728918, 734948, 682547, 692191, 629671, 666759, 626508]
3046F26508k1903j4005P6996l9124m3441L7532m223J9184q5705N9600J3023n2454
3034E71988q746J6964m5687q568K2584k1700Q355j1351K9242O501k5710l1622
3022E02250l5407k4343k2208K5006J6841k7298K5155j3166k9j3233k260P8893
3010E10201k9389q8548n0479Q4341j6101k9922Q363k253J1720J0373n4918n7203
2998B96185J02382J0517m842l855j6660p0893L8937J0614p3030K8961K4328j8196
2986C24448J9228k262o583J2495K0192m0765K9948J4137m2516K3194k534j997
2974C46985n968m2677l0512M6471L1110J5107l0099k9064j658K549O766N438k26
2961C14222l3195j0938K7254j0789L1778m1585L6647J5041j11528L7451M7829
$$ y = [626508, 604605, 590600, 667596, 628472, 585031, 622563, 618340, 637524, 551819, 611419, 624442, 571988, 563242, 580206, 534519, 525951, 548535, 526835, 535190, 523839, 553081, 559582, 533872, 502250, 466843, 442500, 420292, 445298, 462139, 434841, 459996, 446830, 446801, 433568, 431308, 510201, 480812, 392264, 341785, 426126, 410025, 380103, 388466, 386213, 397933, 408306, 353388, 296185, 398567, 409084, 404242, 400387, 383727, 312834, 351771, 362385, 289355, 318316, 342644, 324448, 343676, 341414, 334831, 347326, 367518, 326753, 356701, 370838, 328322, 351516, 348982, 346985, 341017, 298340, 267828, 314299, 345409, 360516, 330417, 301353, 299695, 302244, 309010, 314448, 314222, 281027, 270089, 297343, 286554, 318332, 276747, 313394, 328435, 216907, 254358, 302187]
2950C02187J2084k5314m673J0442o676j6051k5070K621L04R073N5930j857l4743
2937B78257l6397L367J0185k6361J0392N8138R689n257k5002l301J3683k3887
2925B63506k2331n7171j5959K9618L4086K31K8408j0369l2023R8736r760p115
2913B99857q736r3805j5866N199L8467M4217k563o4951j1854j0691n180M0371
2901B14465K7371j0149j5018L4019K0505l3331L0276o0943l5086P1158L6835k072
2889B78030o9066k6614k7167L1394j8384j271L2280k3137L5684L1043n542q632
2877B28618K6974o0538J3233M1578P98J6008J6095j5741n8917L5239J8982k4286
2865B38043j7493j2230K3633l802K3933k718K7215k2254p5523j9845j8130K4581
$$ y = [302187, 314271, 288957, 284284, 294726, 288050, 271999, 246929, 249550, 249854, 258927, 314857, 313000, 278257, 241860, 245227, 255412, 229051, 239443, 297581, 307270, 302013, 277011, 273710, 287393, 263506, 241175, 184004, 168045, 197663, 231749, 231980, 260388, 250019, 217996, 316732, 306972, 299857, 291121, 197316, 181450, 186649, 225116, 269333, 266770, 201819, 189965, 179274, 174094, 214465, 241836, 231687, 216669, 250688, 271193, 237862, 268138, 207195, 172109, 243267, 280102, 278030, 208964, 182350, 155183, 186577, 168193, 166922, 199202, 176065, 211749, 242792, 237250, 228618, 255592, 195054, 208287, 249865, 250663, 266671, 282766, 267025, 208108, 243347, 262329, 238043, 220550, 208320, 231953, 228151, 252084, 249366, 276581, 254327, 178804, 158959, 140829, 165410]
2853A65410L1324m5860j1452j6991L7037L7292r908M6694K5508J3781n3297l8118
2841A81420k3091m3806K2983J141K1934J1605l8649J6986k9541J7019k544N5260
2829A90717L1660l9206J2066N757K6508N71k9540j397J0572K474p0062k2929M4282
2816A61473L9928m9227p206K7567N1636j1901k0140n915k577n2339j8338J3862
2804A26823p17J8668r640J9521l1097J4074j4524N6953m8439p064k4314J9154
2792A19398N0800p0810J7070M0378m4164k5637J9609L804K3431k7214r410L4499
2780A31754K2435o539n431l1530l2155M2651N6835o610m6453m838m0649K6802
2768A06272J7559k1231k3469M0977K8572j1262l9659J4399K3570j8204l1564M4930
$$ y = [165410, 196734, 150874, 139422, 122431, 159468, 196760, 186852, 233546, 259054, 272835, 219538, 181420, 158329, 114523, 137506, 138647, 160581, 172186, 133537, 150523, 120982, 138001, 135457, 190717, 222377, 183171, 195237, 200994, 227502, 228073, 198533, 197136, 207708, 210182, 140120, 117191, 161473, 201401, 152174, 144968, 172535, 224171, 212270, 192130, 186215, 183638, 131299, 112961, 126823, 126106, 144774, 135134, 154655, 123558, 137632, 123108, 180061, 131622, 124558, 100244, 119398, 170198, 99388, 116458, 156836, 112672, 87035, 106644, 110448, 133879, 106665, 97255, 131754, 154189, 147650, 142219, 110689, 78534, 121185, 178020, 171410, 124957, 120119, 79470, 106272, 123831, 102600, 79131, 120108, 148680, 137418, 97759, 112158, 135728, 117524, 85960, 130890]
2756A30890L1921n898K712o1629J1117M747J7084K0004j6858R224j2288n0822
2744H0204N2773p5473P774m826K3346k0223K3607J7701J0896p154l1830Q898l463
2731H2230K1075m591K7361j1979l5899m264L6352J453j8539J6166L1382n3177
2719H7570j7841k89K9899p2404J9014m170m427P8511K150n8318K9583n033m099
2706H0146L1115j4485L7933j5196K5542p192k4587L6090M322n8587j3741L7348
2694A18708P74k9287Q743o444k1319J069P342m136N3241k4089k7292K383K0786
2681A00479M706j9284m2315L3442O680r431M4983J7688M2609k6667k8074K4721
2669A49537k9778L333M2249j6573L9687m710n6479p229O087O479L4518j7903o9942
$$ y = [130890, 162811, 156913, 159625, 97996, 109113, 113860, 130944, 150948, 134090, 143314, 131026, 80204, 132977, 57504, 65278, 60452, 83798, 63575, 87182, 104883, 115779, 108625, 76795, 85693, 82230, 103305, 98714, 126075, 114096, 78197, 73933, 110285, 111738, 93199, 109365, 140747, 87570, 69729, 69440, 99339, 26935, 45949, 41779, 37352, 115863, 118013, 59695, 89278, 84245, 80146, 111261, 96776, 134709, 119513, 145055, 137863, 113276, 149366, 153688, 95101, 81360, 118708, 119482, 90195, 98938, 92494, 71175, 72244, 79586, 75450, 128691, 104602, 77310, 79693, 100479, 105185, 85901, 43586, 77028, 83708, 74277, 119260, 136948, 179557, 152890, 124816, 149537, 119759, 123092, 165341, 148768, 188455, 183745, 127266, 120037, 126124, 132603, 167121, 149218, 79276]
2656G9276j171J7379K2228Jn2808n946N0082L802K615m643N426j3682n8111j7063
2642B7385J2470J5047K267m783k5774J9793j7468j5407N534N8571M3032o1506
2630E9161q032Q081J315M748J6988J6525o047j0570J6310K6308m003J2091j7714
2617A15161Q820o259K2174n5445k4833K3749Q906m190L1401k9219n0476k1990
2605A7799p223J7758N0651K0948l148Q139l2667l1417M6263K5797j7065j9257
2593G6578J1767L3932m2993L6551K5111l3986R0J498j3859l5808k4301L3422N4685
2580A22687N805k7013k6531k4464K9794K1217k6307L05Q209Q905j2043R848N7576
2567A47988l8658j4695k735k587O524o2813j361N2225M4860k3137k2861P3469
$$ y = [79276, 78105, 95484, 117712, 117713, 64905, 58959, 109041, 112843, 115458, 110815, 116241, 102559, 44448, 27385, 39855, 54902, 57169, 52386, 26612, 46405, 28937, 13530, 19064, 77635, 120667, 59161, 51129, 59210, 60525, 65273, 82261, 98786, 92739, 82169, 98479, 124787, 120784, 132875, 115161, 123981, 117722, 139896, 84451, 59618, 83367, 92273, 88083, 119484, 90265, 39789, 17799, 10576, 28334, 78985, 99933, 96785, 104924, 72257, 40840, 87103, 112900, 95835, 76578, 88345, 122277, 79284, 115835, 140946, 106960, 107050, 108548, 94689, 58881, 34580, 68002, 122687, 128492, 101479, 74948, 50484, 80278, 101495, 75188, 75493, 83702, 92607, 80564, 90412, 147988, 109330, 94635, 91900, 89313, 95837, 33024, 31663, 83888, 128748, 105611, 82750, 156219]
2555A56219l6719q668M427J4001K5413o3292p880m1966j3411M6314J2409K4872
2543A11719q515J0696k7368r508j9356N003L598K7013m0971M0839K150j3576j1763
2530F9961N8010O195n0751N719J6976Q785p882K7272M4638K97o1845L4723p555
2517A44543m3508K50K9859l033l8567l9484K437K1941K3623J2985k5122N9472
2505A45396R0037p0913r0649Q678L0546K2818k6504M6875O1175k8418j173L521
2493A91389K0225K648q769o3665L1472O643L9111l4684R919J9038J0451K6696
2481B50474k0770K8673M4718j5922p2514J0012N2496M1204J7920k8158L3647j2702
2469C29078N0085m5286j5520m1493J5428O406K9N7107k0694o133p538l6265L0882
$$ y = [156219, 119500, 110832, 115259, 129260, 154673, 91381, 83501, 41535, 28124, 74438, 86847, 111719, 103204, 113900, 86532, 77024, 57668, 62671, 66269, 93282, 52311, 93150, 95300, 81724, 69961, 127971, 134166, 83415, 89134, 106110, 114895, 107013, 134285, 178923, 179220, 117375, 152098, 144543, 101035, 101285, 131144, 128111, 89544, 50060, 52497, 74438, 98061, 111046, 85924, 145396, 235433, 164520, 73871, 82549, 113095, 135913, 109409, 156284, 217459, 189041, 187868, 191389, 211614, 214262, 205493, 141828, 173300, 179943, 219054, 184370, 194289, 213327, 223778, 250474, 229704, 258377, 303095, 287173, 214659, 224671, 277167, 318371, 336291, 308133, 341780, 329078, 379163, 333877, 318357, 276864, 292292, 298698, 298727, 355834, 335140, 329007, 321469, 285204, 316086]
2456C16086K343N363j94l0440M3387J8476L2484L4087O8727o5305J8064L6490
2444D79568J8943j8133j8801J2640L2319L4858N7479L2869l3042L0904L0751k1129
2432F39226M4153P0789N2699k7334L1817J5070L4087O8257P7919N1360P0920N4584
2420A183547O4034j5409J04317J29983O5286R1815O7142J06712J25687J94187
2410B117301J69165L1051R2856J65940J99307K79661L32352M95267O38437Q41203
2400E362540J148067J436298J791033K555836K650791Q33692j733259k503707
2392A1541291k088365j714359j327839j076630p75082n89343m65289l91961k87390
2383B825033k27381j65806j45398j65450j64348j35752j32658j83552j74540r7263
$$ y = [316086, 318429, 323792, 323598, 293158, 336545, 355021, 387505, 421592, 490319, 425014, 443078, 479568, 498511, 480378, 461577, 474217, 506536, 541394, 598873, 631742, 598700, 629604, 660355, 639226, 683379, 754168, 806867, 779533, 811350, 826420, 860507, 928764, 1006683, 1058043, 1128963, 1183547, 1247581, 1232172, 1336489, 1466472, 1531758, 1623573, 1690715, 1797427, 1923114, 2117301, 2286466, 2317517, 2410373, 2576313, 2775620, 3055281, 3387633, 3882900, 4521337, 5362540, 6510607, 7946905, 9737938, 12293774, 14944565, 15778257, 14044998, 11541291, 9452926, 7738567, 6410728, 5334098, 4559016, 3969673, 3504384, 3112423, 2825033, 2597652, 2431846, 2286448, 2120998, 1956650, 1820898, 1688240, 1504688, 1330148, 1232885]
2373A232885j14630J307m5134o2833k2127j9469j7067l3900j0120j06486k5606
2362G76820n6180oN83n6328n9751L517j4195k8253j763J961m7893l062K3197J846
2348E40493r4587j8070L2990l3461j5940Q100l5679k4411K4636j9581k2137m2721
2336B99632J1237M1826R865p0274l2390M9017L0759k9822K881L4129o8378J776
2324B80258n1952l2149M564l881J0042k8115P028J5563j7920M829k1305N2354
2312B19316n248l4143L3105m1220m939L5441k3058j3207K336P9883k7655n8853
2300A61758J0953j1249q143n0636k086M712j8851l679L3142J1194n13k9931P934
2287A04605O4124K4602n9352l0141j840j0899J0536N6230j027q398j9629M9377
$$ y = [1232885, 1118255, 1119562, 1074428, 1011595, 989468, 969999, 952932, 919032, 908912, 802426, 776820, 720640, 720634, 721217, 664889, 605138, 608655, 594460, 566207, 564444, 566405, 518512, 515450, 538647, 540493, 445906, 427836, 460826, 427365, 411425, 419525, 383846, 359435, 384071, 364490, 342353, 299632, 310869, 352695, 362560, 292286, 259896, 308913, 339672, 309850, 312731, 346860, 278482, 280258, 228306, 196157, 200721, 196840, 206882, 178767, 185795, 201358, 183438, 188267, 166962, 219316, 214068, 179925, 213030, 171810, 166871, 202312, 179254, 166047, 168383, 248266, 220611, 161758, 172711, 161462, 153319, 102683, 100597, 105309, 86458, 82779, 115921, 127115, 126602, 96671, 104605, 168729, 193331, 133979, 103838, 101998, 91099, 101635, 157865, 156838, 148440, 128811, 178188]
2275A78188N849k4917l6036J6511O410k7206L359m6196l7110L4015J9621K1876
2263A14364n45q286k6992r932n034J5685N2987l6191l8428N8090l688l7132m523
2250G0375k0986O4785J7637m6633m0710K3560l501R128j817O589L0961o0421J056
2237E0023N3988n20R55o4310J1231L6520j2404K9085m1601O498j8885K3937j1494
2224F3023K6362k2588j9045k6000j004N2583k6397k991n232p036J0076j8373M9621
2211G2999J1732n6022L2443M6893o045p0955K123L9161L8914j2209L4648j8280
2199A15402n7855N208j4414L6131O334l4231p179k8969J6219O881O861K8647l0226
2186D8809K532L1068n266l4670o7074K1793N9252m0356m0833K7664j987N1394
$$ y = [178188, 184037, 159120, 123084, 139595, 146005, 118799, 122158, 75962, 38852, 72867, 92488, 114364, 113819, 105533, 78541, 68609, 63575, 79260, 132247, 96056, 57628, 115718, 112030, 74898, 70375, 49389, 114174, 131811, 85178, 44468, 68028, 64527, 73655, 71838, 78427, 109388, 48967, 50023, 104011, 103491, 104446, 40136, 51367, 87887, 75483, 104568, 62967, 69465, 50580, 74517, 63023, 89385, 66797, 47752, 21752, 20748, 73331, 46934, 43943, 38711, 31675, 41751, 23378, 72999, 84731, 28709, 61152, 108045, 102000, 31045, 33168, 72329, 111243, 99034, 133682, 115402, 57547, 62755, 48341, 84472, 90806, 56575, 49396, 20427, 36646, 43527, 50388, 79035, 48809, 51341, 82409, 77143, 42473, -24601, -2808, 56444, 16088, -24745, 2919, 932, 52326]
2174E2326J4786n8003K0197K2720j2095O865k9669N510j8803K8795j6261j8497
2162b129m3910p291M2266L1645K4221j5798L871l784j6333k382K1236m980J1683
2149C8315P108J5700m6559o632M3032K1947Q24l5758L1769M0063p2697l3977k964
2136A71J8847j1623J8349J8579J4720K8910l1996J0299K0265M7167k6751J1698
2124A18635k5062r30j3126n454j2332L3029J9299k4755o1159k0902K2207K2577
2112E2027L2057m6558p659K2918n0265J7590k0470n848K7129O108N1251l6109
2100D2171N306m3732j167O970j0063l7404L7141L5655l9186K9992J7678m6580
2088c219M0778O285k8873l589K83m071L373j7473L0945k3712J0885M7942J0131
$$ y = [52326, 67112, 9109, 29306, 52026, 39931, 46796, 17127, 22637, 3834, 32629, 16368, -2129, -46039, -53330, -11064, 20581, 44802, 29004, 32875, 29091, 12758, 10376, 31612, 26632, 38315, 45423, 61123, 14564, 7932, 50964, 72911, 73735, 37977, 69746, 109809, 37112, 3135, 171, 19018, 7395, 25744, 44323, 59043, 87953, 55957, 66256, 86521, 133688, 106937, 118635, 93573, 92643, 79517, 74063, 61731, 94760, 114059, 89304, 28145, 7243, 29450, 52027, 84084, 37526, 29867, 52785, 2520, 20110, -360, -6208, 20921, 27029, 78280, 42171, 47477, 3745, 2578, 9548, -515, -37919, -778, 34877, -4309, 25683, 43361, -3219, 37559, 43844, 14971, 11382, 11665, 7594, 10967, -6506, 24439, 727, 11612, 59554, 69685]
2075F9685j162P208k3473m2644l6392k6121N7160N0468J4144j1409m818j8884
2063C3762k1938j6525K5375N4025j4377k7313m823k208J0352r140l5220j0391
2051a8421o04O4524Q866n8820m36L4399J6523K3974p8872K4003J4380j4938o415
2038H163O4821j2850n0645n7215P982L8247m1670Q2974M983l7065m154J3974j6592
2025I53j7573J131N6177Q70l1508J3795J9564p8826k977K4735k370j3135O5871
2012C6707k2357j9644L7944L2000m7451l1585j1104M5313N5838N464m5306j0613
2000B5206j3537J4898j0396R038K8775J3911l7764l7255L9927K4876j5696O745
1988D8728j5663n0528O945K452K9703o5253J9725r452J2948M9391K7626J3700
$$ y = [69685, 68523, 75731, 52258, 9614, -26778, -52899, 4261, 54729, 68873, 57464, 52646, 33762, 11824, -4701, 20674, 74699, 60322, 33009, 28186, 25978, 36330, 27190, -8030, -18421, -19025, 45499, 54365, -4455, -4891, 29508, 46031, 70005, -8867, 15136, 29516, 14578, 8163, 72984, 60134, 9489, -47726, -39744, -1497, -43167, 39807, 44790, 7725, 3571, 17545, 953, -16620, -15489, 40688, 41558, 10050, 23845, 43409, -35417, -38394, -13659, -16029, -29164, 36707, 14350, -5294, 32650, 64650, 17199, -14386, -25490, 19823, 75661, 81125, 35819, 25206, 11669, 26567, 16171, 25209, 53984, 67895, 30131, -7124, 32803, 57679, 41983, 48728, 33065, -17463, -10518, -8066, 21637, -43616, -23891, -33343, -20395, 28996, 56622, 70322]
1976G0322o7111N0290L5025J1066j7821p0931K431N310k6193o532P7733k53l0346
1963C2990k2948L5132J3236j7721k0831k4558K3813j8093N523L527L4144J5316
1951E9530j5140J5429k0502q872K4573j438j7171j05k9442m212J2352K9808o0906
1938a6096J3648j2937J4530L4441J4372J8592j8163j9165J5426Q245N189k290
1926E5792k6937K2200k5031k8503L329L0967J0741o4344j7584R272j3494R1312
1914D7720j363n8138j4903L3309J6113l014L619O056j7571o450Q997k4865j0828
1901b1318M434P7865n440m4949l3065K8245P862j9680l786K9885M4970l0477K661
1888C7207J2280Q103J833r763l8518k7738L2578N4452j7298n0689m466O873k7153
$$ y = [70322, 3211, 53501, 88526, 99592, 81771, 10840, 13271, 18581, -7612, -14144, 63589, 63336, 32990, 10042, 45174, 58410, 40689, 19858, -4700, 19113, 1020, 6543, 10070, 44214, 59530, 44390, 59819, 39317, 30445, 55018, 53580, 36409, 36304, 6862, 2650, 15002, 44810, -16096, -2448, -15385, -855, 33586, 47958, 66550, 48387, 29222, 44648, 52893, 58082, 55792, 28855, 51055, 26024, -2479, 850, 31817, 42558, -21786, -39370, -30098, -43592, 47720, 46357, -11781, -26684, 6625, 22738, 19724, 23343, 29399, 11828, 5378, 14375, -10490, -21318, -16884, 60981, 55541, 10592, -22473, 5772, 13634, -6046, -9832, 20053, 65023, 34546, 37207, 49487, 57590, 59423, 49660, 11142, -16596, 15982, 70434, 53136, 2447, -2019, 4854, -22299]
1875b2299o052L05J0985k3732J0298J6033O5740k5092j0750P777j1055j3627k1121
1862b2590j4235K6846k9243J0639L2842k7843J6207L1924j80l7616o410Q813K2556
1849A1710L766P186K5929j3632n3339j69J5732l9952l1623L6801k933l6004L9179
1836c7349J4207N38O2207K5334q145p1543O706L5680K2858l4710k2329k8617N7361
1823B2198L358k6194K0471l5773k9095K3202J1150Q360q172N635L0135k0412l9572
1810c4709K7006K8125n425P703j5892Q125k922n617J5167q422n3845j4349j6157
1797g1212M1992j213n342J0532P1437M7631o6730j5889m1399k1000J6649J0662
1785b3882M3783p469q693m407M928K7348j8038K3093L2851k1414l2152K9389n3685
$$ y = [-22299, -28351, -28046, -17061, -40793, -30495, -14462, 51278, 26186, 15436, 23213, 12158, -1469, -22590, -36825, -9979, -39222, -28583, 4259, -23584, -7377, 24547, 24367, -13249, -19659, -10846, 11710, 15476, 22662, 48591, 34959, -18380, -18549, -2817, -42769, -74392, -37591, -40524, -76528, -37349, -23142, -22604, 39603, 64937, 56792, -14751, -8045, 27635, 50493, 15783, -6546, -35163, 22198, 25556, -638, 19833, -15940, -45035, -21833, -10683, -2323, -10495, -4860, 25275, 4863, -34709, -7703, 20422, 14997, 22700, 6808, 14933, 12011, 6394, 21561, 13139, -40706, -55055, -71212, -29220, -30433, -35775, -25243, 46194, 93825, 27095, 11206, -30193, -51193, -34544, -23882, 19901, 12432, 3739, -668, 4260, 31608, 13570, 36663, 69514, 48100, 15948, 45337, -8348]
1772h348j8257Q5616n945r4129J5260j120J4298L8108n9192q221K4324M0353J1256
1759C4003K3916k2519M4875j1964n3097j4666N4218o4548n1131M7461j0114L0575
1747G009k9783k3701J0250o091K601J3581l1150M470K054N0353J0465m7963l4739
1734g2644N3332O5806q7289k9404M4421P582L3634j8905j1651P0242J002k4073
1722C2053p473k1196r19o6353p374M6136N1833k5634n0614j523J6850J8584j025
1709a6655O4732k8886M574k6068o6758M147L9182K0854O262l3957j6070L2169
1697a6474o172K3669k7871L0756k546M789L4446k8018r963J6039l9624j459l208
1684b5636K4670j6152K377K9673k6421J9665l8401K3035Q488n3945j6680N7454
$$ y = [-8348, -26605, 59011, 53066, -41063, -25803, -26923, -12625, 25483, -33709, -41930, -17606, 22747, 34003, 57919, 35400, 80275, 68311, 15214, 548, 54766, -9782, -60913, -13452, -23566, 7009, -22774, -46475, -36225, -42316, -39715, -26134, -57284, -52814, -50760, -407, 10058, -37905, -72644, -19312, 46494, -40795, -70199, -25778, -18196, 15438, -3467, -15118, 55124, 56126, 32053, 24580, 3384, 2465, -63888, -71262, -25126, 26707, 1073, -49541, -51064, -34214, -15630, -16655, 48077, 19191, 23765, -2303, -69061, -64914, -25732, -4878, 1384, -32573, -48643, -16474, -22646, 1023, -26848, 3908, 1362, 6151, 40597, 12579, 2616, 18655, -20969, -22428, -25636, -966, -17118, -14741, 14932, -11489, 8176, -30225, -7190, 1298, -52647, -69327, -11873]
1672a1873L9379k3449Q069j9272L4674L1993k7792j2684l148j5912J0913j4030
1660c132j793O1983j7063k2230Q385j6259m3901M5460n7568J9561J1735K2256
1648G434o372J0431K8654m0923o5096K3335M4995l4865O9375k4233l4190L7778
1636A6323J9077r765K1960j7624L768J977l5133n455K4402q536L1997j231m9391
1623g631k2892K3988N1228l8920L1796m165j9318q357j5769N2962j9703o7767
1611d4548J3528K3946J9548j40k8744j4861L3061n149m3926r192K7208L0155J9689
1598B0575l2194n2382m1379K7154K3634M5024j4651M7231K2833m6947M2979K7268
1586F9145k3048J0684l1174R1m742m0733J5759o133l378j116j7986m1925N6075
$$ y = [-11873, 27506, 4057, 12126, -7146, 27528, 59521, 31729, 19045, 15897, -15, 10898, -3132, -4925, 57058, 39995, 17765, 26150, 9891, -34010, 11450, -46118, -26557, -14822, 7434, 1062, 11493, 40147, -776, -65872, -42537, 2458, -32407, 36968, 12735, -21455, 16323, 35400, 25635, 47595, 29971, 33739, 35716, 583, -4872, 19530, 10994, 42991, 41760, -7631, -30523, -6535, 44693, 5773, 37569, 33404, 14086, 5729, -10040, 42922, 23219, -44548, -31020, -7074, 12474, 12334, -16410, -31271, 1790, -3359, -47285, -56477, -29269, 886, 20575, -11619, -64001, -105380, -78226, -54592, -9568, -24219, 23012, 45845, -1102, 41877, 69145, 46097, 56781, 25607, 25698, 20956, -19777, -4018, -10151, -13529, -14645, -32631, -74556, -18481]
1573a8481Q972J9332n22K6801m0318J1742J1675m5813j8403K2214l2039K7921
1561b6919K2733Q076m8263K1033k1706j0867K2037L7689M4387m9168n8235O434
1549e2769o90p47J7128k4955M4359J7252K793M6268J1476j2745n011k4160k9361
1536a1162P787J0107j3629J4089O6844m6814k9304K6699l7271J4990n070J3426
1524A0692j5843k3830l9639l805K8829K6647j9056M7985K8191l7536k3219l8205
1512e8789O219P0313K92l958J4287l8916n1134N0587O3869n148l9982j8543l5490
1499d6393m381k562m3548P1641M9342k3769j4440j3841K7813j786K692k7328N629
1486b0931R175r84j5069k2469M0722k1962j9061K134J3077r487J1139J8183K96
$$ y = [-18481, -9509, 9823, 9301, 36102, -4216, 7526, 19201, -26612, -45015, -22801, -54840, -26919, -4186, 3890, -44373, -23340, -45046, -55913, -33876, 3813, 48200, -968, -59203, -52769, -53459, -54206, -37078, -62033, -17674, -422, 2371, 48639, 60115, 47370, 42359, 18199, -11162, -3375, 6732, -6897, 7192, 74036, 27222, -2082, 24617, -12654, 2336, -2734, 10692, -5151, -28981, -68620, -72425, -43596, -16949, -36005, 11980, 40171, 2635, -20584, -58789, -52570, 17743, 18035, 14077, 28364, -10552, -61686, -11099, 52770, 47622, 7640, -10903, -46393, -50774, -53336, -96884, -25243, 24099, 330, -14110, -27951, -138, -1924, 768, -26560, -20931, -11756, -12740, -27809, -50278, -9556, -31518, -50579, -48445, -35368, -44855, -33716, -15533, -15237]
1473a5237N1742m419O464l6126j8451m584l9079M9544J3511J4155P441m3376O004
1460a2411J8133k0363k3336L2918j2564p373K1321L7945l7699J9534j823j2279
1448B003J342l8581J9715K5476L541l7015Q273r085M5089J419j6791j0760n04
1435e878j0986K6656K2839r579M5408m9529o4571M7602K9961n6060k2870L2289
1423a4718N2663l7825J7280P508k835J8623n7668j7786M5725J6196l9661j3607
1411b6105L0590J490j2509J9494p198L8917k9277n6781Q61J1119L2689L5705k2284
1398A6711j9544J6514J4561j1671J0398l5374r019J6114J172n2261j1487L5162
1386b8724O0093l3171m1910K7581l223K0124j5235J8600M156L941j3687j5211
$$ y = [-15237, 36505, 32086, 38550, 2424, -16027, -20611, -59690, -10146, 3365, 17520, 24961, -18415, -12411, 5722, -14641, -37977, -5059, -17623, -24996, -3675, 34270, -3429, 16105, 14282, 2003, 3345, -35236, -15521, 9955, 13496, -23519, -15246, -24331, 20758, 22177, 5386, -5374, -5878, -16864, 9792, 32631, 23052, 68460, 18931, -45640, 1962, 31923, -24137, -47007, -14718, 37945, 120, 17400, 24908, 22073, 40696, -16972, -34758, 10967, 27163, -12498, -26105, 4485, 5975, -6534, 12960, 5762, 44679, 15402, -41379, -40518, -29399, 3290, 38995, 16711, -2833, 13681, 28242, 16571, 26969, -8405, -17424, -1310, -138, -52399, -63886, -28724, 31369, -1802, -43712, -16131, -19354, 770, -14465, 4135, 8291, 12232, -1455, -16666]
1374a6666J4340j4229J3483J7653j8623K945J9561K1023r97n3141J9155k3662
1362a9158M8487j0998j09273j1650M3815M820K9495L0456j293K7844J0931j2298
1350C1178Q716n4340j5029L3120J1150J3412k7157M6066j700m0915o2172N7332
$$ y = [-16666, -2326, -16555, -3072, 14581, -4042, -1097, 18464, 39487, 38490, -14651, 4504, -19158, 29329, 18331, -90942, -102592, -58777, -53957, -24462, 5994, 4701, 32545, 43476, 31178, 39894, -14446, -29475, 3645, 14795, 28207, 1050, 47116, 45416, 4501, -57671, -339]
$$ [...]
##END NTUPLES=NMR SPECTRUM
##END=
