##TITLE=1H_CG-1179
 CDCl3+DMSO
 8 sc, 
 1.11.2023
##JCAMPDX= 6.0         $$ Bruker NMR JCAMP-DX V2.0
##DATA TYPE= NMR SPECTRUM
##DATA CLASS= NTUPLES
##ORIGIN= UXNMR, Bruker Analytische Messtechnik GmbH
##OWNER= root
$$ XWIN-NMR		Version 3.5
$$ Wed Nov  1 14:20:22 2023 Russian Standard Time (UT+4h)  she@DPX200
##.OBSERVE FREQUENCY= 200.13135
##.OBSERVE NUCLEUS= ^1H
##.ACQUISITION MODE= SIMULTANEOUS
##.ACQUISITION SCHEME= undefined
##.AVERAGES= 8
##.DIGITISER RES= 18
##SPECTROMETER/DATA SYSTEM= spect
##.PULSE SEQUENCE= zg30
##.SOLVENT NAME= DMSO
##.SHIFT REFERENCE= (INTERNAL, DMSO, 0, 15.8582)
##AUDIT TRAIL= $$ (NUMBER, WHEN, WHO, WHERE, WHAT)
$$ ##TITLE= Audit trail, XWIN-NMR		Version 3.5
$$ ##JCAMPDX= 5.01
$$ ##ORIGIN= Bruker BioSpin GmbH
$$ ##OWNER= she
$$ F:/spectra/data/she/nmr/H-F/1/pdata/1/auditp.txt
$$ ##AUDIT TRAIL=  $$ (NUMBER, WHEN, WHO, WHERE, WHAT)
(   1,<2023-11-01 14:19:10.50 +0400>,<she>,<DPX200>,
      <created by zg, POWCHK disabled, PULCHK disabled
       configuration hash MD5:
       00 E9 B6 7A A2 85 ED C7 34 08 36 98 17 FE 4E 26
       data hash MD5: 16K
       5A 29 8E D9 4C E1 A5 5D 5B 4A 81 19 00 34 90 3B>)
(   2,<2023-11-01 14:19:13.10 +0400>,<she>,<DPX200>,
      <Start of raw data processing
       efp BC_mod = 2 LB = 0.24 FT_mod = 6 PKNL = 1 PHC0 = -23873.55 PHC1 = 8.652709 SI = 16K 
       data hash MD5: 16K
       D8 29 E9 5F 96 00 73 BC 55 8B 7C 20 E0 73 9C 72>)
(   3,<2023-11-01 14:19:30.92 +0400>,<she>,<DPX200>,
      <pk PHC0 = 0.7758715 PHC1 = -2.2 
       data hash MD5: 16K
       67 DA 4F F9 EB 50 64 F0 86 1E EF 46 F0 E7 62 81>)
(   4,<2023-11-01 14:19:34.71 +0400>,<she>,<DPX200>,
      <abs ABSG = 5 
       data hash MD5: 16K
       D2 7A 57 74 E1 3D 17 DD FE 84 88 9F B1 FA CF DA>)
$$ ##END=
$$ 
$$ hash MD5
$$ 42 08 8A 5D 68 00 44 3E 87 A4 40 37 E3 FB 02 A3
##$RELAX= 
##$RELAX= 
##$RELAX= 
##$RELAX= 
##$RELAX= 
##$RELAX= 
$$ Bruker specific parameters
$$ --------------------------
##$DU= <F:/spectra>
##$EXPNO= 1
##$NAME= <H-F>
##$PROCNO= 1
##$TYPE= <nmr>
##$USER= <she>
##$AMP= (0..31)
100 100 100 100 100 100 100 100 100 100 100 100 100 100 100 100 100 100 
100 100 100 100 100 100 100 100 100 100 100 100 100 100 
##$AQSEQ= 0
##$AQ_mod= 1
##$AUNM= <au_zg>
##$AUTOPOS= <>
##$BF1= 200.13
##$BF2= 200.13
##$BF3= 200.13
##$BF4= 200.13
##$BF5= 200.13
##$BF6= 200.13
##$BF7= 200.13
##$BF8= 200.13
##$BYTORDA= 1
##$CFDGTYP= 0
##$CFRGTYP= 5
##$CHEMSTR= <none>
##$CNST= (0..31)
1 1 145 1 1 1 1 1 1 1 1 1 1 1 1 1 1 1 1 1 1 1 1 1 1 1 1 1 1 1 1 1 
##$CPDPRG= <>
##$CPDPRG1= <>
##$CPDPRG2= <>
##$CPDPRG3= <>
##$CPDPRG4= <mlev>
##$CPDPRG5= <mlev>
##$CPDPRG6= <mlev>
##$CPDPRG7= <mlev>
##$CPDPRG8= <mlev>
##$CPDPRGB= <>
##$CPDPRGT= <>
##$D= (0..31)
0 1.2 0 0 0 0 0 0 0 0.06 0 0.03 0 0 0 0 0.0002 0 0 0 0 0 0 0 0 0 0 0 0 
0 0 0 
##$DATE= 1698833949
##$DBL= (0..7)
120 120 120 120 120 120 120 120 
##$DBP= (0..7)
150 150 150 150 150 150 150 150 
##$DBP07= 0
##$DBPNAM0= <>
##$DBPNAM1= <>
##$DBPNAM2= <>
##$DBPNAM3= <>
##$DBPNAM4= <>
$$ [...]
##$SUBNAM3= <"">
##$SUBNAM4= <"">
##$SUBNAM5= <"">
##$SUBNAM6= <"">
##$SUBNAM7= <"">
##$SUBNAM8= <"">
##$SUBNAM9= <"">
##$SW= 18.05172834244
##$SWIBOX= (0..15)
0 0 2 0 0 0 0 0 0 0 0 0 0 0 0 0 
##$SW_h= 3612.71676300578
##$TD= 16384
##$TD0= 1
##$TE= 0
##$TE2= 300
##$TE3= 300
##$TEG= 300
##$TL= (0..7)
0 120 120 120 120 120 120 120 
##$TP= (0..7)
150 150 150 150 150 150 150 150 
##$TP07= 0
##$TPNAME0= <>
##$TPNAME1= <>
##$TPNAME2= <>
##$TPNAME3= <>
##$TPNAME4= <>
##$TPNAME5= <>
##$TPNAME6= <>
##$TPNAME7= <>
##$TPOAL= (0..7)
0.5 0.5 0.5 0.5 0.5 0.5 0.5 0.5 
##$TPOFFS= (0..7)
0 0 0 0 0 0 0 0 
##$TUNHIN= 0
##$TUNHOUT= 0
##$TUNXOUT= 0
##$USERA1= <user>
##$USERA2= <user>
##$USERA3= <user>
##$USERA4= <user>
##$USERA5= <user>
##$V9= 5
##$VALIST= <valist>
##$VCLIST= <CCCCCCCCCCCCCCC>
##$VD= 0
##$VDLIST= <DDDDDDDDDDDDDDD>
##$VPLIST= <PPPPPPPPPPPPPPP>
##$VTLIST= <TTTTTTTTTTTTTTT>
##$WBST= 1024
##$WBSW= 4
##$XGAIN= (0..3)
0 0 0 0 
##$XL= 0
##$YL= 0
##$YMAX_a= 64510
##$YMIN_a= -130007
##$ZGOPTNS= <>
##$ZL1= 120
##$ZL2= 120
##$ZL3= 120
##$ZL4= 120
##$ABSF1= 15.73256
##$ABSF2= -2.319289
##$ABSG= 5
##$ABSL= 3
##$ALPHA= 0
##$AQORDER= 0
##$ASSFAC= 0
##$ASSFACI= 0
##$ASSFACX= 0
##$ASSWID= 0
##$AUNMP= <proc_1d>
##$AZFE= 0.1
##$AZFW= 0.1
##$BCFW= 0
##$BC_mod= 2
##$BYTORDP= 0
##$COROFFS= 0
##$CY= -3
##$DATMOD= 1
##$DC= 0
##$DFILT= <>
##$DTYPP= 0
##$F1P= 0
##$F2P= 0
##$FCOR= 1
##$FTSIZE= 16384
##$FT_mod= 6
##$GAMMA= 0
##$GB= 0
##$INTBC= 1
##$INTSCL= 3.70164e-10
##$ISEN= 128
##$LB= 0.24
##$LEV0= 0
##$LPBIN= 0
##$MAXI= 10000
##$MC2= 0
##$MEAN= 0
##$ME_mod= 0
##$MI= 1.114404
##$NCOEF= 0
##$NC_proc= -7
##$NLEV= 6
##$NOISF1= 3.799351
##$NOISF2= 2.8
##$NSP= 0
##$NTH_PI= 0
##$NZP= 0
##$OFFSET= 15.85817
##$PC= 1
##$PHC0= -23872.78
##$PHC1= 6.452709
##$PH_mod= 1
##$PKNL= yes
##$PPARMOD= 0
##$PSCAL= 0
##$PSIGN= 0
##$REVERSE= no
##$SF= 200.129982661795
##$SI= 16384
##$SIGF1= 3
##$SIGF2= 2
##$SINO= 5.538805
##$SIOLD= 16384
##$SREGLST= <1H.CDCl3>
##$SSB= 0
##$STSI= 16384
##$STSR= 0
##$SW_p= 3612.71676300578
##$SYMM= 0
##$S_DEV= 0
##$TDeff= 16384
##$TDoff= 0
##$TI= <>
##$TILT= no
##$TM1= 0
##$TM2= 0
##$TOPLEV= 0
##$USERP1= <user>
##$USERP2= <user>
##$USERP3= <user>
##$USERP4= <user>
##$USERP5= <user>
##$WDW= 1
##$XDIM= 16384
##$YMAX_p= 427062152
##$YMIN_p= -2606579
$$ End of Bruker specific parameters
$$ ---------------------------------
##NTUPLES= NMR SPECTRUM
##VAR_NAME=  FREQUENCY,     SPECTRUM/REAL,   SPECTRUM/IMAG
##SYMBOL=    X,             R,               I
##VAR_TYPE=  INDEPENDENT,   DEPENDENT,       DEPENDENT
##VAR_FORM=  AFFN,          ASDF,            ASDF
##VAR_DIM=   16384,         16384,           16384
##UNITS=     HZ,            ARBITRARY UNITS, ARBITRARY UNITS
##FACTOR=    0.220516191357247, 1,           1
##FIRST=     3173.69519822285, 0,            0
##LAST=      -439.021564782926, 0,           0
##MIN=       -439.021564782926, -2606579,    0
##MAX=       3173.69519822285, 427062152,    0
$$ Real data points
##PAGE= N=1
##DATA TABLE= (X++(R..R)), XYDATA
$$ [...]
7813a66559M8344o2781J17361q0607q1483R0994Q0567R7297L1316k90648j007
7802b17206J75270O0660p2854k21116J02903R1815j13142n4128P8185j8740J40575
7791d7778J8171o3433R5741q0314j06340J00872m0033m60k67481J14498K07358
7780f9199n48o3973j00469p7027K69554J5924n34M6642P9640k87153q9415P3670
7768b02888J04896k02893K5083K38476J22983P2438j23929p0297k8022K64497
7758B00344M3858k62013O7353O3005j2207P3824p2772J6581j7477j22436J8650
7747c290o3222J23439k02314O055K7180J8751j23553J23527N7425L0790J27079
7736A21867j56034j28236j27484O5911J84435J96571j90213K8341j88079K500
$$ y = [-166559, -118215, -180996, -63635, -144242, -225725, -134731, -54164, 43133, 74449, -216199, -217206, -41936, 18724, -54130, -275246, -172343, -80528, -193670, -247798, -169613, -188353, -47778, -29607, -93040, 2701, -77613, -183953, -83081, -123114, -123574, -391055, -276557, -69199, -69747, -133720, -234189, -311216, -41662, -25738, -26272, 20370, 100010, -187143, -276558, -202888, -97992, -300885, -275802, -37326, 85657, 158095, 34166, -36131, -64153, 200344, 244202, -17811, 49542, 112547, 100340, 174164, 101392, 117973, 100496, -21940, -3290, -66512, 56927, -145387, -139332, -112152, -93401, -216954, -93427, -36002, -5212, 121867, -34167, -162403, -289887, -223976, -39541, 157030, -33183, -4842, -192921, -190421]
7726a90421l0044k03427J78806N1868J68991P4582j25829Q1360j15484J32295
7716B2697j11220Q3631J07773j1357j24168n8255l7163j84464J44664J18850j64115
7705b13127J49855M9180j1376Q6219n985j92634J61961N8931q0416j18905J47686
7694C1389k8612j05876o830J79403j23809m9700j55974j6972n3457K84236o3689
7683a09891j12035O4050O8779j19610j09237R5793j3415J55421m8877M6969j78875
7672b60928K316m6492M9272j91478J54537J40011L8780O4889K2238j03854L16577
7661A85868j17604k37768l8412Q8359N4969J0051N32K7949j86282J39885P1975
7650d78m8788P0551L5417k30397k36857J26460J17069P1359Q4940j29782M9407
$$ y = [-190421, -220465, -423892, -245086, -193218, -24227, 50355, -75474, 5886, -109598, 22697, -88523, -4892, 102881, 91524, -32644, -90899, -128062, -312526, -167862, -49012, -213127, -63272, -14092, -25468, 60751, 54766, -137868, 24093, 83024, 2608, -116297, 31389, 2777, -103099, -109929, 69474, -54335, -104035, -260009, -276981, -330438, -46202, -109891, -221926, -157876, -89097, -208707, -317944, -222151, -235566, -80145, -129022, -82053, -260928, -258612, -305104, -255832, -447310, -292773, -152762, -113982, -49093, -26855, -130709, 185868, 68264, -169504, -207916, -119557, -64588, -54537, -54005, -26056, -212338, -72453, -478, -49266, 21285, 56702, -173695, -410552, -284092, -167023, -95664, -10724, -140506, -91099]
7639i1099J72750n9628N8746m5587p7142L9144j44688k9502J77110k3237k17272
7628b40405P1945N0384j46978J1325L39152M9962j24225n424J79569K9871j22176
7617I3000L1235j95514P2759K29816j74489k03334P0166j01114N341q8189o0302
7606c20625J57289P7261m9955J32083q9885J48249J5405M3561j27551k07338J53818
7595f7688j5540o6947q0635n0320J14519k1978K37449K642K3204P6440n3607j93495
7583i5956r2843J76977m0492j16628n7454J15909m1174j1542J54249K58713k13064
7572C6695O808P7472j61901o3954j50319k8565J53368R5492k9807j83946J08560
7561a40097M5789p1608N8554o8900r9188K30482J39189j01515L8613j87774p1555
$$ y = [-91099, 81651, 22023, 80769, 35182, -41960, -2816, -147504, -177006, 104, -23133, -240405, -168460, -118076, -265054, -253729, 85423, 135385, 11160, 5736, 185305, 215176, 93000, 124235, -71279, 1480, 231296, 56807, -146527, -76361, -177475, -172134, -260323, -320625, -163336, -86075, -136030, -3947, -93832, 54417, 69822, 113383, -14168, -221506, -67688, -83228, -150175, -230810, -281130, -166611, -188589, 48860, 51502, 74706, 151146, 97539, -95956, -188799, -11822, -52314, -168942, -226396, -110487, -151661, -163203, -8954, 249759, 36695, 43503, 120975, -40926, -104880, -255199, -283764, -130396, -34904, -64711, -248657, -140097, -94308, -165916, -107362, -176262, -275450, -44968, 94221, -7294, 31319, -156455, -228010]
7550b28010M5462K54335l3440j35679o9723j9595J217P6369L5887m6164j11310
7539b30651J20186J7156K9955J1246j69024J7552N875K32030J24386j87951j39108
7528a68348l535J06585K6206j4604K9693M0691M8569j75690P0809J45876o7935
7517C8317l9965K4922J21403p4838j09725O9811n066J31807j62472k62790J64143
7506a04453P7609k137J32500l7634L942P6037o0013J03392j37805j06946J39948
7495H4440k53368N0403L114J25437K5038j18702m2836J48037R4833n111k56894
7484a45609J9805J01994Q5164p8377o3335P1162L7784J24031j19951j23289J42152
7473E1531J06269m6876l5768M4655j74172j83919m457j15785J12968J52385J24359
$$ y = [-228010, -182548, 71787, 38347, -97332, -167055, -186650, -185433, -109064, -73177, -119341, -230651, -110465, -93309, -63354, -52108, -221132, -203580, -197705, 34325, 158711, -29240, -168348, -171883, -65298, -39092, -53696, -24003, 16688, 65257, -110433, -39624, 106252, 38317, -1648, 23274, 144677, 69839, -39886, 29925, 24859, 156666, -5806, -268596, -104453, -26844, -28981, 103519, 65885, 69827, 145864, 85851, 189243, 51438, -55508, 84440, -168928, -118525, -115411, 10026, 35064, -83638, -126474, 21563, 116396, 111285, -145609, -125804, -23810, 61354, -17023, -80358, -9196, 28588, 152619, 32668, -90621, 51531, 157800, 110924, 75156, 119811, -54361, -238280, -242737, -358522, -245554, -93169, 31190]
7462C1190j2052n049J04373j66642n1657L0290Q2131J21903k10855R5229j88844
7451a69983p4744j90697J25196J70350n6301J43063j68543l8412J22247L6221
7441a01603L8044J18428K7982J1413L1181k18819k51175P6451L38011q3740m4815
7430e8642J26716j72718o7941j0392j421P7610J60301k7443m4201K6800j43115
7419a34446J64274P6800M0428j20057L1632l8050m6659N0981P4604r7136j07563
7408a05192K3582J11507n6278l1676J71394M4459r0045j32154l5683j04740J53400
7397e1426m3584K4728R6890j28898r6579Q5894K8105K44797k858j7407j06117
7386C3545j00244K01286p6629j08288N4890Q9985J24867n7204j43721j59642Q9065
$$ y = [31190, 19138, 14089, 118462, -48180, -99837, -69547, 12584, 134487, -76368, 18861, -169983, -244727, -435424, -310228, -139878, -196179, -53116, -221659, -260071, -137824, -101603, -63559, 54869, 82851, 94264, 125445, -93374, -344549, -268098, 69913, -13827, -58642, 68074, -104644, -172585, -182977, -184398, -106788, 53513, 26070, -18131, 8669, -134446, 29828, 106628, 147056, 26999, 58631, 20581, -26078, 24903, 99507, 2371, -105192, -81610, 29897, -26381, -58057, 113337, 157796, 67751, -64403, -100086, -204826, -51426, -95010, -70282, 26608, -102290, -198869, -112975, -84870, 159927, 157069, 139662, 33545, -66699, 134587, 57958, -50330, 4560, 94545, 219412, 162208, 18487, -141155, -52090]
7375e2090o1687j69015K2842n055M01983k32889n7960Q1960L167m8258R5645P2252
7363E0895R9428o898j64118q0524q7186J07305J13725J20593j00733j2550J34180
7352A74117N0256k30820r7067n7319J27251j18910P9403Q3918j46609J16511N0446
7341C1177L28000k42493j49455O5979k04023O2855l7688N4382j87485n3162J65804
7330a66109J30110L8519M4204j51280l3647P6009L1232J6480L7323r5542O4534
7319h167J4105K1569M9400j055n5739K7545m3373P1500j2810J17559p1261j05172
7307D101l8102O2500m0087l7741M7722m4841n2987j42886k6073J89389M3243k59254
7295b95016L14561o9108p5716J9830k8979o2073K9296Q5425Q3664L1753m6433
$$ y = [-52090, -113777, -282792, -259950, -265005, 136978, -95911, -153871, -71911, -68744, -117002, -21357, 50895, 150323, 143425, -20693, -101217, -188403, -81098, 32627, 153220, 52487, 39937, 174117, 224373, -6447, -103514, -160833, -33582, -152492, -73089, 10829, -135780, -19269, 31177, 359177, 116684, -32771, 33208, -170815, -107960, -145648, -91266, -278751, -331913, -166109, -35999, 2520, 46724, -104556, -138203, -62194, -30962, -14482, 22841, -72701, -8167, 5938, 27507, 76907, 75852, 20113, 47658, 4285, 75785, 62975, 180534, 109273, 4101, -34001, 28499, -11588, -49329, -1607, -46448, -99435, -242321, -268394, -79005, -35762, -295016, 19545, -49563, -125279, -105449, -134428, -196501, -167205, -81780, 1884, 33637, -12796]
7284a2796j8573l7946J71631M5291j67421R7967k24805m3274L4731R5801O1869
7273B475J40078q6396j04742n8514J9994K5291J70779j9269q9296m23k05799J34113
7261g1709k13951O5110R3315M1172J5208J54853J11020k46168n0164k815J14663
7250A0534J3368j03911m7450J55530l2653p4174P3403Q512r6440l9550m4720j69481
7238c47032j11366J63896J55888l2694L7949J5624j50312l2640j730J63535L37568
7227A98686k21292J30828p5658k71555N1185q616j5496o7588K6682K08598q096
7216e2322p3490q1618N5703K08794j20634J29758L3008j56419j28270k1232L0187
7205a76535k2319J23745l7462O4682R1927J86840j65956j23552L8119q9967M5
$$ y = [-12796, -31369, -69315, 102316, 147607, -19814, 78153, -146652, -189926, -155195, -59394, 2475, 142553, 56157, -48585, -107099, -87105, -61814, 108965, 89696, 400, -23, -205822, -71709, -285660, -220550, -127235, -86063, -70855, 83998, 195018, -51150, -101314, -104129, 10534, 23902, -80009, -127459, 28071, -4582, -78756, -5353, 3159, -93281, -132831, -177551, -347032, -458398, -294502, -138614, -171308, -133359, -117735, -268047, -300687, -302417, -138882, 198686, -22606, 108222, 32564, -238991, -187806, -196422, -211918, -279506, -252824, -44226, -52322, -125812, -207430, -151727, 57067, -63567, 66191, 99199, -57220, -185490, -206722, -176535, -198854, -75109, -112571, -47889, 44038, 230878, 64922, -58630, -20511, -110478, -110433]
7194a10433J02041q1259L0598j0281o6015r3581m8959J60321K27759r9755k26199
7183b15763R8278L0544r8573k3914J9486R6320M4781k28056J86659k9983K8691
7172i1530O8808j11299J32745N385k82585J85486o1875K0505P6655j51186o1652
7161b70543K23565Q8987k94697j09111L2065q4578J45454K86651L06622r2379
7151B32036k01207q8044J21810J92956j09195R0749q7524m6380j56197N3086k23116
7140b21026J5958k08586N6655J08775J84737L8253K0895J09012j10467N123L0513
7129B9842J3412L0466P9377k78541J47584n4740O9998q4072N5678R2388J26847
7118B28239R3270q8557p3558p3104j15759l1140j22086L8880J64088J2242l2504
$$ y = [-110433, -8392, -89651, -59053, -69334, -135349, -228930, -277889, -117568, 110191, 10436, -215763, -117485, -86941, -185514, -209428, -189942, -93622, -48841, -276897, -90238, -120221, -91530, -22722, -134021, -1276, 4109, -278476, -92990, -154865, -134360, -57705, -208891, -270543, -46978, 42009, -252688, -361799, -329734, -414312, -268858, 17793, 324415, 232036, 30829, -57215, 64595, 257551, 148356, 239105, 151581, 105201, -50996, 2090, -221026, -205068, -413654, -356999, -248224, -63487, -25234, -4339, 104673, -5794, -671, 29842, 43254, 73720, 153097, -125444, 22140, -32600, 37398, -46674, 9004, 101392, 228239, 321509, 232952, 159394, 86290, -29469, -60609, -182695, -143815, 20273, 32515, 11]
7107A1j13368o4096R9569n1812n4291o2643J80118J23426p3685J89285o3614k6160
7095H2740j12240O1381o540J3757j55247j02950J77805q6737J4266L7065N7494
7084a9206j08755q5899J94674K98769o7148k52664J35048j56625J18381k2872
7074C3703j22109J3849K4492j12097O9629R0739q0726j92759J65877K21537j20133
7063g998J74921N191j51141J34387j02203r1352K6123m471Q8410J19331J56723
7052C47921m6750r7109j10972n756m6124k09341p2214O3388R0435l0490m4249
7041a61261J70419r5230J2797O9132J7423L8653r0798N2362O2864r3526j86809
7030b03974J20891J2513o5399J08885p293N279p9902m6772Q0209Q105P8530R043
$$ y = [11, -113357, -177453, -77884, -129696, -183987, -246630, -66512, 56914, -16771, 172514, 108900, 82740, -29500, 31881, 25341, 39098, -116149, -219099, -41294, -128031, -113765, -76700, -19206, -127961, -213860, -19186, 279583, 212435, -40229, 94819, -61806, 56575, 33703, -88406, -74557, -50065, -162162, -92533, -1794, -82520, -275279, -109402, 112135, -7998, 166923, 172114, 20973, 155360, 53157, -38195, -12072, -16543, 71867, 191198, 347921, 301171, 204062, 93090, 87334, 41210, -168131, -240345, -176957, -86522, -117012, -161261, 9158, -86072, -73275, -4143, 13280, 51933, -38865, 13497, 76361, -17165, -203974, -83083, -70570, -135969, -27084, -34377, -29098, -109000, -155772, -75563, -67458, 11072, 20115]
7018B0115N6869j2812K4115r6190k33225K08117O3787j77097n0368J66963q9068
7007a18794n3154Q1497l6186q8343J94880L9370m7448j31144J4398r1663L8986
6996a97601J6795J28775l7028j02231Q2265j46007O5353n4418J59508J26217o3500
6985b1872q6321R129P5781J15236J54822k09608j08527K14665n5857j01641r8558
6974a12751Q8574j27904q1136l022l9941J27750Q1753m6368J7718J5566k910m674
6962h7345O6513M8916P8961J1485K3035k0970j03476k22257o1050J34623j37733
6951b69298j8143j7501L357J93341n2281n7743K17023l7736j0555q3782k4699
6940a58017K80772R6418j57227j55836J1343J56137q5133k6149j8802k8985J33539
$$ y = [20115, 76984, 64172, 88287, -7903, -241128, -33011, 30776, -146321, -196689, -29726, -118794, -171948, -90451, -126637, -214980, -20100, 19270, -28178, -159322, -144924, -236587, -197601, -180806, -52031, -89059, -191290, -109025, -255032, -189679, -244097, -84589, 41628, -21872, -108193, -99064, -23283, 91953, 246775, 37167, -71360, 143305, 87448, -14193, -112751, -24177, -152081, -233217, -236239, -276180, -148430, -66677, -113045, -95327, -79761, -82671, -87345, -20832, 28084, 107045, 118530, 141565, 120595, 17119, -205138, -266188, -131565, -269298, -287441, -304942, -301585, -108244, -160525, -218268, -1245, -38981, -49536, -133318, -158017, 122755, 219173, 61946, -93890, -82547, 73590, -11543, -37692, -56494, -85479, 48060]
6929D8060o0395j02222k4540L6096Q1576K5431p3743o4015J23316K35351K73316
6918D98231k95361j23698r238J5698M9918J41529p5573j13119n9933p0725j44041
6907a86312k68490J03014J56829Q2102L7274K7500k21225k4650n2006K77312n186
6896g3838m3841O1528k0327J83020n9826j27465j3796J75673j02719p9172J91160
6885I0397L5322p0959j59067l28931K94189K59990j81729R4130J04505r9226l2481
6874F140J1603j7148O240L5314l44843J71692K2950K11187M1699l62757P0882
6863a47041P6734O1722R4947o4113l03172J47657J59932M2637K3387J81824k03426
6852G1088k49677J0099K09347O6497j11826M7699J35187O5981j10482j46275P6935
$$ y = [48060, -12335, -114557, -139097, -103001, -21425, 4006, -69737, -133752, -10436, 224915, 498231, 202870, 79172, 69934, 85632, 135550, 277079, 201506, 88387, 28454, -42271, -186312, -454802, -351788, -194959, -112857, -75583, -48083, -269308, -293958, -345964, -68652, -73838, -117679, -56151, -76478, 106542, 46716, -80749, -94545, 81128, -21591, -100763, 90397, 125719, 54760, -104307, -433238, -139049, 120941, -60788, 33342, 137847, 38621, 6140, 17743, 595, 6835, 42149, -302694, -131002, -108052, 103135, 144834, -217923, -147041, -70307, -8585, 86362, 22249, -280923, -133266, 26666, 69303, 92690, 274514, 71088, -178589, -168490, 40857, 107354, -4472, 43227, 178414, 244395, 133913, -12362, 64573]
6841F4573r2250K2910K1906J52006J55789k09342j77688J58021J74202j24735
6831A45392j86932M6292L5493J58167N8477J30759j43203J99338k7965p0769k328
6820C42721j86010l1820j5922O6811R8612j30857N980J6888M7773m2448j24196
6809D7532r8029j05759k7358R6639j48343n2521L05788K5337j48280R2699J06083
6798I3788k25244O0657J45451L2427N3283O7876j73884k09090J79860J30091j11722
6787D3493j9797l89966l4846L84122J80553k50023R5693m8284J09657K7918p3692
6776B4828j9414l0106J85747j28362K925q7207j77403L40974k1151l7957j78453
6765a25579k9878R5643n3107j70520J35996J4059M6411K7203J3691N0553k39160
$$ y = [64573, -27677, -4767, 17139, 169145, 324934, 115592, -62096, 95925, 270127, 145392, -41540, 4752, 40245, 198412, 256889, 387648, 244445, 443783, 415818, 345049, 342721, 156711, 124891, 108969, 175780, 274392, 143535, 149515, 166403, 214176, 171728, 47532, -50497, -156256, -183614, -86975, -235318, -287839, 17949, 43286, -104994, -12295, 93788, -131456, -70799, 74652, 107079, 160362, 228238, 54354, -154736, 25124, 155215, 43493, 23696, -366270, -401116, -16994, 163559, -86464, 9229, -39055, 70602, 98520, 24828, 5414, -24692, 161055, 32693, 35618, -51589, -228992, 111982, 90831, 52874, -125579, -155457, -59814, -112921, -283441, -147445, -133386, -86975, -59772, -46081, 4472, -234688]
6754b34688n5693P0698N7842J9651J02182R1308P180p4679j18360J16674l6874
6743e4759p3559R8624M3718j5949j96958R7377K40146j78792j18308J36680n3872
6732g5652P1055j3573k0204n3298k6105L2763k4583P6615J33489k65116P6514
6721h8095J41016j46600O9140O2675k7729j80132j0273N9917J31893j3681p5027
6710g6896j23893J95899k1880R4499Q3405r0317Q5586J96341k00108j80763p8248
6699a16375N9030J40895P4585K4994j17019j66375n6691m4850J0220K37451N0108
6688I5973j24901K6557O2353N7669J7002P2266O106j54550O4297k59150K29203
6677I2825M0192r5867N7916K4371K6701r4660k24587L95738n8120r4772p0476
$$ y = [-234688, -290381, -219683, -161841, -142190, -40008, 51300, 58480, -16199, -134559, -17885, -54759, -128318, -29694, 14024, -1925, -198883, -101506, 138640, -40152, -158460, -21780, -75652, -4597, -18170, -38374, -91672, -117777, -85014, -109597, -32982, 100507, -164609, -88095, 52921, -93679, -24539, 38136, 10407, -169725, -179998, -120081, 11812, -1869, -76896, -200789, -4890, -26770, 67729, 151134, 60817, 146403, 342744, 142636, -38127, -116375, -57345, 83550, 158135, 183129, 66110, -100265, -156956, -201806, -191586, 45865, 95973, -28928, -2371, 59982, 117651, 134653, 206919, 213025, 58475, 122772, -136378, 92825, 133017, 37150, 95066, 119437, 146138, 51478, -173109, 222629, 164509, 69737, -739]
6666g39J94503M7470k38643N7046j08192l4886P440J19738K852R261J32121k51297
6654f3326q8L8430j33127M7845J7301J91487l1898k63985n4486J44680m2334l4149
6642a83650K20602Q6602O1648L8373j75146m8408N3621k08783Q8084J83632j81663
6631f5088J60868j0770j99268O8860M3320R9696R846L244j60587J06234J0646
6620F7001k4086o1156J30959q7787m9020L0811P9343M9603k99696O4025P7270
6609b2733k47330m4185P1394M0067R0683J0097Q9822p9060L6311K11546k07411
6598e0799j898n5854J35894K11127k08306J9347l8809Q500r3128J6222j03933
6587a61637R4073J11644j6413r9871J44042n7519j2788l9146J58501j71095l7527
$$ y = [-739, 193764, 241234, 2591, 59637, -48555, -83441, -76001, 43737, 46589, 55850, 187971, -63326, -63414, -24984, -158111, -110266, -92965, 98522, 66624, -197361, -251847, -107167, -149501, -183650, 36952, 123554, 185202, 223575, 48429, 21, 53642, -155141, -67057, 116575, -65088, 95780, 85010, -114258, -45398, -2078, 97618, 107464, 110708, -49879, 56355, 67001, 42915, -18241, 112718, 24931, -24089, 6722, 86065, 135668, -164028, -100003, -22733, -270063, -314248, -242854, -202787, -112104, -102007, -12185, -91245, -54934, 156612, -50799, -52697, -108551, 27343, 238470, 30164, 49511, 10702, 19202, -73926, -57704, -161637, -67564, 44080, 27667, -72204, 71838, 14319, 1531, -37615, 120886, -50209, -87736]
6576h7736J11285K1910J14737R3231P1096p5689O4922j42113J3514p2702J15201
6565B27656j00960k34127k5983N4046J13653o8628K60207p439j76695o0371q1885
6554a00526M2823J558n6230L5056p5356J40327K67570J15172N40j17372j2361
6543B41201j1973k12077k2460n4888q0563L0967O0550L6380Q6137r6126j8111
6532d0963p8665k995J46501q2970P5455j93510r2879L43565j55094R5435J49462
6521A63342k15718K16880K52523l06867j41502r815k9453j65224J43799N7847
6511c4188Q6950K9289o2006N0534O878M0300J64232j74736j97822J89057L2438
6500A30926p7608r6719l8444m193K2034K49693k7549k18417J76162m1775J23515
$$ y = [-87736, 23549, 45459, 160196, 253427, 324523, 248834, 313756, 171643, 185157, 112455, 227656, 126696, -107431, -133414, -79368, 34285, -34343, 225864, 218425, 41730, -18641, -100526, -57703, -56145, -112375, -77319, -152675, -12348, 255222, 370394, 370934, 253562, 241201, 229228, 17151, -5309, -60197, -140760, -109793, -49243, -12863, 73274, -22852, -40963, -119628, -122623, 23878, -59092, 16363, -177147, -270026, 73539, -81555, 13880, 163342, -52376, 164504, 417027, 110160, -31342, -41157, -70610, -235834, -92035, -34188, 52762, 82051, 20045, 70579, 77457, 117757, 281989, 107253, -90569, 98488, 130926, 53318, -43401, -81845, -86038, -64004, 185689, 158140, -60277, 115885, 74110, 197625]
6489A97625r6976M7259J0742L5024o8020k2939k6933O7803l8561l8972Q4394j9397
6477A31049J18031P1202j0602o4740k3920k3330L4777p7969J93336Q236j74774
6466A81296k6341p8568J50072j34652j08956J50397K5901J11504J13097k76944
6456A06806m4926K06728M520j41194M7374p2902J78814l1205O1715k05589p1500
6445C8641K69484k4796j08114O1008q2412p9530L1293J05242r8434J20754J10552
6434C43688Q1749K717k37533j35730Q5376M5838O808j9004j590J3849k03847R1062
6422G3383K78409k8591O834r3626q9134J16907r5398N7209q5059j26183J42891
6411A57642k2759l8496q8433J5412P9308Q5921n3856L7071j34325r219J67143
$$ y = [197625, 100649, 147908, 158650, 193674, 125654, 102715, 75782, 143585, 105024, 66052, 150446, 131049, 249080, 320282, 309680, 244940, 221020, 197690, 232467, 154498, 347834, 356070, 181296, 154955, 76387, 226459, 91807, -17149, 133248, 159149, 270653, 383750, 106806, 61880, 268608, 273128, 131934, 179308, 106406, 285220, 254015, 315730, 110141, 38641, 308125, 283329, 175215, 236223, 153811, 74281, 105574, 210816, 112382, 233136, 343688, 425437, 428154, 190621, 54891, 140267, 186105, 192913, 173909, 172319, 186168, -17679, 73383, 351792, 323201, 330035, 236409, 147275, 264182, 168784, 225993, 140934, 14751, 157642, 134883, 96387, 7954, 23366, 102674, 188595, 134739, 171810, 37485, 28266, 195409]
6400A95409J04753m6975j26589k8228r3951J46794k74730J93233M7884j64984
6390d7384n035K30028q9924M3822N8886Q2838N0007j04879J60253q1850j07781
6379A88981k42811O3442L02299Q2170j06855l9925j0769j01554M1357Q5081J778
6368B63194p6691o961P1770j6573j84284J9462r3327P4109K2811k6013n7323J52367
6356A42541N8763J4067j03423J27257J84489p2689j19125J08889j23498J53923
6346C71194j12691q3537j4061K650m5449P7969J20871R3484N7276j52587k4361
6335B90758J49359J19979j88450k48647n1812J29913O6433O1266N4910j31027
6325B52682J49886J07560j81113J14798M2554r4875P9845J72240r4815p70O3678
$$ y = [195409, 300162, 253187, 126598, 98370, 4419, 151213, -123517, 69716, 117600, -47384, -52419, 177609, 87685, 131507, 190393, 273231, 323238, 218359, 378612, 296762, 188981, -53830, 9612, 311911, 394081, 287226, 247301, 236532, 134978, 176335, 261416, 263194, 186503, 179542, 251312, 234739, 50455, 69917, -23410, 50699, 73510, 47497, -9826, 142541, 201304, 215371, 111948, 239205, 423694, 351005, 231880, 340769, 217271, 371194, 258503, 174966, 160905, 163555, 118106, 196075, 316946, 410430, 467706, 315119, 290758, 440117, 560096, 371646, 122999, 71187, 201100, 267533, 328799, 383709, 252682, 402568, 510128, 329015, 443813, 486367, 391492, 471337, 643577, 548762, 547992, 611670]
6314F11670J59198j11916K0435p4076M7646j85762J45815J32054J42418K9024
6304I16506j14613j23614J02844J10364q372j84711J01915k193j95769K36410
6294H38767J40034K1956k73758k46558l4671K89368J7582M6609j2954P0544M2521
6283H99440j0239K9465k4915J0359k34419k4015N0390L147N4378J07259j51011
6272G09839m3387q2713J94230K16361k17592Q49P482J08354j17352j23229J06705
6261G59547j10614j9333n3408m1310p5611Q3296j39556p5232K37730j44171L2937
6250D54275K22397q1149m2234O0098J469l3542j07010R3241J2213K9223r2119
6239E16862j14158J91810k799M6968n2197O4685J74084K1458k02067q3844J49056
$$ y = [611670, 770868, 658952, 679387, 605311, 652957, 467195, 613010, 745064, 887482, 916506, 801893, 678279, 781123, 891487, 883115, 698404, 800319, 798126, 602357, 838767, 978801, 1000757, 726999, 480441, 445770, 735138, 752720, 799329, 786375, 856919, 899440, 889201, 918666, 893751, 904110, 669691, 645676, 696066, 699213, 753591, 860850, 709839, 666452, 583739, 777969, 994330, 776738, 777587, 785069, 893423, 776071, 652842, 759547, 648933, 629600, 576192, 534882, 459271, 542567, 403011, 327779, 565509, 421338, 454275, 676672, 595523, 553289, 613387, 614856, 581314, 474304, 567545, 579758, 608981, 516862, 402704, 594514, 591715, 638683, 586486, 651171, 825255, 846713, 644646, 560802, 709858]
6228G09858j0864j48405J37139K0791q300P3724p0128p6047J3386R6472j30233
6217F07393n61J95557j7229L7315K27260k8174l8553j54712l8223L8003p0227
6206G57849j95955P4754J92747K3229j09577O4002o0046J8878M8033j37469J32686
6195H09131k23523L03207J67352j4779n1811o9991j9967P6288p6576J31067o628
6184A023770k33375P290Q0849L43057l7246K843o8164K00843o6137j22694L6175
6173A167211k31340j4673M65664k0573r9015j63288Q7179j23888p4047K13534
6163A206764J83157J766j13039N6783K39320J78490k11581N0126M9872l7701r3151
6152A510806K87604j22259J4777j075m5773J68795J0900o7036j64390p7721J25467
$$ y = [709858, 698994, 550589, 687728, 708519, 700219, 773943, 703815, 627768, 641154, 737626, 607393, 606832, 802389, 785160, 822475, 1049735, 1021561, 983008, 828296, 790073, 828076, 757849, 561894, 636648, 829395, 852624, 743047, 807049, 747003, 765881, 813914, 676445, 809131, 585608, 888815, 1056167, 1041388, 989577, 919586, 899619, 975907, 899331, 1030398, 1023770, 790395, 797685, 878534, 1221591, 1184345, 1187188, 1119024, 1319867, 1253730, 1131036, 1167211, 935871, 921198, 1386862, 1366289, 1267274, 1103986, 1191165, 1067277, 993230, 1206764, 1389921, 1391687, 1278648, 1335431, 1574751, 1753241, 1541660, 1591786, 1641658, 1603957, 1510806, 1798410, 1676151, 1690928, 1689853, 1644080, 1812875, 1823775, 1756739, 1592349, 1514628, 1640095]
6141A640095m7414K62685R178J32081N6401J48330L08091k13246K42581j12737
6131B426045L5836j106J11410r6453J29267J84900R9817l754K30765J52878Q7880
6120C357485J76614K66788K87515M3453K87583R4329j03227k33785k67634j13973
6110C795148m6891j76698J48003M8303j50526K7564J08218R3890K58811J49541
6100D255363K41964M04631M9234K54912L36953K94535O33717M51113J92415J9299
6090G134136j849k23589n11412p92833n17039J03267j19271l01331j77324N3297
6080D646052k36355J17407L9716j4070P1284q1860J63960J05371K77816K46859
6070E336180L42803L24577J27660j4846p0962o4049j0930l91879l64521N741Q3577
$$ y = [1640095, 1592681, 1855366, 1864544, 1996625, 2053026, 2201356, 2509447, 2296201, 2538782, 2426045, 2461881, 2460775, 2572185, 2475732, 2604999, 2789899, 2889716, 2885962, 3116727, 3269605, 3357485, 3534099, 3800887, 4088402, 4131855, 4419438, 4513767, 4410540, 4176755, 3909121, 3795148, 3748257, 3571559, 3719562, 3767865, 3617339, 3644903, 3753121, 3847011, 4105822, 4255363, 4497327, 4901958, 4951192, 5206104, 5543057, 5837592, 6471309, 6922422, 7114837, 7134136, 7132287, 6908698, 6397286, 5604453, 5087414, 5190681, 5071410, 4770079, 4592755, 4646052, 4409697, 4527104, 4566820, 4552750, 4624034, 4542174, 4706134, 4811505, 5089321, 5336180, 5678983, 6003560, 6131220, 6116374, 6045412, 5981363, 5970433, 5578554, 5214033, 5219774, 5303351]
6059E303351j38813j06220j04063j20557P4529M7230J95252R7522q8264n006J8114
6048E173075j67476J46019L19664K31843K91814J86697n5428j01237l0084J50095
6038F144982q0871J29098N1944k00250p4559J95952K19895k8742J22210O3462
6028F543121K92046J38679M8797Q1222M32838L7625l2602K64973K53222L33613
6018H393534J20813N8048k8229K11433L31770K4712K62474J08389K62365M78025
6008A0223334L54702M35499M27008L66228L80511J40238L51798N84253N46937
5999A3810508L56895N99357N38754N75931O17618N09064P58337Q13294Q48205
5990A9427963R40871J176665J221013J266589J257585J568727J674550J351923
$$ y = [5303351, 5164538, 5058318, 4954255, 4833698, 4908227, 4955457, 5150709, 5248231, 5159967, 5154961, 5173075, 5005599, 5151618, 5471282, 5703125, 5994939, 6181636, 6126208, 6024971, 5994887, 6144982, 6064111, 6193209, 6245153, 6044903, 5970344, 6166296, 6386191, 6357449, 6479659, 6543121, 6835167, 6973846, 7022643, 7103865, 7536703, 7574328, 7541726, 7806699, 8059921, 8393534, 8514347, 8572395, 8544166, 8755599, 9087369, 9112081, 9374555, 9482944, 9745309, 10223334, 10578036, 11013535, 11440543, 11806771, 12187282, 12327520, 12679318, 13263571, 13810508, 14167403, 14766760, 15305514, 15881445, 16499063, 17008127, 17766464, 18579758, 19427963, 20368834, 21545499, 22766512, 24033101, 25290686, 26859413, 28533963, 29885886]
5982B9885886J853097J929174K332665K933532L143816L395205M013912M540547
5974E4027834M992047P000471Q345634P936261M586859K50689l123918n413603
5966G8602274n851994m245984k288952j72088J624363L428675M955304N134063
5958H1185661L537175J270918o0425n80758Q65778L269582M679451L973950Q26094
5949I8967426k347761n096241o329516n366092l543749q08538J507142J851920
5941G8834591o5977k101617l051075l886634l211467j651129J89268K314447M488710
5932G1859117O064763N291478J221873l903253p623586j0300564j0505643q629620
5924D3474565o494944m843725l773358k994046k351522j735671j487803j365850
$$ y = [29885886, 31738983, 33668157, 36000822, 38934354, 42078170, 45473375, 49487287, 54027834, 59019881, 66020352, 74365986, 82302247, 86889106, 87139795, 84015877, 78602274, 72750280, 68504296, 66215344, 66043256, 67667619, 71096294, 76051598, 81185661, 84722836, 85993754, 85933329, 85352571, 86218349, 89487931, 94167382, 98141332, 98967426, 96619665, 91523424, 85193908, 79827816, 76284067, 75475529, 76982671, 78834591, 78768614, 76666997, 73615922, 69729288, 66517821, 64866692, 65055960, 67370407, 71859117, 77923880, 83215358, 84437231, 80533978, 72910392, 62609828, 52104185, 43474565, 36979621, 32135896, 28362538, 25368492, 23016970, 21281299, 19793496, 18427646]
5916A8427646j090185q68485q50409o75565n07870n07876m16447m30955r9573
5907A2980281J781j16238k32400n07856o81353l55848p52498o65919l71158m35503
5897H863289k81280l77362k45381r4019k35046l27155l59490K9867j61219k53149
5887F559055k1640j08281j98751j07106P1003k04775N2116j1255L9504j22575
5877E947295N3977J58901K52731J33140j61913M2581l04596m92456l91568k44738
5867D993354j54652k84059J1463j74999k41053k69002J4148j389m7036j51749
5857C695026J1988J16111k75861K8217n9901j33669j6159p7859P6426o904P0826
5846C428241n753J32310j51675n1377J71803m2747j18202j00567j09170k29886
$$ y = [18427646, 17337461, 16468976, 15618567, 14943002, 14435132, 13927256, 13510809, 13079854, 12980281, 12982062, 12865824, 12633424, 12125568, 11444215, 11088367, 10335869, 9669950, 9298792, 8863289, 8582009, 8204647, 7959266, 7865247, 7630201, 7303046, 6943556, 6973423, 6812204, 6559055, 6537415, 6429134, 6230383, 6123277, 6194280, 5989505, 6041621, 6030366, 6069870, 5947295, 6001272, 6160173, 6412904, 6546044, 6384131, 6426712, 6122116, 5629660, 5238092, 4993354, 4838702, 4554643, 4566106, 4391107, 4150054, 3881052, 3895200, 3893811, 3846775, 3695026, 3707014, 3823125, 3547264, 3575481, 3515580, 3381911, 3365752, 3287893, 3364319, 3357415, 3428241, 3422488, 3554798, 3403123, 3351746, 3523549, 3480802, 3362600, 3262033, 3152863, 2922977]
5836B922977j26325k96616k41553J34623O5332j86808o0650J0027J5004K30426
5826B466437J72456M4860k00326l44556R0124M5970P5918o0379r432L9642j56498
5815B164216J36862k2060r1890Q8454J09406n219j68644J64429J09464M3995J09955
5804B638968J70885R9737K21453O077K15977L07295P6652L50500K85183J12964
5794D485691j691j6165j47567j92420j13630k09276l4028m9123J83427J43458
5784D048676q7135r662L88355n8244j07827J53236J25102n8458K90573N6253J2212
5773D753081k63845l01753j58785Q109k43495j14850J80341J72209Q0173k14328
5763C896857j13078n2962j38776J88535K39268m2233J05316M9320K09380J63488
$$ y = [2922977, 2796652, 2500036, 2258483, 2393106, 2458438, 2271630, 2210980, 2221007, 2236011, 2466437, 2638893, 2683753, 2483427, 2138871, 2228995, 2274965, 2350883, 2290504, 2281072, 2320714, 2164216, 2301078, 2279018, 2187128, 2275582, 2384988, 2379769, 2211125, 2375554, 2485018, 2529013, 2638968, 2809853, 2909590, 3131043, 3137120, 3353097, 3660392, 3737044, 4087544, 4372727, 4485691, 4484000, 4467835, 4320268, 4127848, 4014218, 3804942, 3770914, 3721791, 3905218, 4048676, 3961541, 3951879, 4340234, 4281990, 4174163, 4327399, 4452501, 4394043, 4684616, 4740869, 4753081, 4489236, 4187483, 4028698, 4036807, 3793312, 3678462, 3858803, 4031012, 4111185, 3896857, 3783779, 3730817, 3592041, 3780576, 4019844, 3977611, 4082927, 4132247, 4341627, 4505115]
5753D505115l73078m70611l69924k85861o6749l35205k27615l90052j05327P1206
5743A951899J1330o2919j7331P3310l7650k30271J18093o536k14197K6794L3571
5732A646093l9023j15951P3931j54262J02098K17118j10971j42626N9564k1131
5722A514840k7168k0785k02314l3029O3489J69600k64909J79749N8359j17402
5712A320430j07835j22149J22311K30673k06970L3347J58072j88010n5780J25524
5702A309613o1695n1717L1771J867j6674j41379m1387Q404M1220J17K8413J12740
5690A221293p1288k42635r3953N208J624J58972K6485J62375k34536J51374n1212
5679A033707M5652J2110L9527N4331j705p2011j13676J1156J00974J58187k14712
$$ y = [4505115, 4132037, 3661426, 3291502, 3005641, 2938892, 2603687, 2376072, 1986020, 1880693, 1951899, 1963229, 1900310, 1882979, 1956289, 1918639, 1688368, 1806461, 1799925, 1585728, 1612522, 1646093, 1607070, 1491119, 1565050, 1410788, 1512886, 1730004, 1619033, 1476407, 1535971, 1514840, 1487672, 1466887, 1264573, 1231544, 1295033, 1464633, 1199724, 1379473, 1437832, 1320430, 1212595, 1090446, 1212757, 1443430, 1236460, 1269807, 1427879, 1239869, 1184089, 1309613, 1247918, 1196201, 1227972, 1229839, 1213165, 1071786, 1030399, 1038803, 1080023, 1080140, 1108553, 1221293, 1150005, 907370, 813417, 818625, 820249, 979221, 1005706, 1168081, 933545, 1084919, 1033707, 1079359, 1091469, 1130996, 1185327, 1183622, 1111611, 997935, 1009091, 1110065, 1268252, 1053540]
5668A053540Q2724J04530P9006j86198p3624J73435J20013j24668j82231M8029
5658A094556K34810J0654l1680o0501J20917J02940j68106r4933R9250l4188l648
5647A270071Q418J47122O4301k06251k07896K06037J38434Q0699M6471o9717J66939
5636A644628j60765j47458J60223O670l4181K62591J70591j71552J05402j8982
5626A817167J57178p9886p5306o3086k6032J28593L4027p1835J8622M0830J0406
5615A890678k525k0644J17512J46571J61290m8277j3876J1045K605k03202R3839
5604B135016K86211m8051j91743J09130J1157M3140M8600p1137K43044N6536j95360
5593B426543L9021M307j05362J07702K54971j49863P8285L7958L6509J50791n4301
$$ y = [1053540, 1136264, 1240794, 1319800, 1133602, 1059978, 1233413, 1353426, 1228758, 1046527, 1094556, 1329366, 1340020, 1308340, 1247839, 1368756, 1471696, 1303590, 1208657, 1307907, 1273719, 1270071, 1278489, 1425611, 1489912, 1283661, 1075765, 1281802, 1420236, 1500935, 1547406, 1477689, 1644628, 1483863, 1336405, 1496628, 1503298, 1469117, 1731708, 1902299, 1730747, 1836149, 1817167, 1974345, 1894459, 1819153, 1756067, 1730035, 1858628, 1892655, 1820820, 1839442, 1880272, 1890678, 1888153, 1867509, 1985021, 2131592, 2292882, 2244605, 2230729, 2241774, 2244379, 2041177, 2135016, 2421227, 2373176, 2181433, 2290563, 2301720, 2344860, 2393460, 2322323, 2565367, 2621903, 2426543, 2465564, 2469871, 2364509, 2472211, 2727182, 2577319, 2655604, 2693562, 2730071, 2880862, 2826561]
5582B826561j6798n1799K194O379J40981o1227J61827j294J49994P7190M2990
5571C276998M2712J79452K04288O5485j5965J87029M89369K96742J37801M80625
5561E344536O8431j57450P4857P035k97235o1603k89800k40861J76278j26034
5551D498154K5794L06436J52504P2296L8841K66776K21261K71145L73921L50509
5541F577637N04134J76615M82953P67398L66042K54589N292l19648n53487m64317
5531G797208k90518l05107n28355l55214j20006R921r8525k53787J42294J15820
5521F113731J12946M8322J39108R2958K82579j5411J93008J41803J95130J30113
5511G434287J65625l72902Q711k8914k24095j52548j86413n2358J6949K0927O3673
$$ y = [2826561, 2809763, 2757964, 2760158, 2766537, 2907518, 2846291, 3008118, 3006824, 3156818, 3234008, 3276998, 3319710, 3499162, 3703450, 3768935, 3752970, 3939999, 4429368, 4726110, 4863911, 5344536, 5412967, 5255517, 5330374, 5337409, 5040174, 4978571, 4688771, 4447910, 4624188, 4498154, 4523948, 4830384, 4982888, 5055184, 5094025, 5360801, 5582062, 5853207, 6227128, 6577637, 7081771, 7258386, 7741339, 8508737, 8874779, 9129368, 9134660, 8815012, 8261525, 7797208, 7506690, 7201583, 6673228, 6318014, 6198008, 6207929, 6109404, 5855617, 5997911, 6113731, 6226677, 6274999, 6414107, 6507065, 6789644, 6774233, 6967241, 7109044, 7304174, 7434287, 7599912, 7227010, 7235721, 7206807, 6982712, 6830164, 6643751, 6591393, 6608342, 6629269, 6692942]
5500F692942o3342n6004n0310L54731M3589n9167Q1982O8127K90079q451J05894
5489G400070L06698K54753N7680j04003M1823J17306J37478M44679J8240K14347
5479H889071L8692K27029L56546K69602L7871K65908L92298J58586K66004L44838
5469A1246445N48790N05503N31908L74822L18083M81515M92459M14970N27254
5460A5441749M74760O07997P56191N30697P18284R09073Q14274P95548R05416
5451B1953989J187122J405565J131755J591398J943662J978039K061699K450116
5443C5703345K938889K925351L343369M129414M142795M661306N593938O777868
5435G0216275Q746809R089666O938778K044188k457037n512309o795240n922700
$$ y = [6692942, 6629600, 6573596, 6523286, 6878017, 6921606, 6862439, 6944421, 7012548, 7302627, 7294176, 7400070, 7706768, 7961521, 8019201, 7915198, 7957021, 8074327, 8211805, 8656484, 8674724, 8889071, 8927763, 9154792, 9511338, 9780940, 9818811, 10084719, 10477017, 10635603, 10901607, 11246445, 11795235, 12300738, 12832646, 13207468, 13525551, 14007066, 14499525, 14914495, 15441749, 15916509, 16524506, 17280697, 17811394, 18529678, 19438751, 20253025, 21048573, 21953989, 23141111, 24546676, 25678431, 27269829, 29213491, 31191530, 33253229, 35703345, 38642234, 41567585, 44910954, 49040368, 53183163, 57844469, 63438407, 70216275, 78963084, 88052750, 94991528, 97035716, 94578679, 89066370, 82271130, 76348430]
5427G6348430l866255j497580O78187K804165M305980M146003K421047K22296
5419H5562273p35244j287823o68088J707271M036048N356597M514722J572027
5411A00057783k302414m896493n947965n155461k666053m41819j68444j891176
5403G6587958l112892l620086m380928l418779j961289k10660J300464K991785
5395F4175573M264320M784364K538646j588706n192347p685215q918660q273494
5387D4104481o676735m988452l812310l166176k209375j837587j651955j524310
5379A8237581j260252j170086r04867p84180n37427n55356n93197p84415l96217
5370A1251584k29294m19377l29416n00647l69236j47060m23947k57005O1096k26237
$$ y = [76348430, 72482175, 70984595, 71662782, 74466947, 78772927, 82918930, 85339977, 85562273, 84827029, 83539206, 82871118, 84578389, 88614437, 93971034, 98485756, 100057783, 97755369, 92858876, 86910911, 81755450, 79089397, 78647578, 78479134, 76587958, 73475066, 69854980, 65474052, 62055273, 60093984, 59883324, 61183788, 64175573, 68439893, 73224257, 75762903, 74174197, 68981850, 61296635, 52377975, 44104481, 37427746, 32439294, 28626984, 25460808, 23251433, 21413846, 19761891, 18237581, 16977329, 15807243, 14902376, 14118196, 13580769, 13025413, 12432216, 11647801, 11251584, 11022290, 10602913, 10273497, 9772850, 9403614, 9256554, 8832607, 8575602, 8636698, 8410461]
5360H410461k08306k05505k25569l26789k03121Q1012k61916o0923p3586j8787
5350F906971m73330l02419q1142j72567K8978q0102q6080o5273R497j63447j83296
5339E337790j28851k11305j18885m0246j23641j87059J79334L98235r5573q6471
5329D923328j14919O8526p4450O360k49253J03115j66383J65767L66217j40870
5319D887438K254j09316l1460j56724k00069j59409m6812j1225r6348q9670j75866
5308C812793J16425L3919N7078j71439j8509P5363n5049L3922j02965L3507j58763
5297C656282J07164K45639J20898J05588k62309O763q9183j60385n9999j49246
5287C521212j11430q2425l0611k15036O0335J23952Q0988n7630J13974r37J94545
$$ y = [8410461, 8202155, 7996650, 7771081, 7444292, 7241171, 7322183, 7060267, 6999344, 6925758, 6906971, 6433641, 6131222, 6050080, 5877513, 5906491, 5826389, 5740309, 5675036, 5684533, 5521086, 5337790, 5208939, 4997634, 4878749, 4838503, 4714862, 4527803, 4707137, 5105372, 5009799, 4923328, 4808409, 4876935, 4802485, 4808845, 4559592, 4662707, 4496324, 4662091, 5028308, 4887438, 4889692, 4780376, 4748916, 4592192, 4392123, 4232714, 4185902, 4174677, 4078329, 3988659, 3812793, 3929218, 3963137, 4020215, 3848776, 3830267, 3905630, 3850581, 3884503, 3781538, 3815045, 3656282, 3763446, 4009085, 4129983, 4235571, 3973262, 3980025, 3890842, 3730457, 3670458, 3521212, 3409782, 3327357, 3296746, 3081710, 3142045, 3265997, 3346985, 3289355, 3403329, 3402392, 3596937]
5276C596937J17389J69315N55j2434L2398J91298K09520J92176L44238L52844
5266E194236M80590p4090j18837j75002k72606m95348j93543J76503j90013l496
5256D328394J9819M9878J74127P2865L3918j22962m023o8118o4086K95550J41834
5245D857196M28345j29649k11827k09485j21849j55045j53941k0200j65632k9240
5235D088673q0186k07884k52222j93982N5882j08647K48458K08637L08712J04371
5225D171812m22019o7603r9740l04870l96125l82067k42475j32128j61601k37964
5215A725220n6010P9600k47478J66640J83807k64797O1467j1646j98426k0055
5205A418322J41322j44548o1696k0637k62564J46749J18953q7463j1959J10548
$$ y = [3596937, 3714326, 3883641, 3884196, 3871762, 3904160, 4095458, 4304978, 4497154, 4841392, 5194236, 5674826, 5600736, 5481899, 5306897, 5034291, 4538943, 4345400, 4521903, 4331890, 4328394, 4348213, 4398091, 4572218, 4645083, 4679001, 4556039, 4552016, 4483898, 4419812, 4715362, 4857196, 5285541, 5155892, 4944065, 4734580, 4612731, 4457686, 4303745, 4283545, 4117913, 4088673, 4008487, 3800603, 3548381, 3354399, 3410281, 3301634, 3550092, 3758729, 4067441, 4171812, 3749793, 3682190, 3582450, 3277580, 2881455, 2499388, 2256913, 2124785, 1963184, 1725220, 1669210, 1748810, 1501332, 1667972, 1851779, 1586982, 1648449, 1636803, 1438377, 1418322, 1559644, 1415096, 1353400, 1332763, 1070199, 1216948, 1335901, 1248438, 1236479, 1347027]
5195A347027N0666K2956l54705j05324L4682Q8872m910j1580K2350J17665J47533
5184A355232k10152n6696O6857m389l0236k3266L2215q8717j87112J57262m8437
5173I62561j07591R3310k10924J21665J56078R4986J3668p0556k51503M0999K68691
5162A111384n0459k0424o8808K67318j1365M1786l5480p7630P8024j05165K9812
5151A158993j18342j1714q6525J19920j55386j53380J25825Q0487J99255j5655
5141A143478k58735K41866J19684L236k63554o7991J4567J54613J48800j08744
5131A127220K2850J3754r1854q2460L20847J16322l50459M7193R5173l7634J43633
5120A324585q9191M5624j90996J82729J01216r3035J78116p6314M8977K12354
$$ y = [1347027, 1397693, 1420649, 1065944, 960620, 995302, 1084174, 1079264, 1067684, 1090034, 1207699, 1355232, 1145080, 1088384, 1155241, 1150852, 1120616, 1097350, 1129565, 1040848, 853736, 1010998, 962561, 854970, 948280, 737356, 859021, 1015099, 1110085, 1123753, 1053197, 801694, 842693, 1111384, 1060925, 1040501, 971693, 1239011, 1227646, 1269432, 1233952, 1156322, 1234346, 1129181, 1158993, 1040651, 1028937, 942412, 1062332, 906946, 753566, 879391, 959878, 1159133, 1143478, 884743, 1126609, 1246293, 1249529, 985975, 917984, 932551, 1087164, 1235964, 1127220, 1150070, 1163824, 1071970, 989510, 1310357, 1426679, 1076220, 1123413, 1218586, 1180952, 1324585, 1235394, 1281018, 1090022, 1272751, 1373967, 1280932, 1459048, 1382734, 1431711, 1644065]
5110A644065R7568k43934R4457k0910J59462O3210m6628j22152J05868J61798
5100A892804p2089j87569Q1183M40527l7387L09354Q5037j13608o6629j29544
5090B202079L88990L75781M06910K42581k7630m0537l44335m70775o21932k90423
5080A820709j60224j66570K86586R5342j42075j06382N3028J0416j52318M5403
5070A583915p649n3400p9917L10742P1992k8750m981j63542j00445m7170o8426
5059A412369J38850j88081r6973K0979q6266j040J24236J1403M3830J02193j53081
5048A328419j53327J21109j02621R7462J39609K5013K9916o3488J01831p2652
5038A451271j24449Q9383p6390K7095q72q1290L5248q648M3275K17756j16905
$$ y = [1644065, 1741633, 1497699, 1592156, 1571246, 1730708, 1793918, 1747290, 1625138, 1731006, 1892804, 1820715, 1633146, 1714329, 2154856, 2117469, 2426823, 2511860, 2398252, 2331623, 2202079, 2591069, 2966850, 3373760, 3616341, 3588711, 3548174, 3203839, 2733064, 2111132, 1820709, 1660485, 1493915, 1780501, 1875843, 1733768, 1627386, 1680414, 1690830, 1538512, 1583915, 1576266, 1522866, 1442949, 1753691, 1825683, 1796933, 1791952, 1628410, 1527965, 1480795, 1412369, 1551219, 1363138, 1266165, 1287144, 1200878, 1199838, 1324074, 1335477, 1379307, 1481500, 1328419, 1175092, 1296201, 1193580, 1291042, 1430651, 1455664, 1485580, 1422092, 1523923, 1451271, 1326822, 1416205, 1339815, 1366910, 1366038, 1284748, 1319996, 1311348, 1354623, 1572379, 1455474]
5027A455474j29096M037m0704O5539L7698Q3492j52838q9644K10645k5696J13401
5016A532308K21994R1163k24588m0169R2696k00504K0044Q1157r3236J9488l5813
5005A464540J14982J63775j03017k10799J30689L5308j1286n8889j57795j5616
4995A351892k850P7944J97389J76395j74110j27716j37059j3985R6123j0348J91763
4984A625438K89809q4453k03353K27864r77K8152J67301j3364J48307j42831k03474
4973A838419n0348L21526j08788J44086L7914k65543j3660p782J2783J34685J0973
4962B054265n0874k32980O9479K72432O7118p452k4255p9769J85212J37072K31339
4951B621587O1082J1355k05915L8993J95889p2649o3272o291o0520j11786m1436
$$ y = [1455474, 1326378, 1330415, 1289711, 1355250, 1392948, 1476440, 1323602, 1233958, 1444603, 1418907, 1532308, 1754302, 1845465, 1620877, 1580708, 1673404, 1472900, 1492944, 1574101, 1480865, 1500353, 1464540, 1579522, 1743297, 1640280, 1429481, 1560170, 1595478, 1584192, 1525303, 1367508, 1351892, 1349042, 1426986, 1624375, 1800770, 1626660, 1498944, 1361885, 1347900, 1444023, 1433675, 1625438, 1915247, 1830794, 1627441, 1855305, 1854328, 1882480, 2049781, 2036417, 2184724, 2041893, 1838419, 1788071, 2109597, 2000809, 2144895, 2182809, 1917266, 1903606, 1895824, 1908607, 2043292, 2054265, 2003391, 1770411, 1839890, 2112322, 2179440, 2171988, 2147733, 2067964, 2253176, 2390248, 2621587, 2682669, 2694024, 2488109, 2527102, 2722991, 2650342, 2587070, 2580779, 2520259, 2408473, 2367037]
4940B367037j02819J2528p7054k08570J78376K08958n1485n7299r8711J82935
4930B353896Q3568K22182J56426M2068J64114l9767o5303m7024q9121J54346l2863
4919B902522n0316K38476K91617p592o6164O9706l8062j58088K2791J97712J60789
4908C563391M2272j86215J94007p4674P0947O4543J20364K16762j36253l3758
4898C841386J75425K41676J66628j09699R1244K93744J92470m0354P2961K08472
4888E133953R133K07997L54856K83091J49464J93219K02057k06368N6754M3412
4878F427568J66803J90499J81663K60665J59331K8523K39494M93000j0910j33780
4868H002856j15899L33231J27157k84352k42986L1425M02525L09647J10498R5547
$$ y = [2367037, 2264218, 2276746, 2199692, 1991122, 2169498, 2378456, 2326971, 2269672, 2170961, 2353896, 2437464, 2659646, 2816072, 2858140, 3022254, 2982487, 2917184, 2870160, 2781039, 2935385, 2902522, 2852206, 3090682, 3382299, 3374707, 3308543, 3378249, 3340187, 3182099, 3204890, 3402602, 3563391, 3605663, 3419448, 3613455, 3538781, 3609728, 3674271, 3794635, 4011397, 3875144, 3841386, 4016811, 4258487, 4425115, 4315416, 4406660, 4700404, 4892874, 4852520, 4925481, 5133953, 5143086, 5351083, 5705939, 5989030, 6138494, 6331713, 6533770, 6327402, 6384156, 6427568, 6594371, 6784870, 6966533, 7227198, 7386529, 7415052, 7654546, 8147546, 8136636, 8002856, 7886957, 8220188, 8347345, 8062993, 7820007, 7851432, 8253957, 8563604, 8674102, 8769649]
4858H769649p5262J54349k4614q4536K1283L12898J78494r2538J56598R0855N6561
4847I463737K64128K80385M45797L26562K38142K09395M61244J51612L22340J79019
4837A2342361L07952J92544K91107L26063L52656M73177M61604O52065K56113
4828A5655642J17837K60420L80033P22804M00103P09143O92479O78699Q04422
4819B0421582Q80019P73852O40681O29132O50778Q52552P66332O08866R00520
4810B7124314J085136J193113J240903J131022J506358J386546J317664J451163
4802C7436219J604964J813020K199771K532180K301031K334465K345543K540972
4794E5108165K915849L430646L751840M815793O170276P073081P114881O261756
$$ y = [8769649, 8694387, 8848736, 8824122, 8739586, 8760869, 9073767, 9252261, 9159723, 9316321, 9407176, 9463737, 9727865, 10008250, 10454047, 10780609, 11018751, 11228146, 11689390, 11841002, 12163342, 12342361, 12650313, 12842857, 13133964, 13460027, 13812683, 14285860, 14747464, 15399529, 15655642, 15773479, 16033899, 16413932, 17136736, 17536839, 18245982, 18938461, 19617160, 20421582, 21301601, 22075453, 22716134, 23345266, 23996044, 24848596, 25614928, 26223794, 27124314, 28209450, 29402563, 30643466, 31774488, 33280846, 34667392, 35985056, 37436219, 39041183, 40854203, 43053974, 45586154, 47887185, 50221650, 52567193, 55108165, 58024014, 61454660, 65206500, 70022293, 76192569, 83265650, 90380531, 96642287]
4786I6642287N659583O193263Q025898R999318J2033155J3575997J5192951J5343431
4778A82665883J7597998K5402204L8591958N5139941O3731072M3933096l594297
4771D23467855n4392874p7313991o9217551m8850332l3417708k3705816j7169174
4764I9400409j3121317j0203362q139638o793658n684259m525330l968538l077369
4756D3886938k674269k228073k045876j987861j993457j593690j323726j140057
4748B8899929j189557q26319q02159n89048n67367p12684r59930m59465m23747
4739B2369653n39681m86054k84485j85578k10358j15993L7484J76399J71185L71137
4729B1303709L43678N92026J050192J532363J435569J270132k82285p86753p75893
$$ y = [96642287, 102301870, 108495133, 116521031, 126520349, 138553504, 152129501, 167322452, 182665883, 200263881, 225666085, 264258043, 319397984, 383129056, 427062152, 423467855, 369074981, 291760990, 222543439, 173693107, 140275399, 116569583, 99400409, 86279092, 76075730, 67936092, 61142434, 55458175, 50932845, 46964307, 43886938, 41212669, 38984596, 36938720, 34950859, 32957402, 31363712, 30039986, 28899929, 27710372, 26884053, 26081894, 25492846, 24925479, 24212795, 23252865, 22793400, 22369653, 21829972, 21343918, 21059433, 20873855, 20663497, 20547504, 20584988, 20761387, 20932572, 21303709, 21647387, 22239413, 23289605, 24821968, 26257537, 27527669, 27245384, 26458631, 25682738]
4720B5682738o2031M58224L96906J34945j015476k433994k851864k371431j782388
4711A6155629j439866r88454q37593p95983l96235n17161o34124l67018k37872
4702I941323n59636J0013l60188j22253n1995o9517j31247m53052l31360k99006
4692G573082l25213l21755l71925j66743j16289r7869Q5064p8636j63721r2907
4682E923088l19935q0551j65986k91639k52961k81983Q768L0569r6716r9413n4899
4671D318342j56367k09529J38454J26962J1362j73844n163l85621j52116m5189
4661C467291R6203K18955q3742J13435r117K17940j83597j16580k56622Q9720
4651C553886J74315j7685M3825q2479N4458j56137J2548j55443r0375K94841j4186
$$ y = [25682738, 25620707, 26078931, 26475837, 26610782, 25595306, 23161312, 20309448, 17938017, 16155629, 14715763, 13727309, 12889716, 12093733, 11697498, 11180337, 10546213, 10179195, 9941323, 9381687, 9391700, 9031512, 8909259, 8857264, 8787747, 8656500, 8203448, 7872088, 7573082, 7247869, 6926114, 6554189, 6387446, 6271157, 6173288, 6258352, 6179716, 6015995, 5923088, 5603153, 5522602, 5356616, 5064977, 4812016, 4530033, 4538801, 4569370, 4472654, 4373241, 4318342, 4161975, 3952446, 4090900, 4217862, 4229224, 4055380, 4050217, 3664596, 3512480, 3467291, 3563494, 3782449, 3698707, 3812142, 3803025, 4020965, 3837368, 3720788, 3464166, 3553886, 3728201, 3710516, 3754341, 3671862, 3726320, 3570183, 3582731, 3427288, 3336913, 3631754, 3617568]
4640C617568p1611j56867J942o3446k52545r7380J13016Q7966n0784p6927J71363
4629C222295j51377j24393Q8611p1951L6557J46193N442K1943J6272M5168M100
4618C238860j8196o5503p0543J87006J71455j05204j77411J20289J2539J51997
4608C445289j37409j71197K6199N1358j34028q3486r7763K6785o676j35608j95216
4597B588248L2811L0711j02409j30459K12802K06613k7555J83749J70689J24109
4587C289309k07637q2496K11646j40102j17884R2309J423J65333j53265r719K06306
4576C255223k41221K7834K4637n2268O8216l2708J65450P8146Q6245m2782M1452
4565C378224m5048R6521K90299J80869J12552K5897J7381q0324o2947J07568K58407
$$ y = [3617568, 3545957, 3389090, 3391032, 3327586, 3075041, 2977661, 3090677, 3178643, 3127859, 3050932, 3222295, 3070918, 2946525, 3035136, 2963185, 2999742, 3145935, 3151377, 3173320, 3189592, 3234760, 3238860, 3220664, 3155161, 3084618, 3271624, 3443079, 3337875, 3160464, 3280753, 3293292, 3445289, 3307880, 3136683, 3162882, 3214240, 3080212, 2996726, 2898963, 2925748, 2919072, 2783464, 2588248, 2621059, 2651770, 2549361, 2418902, 2631704, 2838317, 2810762, 2994511, 3165200, 3289309, 3081672, 2999176, 3210822, 3070720, 2952836, 3045145, 3046568, 3211901, 3058636, 3048917, 3255223, 3014002, 3041836, 3066473, 3014205, 3082421, 3049713, 3215163, 3293309, 3379554, 3336772, 3378224, 3333176, 3429697, 3719996, 3900865, 4013417, 4039314, 4056695, 3976371, 3913424, 4020992, 4279399]
4554D279399L7652j49330j34552O8842j4923J50089K07428k3000m2453J08868
4544D488020j35552j71192O3257J40009P590K90538j0107M3215J50530o8672K01141
4533D998777J38398J8432p8277K16346r849o4397J27585J10684J2734K48615j46504
4522E572544j20478Q0183L9712J58965K19705n0596o1321J22944Q4760J10122
4512F156540o2310J3510J78313J30686J11229O828J96859J22034j06496J70323
4502F917516J94186K5838l85931m5552j27551k4426Q7245q0974N0651j23121N1977
4491F539858J47822J78561j59317K20669J33255J06625r707K24155K27166j4658
4481G594429k9575P3355m3907o4718J7517K90407J31174Q161K11485Q4738N221
$$ y = [4279399, 4317051, 4167721, 4033169, 4102011, 4087088, 4237177, 4444605, 4421605, 4379152, 4488020, 4352468, 4181276, 4244533, 4384542, 4392132, 4682670, 4672563, 4715778, 4866308, 4797636, 4998777, 5137175, 5155607, 5077330, 5293676, 5283827, 5219430, 5347015, 5457699, 5470433, 5719048, 5572544, 5452066, 5532249, 5571961, 5730926, 5950631, 5900035, 5838714, 5961658, 6046418, 6156540, 6094230, 6107740, 6286053, 6416739, 6527968, 6534796, 6731655, 6853689, 6747193, 6917516, 7111702, 7137540, 6751609, 6706057, 6578506, 6554080, 6641325, 6560351, 6611002, 6487881, 6539858, 6687680, 6866241, 6706924, 6927593, 7060848, 7167473, 7157766, 7381921, 7609087, 7594429, 7564854, 7638209, 7594302, 7529584, 7547101, 7837508, 7968682, 7976843, 8188328, 8273066, 8278287]
4470H278287R8516J05975O1617K23523K89404K18906K40037M89658M03130M67905
4460A0876958N20929O34295L48095L95707N10508J34410l9141k61798m44085n56924
4450A2118954o79421l73693l28173l06048k27628k28602q1715r2697j00177J47850
4440I848650K96421J29971q9361J76718K66825K28554K45827L38194L55603O9161
4430A1866563J87538L74938L32671K84002J62873K73189j0176j11522l46168k96344
4420A2717564n13569l31493m44307l60189k13151k38550j01927p4206j29989l17961
4410I992222J8077j60066m6768K12827M8172k93710j16539P7058K2732l6968K61144
4399I978181J65115L26237K29707K32670L45657K19394J10782K42330N08635P0632
$$ y = [8278287, 8376803, 8482778, 8544395, 8767918, 9057322, 9276228, 9516265, 10005923, 10409053, 10876958, 11397887, 12032182, 12380277, 12775984, 13286492, 13420902, 13381761, 13119963, 12675878, 12118954, 11439533, 11065840, 10737667, 10431619, 10203991, 9975389, 9893674, 9800977, 9700800, 9848650, 10145071, 10275042, 10185681, 10362399, 10629224, 10857778, 11103605, 11441799, 11797402, 11866563, 12054101, 12429039, 12761710, 13045712, 13208585, 13481774, 13471598, 13360076, 13013908, 12717564, 12203995, 11872502, 11428195, 11068006, 10854855, 10616305, 10514378, 10440172, 10310183, 9992222, 10010299, 9850233, 9803465, 10016292, 10064464, 9770754, 9654215, 9731273, 9754005, 9717037, 9978181, 10143296, 10469533, 10699240, 10931910, 11277567, 11496961, 11607743, 11850073, 12358708, 12429340]
4389A2429340J52962k6605R5056K58489L71205K08142K86654L35056J97744L92973
4379A4701016L67240M12821O72650P25465Q67547J335966J968024K130435J896254
4370B5077418J92801k011371k998181k915845k403638j526032j027304r52807
4362A1435041n07507n84310n08459l12609l80229l31114m01732j68313n8002l5542
4352H147224L469L6725j15161m4885r8482O1212J72964K38212L2132j56436O8849
4341H345823J04522J61075o5407o0833K36093J1041k0003j55901k08031l94937
4331G953442k84497K25069J28131L13373n1426j17286n49489m36931j19282n25263
4321F535841l46845O1674k55049k26745l71681l33963k812l9383l66695k97999
$$ y = [12429340, 12582302, 12555697, 12650753, 12909242, 13280447, 13488589, 13775243, 14110299, 14308043, 14701016, 15068256, 15481077, 16153727, 16879192, 17746739, 19082705, 21050729, 23181164, 25077418, 25270219, 23258848, 20260667, 17344822, 14941184, 13415152, 12387848, 11435041, 10927534, 10343224, 9834765, 9522156, 9141927, 8810813, 8409081, 8240768, 8182766, 8147224, 8150693, 8187418, 8072257, 8027372, 7928890, 7990102, 8163066, 8401278, 8433410, 8276974, 8345823, 8450345, 8611420, 8546013, 8485180, 8721273, 8732314, 8712311, 8556410, 8348379, 7953442, 7668945, 7894014, 8022145, 8335518, 8284092, 8166806, 7617317, 7180386, 7061104, 6535841, 6188996, 6250670, 5995621, 5768876, 5397195, 5063232, 5060420, 5021037, 4654342, 4356343]
4311D356343j47297l856r1873j19100l20942q0527k30563k50782l2060k25486
4301B853857J01498J51470k12184P2347p844m6931j77361j56450K3706j51026
4291B451082j22668P9232j17707L0464k01988J36332R9729l4490N0477m1792p3697
4280B254974O8591j21323K9611Q6503m9541O1859Q2377q4072k11716M5910o7757
4269B095416k4744j67290j69986k16604j9962k6080J10323N3694J61109p7538
4259A718338p1055k43324j41325J95639N6178j67929l85p7151J386j73958J53482
4248A249896p9552j4280J04080P3951k485j93741R3196n1922l7364O4758l48033
4237H58504r2412J02049M1800J95412M0386m9205q3921m3600K1110o636K0576
$$ y = [4356343, 4209046, 4205190, 4113317, 3994217, 3673275, 3592748, 3362185, 3111403, 3079343, 2853857, 2955355, 3106825, 2894641, 2966988, 2959144, 2912213, 2734852, 2578402, 2602108, 2451082, 2328414, 2407646, 2289939, 2320403, 2118415, 2254747, 2354476, 2319986, 2370463, 2328671, 2254974, 2323565, 2202242, 2231853, 2318356, 2268815, 2330674, 2413051, 2328979, 2117263, 2163173, 2095416, 2070672, 1903382, 1733396, 1516792, 1496830, 1470750, 1581073, 1634767, 1795876, 1718338, 1647283, 1403959, 1262634, 1458273, 1514451, 1346522, 1346137, 1268986, 1270372, 1096414, 1249896, 1170344, 1156064, 1260144, 1334095, 1331610, 1137869, 1231065, 1179143, 1141779, 1206537, 858504, 766092, 868141, 909941, 1105353, 1145739, 1096534, 1012613, 969013, 990123, 983487, 1004063]
4226A004063j72031j30343J15496o2630L5340J78714j01796K5538R4761j45422
4216H41690R2852k0166k7318L7367N4147j75803o7397Q0737O645K2214P2691j4565
4204I03094j72039N6237l3903Q0925k67163l3749O273L7931K38149j5649o2127
4193G37979N4548N903j19936j1315m1282j7500J53045p6857L3143K02647l4707
4182H85668k63638p5055J92710j02547j63606q6331r7359j6683R1167J7877P3770
4171D55973O9630l9494K837K6503m2519P7975j43961J05659j14863r9086O7473
4160C66127R7854k0566j3453q4240p4043L7864J27075q3551k15203K5628O9072
4149B32564J29431k0889k4214p4425k7692K0696n1344M0046k65342K14664J18495
$$ y = [1004063, 832032, 701689, 817185, 754555, 789895, 968609, 866813, 892351, 987112, 841690, 934542, 914376, 887058, 924425, 978572, 802769, 735372, 816109, 822754, 844968, 917659, 903094, 731055, 787292, 753389, 834314, 567151, 533402, 539675, 577606, 815755, 800106, 737979, 792527, 798430, 678494, 667179, 625897, 608397, 761442, 684585, 717728, 920375, 885668, 622030, 546975, 739685, 637138, 473532, 387201, 289842, 273159, 364326, 382203, 455973, 525603, 486109, 488946, 515449, 472930, 550905, 406944, 512603, 397740, 298654, 366127, 463981, 443415, 429962, 345722, 271679, 309543, 436618, 353067, 137864, 163492, 232564, 361995, 341106, 316892, 242467, 214775, 235471, 184127, 224173, -41169, 173495, 291990]
4138B91990J58243j95966m4644K57556K00316l0181l53803l823M3350J14623k6300
4127D11361m554j2850l4312k59384J20862j13717K42407J62344j96015J3169m8605
4116B80706m9806m9391m86N3152p7894j2022J30238Q9481j22776k0783J17037
4105C37456J34457j35702j80437Q4823m6270M1727j24170J3573O4270k7868M1154
4094B03013Q2520q2888K09112J63826q0039J10825k14491q844j4312R4874j22293
4083C41303k404J38652j18238l2082n0584K0941R7907J06640j44954P5691j81038
4072B51834j68400N9261k3284K97812K735O0326j07006J20778o9663L8293O2518
4061E25204q0281m141k63837K00728q2679n9282m5839O3919M2854J3724J6453
$$ y = [291990, 450233, 254267, 209623, 467179, 667495, 637314, 283511, 279688, 323038, 437661, 411361, 406807, 393957, 359645, 100261, 221123, 107406, 349813, 512157, 316142, 329311, 280706, 230900, 181509, 181023, 234175, 156281, 144259, 274497, 363978, 241202, 220419, 337456, 471913, 336211, 155774, 240597, 194327, 236054, 111884, 125457, 189727, 161859, 203013, 285533, 202645, 411757, 575583, 495544, 606369, 391878, 383034, 368722, 463596, 341303, 338899, 477551, 359313, 327231, 276647, 297588, 395495, 502135, 357181, 432872, 251834, 83434, 142695, 119411, 417223, 419958, 480284, 373278, 494056, 424393, 462686, 525204, 444923, 440782, 176945, 377673, 294994, 235712, 189873, 253792, 296646, 310370, 326823]
4050C26823n2846J65080l2974k38624r662j1767N9268J56453l2741K3699M8347
4039D01056o9461q3087J52681j33775N0078J07129j89728k42616p7387J55349
4029G0239J60268J29667k28607j6793M8609J44399J26029J38564j78633o2170
4019C31572q5409q3967N6941K5379J42738j59621j40389J12046j19304J37990
4009B17976J13459L3277l0001J67300J08843j27396j24458j62967o4242J04892
3999B36683R9116j22733K05592p2091j37013k23404J08058J47484j89818K45429
3989B97303K88468l7576k60759M3060J3892k31896J09324R9919Q4567m8869j785
3978C55648K57915Q8574j35543j72719j0034k00681j29396J31913J09060K28470
$$ y = [326823, 273977, 439057, 406083, 167459, 157797, 146030, 205298, 361751, 329010, 352709, 401056, 331595, 248508, 401189, 267414, 317492, 424621, 234893, -7723, -85110, 70239, 230507, 360174, 131567, 114774, 163383, 307782, 433811, 572375, 393742, 331572, 246163, 162196, 219137, 244516, 387254, 227633, 87244, 199290, 79986, 217976, 331435, 364712, 334711, 502011, 610854, 483458, 359000, 196033, 131791, 236683, 335799, 213066, 418658, 346567, 209554, -13850, 94208, 241692, 51874, 297303, 585771, 548195, 287436, 330496, 344388, 112492, 221816, 321735, 406302, 357433, 355648, 613563, 702137, 566594, 393875, 383841, 183160, 53764, 185677, 294737, 523207]
3968E23207J17618q2029J0412K6055o7861l2850j57125K05076K0332J64174K84739
3957A011748O4620j60095q6343l02449l9574O5244l6905j77736k7004K94090P5314
3946F80910j93493r8626J61470j6923k5382p5064O7807l7518R1784k05679j53221
3935A96065J92936q3828l0118J70882K2275j20227J47366k06474r1975J45989
3925C42891n066j33134m3044Q3285l8946M440J2790J44593Q1743j57377p2843
3914B19332N8827j1532J40175J36111K9015j49378m2449K20816o0369m8644k1104
3903D70800k61916O0820p9856J59708J6036k95583m410K97119J43522l6275n6675
3892D13290p1838J89530r9120n0021Q2650j15709L2871j60571Q6727J33774p647
$$ y = [523207, 640825, 558796, 569208, 595263, 527402, 494552, 337427, 542503, 562835, 727009, 1011748, 1076368, 916273, 829930, 527481, 487907, 553151, 516246, 338510, 311506, 605596, 680910, 487417, 388791, 550261, 533338, 507956, 432892, 500699, 463181, 554965, 349286, 196065, 389001, 305173, 275055, 445937, 468212, 347985, 495351, 288877, 196902, 342891, 337825, 204691, 161647, 244932, 205986, 210426, 223216, 367809, 449552, 292175, 219332, 278159, 266627, 406802, 542913, 571928, 422550, 380101, 600917, 540548, 491904, 470800, 208884, 269704, 189848, 349556, 365592, 70009, 65599, 362718, 506240, 469965, 413290, 341452, 530982, 431862, 381841, 464491, 348782, 381653, 221082, 307809, 441583, 433936]
3881D33936j64107J82415P3244J1726J1970j35667J71071L5470j9607K83333k20984
3870F62800P360l7731q5629L7281J1253k8681n9269l2997j95060R6624Q663J13376
3858D97990j12637L3412M1968j11476J6433K79520k74463K26005l9378K2688J32443
3847G12505J48014j9600j95352J05506j93157P2170J12201P6564l6725j25884
3837F56242j25626K04686r0987j79813J77311l7869r2392j9350j28957R3400m2183
3826D14462J3427N8454M4312k5383j0413K46498O1440j08903J12002O6645k96826
3815E75715j16101k14480J53714K55851J38198R2270k1014o6178j16315k76824
3805D04836K09205K82515j64093j27069m5146J49057o2828k51297R6189J62965
$$ y = [433936, 269829, 452244, 525488, 537214, 549184, 413517, 584588, 620058, 600451, 883784, 662800, 670160, 632429, 546800, 584081, 595334, 566653, 507384, 474387, 279327, 375951, 384614, 497990, 385353, 418765, 460733, 349257, 365690, 645210, 370747, 596752, 557374, 580062, 712505, 860519, 840919, 645567, 751073, 557916, 630086, 742287, 818851, 782126, 656242, 530616, 735302, 644315, 464502, 641813, 603944, 511552, 492202, 363245, 456645, 414462, 427889, 486343, 530655, 505272, 494859, 741357, 802797, 693894, 805896, 872541, 575715, 459614, 245134, 398848, 654699, 792897, 885167, 864153, 797975, 681660, 404836, 614041, 896556, 732463, 605394, 560248, 709305, 646477, 395180, 491369, 654334]
3795F54334j38068P1800M2634l9616R2867r5789o3991K09480j2031p3410O1416
3784G09626M6349R7401J17617j05687j26738K5786n6400n6427O8510R2021m7785
3773G64273q8390M3685r5984J23150J77203L4058k13663P4468l5032r177n6952
3762G17639J03129N4202k5436J6926j82842J18220L9283m619J79942q7901j16087
3751H12456p1332l6186N7636J4324P3691J2922k4839m1630M5653r7759M261N8376
3739H07573O3036p6377J71410O0128j12889m1396m1656K8712J64685o7614k30141
3728G25471r2320K00215L676J11137r721j05771m610j29694L15106J98515R9698
3717A311702j99254l2286O4944r0804n1714l5426j00073k4976n9246n5214J59588
$$ y = [654334, 516266, 588066, 630700, 591084, 683951, 588162, 524171, 733651, 721620, 648210, 709626, 755975, 853376, 970993, 865306, 738568, 764354, 707954, 651527, 720037, 812058, 764273, 675883, 719568, 623584, 746734, 923937, 957995, 744332, 818800, 783768, 774591, 717639, 820768, 874970, 849534, 866460, 683618, 801838, 841121, 836502, 1016444, 928543, 812456, 741124, 704938, 762574, 776898, 850589, 863511, 838672, 797042, 842695, 744936, 749197, 807573, 870609, 794232, 965642, 1025770, 912881, 871485, 829829, 858541, 1023226, 955612, 725471, 633151, 833366, 837042, 948179, 938458, 832687, 828077, 698383, 1013489, 1212004, 1311702, 1112448, 1080162, 1145106, 1054302, 1002588, 967162, 867089, 842113, 782867, 727653, 887241]
3706H87241j27822J71011J58807j67055k48363J85860M8308J79104J27397k85328
3696I29160q173J18701p318k12474j3259R3239m0317J58707K8605q8802J02745
3685A060814K16544O8583j22810J80805l40770p8978O3852K27529L6601j09773
3675A202397j28105P6933K0973j69790Q8231N9261K3779R4002J89851j38118r5884
3664A223530o1408N1310R9400J3574o5997J8732l8396L9582o8385m9484K9986
3653A192444k2233O9894o3669K209j2431J58663o9510k33522J79847K8021q4778
3642A144935J4341J16431J00235K12016l0531j76790k32337K42705k2924p7116
3632A290965O0833J84774j3440j46501j05798J68852R8856q6515K7776J60679
$$ y = [887241, 759419, 930430, 1089237, 922182, 673819, 859679, 907987, 1087091, 1214488, 929160, 920987, 1039688, 1032370, 819896, 806637, 899876, 859559, 1018266, 1046871, 958069, 1060814, 1277358, 1345941, 1223131, 1403936, 1063166, 984188, 1048040, 1275569, 1312170, 1202397, 1074292, 1151225, 1172198, 1002408, 1090639, 1149900, 1173679, 1267681, 1457532, 1319414, 1223530, 1162122, 1213432, 1312832, 1326406, 1260409, 1279141, 1240745, 1280327, 1211942, 1162458, 1192444, 1170211, 1240105, 1176436, 1178645, 1166214, 1324877, 1255367, 1021845, 1201692, 1229713, 1144935, 1159276, 1275707, 1375942, 1587958, 1557427, 1380637, 1148300, 1391005, 1368081, 1290965, 1351798, 1536572, 1523132, 1376631, 1270833, 1439685, 1538541, 1452026, 1479802, 1640481]
3622A640481J25789k64673L576J572L0706j78984O7351K2272m2642k890J85242
3611A587800n3682O7038K95608j2781Q1958O646l7052k15806j09348r588J8452
3600A619245M6938m3762J14416L8728L33823j87644j94651L2276K66075k07116
3590A818328k32134M17292L2897k18898m116J85372L5706m8853j28754J46942
3580B003782J7653K13170p9513j00447j20343j73130J33067M7047J22750J76657
3570B240693K30825o4712j3937Q4375p5107j57377o14o3141m8334p8327K8228
3559B082572K85467j8555r416r676l8793n8235K34460Q6979j97237M7540J08495
3548B513601j22922Q4989J82470k02126K9796r5038J41880k00J45919l11753L6175
$$ y = [1640481, 1766270, 1501597, 1505173, 1506745, 1537451, 1358467, 1425818, 1448090, 1405448, 1402558, 1587800, 1534118, 1601156, 1896764, 1883983, 1965941, 1972587, 1935535, 1719729, 1610381, 1600793, 1619245, 1666183, 1622421, 1736837, 1775565, 2109388, 1921744, 1727093, 1759369, 2025444, 1818328, 1586194, 2003486, 2036383, 1817485, 1813369, 1998741, 2034447, 1985594, 1856840, 2003782, 2021435, 2234605, 2155092, 2054645, 1934302, 1761172, 1894239, 1941286, 2064036, 2240693, 2471518, 2406806, 2392869, 2477244, 2402137, 2244760, 2244146, 2181005, 2132671, 2054344, 2082572, 2368039, 2349484, 2340068, 2330392, 2291599, 2233364, 2467824, 2554803, 2357566, 2405106, 2513601, 2390679, 2475668, 2658138, 2456012, 2485808, 2390770, 2532650, 2532450, 2678369, 2366616, 2402791]
3537B402791J65659k4077j19975n8581L029j80321J88514J1485Q5964j56777J5189
3526B332900j30835J34416n2985M0151m0657n3352J32998J63601n3817p0879J06767
3515B508308j5865j1600K04989O4617l5586l26952r3230L27728j70374Q7017Q3760
3504B622812l3369Q4889k097j83664J26901j40087j70493K97493J70367j39641
3494B633111J42157R3478j01151j89493l3959O6916O293M275N7567P56M7890J0234
3482B738074m6477p6965m9405K01070j41400M7404J39713r3380j54599K29655
3472B793690J2207j82276L8694j3213k77671j3135L3217P7076N3065O632l6638
3461B491648L7720L80925J2583k67857M4045J10400k5369J53016r9449m2366J31814
$$ y = [2402791, 2568450, 2544373, 2424398, 2365817, 2368846, 2188525, 2377039, 2388524, 2474488, 2317711, 2332900, 2202065, 2336481, 2283496, 2323647, 2282990, 2229638, 2362636, 2526237, 2472420, 2401541, 2508308, 2492443, 2480843, 2685832, 2750449, 2714863, 2387911, 2294681, 2622409, 2452035, 2539052, 2622812, 2589443, 2674332, 2672235, 2488571, 2615472, 2475385, 2304892, 2602385, 2772752, 2633111, 2775268, 2868746, 2767595, 2578102, 2544143, 2611059, 2617352, 2621627, 2679194, 2679950, 2727840, 2738074, 2691597, 2614632, 2565227, 2766297, 2624897, 2672301, 2812014, 2718634, 2564035, 2793690, 2805897, 2623621, 2662315, 2649102, 2371431, 2358296, 2391513, 2468589, 2521654, 2528286, 2491648, 2529368, 2910293, 2922876, 2655019, 2699064, 2809464, 2784095, 2937111, 2837662, 2795296, 2927110]
3450B927110N5489L5628m9483l4152k4076j04327n9598J26945K04815r9042j85193
3439B794116J85729k76845J997J80704O1191o9571j68511J43234J15421j78341
3429B789124Q8617J08067j18163o1901M0803K4690J908J01100N0661k6814Q924
3418C007016P5136L0525j18802j2764p242j21549L12462k5112P6223j01109L8843
3407C153627J27904P8467j50891n7510J69523q4009j4665K0028l9080m4893n8872
3396C099629K34174J79003j53634r1224M7245k918J87408r4138K531N9634p0505
3385C397205P9540j9933R4049J0684j66915k45773J97936J27513J98437k8626
3375C644117p4559j94905n6297L94346j75207k9251J12179M5444l6738M4190J51780
$$ y = [2927110, 2982599, 3018227, 2968744, 2934592, 2910516, 2806189, 2746591, 2873536, 3078351, 2979309, 2794116, 2979845, 2703000, 2704997, 2885701, 2946892, 2877321, 2708810, 2852044, 2967465, 2789124, 2877741, 2985808, 2867645, 2805744, 2846547, 2871237, 2873145, 2974245, 3024906, 2998092, 3007016, 3082152, 3112677, 2993875, 2981111, 2973869, 2852320, 3164782, 3139670, 3215893, 3114784, 3153627, 3281531, 3359998, 3209107, 3151597, 3321120, 3237111, 3222446, 3242474, 3203394, 3158501, 3099629, 3333803, 3512806, 3359172, 3267948, 3315193, 3312275, 3499683, 3405545, 3408076, 3467710, 3397205, 3476745, 3456812, 3550861, 3561545, 3394630, 3148857, 3346793, 3474306, 3672743, 3644117, 3569558, 3374653, 3318356, 3712702, 3537495, 3508244, 3620423, 3665867, 3629129, 3673319, 3825099]
3364C825099j20426r7957k898J68759J84093n4330m6193m6475k23160K34467K24224
3353D045203j08080j07313J77934o1278q3307q3764R1085K22571l2383o6483j74949
3342C819236N4819K8708J22609k6260P5641o3346N2056K35932m0987J14809k06826
3331D166391j077J06108k6860K0407K4268J34749K63961N4656m7170K10138J78423
3320E083994p9784k20744L15735J44690J3914Q837J70258K16876K64135J68246
3310F086157l2229K37413N88915K65081J41094l78968l97349j05801k27018l26251
3300E851044k06039o2292L1099m0217K3380R8303O0328J21351q2890P5978J13767
3289E983812N4557K91411K24272K8497P3957n037L33394J41872K78228J41620
$$ y = [3825099, 3704673, 3606716, 3603818, 3772577, 3956670, 3902340, 3856147, 3809672, 3586512, 3820979, 4045203, 3937123, 3829810, 4007744, 3946466, 3863159, 3779395, 3870480, 4093051, 4060668, 3994185, 3819236, 3874055, 3902763, 4025372, 3999112, 4074753, 4011407, 4063463, 4299395, 4258408, 4373217, 4166391, 4165314, 4271422, 4244562, 4264969, 4289237, 4423986, 4687947, 4742603, 4695433, 4905571, 5083994, 5004210, 4783466, 5099201, 5243891, 5257805, 5266642, 5436900, 5653776, 5917911, 6086157, 6053928, 6291341, 6880256, 7145337, 7286431, 6907463, 6510114, 6404313, 6177295, 5851044, 5645005, 5582713, 5613812, 5573595, 5596975, 5695278, 5755606, 5876957, 5794067, 5870045, 5983812, 6038369, 6329780, 6554052, 6582549, 6656506, 6651469, 6984863, 7126735, 7404963, 7546583]
3279G546583L27779M90143N44606O02032O30466K383k11096o28244q67595o11314
3269G825743n06598j49056j49034N03j22070p5636j43588J16783P5459l0192N3177
3258F895491K94711Q4706k55329M8892P6940n403K2877K24328J92857M6242J69077
3247G795389K19436J90856J20091L80870N85113R1194k29405l38247k33530m16120
3237H165647j576j05331j64534r6291L8180M8252J56924J26520j42167m8982J038
3226G977680O7368R5306J65253K0127K65644J97048r1930o6741K23326K18941
3216I072022J13211j8460J32413J06378K0011J22341L7746J47986K64613O0967
3206A0059228l3250R1946J46766J52550Q3691K32601J02494J64311J52076J32126
$$ y = [7546583, 7874362, 8364505, 8909111, 9511143, 10141609, 10143992, 9932896, 9304652, 8437057, 7825743, 7319145, 7170089, 7021055, 7021558, 6899488, 6823852, 6680264, 6797047, 6872506, 6842314, 6895491, 7190202, 7274908, 7019579, 7068471, 7145411, 7140008, 7162885, 7387213, 7580070, 7626312, 7795389, 8014825, 8205681, 8325772, 8706642, 9291755, 9382949, 9153544, 8815297, 8581767, 8165647, 8164071, 8058740, 7894206, 7797915, 7836095, 7884347, 8041271, 8167791, 8025624, 7976642, 7977680, 8045048, 8140354, 8305607, 8325734, 8591378, 8788426, 8696496, 8629755, 8853081, 9072022, 9185233, 9166773, 9299186, 9405564, 9425575, 9547916, 9585662, 9733648, 9998261, 10059228, 10025978, 10117924, 10264690, 10417240, 10500931, 10733532, 10836026, 11000337, 11152413, 11284539]
3196A1284539K84525K0083J41438J95823M7198K18764L18152N46918K93368j23054
3186A3227754K18L09579M70718L23223m165K65300L75280L35777M94797Q3934
3176A5882415N5345L06003N55844K98068L55011K27834M49035L74153J30541L38512
3166A8972761L09386L92559L63968N31009M53549M02277P82652N73898N90576
3157B3372635O44895O07385N83226N26049O78549P41701Q20215J047073J205348
3148C0227076J208990J174390J256286J433561J316928J783768J663134J822310
3140D1886443J667251J903427K163328J813525K186105J978704J810707J492686
3132E6902176J119512M12541q1313q20249k197117k731105k873846k962965k774439
$$ y = [11284539, 11569064, 11589147, 11730585, 11926408, 11973606, 12192370, 12510522, 13057440, 13350808, 13227754, 13227972, 13537551, 14008269, 14331492, 14327327, 14592627, 14967907, 15303684, 15798481, 15882415, 15937760, 16243763, 16799607, 17097675, 17452686, 17680520, 18129555, 18503708, 18634249, 18972761, 19282147, 19674706, 20038674, 20569683, 21023232, 21425509, 22208161, 22782059, 23372635, 24017530, 24624915, 25208141, 25734190, 26412739, 27154440, 27974655, 29021728, 30227076, 31436066, 32610456, 33866742, 35300303, 36617231, 38400999, 40064133, 41886443, 43553694, 45457121, 47620449, 49433974, 51620079, 53598783, 55409490, 56902176, 58021688, 58434229, 58352916, 57532667, 55335550, 52604445, 49730599, 46767634, 43993195]
3123D3993195k628689k147867j916319j421805j424474j316900j216726r58625
3115C0961790r91843q31857q28887q33034n50807n88017o71243n60684k81679
3106B4823739m93361o07753k94384m50472k13496l61712n00642l13785l04126
3097B1284008l47403l52018m30612n02535j84661l86683o20869o05571m31522
3088A7422134l3526j79477l46643l78495m20273n10313l46598k10624k94939k12762
3078A4488484m87388j78762j43097k53043m07521k91757o1540j57319m58499L7289
3068A2086847k0499j42838k87968j12644j95767m5j65739j69931j62303k33538
3058A0595575l9357j84603j70499L5716j54601k58429o3751J26587q0558k14455
$$ y = [43993195, 41364506, 39216639, 37300320, 35878515, 34454041, 33137141, 31920415, 30961790, 29969947, 29138090, 28309203, 27476169, 26925362, 26337345, 25666102, 25105418, 24823739, 24330378, 23722625, 23428241, 22977769, 22764273, 22402561, 21901919, 21588134, 21284008, 20936605, 20584587, 20153975, 19651440, 19466779, 19080096, 18459227, 17853656, 17422134, 17388608, 17209131, 16862488, 16483993, 16063720, 15553407, 15206809, 14996185, 14701246, 14488484, 14001096, 13822334, 13679237, 13426194, 13018673, 12726916, 12665376, 12508057, 12049558, 12086847, 12066348, 11923510, 11635542, 11522898, 11327131, 11327086, 11161347, 10991416, 10829113, 10595575, 10556218, 10371615, 10201116, 10236832, 10082231, 9823802, 9760051, 9886638, 9806080, 9591625]
3048I591625k59374K7160j22568j399N4153k31256r4630m0314J51538j48602j54892
3037H771441l05986j88408Q5267j87678j685j7748m6965k4457l0983l5815n7992
3026G958991l496j05078q2780k39386k39719L16339j04861j58142J03755k28350
3016G217273n7369J2796l4808j80315K10353m4875k34312l8297J31958j71097
3006F811307m85350K19480j3342j040J12650m5580j8739p862j75207k18606J55037
2995F332748O6869j68681j48614r28j07051O6297p431O7467Q6977p7048l79744
2984E730861Q1523r0499M0498J44803M9389j24453k67228K49119R0158j98007
2974E706164K50481j28020m2341J6266k05336k8111k97694M3836K68479J07979
$$ y = [9591625, 9332251, 9359411, 9236843, 9235444, 9289597, 9058341, 8963711, 8923397, 9074935, 8926333, 8771441, 8465455, 8277047, 8362314, 8174636, 8172951, 8155203, 8108238, 8083781, 8052798, 8016983, 7958991, 7955495, 7850417, 7767637, 7528251, 7288532, 7604871, 7500010, 7341868, 7445623, 7217273, 7159904, 7172700, 7137892, 6957577, 7167930, 7123055, 6888743, 6850446, 6982404, 6811307, 6325957, 6545437, 6532095, 6531055, 6643705, 6598125, 6579386, 6571524, 6396317, 6177711, 6332748, 6399617, 6230936, 6082322, 6081394, 5974343, 6040640, 6033209, 6100676, 6187653, 6110605, 5730861, 5812384, 5721885, 5762383, 5907186, 5956575, 5832122, 5564894, 5814013, 5904171, 5706164, 5956645, 5828625, 5786284, 5802550, 5597214, 5569103, 5271409, 5315245, 5583724, 5691703]
2964E691703q5667k52224j25779L19777K7847j85528N5934J6190k25491j16009
2954E120753J41092j1157l4212p2196j13271k07659J8584J50575J7122n5697o2125
2943D891809j50854p2831L24837J62697k52239p5012j10246J2722L2025K768j48895
2932D616781Q8049K12929m2246k14862j63326N3546o3014N4449o0691p1285K3565
2921D433895m8036O2699K4271j2394J39987J4181Q1057j30761j32938j56377L6322
2910D311906J30404Q6174Q9772O7418J80188m4614m4248j21048N0835n4447l7165
2899D615175m0812l9908R9749k4236J86787n4863o7942K3820Q640r2479J13571
2888D727502J72137l2394K70551j28389k3553l66588M9937J80789l5973J79500
$$ y = [5691703, 5606036, 5353812, 5228033, 5547810, 5575657, 5390129, 5446063, 5462253, 5236762, 5120753, 5261845, 5250688, 5216476, 5144280, 5031009, 4823350, 4841934, 4992509, 5009631, 4953934, 4891809, 4740955, 4668124, 4992961, 5155658, 4903419, 4828407, 4718161, 4730883, 4762908, 4765676, 4616781, 4704830, 4917759, 4875513, 4660651, 4497325, 4550871, 4487857, 4542306, 4481615, 4410330, 4433895, 4385859, 4448558, 4472829, 4460435, 4600422, 4614603, 4695660, 4564899, 4431961, 4275584, 4311906, 4442310, 4528484, 4618256, 4685674, 4865862, 4821248, 4777000, 4655952, 4706787, 4652340, 4615175, 4574363, 4534455, 4634204, 4609968, 4796755, 4741892, 4673950, 4697770, 4706410, 4613931, 4727502, 4899639, 4867245, 5137796, 5009407, 4985854, 4619266, 4669203, 4849992, 4814019, 4993519]
2878D993519j82638o2610m960L30305J80245P4262p4890J75144l640J08412J65261
2867E698410l3893J58106o1871K81771J04278n599K95446j11854R714k5176j13768
2856F195564N3542K86628K37227j277r5670r5099j88805J62232J71445J94667
2846F920454N7986K7703J37994K09432K5642K06580M8436J79225J93044K82237
2836H288733K93599p0128R6762K78875L51622J86700J52643K52597L30013J98328
2826A0359744Q9344L55150J73983L35487J83511K24308L91000J06652Q2112J68865
2816A2470156K36448J0682K48316J65385m3164L27562L08148J09762L17372M21615
2806A4572282K13583j52285K41052N29168N51608L34356N17034M36370M18077
$$ y = [4993519, 4810881, 4748271, 4743311, 5073616, 5253861, 5328123, 5253233, 5428377, 5424737, 5533149, 5698410, 5664517, 5822623, 5760752, 6042523, 6146801, 6141202, 6436648, 6324794, 6334508, 6309332, 6195564, 6249106, 6535734, 6772961, 6771684, 6676014, 6580915, 6392110, 6554342, 6725787, 6920454, 6978440, 7006143, 7144137, 7353569, 7379211, 7585791, 7634227, 7813452, 8006496, 8288733, 8582332, 8512204, 8608966, 8887841, 9239463, 9426163, 9578806, 9831403, 10161416, 10359744, 10449088, 10804238, 10978221, 11313708, 11497219, 11721527, 12112527, 12219179, 12301291, 12470156, 12706604, 12717286, 12965602, 13130987, 13087823, 13415385, 13723533, 13833295, 14150667, 14572282, 14785865, 14633580, 14874632, 15403800, 15955408, 16289764, 16806798, 17243168, 17661245]
2797A7661245N82497N75248N05669N13271N42512P09232K89514N27218J95897
2788B2102303r6425l21297n86782p38570o40916p14164l10968k82257j99769Q9902
2778A8301057j14918j66J07643K91082K98985K55780L73022N27738J88091M73300
2768B0701614K39461K62538K82692K09682O3289O9952O830m09496j69703l87802
2758B0869057o47934m44574p81530j002670m68327n37103m02859l43430l74936
2749A5865694k23707k79800l84408j32765j39878J0991J28765j22685J17621o9450
2739A4770378k81178l20395m31895k78418k93158m68830m41894o22276l35844
2730A1296490n82403l39694l58717o00965l99604l26257j76921k84099k97540
$$ y = [17661245, 18243742, 18818990, 19324659, 19837930, 20380442, 21089674, 21379188, 21906406, 22102303, 22005878, 21684581, 21097799, 20359229, 19718313, 19004149, 18693181, 18410924, 18211155, 18301057, 18186139, 18185973, 18293616, 18584698, 18883683, 19139463, 19512485, 20040223, 20228314, 20701614, 20941075, 21203613, 21486305, 21695987, 21759276, 21829228, 21836058, 21426562, 21256859, 20869057, 20221123, 19776549, 18995019, 17992349, 17524022, 16986919, 16584060, 16240630, 15865694, 15641987, 15362187, 14977779, 14845014, 14705136, 14716127, 14844892, 14722207, 14839828, 14770378, 14489200, 14168805, 13736910, 13458492, 13165334, 12696504, 12254610, 11632334, 11296490, 10714087, 10374393, 10015676, 9414711, 9015107, 8688850, 8511929, 8227830, 7930290]
2721G930290k07166k06291j76305k07680l09880j46246j85155q4572r2363j26891
2711F187741j93127k6284m632j74212k98129k67744j36849r9806p9552j25867
2701D781539j39718j14459k3969k50721n7589J680k51497k0129j11861J21754
2691C935030j12019k54686J356L9055k48592o8352j53013K7556n3983j99943J73920
2680C086329q6569l2727j20353M4337j4174m5478o2710m9184j59883R6487K3383
2669B679458o9383K5346M1006n7031j31619j52212k18952k4830J19324k4068r7912
2658B089127j28569O1225Q2311p8715j10766j60159J97699J01282j88600j7997
2648A846838j21153K3242L8266O771k46474n5873K26801o2642j99347J33450j15494
$$ y = [7930290, 7723124, 7516833, 7340528, 7132848, 6822968, 6676722, 6491567, 6406995, 6314632, 6187741, 5994614, 5968330, 5963698, 5789486, 5491357, 5223613, 5086764, 4986958, 4907406, 4781539, 4641821, 4527362, 4503393, 4252672, 4195083, 4196763, 3945266, 3925137, 3813276, 3935030, 3823011, 3568325, 3569681, 3608736, 3360144, 3291792, 3138779, 3166335, 3112352, 2912409, 3086329, 2999760, 2967033, 2846680, 2891017, 2876843, 2831365, 2768655, 2719471, 2559588, 2656075, 2679458, 2610075, 2635421, 2676427, 2619396, 2487777, 2335565, 2116613, 2091783, 2211107, 2187039, 2089127, 1960558, 2021783, 2104094, 2025379, 1914613, 1754454, 1952153, 2053435, 1864835, 1846838, 1725685, 1748927, 1787193, 1793964, 1547490, 1491617, 1718418, 1655776, 1456429, 1589879, 1474385]
2637A474385k99330J37173j10398J96811m6567n6688P3660O5055o9166k46435
2627A118500J657J64676R9290j98393R3728j12072m8791k32431L9251J21101M2469
2616A088985p5404J7389R0491j49187J39415j13767o0014J55179j05041J21254
2606A109300j64536j27752j26546J58994J69590j59855K0380L1396J31752j15327
2596I27396L6050J66986j33941j57125l4365r4908J2908J46938q3428k16538K6836
2585E96809J05668N6528o7284N3703p9710R4100j1941p0554j17293r8897K05904
2574F67033M8221o3439o1609j62436J00280q863j74997P4995K31286l2990J37054
2563G54535J1249k44861m7512N478J98135r2047j8591J24702o6563R1707j03617
$$ y = [1474385, 1175055, 1312228, 1201830, 1398641, 1352074, 1295386, 1369046, 1434101, 1364935, 1118500, 1120157, 1284833, 1384123, 1185730, 1279458, 1167386, 1118595, 886164, 925415, 1046516, 1088985, 1013581, 1030970, 1121461, 972274, 1111689, 997922, 937908, 1093087, 988046, 1109300, 944764, 817012, 690466, 849460, 1019050, 859195, 879575, 910971, 1042723, 927396, 963446, 1130432, 996491, 839366, 805001, 710093, 723001, 869939, 786511, 569973, 596809, 702477, 759005, 691721, 745424, 665714, 759814, 747873, 677319, 560026, 461129, 667033, 715254, 651815, 590206, 427770, 528050, 519187, 344190, 419185, 650471, 617481, 754535, 765784, 520923, 473411, 478889, 677024, 584977, 566386, 691088, 624525, 716232, 612615]
2552F12615r3296j49373M2683Q4806J11665j78535L9443J30457L456j64114J07120
2541E46927j8140K2902R5308j36677m1130J15609P0666j04846j3247O4735j77356
2530D24751J5278P4791j7955Q300j12953J4499p5748R8492P8018k5739j83354
2519B98380O0750J77586Q8639l8910j73555L3148k4087j5188O7569r4257J13208
2508D93283j39533p9654K13200j86913J78421j3242p0763P0366K969j14862j66961
2497A86311P9407J43754M9599j84805M8670k09390K37093P5169k31170J20469
2487C15107Q7856o375k22198J24772J75301j781j1628r7219J80273j6959j50868
2476C76281j58501R5284j2145K1498j73242J59407N089l85066J12278J85390O2921
$$ y = [612615, 519319, 369946, 412629, 497435, 609100, 430565, 470008, 600465, 603921, 439807, 546927, 528787, 551689, 646997, 510320, 469190, 584799, 655465, 550619, 537372, 602107, 424751, 440029, 514820, 496865, 505165, 392212, 406711, 330963, 429455, 507473, 481734, 298380, 359130, 536716, 625355, 586445, 412890, 446038, 421951, 406763, 474332, 380075, 493283, 353750, 274096, 487296, 300383, 478804, 465562, 394799, 465165, 468134, 353272, 186311, 265718, 409472, 459071, 274266, 322936, 113546, 350639, 425808, 194638, 315107, 402963, 396588, 174390, 299162, 474463, 472682, 461054, 363835, 544108, 527149, 376281, 217780, 313064, 300919, 322417, 149175, 308582, 313671, -71395, 40883, 226273, 289194]
2465B89194J29755j59985L2451J9879j87492j11079J30479J34370M703J29848
2455D12123J54146j04284k7104q7278q2159j8479j03860L572m7796R8833J69498
2444C67212j60141r4378N2808P6628K1909j5768P3101k6449j46793k5904J23905
2433B46130J02582p1203k7940J59953j21886O0488J8333k35686m2672O4891K64953
2422D17943j58306j67468N3319l9523J01987J40545J56177j33418o7468j41570
2412A62218p1066M0920J16539P7258j6285J00000p5061j3138J1370j86964j14787
2401C1004Q8699L5572J3020m243k56108P8155M8628o0726J40956J53115k0928
2390B47144k36537r057N6440J25888r2221J05930M6118p5565P5744k59738J42615
$$ y = [289194, 418949, 258964, 291415, 311294, 123802, 12723, 143202, 277572, 282275, 412123, 566269, 461985, 434881, 347603, 265444, 246965, 143105, 146677, 98881, 197714, 367212, 207071, 112693, 165501, 242129, 264038, 248270, 321371, 294922, 148129, 122225, 246130, 348712, 277509, 249569, 409522, 287636, 348124, 366457, 130771, 88099, 152990, 417943, 259637, 92169, 145488, 105965, 207952, 348497, 504674, 371256, 303788, 162218, 91152, 132072, 248611, 325869, 309584, 409584, 334523, 321385, 332755, 145791, 31004, 119703, 155275, 168295, 164052, -92056, -13901, 34727, -25999, 114957, 268072, 247144, 10607, 1550, 57990, 183878, 91657, 197587, 243705, 168140, 243884, -15854, 126761]
2379A26761O4667K51556k2016k29366j19343J48914q9496j10817K28484Q716n1462
2368B06598j01071j65709K72232J54323j57271j1385Q9658k62511O7332Q7524
2358A79720p7112n0701k20713K4248K16593j9426q6850J12905R1475n2693J07250
2347B24696j52394n8370L1498J85389M1087J0152M5658j7315m7691j05488K0094
2336A77316j00087P2801j03561k38680K26786q9318M4430J23673q1713O737p0504
2325c2120m9067M5437J33679J08666l3530j34721k006j59538Q6278R7351L1284
2314I1713j04663M6722m8140O8043j18005q3383Q5360K48123p8061p8443l2915
2303c649N1141J51807R4813j02299J6148j90858J60919M0193j12746Q4424j04032
$$ y = [126761, 191428, 442984, 420968, 191602, 72259, 221173, 131677, 20860, 249344, 258060, 206598, 105527, -60182, 212050, 366373, 209102, 197717, 287375, 24864, 92196, 179720, 102608, 51907, -168806, -144558, 72035, 52609, -34241, 78664, 170139, 117446, 224696, 72302, 13932, 45430, 230819, 271906, 282058, 327716, 310401, 262710, 157222, 177316, 77229, 150030, 46469, -192211, 34575, -54743, -10313, 113360, 31647, 38384, -32120, -81187, -35750, 97929, 206595, 173065, 38344, 36338, -123200, -36922, 60429, 91713, -12950, 33772, -14368, 53675, -64330, -147713, -62353, 185770, 107709, 29266, -3649, 47492, 199299, 294112, 191813, 207961, 17103, 178022, 218215, 105469, 189893, 85861]
2292H5861j01005K7019J47668P3699R3102M8218J2654L0414k64696j45370P6075
2281H3639J19273k8442M7843R906Q481q6077r8667J57864L1709M5377K772k2884
2269B70794q8762K7215j1081j39673J42371K61956k03200k01823J576K22897K36084
2258E18354j1201k7969J1512k29727q1402J29452j4086j26787P0106L0507j74083
2247I4676J63428J40708j62203L3359Q6153q5168J01406j33531j43130O5248R6028
2236B56974j25029m4440R4657m583K9931N5521l3822j32612j5556l8365K55701
2225B98377R0384n8556j5465j08889j8330J40674m9742j9444o7522N2171J49721
2214C93379k36487j54990l5550J80277K84349N409k8317k61604o7476K55500j47352
$$ y = [85861, -15144, 11875, 159543, 233242, 326344, 374562, 387216, 417630, 152934, 7564, 83639, 202912, 174470, 222313, 232219, 240700, 154623, 55956, 213820, 245529, 290906, 293678, 270794, 182032, 209247, 198166, 58493, 200864, 462820, 259620, 57797, 59373, 282270, 518354, 507153, 479184, 490696, 260969, 179567, 309019, 294933, 168146, 238252, 268759, 94676, 258104, 398812, 236609, 269968, 356121, 270953, 372359, 238828, 95698, 160946, 256974, 131945, 87505, 182162, 177579, 207510, 263031, 229209, 96597, 81041, 42676, 298377, 388761, 330205, 314740, 205851, 187521, 328195, 278453, 259009, 191487, 243658, 393379, 156892, 1902, -33648, 146629, 430978, 436387, 408070, 146466, 78990, 334490, 187138]
2203A87138m3292l1960K9939M9416j10137j4553K43294J5544j43150J49422j51596
2192A80065O7094n8178L5700l1387L3980M261L1829j50113p8508M8341Q8579P0604
2180B42267N3098Q7512M1615J4932J8336r7680j59191O5038J04391j71641j92328
2169F349K20100J42697M4802j04242q3135J80316L7046p6206k828O6258j29886
2158C01271m8180k5123k831P563N9297M4454j2776Q9111p601J27682k1714j86934
2146C24219m060j74124J16914Q0543l385K21323n9132J33173J2280p9968J02443
2135F70226j59278k3564J06809M5585l6814j84208R5054J61934j6161j22611J1174
2124E48146N4301M5600Q6425k7563j59101J14371N1469m610R2591J33138j87882
$$ y = [187138, 143846, 111886, 141825, 191241, 81104, 66551, 309845, 325389, 182239, 331661, 180065, 247159, 188981, 224681, 193294, 227274, 231535, 263364, 113251, 34743, 83084, 171663, 242267, 295365, 382877, 424492, 439424, 457760, 360080, 200889, 265927, 370318, 198677, 6349, 226449, 369146, 413948, 309706, 226571, 406887, 443933, 367727, 364899, 431157, 301271, 253091, 227968, 225137, 232700, 291997, 336451, 323675, 412786, 405185, 532867, 511153, 324219, 320159, 146035, 262949, 343492, 340107, 561430, 502298, 635471, 647751, 567783, 670226, 510948, 487384, 594193, 639778, 602964, 418756, 513810, 675744, 659583, 536972, 548146, 602447, 648047, 734472, 706909, 547808, 662179, 713648, 709038, 801629, 934767, 746885]
2113G46885n7895m4828J69380J76814j04534j75552J00766J03566L8167j09916
2103H42853J52386M2386L9351j0261L4998K55511L2650j55858k3973j792M3024
2092A251275l9651o8599P5656o2542J52293L7401R6294J41613l267k9730l4109
2081A516634L157M8667j50469J25352O1932j40564q9440K49212J11320o0577J20599
2070A795823o0697j26181j4330k5006K1993J84816n312J58123k5J47418J28961
2059B205583N6096K28258j59496j38607R4834J11519J05469o5624P7034n7936
2049B457130L01254K71216M6337p3021l8562J11919l0923L11921k234K75667J51630
2038C782334J93564K67615q0730K3087L08894L48803J53591j64230J034J3740
$$ y = [746885, 688990, 644162, 813542, 990356, 885822, 710270, 811036, 914602, 952769, 842853, 995239, 1037625, 1076976, 1066715, 1101713, 1357224, 1389874, 1234016, 1210043, 1208251, 1251275, 1211624, 1143025, 1218681, 1156139, 1308432, 1345833, 1442127, 1583740, 1580473, 1550743, 1516634, 1519791, 1568458, 1417989, 1543341, 1605273, 1464709, 1375269, 1624481, 1735801, 1675224, 1795823, 1735126, 1608945, 1594615, 1569609, 1591602, 1776418, 1771106, 1929229, 1929204, 2076622, 2205583, 2261679, 2489937, 2330441, 2191834, 2286668, 2398187, 2503656, 2438032, 2515066, 2457130, 2758384, 3029600, 3075937, 3002916, 2964354, 3076273, 3045350, 3357271, 3355037, 3630704, 3782334, 3975898, 4243513, 4162783, 4185870, 4494764, 4843567, 4997158, 4832928, 4833962, 4847702]
2028D847702L46532L51932L02396K34298K18284L39974L13156L50384L47715J51183
2018G803556K89548N37162M07107L78712N52034Q35953N50786O57352R67429Q83602
2008A3863241Q79325J768897J674904J188182J094557J100754J559124J972817
2000B5101801K476144K835412K875989L247213L453276N461664Q295226J1915092
1992F5661817J2442687N934059m889872j3677556j5440513j1818619p489104n802993
1984B4919906l903182k787042k106113j801999j532774q88707o43410o79247n63648
1975A0013784p97925o27604q92158p13663m19309n37911m73969k87742j31992
1966E131511k99815l20754j92193j74096j55785k00365n4955j34097k45936l56143
$$ y = [4847702, 5194234, 5546166, 5848562, 6082860, 6301144, 6641118, 6954274, 7304658, 7652373, 7803556, 8093104, 8630266, 9037373, 9416085, 9968119, 10804072, 11354858, 12012210, 12979639, 13863241, 14742566, 16511463, 18186367, 19374549, 20469106, 21569860, 23128984, 25101801, 27577945, 30413357, 33289346, 36536559, 39989835, 45451499, 53746725, 65661817, 78104504, 84038563, 79148691, 65471135, 50030622, 38212003, 30722899, 24919906, 21016724, 18229682, 16123569, 14321570, 12788796, 11900089, 11256679, 10577432, 10013784, 9215859, 8588255, 7696097, 6982434, 6563125, 6025214, 5551245, 5263503, 5131511, 4831696, 4510942, 4318749, 4144653, 3988868, 3788503, 3733548, 3599451, 3353515, 2997372]
1956B997372q0544o1100j08684O280j15043j41590J11324k05698l83103J08953
1946B128167j7858j15794q5157j9652m2192j49132O0757K5789j35495p3473j83704
1935A392256P5646J79014J100k4920p932j74954J42981j02973n3044j60662o3106
1924A203406K09847n4173j70554P1792k64439J84843Q743p3920q389R5260p5721
1913A126695j90033P0494j88086O3169R8740k32050m8322n2263J50166k0416K17362
1902I95456k2535j87749O0951l34947Q4365L7948k08226L2830K11814j5276k14894
1891D39737p5643P9416O3048j6284n9184O0295N9397k62568O8411O7138n8532
1880C65231r2527J37022J23744p9202J8570R4136J2006k70441p1658P3002J15724
$$ y = [2997372, 2916828, 2855728, 2747044, 2753324, 2638281, 2496691, 2608015, 2402317, 2019214, 2128167, 2110309, 1994515, 1909358, 1889706, 1847514, 1698382, 1759139, 1784928, 1649433, 1575960, 1392256, 1467902, 1646916, 1648016, 1623096, 1615164, 1440210, 1583191, 1480218, 1427174, 1266512, 1203406, 1413253, 1359080, 1188526, 1260318, 995879, 1180722, 1189465, 1115545, 1107156, 1202416, 1126695, 936662, 1007156, 819070, 882239, 980979, 748929, 700607, 648344, 798510, 778094, 995456, 972921, 785172, 846123, 511176, 595541, 633489, 425263, 458093, 669907, 654631, 439737, 364094, 443510, 506558, 490274, 431090, 491385, 550782, 288214, 356625, 423763, 365231, 272704, 409726, 533470, 454268, 472838, 566974, 578980, 308539, 236881, 309883, 425607]
1869D25607Q1529q5139J6720P3323j78385J0899o8540j87624N1430K46723n7674
1858C28869o8013q158N260j02928j0218j15425J15932m2433J08682j60360N2957
1847A04165j07120J27891P2223m1473R8562l3024j30445p6628J47320J16949m12519
1836a34099k82061K95288K49379K09291k30332Q4526j9261J72525k6119j47837
1826A71300j30376M0824K54248l22707j75498m7382J16980J99695k75046R0294
1816g7668m3145n3096N6884L1546J63559j27194J679j71674j40401J95828N9024
1805a04658J92503J14196K8255o5775o499j4331j39468m4672J49723l763K3729
1794A29240n8030j9800j3292q2389J56129o1144n2765m014q8858J25522J10319
$$ y = [425607, 507136, 421997, 438717, 512040, 333655, 344554, 276014, 88390, 139820, 386543, 328869, 260856, 252698, 257958, 155030, 144812, 29387, 145319, 102886, 211568, 51208, 104165, -2955, 124936, 197159, 155686, 254248, 221224, 90779, 14151, 161471, 278420, -134099, -416160, -120872, 128507, 337798, 107466, 191992, 172731, 345256, 319137, 171300, 40924, 81748, 335996, 13289, -162209, -209591, -92611, 107084, -167962, -77668, -120813, -173909, -117025, -85479, 78080, -49114, -47435, -219109, -359510, -163682, -104658, 87845, 202041, 230296, 164521, 158022, 143691, 4223, -40449, 109274, 105511, 129240, 71210, 51410, 38118, -44271, 111858, 50714, -2051, -6065, -94923, 30599, 140918]
1783A40918J3986O8561q1220m6984j04162K8846J35776q6438j13589N8898K0347
1772C4939o6304l8569j05185J5109K66277n9029j07872l0780j38165K28275J85856
1761A84552j41945n9709o7254p4637J62184n4054J26445J31825j35696J36789
1751B08500l6185J07890j26913k02066M7573J60564m121j18835Q5551O012K7345
1740A55315l11316j11985K56675M6788k06276N7754L08351Q513m9943J24556J20814
$$ y = [140918, 154904, 223465, 142245, 95261, -8901, 19945, 155721, 69283, -44306, 14592, 34939, -31365, -69934, -175119, -160010, 106267, 47238, -60634, -91414, -229579, -1304, 184552, 42607, -17102, -84356, -158993, 3191, -50863, 75582, 207407, 71711, 208500, 172315, 280205, 153292, -48774, -1201, 159363, 155242, 36407, 121958, 127970, 155315, -156001, -267986, -11311, 35477, -170799, -113045, 195306, 203819, 153876, 278432, 399246]
$$ [...]
##END NTUPLES=NMR SPECTRUM
##END=
