##TITLE=1H_CG-1179-ocI
 DMSO
 8 sc, 
 2.11.2023
##JCAMPDX= 6.0         $$ Bruker NMR JCAMP-DX V2.0
##DATA TYPE= NMR SPECTRUM
##DATA CLASS= NTUPLES
##ORIGIN= UXNMR, Bruker Analytische Messtechnik GmbH
##OWNER= root
$$ XWIN-NMR		Version 3.5
$$ Thu Nov  2 13:07:49 2023 Russian Standard Time (UT+4h)  she@DPX200
##.OBSERVE FREQUENCY= 200.13135
##.OBSERVE NUCLEUS= ^1H
##.ACQUISITION MODE= SIMULTANEOUS
##.ACQUISITION SCHEME= undefined
##.AVERAGES= 8
##.DIGITISER RES= 18
##SPECTROMETER/DATA SYSTEM= spect
##.PULSE SEQUENCE= zg30
##.SOLVENT NAME= DMSO
##.SHIFT REFERENCE= (INTERNAL, DMSO, 0, 15.748)
##AUDIT TRAIL= $$ (NUMBER, WHEN, WHO, WHERE, WHAT)
$$ ##TITLE= Audit trail, XWIN-NMR		Version 3.5
$$ ##JCAMPDX= 5.01
$$ ##ORIGIN= Bruker BioSpin GmbH
$$ ##OWNER= she
$$ F:/spectra/data/she/nmr/H-F/1/pdata/1/auditp.txt
$$ ##AUDIT TRAIL=  $$ (NUMBER, WHEN, WHO, WHERE, WHAT)
(   1,<2023-11-02 13:06:11.71 +0400>,<she>,<DPX200>,
      <created by zg, POWCHK disabled, PULCHK disabled
       configuration hash MD5:
       00 E9 B6 7A A2 85 ED C7 34 08 36 98 17 FE 4E 26
       data hash MD5: 16K
       29 90 68 B6 5C 90 BE 3E 39 63 0E 05 6D 66 0A A7>)
(   2,<2023-11-02 13:06:14.01 +0400>,<she>,<DPX200>,
      <Start of raw data processing
       efp BC_mod = 2 LB = 0.24 FT_mod = 6 PKNL = 1 PHC0 = -23872.54 PHC1 = 9.452703 SI = 16K 
       data hash MD5: 16K
       9E AE B1 C7 81 ED 02 87 DB 89 63 D1 46 01 86 AB>)
(   3,<2023-11-02 13:06:49.25 +0400>,<she>,<DPX200>,
      <pk PHC0 = -5.029879 PHC1 = 1.200001 
       data hash MD5: 16K
       C1 A6 73 04 F4 9D A2 2E B0 1B B1 A1 F6 CC 5A 06>)
(   4,<2023-11-02 13:06:53.40 +0400>,<she>,<DPX200>,
      <abs ABSG = 5 
       data hash MD5: 16K
       AD F5 11 B0 C1 E4 4C DA DA 65 EA 38 F1 F4 E1 8F>)
$$ ##END=
$$ 
$$ hash MD5
$$ A1 90 DD 04 65 23 D0 39 D1 26 DB 3C 8E 37 B6 C5
##$RELAX= 
##$RELAX= 
##$RELAX= 
##$RELAX= 
##$RELAX= 
##$RELAX= 
$$ Bruker specific parameters
$$ --------------------------
##$DU= <F:/spectra>
##$EXPNO= 1
##$NAME= <H-F>
##$PROCNO= 1
##$TYPE= <nmr>
##$USER= <she>
##$AMP= (0..31)
100 100 100 100 100 100 100 100 100 100 100 100 100 100 100 100 100 100 
100 100 100 100 100 100 100 100 100 100 100 100 100 100 
##$AQSEQ= 0
##$AQ_mod= 1
##$AUNM= <au_zg>
##$AUTOPOS= <>
##$BF1= 200.13
##$BF2= 200.13
##$BF3= 200.13
##$BF4= 200.13
##$BF5= 200.13
##$BF6= 200.13
##$BF7= 200.13
##$BF8= 200.13
##$BYTORDA= 1
##$CFDGTYP= 0
##$CFRGTYP= 5
##$CHEMSTR= <none>
##$CNST= (0..31)
1 1 145 1 1 1 1 1 1 1 1 1 1 1 1 1 1 1 1 1 1 1 1 1 1 1 1 1 1 1 1 1 
##$CPDPRG= <>
##$CPDPRG1= <>
##$CPDPRG2= <>
##$CPDPRG3= <>
##$CPDPRG4= <mlev>
##$CPDPRG5= <mlev>
##$CPDPRG6= <mlev>
##$CPDPRG7= <mlev>
##$CPDPRG8= <mlev>
##$CPDPRGB= <>
##$CPDPRGT= <>
##$D= (0..31)
0 1.2 0 0 0 0 0 0 0 0.06 0 0.03 0 0 0 0 0.0002 0 0 0 0 0 0 0 0 0 0 0 0 
0 0 0 
##$DATE= 1698915971
##$DBL= (0..7)
120 120 120 120 120 120 120 120 
##$DBP= (0..7)
150 150 150 150 150 150 150 150 
##$DBP07= 0
##$DBPNAM0= <>
##$DBPNAM1= <>
##$DBPNAM2= <>
##$DBPNAM3= <>
##$DBPNAM4= <>
$$ [...]
##$SUBNAM3= <"">
##$SUBNAM4= <"">
##$SUBNAM5= <"">
##$SUBNAM6= <"">
##$SUBNAM7= <"">
##$SUBNAM8= <"">
##$SUBNAM9= <"">
##$SW= 18.05172834244
##$SWIBOX= (0..15)
0 0 2 0 0 0 0 0 0 0 0 0 0 0 0 0 
##$SW_h= 3612.71676300578
##$TD= 16384
##$TD0= 1
##$TE= 0
##$TE2= 300
##$TE3= 300
##$TEG= 300
##$TL= (0..7)
0 120 120 120 120 120 120 120 
##$TP= (0..7)
150 150 150 150 150 150 150 150 
##$TP07= 0
##$TPNAME0= <>
##$TPNAME1= <>
##$TPNAME2= <>
##$TPNAME3= <>
##$TPNAME4= <>
##$TPNAME5= <>
##$TPNAME6= <>
##$TPNAME7= <>
##$TPOAL= (0..7)
0.5 0.5 0.5 0.5 0.5 0.5 0.5 0.5 
##$TPOFFS= (0..7)
0 0 0 0 0 0 0 0 
##$TUNHIN= 0
##$TUNHOUT= 0
##$TUNXOUT= 0
##$USERA1= <user>
##$USERA2= <user>
##$USERA3= <user>
##$USERA4= <user>
##$USERA5= <user>
##$V9= 5
##$VALIST= <valist>
##$VCLIST= <CCCCCCCCCCCCCCC>
##$VD= 0
##$VDLIST= <DDDDDDDDDDDDDDD>
##$VPLIST= <PPPPPPPPPPPPPPP>
##$VTLIST= <TTTTTTTTTTTTTTT>
##$WBST= 1024
##$WBSW= 4
##$XGAIN= (0..3)
0 0 0 0 
##$XL= 0
##$YL= 0
##$YMAX_a= 130682
##$YMIN_a= -147597
##$ZGOPTNS= <>
##$ZL1= 120
##$ZL2= 120
##$ZL3= 120
##$ZL4= 120
##$ABSF1= 15.65985
##$ABSF2= -2.391997
##$ABSG= 5
##$ABSL= 3
##$ALPHA= 0
##$AQORDER= 0
##$ASSFAC= 0
##$ASSFACI= 0
##$ASSFACX= 0
##$ASSWID= 0
##$AUNMP= <proc_1d>
##$AZFE= 0.1
##$AZFW= 0.1
##$BCFW= 0
##$BC_mod= 2
##$BYTORDP= 0
##$COROFFS= 0
##$CY= -3
##$DATMOD= 1
##$DC= 0
##$DFILT= <>
##$DTYPP= 0
##$F1P= 0
##$F2P= 0
##$FCOR= 1
##$FTSIZE= 16384
##$FT_mod= 6
##$GAMMA= 0
##$GB= 0
##$INTBC= 1
##$INTSCL= 3.70164e-10
##$ISEN= 128
##$LB= 0.24
##$LEV0= 0
##$LPBIN= 0
##$MAXI= 10000
##$MC2= 0
##$MEAN= 0
##$ME_mod= 0
##$MI= 1.114404
##$NCOEF= 0
##$NC_proc= -7
##$NLEV= 6
##$NOISF1= 3.799351
##$NOISF2= 2.8
##$NSP= 0
##$NTH_PI= 0
##$NZP= 0
##$OFFSET= 15.74799
##$PC= 1
##$PHC0= -23877.57
##$PHC1= 10.6527
##$PH_mod= 1
##$PKNL= yes
##$PPARMOD= 0
##$PSCAL= 0
##$PSIGN= 0
##$REVERSE= no
##$SF= 200.130004712897
##$SI= 16384
##$SIGF1= 3
##$SIGF2= 2
##$SINO= 5.538805
##$SIOLD= 16384
##$SREGLST= <1H.CDCl3>
##$SSB= 0
##$STSI= 16384
##$STSR= 0
##$SW_p= 3612.71676300578
##$SYMM= 0
##$S_DEV= 0
##$TDeff= 16384
##$TDoff= 0
##$TI= <>
##$TILT= no
##$TM1= 0
##$TM2= 0
##$TOPLEV= 0
##$USERP1= <user>
##$USERP2= <user>
##$USERP3= <user>
##$USERP4= <user>
##$USERP5= <user>
##$WDW= 1
##$XDIM= 16384
##$YMAX_p= 273644894
##$YMIN_p= -1135463
$$ End of Bruker specific parameters
$$ ---------------------------------
##NTUPLES= NMR SPECTRUM
##VAR_NAME=  FREQUENCY,     SPECTRUM/REAL,   SPECTRUM/IMAG
##SYMBOL=    X,             R,               I
##VAR_TYPE=  INDEPENDENT,   DEPENDENT,       DEPENDENT
##VAR_FORM=  AFFN,          ASDF,            ASDF
##VAR_DIM=   16384,         16384,           16384
##UNITS=     HZ,            ARBITRARY UNITS, ARBITRARY UNITS
##FACTOR=    0.220516191357247, 1,           1
##FIRST=     3151.64524378195, 0,            0
##LAST=      -461.071519223834, 0,           0
##MIN=       -461.071519223834, -1135463,    0
##MAX=       3151.64524378195, 273644894,    0
$$ Real data points
##PAGE= N=1
##DATA TABLE= (X++(R..R)), XYDATA
$$ [...]
$$ plain form
8192 -1135463 -302015 1109025 482446 712297 328382 203883 61100 133215 300236 329261
8182 329261 357381 275422 172748 -12375 230330 278608 273832 257224 306738 192166 220330
8171 220330 301149 43618 -221685 -65162 9565 -119133 85829 73357 289753 77682
8161 77682 402 180519 154869 117535 -105875 5068 4039 -170631 -64697 -13309 207695
8150 207695 173759 103387 -34145 -49599 -49937 -267452 -82247 66051 72066 -44450 -155901
8139 -155901 29869 165888 -97091 -101695 -88113 138108 -57788 -192185 -357526 -185782
8129 -185782 34845 -73 294156 440951 53467 -99839 127127 53837 -26939 -214920
8119 -214920 177247 172035 50933 194997 21807 -82832 -190732 -213649 -203980 -83041 -66442
$$ packed form
8192a135463Q33448J411040o26579K29851l83915j24499j42783P2115J67021K9025
8182C29261K8120q1959j02674j85123K42705M8278m776j6608M9514j14572K8164
8171B20330Q0819k57531k65303J56523P4727j28698K04962j2472K16396k12071
8161G7682p7280J80117k5650l7334k23410J10943j029j74670J05934N1388K21004
8150B07695l3936p0372j37532j5454l38k17515J85205J48298O015j16516j11451
8139a55901J85770J36019k62979m604J3582K26221j95896j34397j65341J71744
8129a85782K20627l4918K94229J46795l87484j53306K26966p3290q0776j87981
8119b14920L92167n212j21102J44064j73190j04639j07900k2917R669J20939J6599
$$ plain form
8108 -66442 -93618 58251 174865 213192 74057 -88224 -190113 -296525 -54160 221345
8098 221345 285316 20688 -109877 -54720 126588 412814 374250 231325 185908 150419 175573
8087 175573 136776 -33068 -136822 -203490 -67560 17022 -161280 -224767 -367165 -290639 -130717
8076 -130717 -305460 -80010 11300 -10640 236502 110141 -155096 -137824 -168332 -26589
8066 -26589 162663 -109555 -116771 -58626 67081 -27755 144139 -31200 -122482 8541 30597
8055 30597 -59869 -5752 -88973 -275968 -180896 -2849 -70627 -218579 -167812 -96194 153838
8044 153838 -114601 -120270 -54256 132773 182010 105682 -82816 -111800 72907 194047 41508
8033 41508 -34616 -231106 -160849 30522 47849 7961 -82352 -29173 44901 -130978 -113580
$$ packed form
8108f6442k7176J51869J16614L8327j39135j62281j01889j06412K42365K75505
8098B21345O3971k64628j30565N5157J81308K86226l8564j42925m5417l5489K5154
8087A75573l8797j69844j03754o6668J35930Q4582j78302o3487j42398P6526J59922
8076a30717j74743K25450R1310k1940K47142j26361k65237J7272l0508J41743
8066b6589J89252k72218p216N8145J25707r4836J71894j75339r1282J31023K2056
8055C0597r0466N4117q3221j86995R5072J78047o7778j47952N0767P1618K50032
8044A53838k68439n669O6014J87029M9237p6328j88498k8984J84707J21140j52539
8033D1508p6124j96490P0257J91371J7327l9888r0313N3179P4074j75879J7398
$$ plain form
8022 -113580 -271533 -303248 -173617 -217863 -34497 9318 -96285 -51940 11114 -41404 -116333
8011 -116333 -90522 -138054 116496 -47634 -44568 11183 21710 79048 76568 60799 -122089
8000 -122089 -97743 -176024 1783 -18219 101315 -16690 -151430 -157170 -207247 -168917 -97369
7989 -97369 -97780 -205058 -87667 -133348 -118534 145225 76994 90972 -84703 -292278 -149988
7978 -149988 -92990 -79154 -222028 -392578 156501 80217 -35422 -109766 -191544 -145816 22020
7967 22020 -273211 -186896 -30440 -235381 -64558 -83594 -188830 -213586 -1278 -137856
7957 -137856 -194086 -66647 -41019 -252071 -167643 3776 61180 -313632 -441634 -381114 -310059
7946 -310059 -148867 -81080 198380 7929 -258171 -63465 -165234 -140236 -155061 -84164
$$ packed form
8022a13580j57953l1715J29631m4246J83366M3815j05603M4345O3054n2518p4929
8011a16333K5811m7532K54550j64130L066N5751J0527N7338k480j5769j82888
8000a22089K4346p8281J77807k0002J19534j18005j34740n740n0077L8330P1548
7989i7369m11j07278J17391m5681J4814K63759o8231J3978j75675k07575J42290
7978a49988N6998J3836j42874j70550N49079p6284j15639p4344q1778M5728J67836
7967B2020k95231Q6315J56456k04941J70823j9036j05236k4756K12308j36578
7957a37856n6230J27439K5628k11052Q4428J71419N7404l74812j28002O0520P1055
7946c10059J61192O7787K79460j90451k66100J94706j01769K4998j4825P0897
$$ plain form
7936 -84164 134378 -40425 -168682 -103205 -232531 -59104 -328973 -402318 -265967 -235787
7926 -235787 77809 -197065 -41942 -250131 -366437 -227221 -144429 -152189 -143770 -190270 -171768
7915 -171768 -125084 -59345 133507 -49257 -231787 -315194 -112358 98479 24419 119134 54602
7904 54602 -237283 -258191 -261216 -316214 -152884 -190100 -143603 23982 -72159 -2553 -29472
7893 -29472 -167219 17110 -117773 -284324 -251861 -44878 85247 3612 123886 280315
7883 280315 2066 -107325 -187321 -298789 -172872 -238191 15281 -246361 -339447 -189567
7873 -189567 -25183 -128053 -12544 -16239 61807 -33711 -95841 48204 154774 -132171 -125044
7862 -125044 38858 -159649 -402654 -364816 -116143 111705 114210 -147374 -185329 -75124
$$ packed form
7936h4164K18542j74803j28257O5477j29326J73427k69869p3345J36351L0180
7926b35787L13596k74874J55123k08189j16306J39216Q2792p760Q419m6500J8502
7915a71768M6684O5739J92852j82764j82530q3407K02836K10837p4060R4715o4532
7904E4602k91885k0908l025n4998J63330l7216M6497J67585r6141O9606k6919
7893b9472j37747J84329j34883j66551L2463K06983J30125q1635J20274J56429
7883B80315k78249j09391p9996j11468J25917o5319K53472k61642r3086J49880
7873a89567J64384j02870J15509l695P8046r5518o2130J44045J06570k86945P127
7862a25044J63902j98507k43005L7838K48673K27848K505k61584l7955J10205
$$ plain form
7852 -75124 -84285 -152410 -119538 18153 203622 351187 204077 -8285 -128678 -166319 -422222
7841 -422222 -314992 -110257 -364908 -214638 -114655 -49920 -213725 -32200 -56470 -8433
7831 -8433 -137539 -204398 -232494 -138952 -260215 -292526 -510064 -216557 -158843 -49980 152966
7820 152966 -103296 -50776 -346567 -442526 -423015 -32657 246121 3158 24128 116781 182572
7809 182572 -100902 -199760 -22750 -78088 -313533 -157108 -208404 -263748 -190330 -65790 5149
7798 5149 76383 -127166 -6446 -19981 -182775 -191091 -91575 45179 -250563 -367726 -356075
7787 -356075 -171983 -150493 -164602 -266238 -151666 -196748 -222064 -184001 -32828 26081 -84964
7776 -84964 -200008 -422269 -570582 -250573 -91511 -236990 -371373 -366057 -423336 -262676
$$ packed form
7852g5124r161o8125L2872J37691J85469J47565j47110k12362j20393l7641k55903
7841d22222J07230K04735k54651J50270R9983O4735j63805J81525k4270M8037
7831h433j29106o6859k8096R3542j21263l2311k17538K93507N7714J08863K02946
7820A52966k56262N2520k95791r5959J9511L90358K78778k42963K0970R2653O5791
7809A82572k83474r8858J77010n5338k35445J56425n1296n5344P3418J24540P0939
7798E149P1234k03549J20720j3535j62794q316R9516J36754k95742j17163J1651
7787c56075J84092K1490j4109j01636J14572m5082k5316L8063J51173N8909j11045
7776h4964j15044k22261j48313L20009J59062j45479j34383N316n7279J60660
$$ plain form
7766 -262676 -273721 -134766 -52426 -67723 -382170 -293093 -96027 -105337 -78515 8223 60849
7755 60849 -47377 -192636 -189695 -164553 -2236 -265278 -381725 6341 -50102 24020 4164
7744 4164 -143788 -122652 -219882 -173392 -102638 -208584 -410972 -204913 54160 17328 12785
7733 12785 -116734 -31675 -114182 -322612 -125023 -62425 -79829 -261971 -320142 -349214 -222242
7722 -222242 -208108 -311135 -19725 165563 167901 -148858 -480464 -462118 -215048 -119422 -178572
7711 -178572 -439058 -177975 47291 130752 -47200 -202034 -427843 -68131 -12994 -143804
7701 -143804 -138631 -59770 -22409 -143222 -266758 -176918 -26334 -224662 39450 23943 165471
7690 165471 178116 66985 9795 -49944 99988 20511 -325162 -142923 9800 -58207 -134510
$$ packed form
7766b62676j1045J38955Q2340j5297l14447Q9077J97066r310K6822Q6738N2626
7755F0849j08226j45259K941K5142J62317k63042j16447L88066n6443P4122j9856
7744D164j47952K1136r7230M6490P0754j05946k02388K06059K59073l6832m543
7733A2785j29519Q5059q2507k08430J97589O2598j7404j82142n8171k9072J26972
7722b22242J4134j03027K91410J85288K338l16759l31606J8346K47070R5626n9150
7711a78572k60486K61083K25266Q3461j77952j54834k25809L59712N5137j30810
7701a43804N173P8861L7361j20813j23536Q9840J50584j98328K64112j5507J41528
7690A65471J2645j11131n7190n9739J49932p9477l45673J82239J52723o8007p6303
$$ plain form
7679 -134510 -253413 -404987 -293117 -67297 -85101 -25466 -10417 -71063 -297731 -190270
7669 -190270 -195405 61411 18705 -26949 70773 -10839 -28174 45263 -22176 -235641 -218633
7658 -218633 -229925 -297930 -12840 112686 -22431 -105353 -184241 5187 -3156 -48342 -251669
7647 -251669 -107717 -34787 -162882 -159762 -309246 -335186 -236955 -307123 -229910 -217189 -245185
7636 -245185 1242 4960 228353 173467 -258281 -354485 -429387 -446614 -531704 -400506 -318775
7625 -318775 -54199 -14414 -280825 81212 -16421 -307288 -89595 -244690 -419228 -376676
7615 -376676 -162310 -224617 -212778 -73876 -394294 -257884 -361733 -76466 24869 112211
7605 112211 -133299 -253128 -87598 -213840 -192567 -86078 177148 226088 75479 -138804
$$ packed form
7679a34510j18903j51574J11870K25820j7804N9635J5049o0646k26668J07461
7669a90270n135K56816m2706m5654R7722q1612j7335P3437o7439k13465J7008
7658b18633j1292o8005K85090J25526j35117q2922p8888J89428q343m5186k03327
7647b51669J43952P2930j28095L120j49484k5940R8231p0168P7213J2721k7996
7636b45185K46427L718K23393n4886m31748r6204p4902j7227q5090J31198Q1731
7625c18775K64576L9785k66411L62037r7633k90867K17693j55095j74538M2552
7615c76676K14366o2307J1839J38902l20418J36410j03849K85267J01335Q7342
7605A12211k45510j19829J65530j26242K1273J06489K63226M8940j50609k14283
$$ plain form
7595 -138804 -355795 -413713 -321291 -310729 -139314 -144657 -105340 -67100 -198793 -294945 -301711
7584 -301711 -345263 -157678 -72657 -135172 -212776 40954 -106215 -55170 -92264 -307864 -219597
7573 -219597 -86958 -189160 -187118 -201315 -171159 -197961 -152411 -32137 -130461 -12711 -16819
7562 -16819 -257028 -97768 25859 -191052 -185160 -123108 -276805 -179612 182609 322270 85307
7551 85307 -162100 -160365 -257757 -163380 -281379 -350442 -213112 -94976 -251506 -158480 -388801
7540 -388801 -292034 -51648 -192397 -300898 -137291 -4507 -99961 13516 -23584 -202279
7530 -202279 -358948 -402282 -144565 -65908 -40260 -147622 -83519 -18657 43433 -115647 -182024
7519 -182024 -132741 -400486 -375221 -327977 -368541 -106733 -43547 -338871 -334571 -381868 -458592
$$ packed form
7595a38804k16991n7918R2422J0562J71415n343L9317L8240j31693r6152o766
7584c01711m3552J87585Q5021o2515p7604K53730j47169N1045l7094k15600Q8267
7573b19597J32639j02202K042j4197L0156k6802M5550J20274r8324J17750m108
7562a6819k40209J59260J23627k16911N892O2052j53697R7193L62221J39661k36963
7551H5307k47407J735r7392R4377j17999o9063J37330J18136j56530R3026k30321
7540c88801R6767K40386j40749j08501J63607J32784r5454J13477l7100j78695
7530b02279j56669m3334K57717P8657K5648j07362O4103O4862O2090j59080o6377
7519a82024M9283k67745K5265M7244m0564K61808O3186k95324M300m7297p6724
$$ plain form
7508 -458592 -416356 -275222 -161802 -78387 -109039 -176857 -142718 -286070 -206796 -185404 -361576
7497 -361576 -77681 -153085 -111391 -197793 -136407 -16593 -12383 -232789 -261699 -253142 -323742
7486 -323742 -399195 -275784 -194272 -264516 -49331 -164101 -108441 -3751 -105521 -105497 -143350
7475 -143350 -87025 -434279 -133673 137729 -568 -129945 -306133 -174690 -186773 -238074
7465 -238074 -248267 -218671 -151898 -80904 -223837 -334581 -396548 -233002 -268880 -464927 -291879
7454 -291879 -161442 -50549 146704 -50334 -125474 -247565 -373468 -304186 -129818 -79225
7444 -79225 -132385 -142041 -135431 -160005 172828 130376 284587 491422 123633 -35387 -144402
7433 -144402 -54223 -83770 -173660 -226576 132874 393439 275675 49070 -150585 -138341 -301334
$$ packed form
7508d58592M2236J41134J13420Q3415l0652o7818L4139j43352P9274K1392j76172
7497c61576K83895p5404M1694q6402O1386J19814M210k20406k8910Q557p0600
7486c23742p5453J23411Q1512p0244K15185j14770N5660J04690j01770K4l7853
7475a43350N6325l47254L00606K71402j38297j29377j76188J31443j2083n1301
7465b38074j0193K9596O6773P0994j42933j10744o1967J63546l5878j96047J73048
7454b91879J30437J10893J97253j97038p5140j22091j25903O9282J74368N0593
7444g9225n3160r656O610k4574L32833m2452J54211K06835l67789j59020j09015
7433a44402R0179k9547q9890n2916L59450K60565j17764k26605j99655J2244j62993
$$ plain form
7422 -301334 -202007 -73103 -135348 -115239 98934 45160 -268134 -303782 11909 134110 -15915
7411 -15915 -173465 -210921 -432760 -250639 -182064 -179335 -15622 184075 19123 -139529 -130140
7400 -130140 -191447 -98811 -169959 -241005 -202459 -7425 12964 37845 -77345 86617 26726
7389 26726 -108732 -273369 -316392 -242790 -191291 -30232 -26077 -160381 -291445 -83656 -107006
7378 -107006 7635 145988 99435 52872 -78028 -233689 -361483 -206893 -158249 -82404
7368 -82404 67197 -20305 -132213 -142091 -185054 -32808 143380 100250 93100 -145846 7470
7357 7470 -182217 -251761 -225146 -199552 -279485 58030 -246055 -440116 -229400 -215770 -181573
7346 -181573 -261306 -144461 -17977 21762 -104007 -110663 -268765 -195159 -249912 11802 -274992
$$ packed form
7422c01334R9327J28904o2245K0109K14173n3774l13294l5648L15691J22201j50025
7411a5915j57550l7456k21839J82121O8575K729J63713J99697j64952j58652R389
7400a30140o1307R2636p1148p1046L8546J95034K0389K4881j15190J63962n9891
7389B6726j35458j64637m3023P3602N1499J61059M155j34304j31064K07789k3350
7378a07006J14641J38353m6553m6563j30900j55661j27794J54590M8644P5845
7368h2404J49601q7502j11908r878m2963J52246J76188m3130p150k38946J53316
7357G470j89687o9544K6615K5594p9933L37515l04085j94061K10716J3630L4197
7346a81573p9733J16845J26484L9739j25769o656j58102P3606n4753K61714k86794
$$ plain form
7335 -274992 -198859 -44933 67153 -21666 82190 -2594 -74932 145603 219382 -98932 -114193
7324 -114193 -192057 -226508 -91261 -43087 107251 243438 171610 57941 -180760 -41873
7314 -41873 -136412 -46910 -78869 -275189 -184142 -179225 -217131 69405 104322 22810 -146932
7303 -146932 -41749 -52101 -39216 128611 -291175 -412313 -340369 -208645 15850 235511
7293 235511 273941 332465 9360 -92609 -172659 -190499 -355510 -232754 -374819 -93332
7283 -93332 -155206 66629 -227764 -378328 -191565 173872 -107265 -121032 3938 -368711
7273 -368711 -207206 -418186 -100919 -112798 -193446 -182911 -195125 43247 -60504 -406700
7263 -406700 -563202 -176481 -3624 -213994 -73439 -55405 -181611 -144720 -304525 -227221
$$ packed form
7335b74992P6133J53926J12086q8819J03856q4784p2338K20535P3779l18314j5261
7324a14193p7864l4451J35247M8174J50338J36187p1828j13669k38701J38887
7314d1873r4539Q9502l1959j96320R1047M917l7906K86536L4917q1512j69742
7303a46932J05183j0352J2885J67827m19786j21138P1944J31724K24495K19661
7293B35511L8430N8524l23105j01969q0050j7840j65011J22756j42065K81487
7283i3332o1874K21835k94393j50564J86763L65437k81137j3767J24970l72649
7273c68711J61505k10980L17267j1879q0648J0535j2214K38372j03751l46196
7263d06700j56502L86721J72857k10370J40555J8034j26206L6891j59805P7304
$$ plain form
7253 -227221 3910 154354 -22217 -197816 -10588 64774 68620 -290030 -203649 9360
7243 9360 -193012 -278427 -171204 -294595 -464382 -307717 -290814 -146065 -130598 -9789 128458
7232 128458 81543 11020 27988 -122963 -153262 -112905 -46775 -198669 -223113 -21361 -67877
7221 -67877 -66738 -109214 -106905 -363504 -94912 -45821 -246831 -210734 25102 67156 -62372
7210 -62372 -380945 -291442 -402102 -225204 26961 -76574 -9391 -90333 53568 38453 -84152
7199 -84152 -278916 -324734 -65379 -130579 -140904 73641 89678 -68804 -140250 -79471 -101526
7188 -101526 104608 -26870 -217286 -200725 -300695 -399983 -431300 -151262 -200062 -176857 -34531
7177 -34531 -280366 -215858 -280921 -155848 -78081 -314246 -384387 -332572 -416697 -364588 -296031
$$ packed form
7253b27221K31131J50444j76571j75599J87228P5362L846l58650Q6381K13009
7243I360k02372q5415J07223j23391j69787J56665J6903J44749J5467J20809J38247
7232A28458m6915p0523J6968j50951l0299M0357O6130j51894k4444K01752m6516
7221f7877J139m2476K309k56599K68592M9091k01010L6097K35836M2054j29528
7210f2372l18573Q9503j10660J76898K52165j03535O7183q0942J43901j5115j22605
7199h4152j94764m5818K59355o5200j0325K14545J6037j58482p1446O0779k2055
7188a01526K06134j31478j90416J6561r9970r9288l1317K80038m8800K3205J42326
7177c4531k45835O4508o5063J25073P7767k36165p0141N1815q4125N2109O8557
$$ plain form
7166 -296031 -315796 -277045 -211282 -134883 -318061 -160129 -22913 -30355 -128485 -12252 -24675
7155 -24675 151397 -21437 62437 48774 -99730 -83231 37803 -85442 -254058 -51342
7145 -51342 -206342 -380811 -366701 -175067 -129459 -12375 -35744 117288 99777 26292 -63120
7134 -63120 -43589 -247627 -4065 83020 108077 226196 140633 21851 -234390 54833 -40286
7123 -40286 -257210 93536 232033 90600 177323 233184 -24872 172301 84930 -60685
7113 -60685 -240944 -281672 -188905 96398 -2389 -60652 -232333 -123640 -81645 -409158 -248494
7102 -248494 -187969 -127848 -282345 -70133 -239612 -95481 -84120 54445 174194 235198
7092 235198 56056 128592 53003 -81683 -218823 -161741 -144102 -296920 -220449 -261138 -244909
$$ packed form
7166b96031j9765L8751O5763P6399j83178J57932J37216p442r8130J16233j2423
7155b4675J76072j72834Q3874j3663j48504J6499J21034j23245j68616K02716
7145e1342j55000j74469J4110J91634M5608J17084k3369J53032j7511p3485q9412
7134f3120J9531k04038K43562Q7085K5057J18119q5563j18782k56241K89223r5119
7123d0286k16924L50746J38497j41433Q6723N5861k58056J97173q7371j45615
7113f0685j80259m0728R2767K85303r8787n8263j71681J08693M1995l27513J60664
7102b48494O0525O0121j54497K12212j69479J44131J1361J38565J19749O1004
7092B35198j79142P2536p5589j34686j37140N7082J7639j52818P6471m0689J6229
$$ plain form
7081 -244909 -228625 -193400 28157 159584 43542 200821 319596 184607 69166 183176
7071 183176 82056 35985 -200448 -264578 1570 -113316 -290686 -273143 -242777 31298
7061 31298 90696 79820 -97822 -38060 -121762 -126794 165378 97874 -2706 139715 -2857
7050 -2857 20873 -87876 -99615 -232514 -190945 -189620 -270895 -244021 -181378 107440 20071 -166267
7038 -166267 -182775 -239859 -12257 107767 99472 271606 78759 78184 87515 300323 210713
7027 210713 111791 10712 -51176 98771 101312 258824 102459 64198 190965 -32509 20478
7016 20478 37610 35930 54153 -43778 -99503 -151599 -53575 38444 56179 93706 99733 -17688
7004 -17688 25710 84162 34077 129087 -180950 -310153 -174779 -104321 -453941 -264191 -67667
$$ packed form
7081b44909J6284L5225K21557J31427j16042J57279J18775j34989j15441J14010
7071A83176j01120m6071k36433o4130K66148j14886j77370J7543L0366K74075
7061C1298N9398j0876j77642N9762q3702n032K92172o7504j00580J42421j42572
7050b857K3730j08749j1739j32899M1569J325q1275K6874O2643K88818q7369j86338
7038a66267j6508n7084K27602J20024q295J72134j92847n75R331K12808q9610
7027B10713r8922j01079o1888J49947K541J57512j56365l8261J26767k23474N2987
7016B0478J7132j680J8223r7931n5725n2096R8024R2019J7735L7527O027j17421
7004a7688M3398N8452n0085R5010l10037j29203J35374P0458l49620J89750J96524
$$ plain form
6993 -67667 13916 -99837 34087 -20721 -190988 -279328 -85630 -75249 -184403 -74751 35458
6982 35458 -131968 -276688 -123772 -173410 -197396 -294514 -243312 8543 142913 -109459 -149167
6971 -149167 -12175 47415 -273516 -317377 101909 42752 -248529 46800 87179 125332 67610
6960 67610 -13063 18203 -31474 -176371 75118 -146464 -316209 -336075 -206803 -206563 -219820
6949 -219820 -90804 -167979 -160701 -41227 -137416 -214226 -152462 -248470 -234586 -92378 18219
6938 18219 81081 88283 20592 -266882 -106222 -241025 -72308 53895 108199 14435 -291977
6927 -291977 -343261 -328767 -294627 -131229 -100216 -223731 -36782 7452 -45458 -159471 -24212
6916 -24212 -20606 4855 -129936 -58361 -308314 -442709 -221554 -221539 -205183 -169803 -97832 17181
$$ packed form
6993f7667Q1583j13753J33924n4808j70267q8340J93698J0381j09154J09652J10209
6982C5458j67426j44720J52916m9638k3986r7118N1202K51855J34370k52372l9708
6971a49167J36992N9590l20931m3861M19286n9157k91281K95329M0379L8153n7722
6960F7610q0673L1266m9677j44897K51489k21582j69745j9866J29272K40j3257
6949b19820J29016p7175P278J19474r6189p6810O1764r6008J3884J42208J10597
6938A8219O2862P202o7691k87474J60660j34803J68717J26203N4304r3764l06412
6927b91977n1284J4494L4140J63398L1013j23515J86949M4234n2910j14013J35259
6916b4212L606K5461j34791P1575k49953j34395K21155J5J6356L5380P1971J15013
$$ plain form
6904 17181 91557 265239 91377 197655 205022 334658 633042 397745 107651 -10347
6894 -10347 -70438 13375 -21982 -72131 -72791 60727 40409 -68537 60217 245309 175397
6883 175397 -54182 -142647 -373161 -145728 67728 -62018 144028 -71653 -13885 199681
6873 199681 -142658 -312664 -97329 -135099 -170439 -164459 -209392 -340098 -245639 -25410 41745
6862 41745 -55060 -234073 -166010 -96937 65848 -324676 -284706 -44451 -246199 -206989 -138390
6851 -138390 51274 -149221 -356949 -268473 -13264 -191167 -178974 113470 44149 23932
6841 23932 -1889 -14872 74057 -33476 -60316 -58163 -10691 62287 145308 299456 166352
6830 166352 -22441 -38248 -161450 -296329 -89975 -176885 -316938 -319609 -199049 -135104 -154858
$$ packed form
6904A7181P4376J73682j73862J06278P367J29636K98384k35297k90094j17998
6894a0347o0091Q3813l5357n0149o60J33518k0318j08946J28754J85092o9912
6883A75397k29579q8465k30514K27433K13456j29746K06046k15681N7768K13566
6873A99681l42339j70006K15335l7770l5340N980m4933j30706R4459K20229O7155
6862D1745r6805j79013O8063O9073J62785l90524L9970K40255k01748L9210O8599
6851a38390J89664k00495k07728Q8476K55209j77903J2193K92444o9321k0217
6841B3932k5821j2983Q8929j07533k6840K153M7472P2978Q3021J54148j33104
6830A66352j88793j5807j23202j34879K06354q6910j40053k671J20560O3945j9754
$$ plain form
6819 -154858 -134041 -120464 -91115 156765 -22356 37810 -159270 -222760 24346 -98921 -47863
6808 -47863 42165 125398 237385 -59161 -51493 -99068 -215080 -288702 33929 290248 277780
6797 277780 157982 70865 97204 84026 -10777 -50222 -9032 -48779 -87081 -64759 -127471
6786 -127471 -225134 -6972 -103398 -105888 19542 104 277380 325580 315552 206642 -82558
6775 -82558 180779 111047 403559 580400 422726 408074 477731 28042 -191667 -157671 -49566
6764 -49566 36099 -133259 164354 -188774 -243080 -142384 -764 214105 71566 -57895
6754 -57895 59389 224559 172564 1656 62670 -101416 -22315 93050 -105082 -43869 19782
6743 19782 69492 -32246 201728 -63583 -184022 -108400 38003 139311 159646 112567 316618
$$ packed form
6819a54858K0817J3577K9349K47880j79121O0166j97080o3490K47106j23267N1058
6808d7863R0028Q3233J11987k96546P668m7575j16012p3622L22631K56319j2468
6797B77780j19798q7117K6339j3178r4803l9445M1190l9747l8302K2322o2712
6786a27471r7663K18162r6426k490J25430j9438K77276M8200j0028j08910k89200
6775h2558K63337o9732K92512J76841j57674j4652O9657m49689k19709L3996J08105
6764d9566Q5665j69358K97613l53128n4306J00696J41620K14869j42539j29461
6754e7895J17284J65170n1995j70908O1014j64086P9101J15365j98132O1213O3651
6743A9782M9710j01738K33974k65311j20439P5622J46403J01308K0335m7079K04051
$$ plain form
6732 316618 300819 5301 -67808 25439 -45240 -238173 -139709 -154914 -148337 -187096 -38556
6721 -38556 -95076 -129707 163288 52019 -59824 -224961 -128266 -98516 -138380 -218484 -125084
6710 -125084 44585 -55394 -103971 21767 23610 -46746 -210377 -21780 -115040 -83812 290042
6699 290042 183744 30360 -110846 -62943 27472 -260850 -209475 -86260 -68739 -23083 53502
6688 53502 135066 89342 -28354 -197053 -117045 52030 -6128 -267469 -170472 -202022 -103163
6677 -103163 -234034 -101790 21237 155991 336308 329027 331431 106110 92058 218157 225199
6666 225199 233036 277250 464167 382673 419464 -7460 -68898 -37268 -260799 -192662 63799
6655 63799 157391 47888 -117521 -31269 207557 231604 92985 -83080 -98865 44371 171100
$$ packed form
6732C16618j5799k95518p3109R3247p0679j92933R8464j5205O577l8759J48540
6721c8556n6520l4631K92995j11269j11843j65137R6695K9750l9864q0104R3400
6710a25084J69669r9979m8577J25738J843p0356j63631J88597r3260L1228L73854
6699B90042j06298j53384j41206M7903R0415k88322N1375J23215J7521M5656P6585
6688E3502Q1564m5724j17696j68699Q0008J69075n8158k61341R6997l1550R8859
6677a03163j30871J32244J23027J34754J80317p281K404k25321j4052J26099P042
6666B25199P837M4214J86917q1494L6791m26924o1438L1630k23531O8137K56461
6655F3799R3592j09503j65409Q6252K38826K4047j38619j76065j5785J43236J26729
$$ plain form
6644 171100 -44754 -63029 176837 42176 117395 77888 46745 -42209 -128652 -122848 -147429
6633 -147429 -976 286062 346532 -30940 -25250 -36613 -65110 -43621 -83652 -144988 -377464
6622 -377464 -260252 177846 104494 -8918 -44809 -315978 -252019 -29737 -152558 55254
6612 55254 92955 42842 892 -39306 12679 -103829 49129 178638 213242 35722 -64668
6601 -64668 -39410 -66175 -151514 -130956 -32928 153961 225051 189840 254588 23832 299609
6590 299609 280978 203030 237317 -18501 -76390 152764 83501 -66930 -94831 151693 350088
6579 350088 96946 26164 -68408 -172966 -121808 53550 108312 144691 73953 175541 218020
6568 218020 296816 184451 -87749 -46519 -39416 36401 106599 32203 -215014 62605 175006
$$ packed form
6644A71100k15854j8275K39866j34661P5219l9507l1143q8954q6443N804k4581
6633a47429J46453K87038O0470l77472N690j1363k8497K1489m0031o1336k32476
6622c77464J17212M38098p3352j13412l5891k71169O3959K22282j22821K07812
6612E5254L7701n0113m1950m0198N1985j16508J52958J29509L4604j77520j00390
6601f4668K5258k6765q5339K0558R8028J86889P1090l5211O4748k30756K75777
6590B99609j8631p7948L4287k55818n7889K29154o9263j50431k7901K46524J98395
6579C50088k53142p0782r4572j04558N1158J75358N4762L6379p0738J01588M2479
6568B18020P8796j12365k72200M1230P103P5817P0198p4396k47217K77619J12401
$$ plain form
6557 175006 -16050 -45070 175796 -97624 -96926 -103493 -163821 -152971 -223163 -115198 117456
6546 117456 221959 347044 206751 369621 405149 203125 226003 265902 -876 -67931
6536 -67931 136270 -12967 -136702 -137447 -29483 17232 257577 323153 -23886 -231931 17485
6525 17485 48729 72115 102609 84089 173187 240583 228719 -16905 37703 392643 190400
6514 190400 68207 201445 242934 94897 163500 158785 66897 228688 444428 138368 85659
6503 85659 223269 368807 260400 265892 175383 100783 149268 111667 307413 398590 125023
6492 125023 -25142 122746 -15458 -77670 -1859 -244502 -185949 22334 186341 108911
6482 108911 51862 77175 235824 79448 191908 196026 30851 50098 146323 323675 65074
$$ packed form
6557A75006j91056k9020K20866k73420O98o567o0328J0850p0192J07965K32654
6546A17456J04503J25085j40293J62870L5528k02024K2878L9899k66778o7055
6536f7931K04201j49237j23735p45J07964M6715K40345O5576l47039k08045K49416
6525A7485L1244K3386L0494j8520Q9098O7396j1864k45624N4608L54940k02243
6514A90400j22193J33238M1489j48037O8603m715r1888J61791K15740l06060n2709
6503H5659J37610J45538j08407N492r0509p4600M8485l7601J95746R1177k73567
6492A25023j50165J47888j38204o2212P5811k42643N8553K08283J64007p7430
6482A08911n7049K5313J58649j56376J12460M118j65175J9247R6225J77352k58601
$$ plain form
6471 65074 193695 170027 45981 152284 310979 442028 520920 433612 356547 289510 207952
6460 207952 304959 172452 204122 40030 -40833 -127728 -238559 110109 30678 189649 327237
6449 327237 234562 215753 240729 48450 31956 116078 145157 148898 14963 -64652 123639
6438 123639 308850 142168 306591 550207 384564 202380 248108 243090 433940 359217
6428 359217 296165 580104 551214 390412 363965 499806 617926 548060 501850 586412 594429
6417 594429 599261 426467 580387 608493 486398 604915 437243 298237 293516 516677 858990
6406 858990 826463 522750 475445 528228 535688 644940 507520 556071 735691 705949 679620
6395 679620 915883 933371 793060 647703 631853 620929 649031 535704 507590 513075 765292
$$ packed form
6471F5074J28621k3668j24046J06303J58695J31049P8892q7308p7065o7037q1558
6460B07952R7007j32507L1670j64092q0863q6895j10831L48668p9431J58971J37588
6449C27237r2675j8809K4976j92279j6494Q4122K9079L741j33935p9615J88291
6438A23639J85211j66682J64423K43616j65643j82184M5728n018J90850p4723
6428C59217o3052K83939k8890j60802k6447J35841J18120o9866m6210Q4562Q017
6417E94429M832j72794J53920K8106j22095J18517j67672j39006m721K23161L42313
6406H58990l2527l03713m7305N2783P460J09252j37420M8551J79620k9742k6329
6395F79620K36263J7488j40311j45357j5850j0924K8102j13327k8114N485K52217
$$ plain form
6384 765292 814614 935737 926220 776801 843932 673428 701563 648094 772837 1023672 1037429
6373 1037429 987134 756067 746433 532384 558302 689488 890778 777361 705245 911592
6363 911592 825225 635397 655245 780580 583538 828485 727746 424501 387337 661545
6353 661545 521320 547905 462988 597105 589595 510061 801992 720220 681949 613929 769917
6342 769917 864565 774444 852178 891864 825511 903888 806557 656839 627435 568219 659206
6331 659206 988692 902428 804376 933863 902406 738008 518513 593402 688507 728563 689493
6320 689493 848228 658957 591602 764931 836064 874449 884276 719598 570250 807088 873925
6309 873925 690307 783849 816464 801032 736716 802234 859628 755292 1153458 1345635 1030109
$$ packed form
6384G65292M9322J21123r517j49419O7131j70504K8135n3469J24743K50835J3757
6373A037429n0295k31067r634k14049K5918J31186K01290j13417p2116K06347
6363I11592q6367j89828J9848J25335j97042K44947j00739l03245l7164K74208
6353F61545j40225K6585q4917J34117p510p9534K91931q1772l8271o8020J55988
6342G69917R4648r0121P7734L9686o6353P8377r7331j49718k9404n9216R0987
6331F59206L29486q6264r8052J29487l1457j64398k19495P4889R5105M0056l9070
6320F89493J58735j89271o7355J73329P1133L8385R827j64678j49348K36838O6837
6309H73925j83618R3542L2615j5432o4316O5518N7394j04336L98166J92177l15526
$$ plain form
6298 1030109 962500 950195 1032412 1426448 1133199 896003 982201 1182055 1130180 1131297 1263336
6287 1263336 1220901 1279498 1385168 1297898 1267690 1236308 1267072 1245613 1547619 1743196 1596073
6276 1596073 1813681 1850170 2192292 2080755 2293831 2363778 2296325 2324026 2207464 2317708
6266 2317708 2493571 2484034 2453736 2346787 2216465 2213176 2407578 2438595 2536935 2658505 2624833
6255 2624833 2565395 2750113 2803559 2657258 2738724 2595559 2665099 2892665 3142021 3434207
6245 3434207 3512710 3631056 3685500 3665516 3618988 3644276 3578774 3356721 3625331 3331325 3181918
6234 3181918 3109728 3061885 3075785 3248494 3281224 3321145 3418110 3229238 3159322 3203250 3386987
6223 3386987 3499154 3544174 3434677 3542172 3503119 3493703 3485707 3551654 3468939 3538579 3533663
$$ packed form
6298A030109o7609j2305Q2217L94036k93249k37196Q6198J99854n1875J117J32039
6287A263336m2435N8597J05670q7270l0208l1382L0764k1459L02006J95577j47123
6276A596073K17608L6489L42122j11537K13076O9947o7453K7701j16562J10244
6266B317708J75863r537l0298j06949j30322l289J94402L1017R8340J21570l3672
6255B624833n9438J84718N3446j46301Q1466j43165O9540K27566K49356K92186
6245C434207P8503J18346N4444j9984m6528K5288o5502k22053K68610k94006j49407
6234C181918p2190m7843J3900J72709L2730L9921R6965j88872o9916M3928J83737
6223C386987J12167M5020j09497J07495l9053r416p996O5947q2715O9640m916
$$ plain form
6212 3533663 3082769 3528633 3418339 3150336 3128243 3049362 3608322 3516641 3395800 3555242
6202 3555242 3309566 3359524 3418166 3299636 2997147 2904994 3181014 3444671 3297273 3445876
6192 3445876 3666838 3634907 3433840 3590374 3620072 3702537 3863989 3962649 4072304 4080395 4190254
6181 4190254 4130812 4155230 4172421 4211126 4610293 4805427 4771800 4731476 4818512 4875176 5101071
6170 5101071 5347597 5277507 5658516 5864211 5900075 5807538 5728299 5861224 6292606 6284398 6639485
6159 6639485 6786887 7001175 7238313 7382921 7496790 7517171 7684926 7873881 8254125 8267256
6149 8267256 8452857 9156745 9561047 9648447 9706651 10057466 10423924 10624294 10823783 11081519
6139 11081519 11321225 11909531 12322376 12559748 12939951 13376934 13980595 14493487 15203801
$$ packed form
6212C533663m50894M45864j10294k68003k2093p8881N58960r1681j20841J59442
6202C555242k45676M9958N8642j18530l02489r2153K76020K63657j47398J48603
6192C445876K20962l1931k01067J56534K9698Q2465J61452R8660J09655Q091J09859
6181D190254n9442K4418J7191L8705L99167J95134l3627m0324Q7036N6664K25895
6170E101071K46526p0090L81009K05695L5864r2537p9239J32925M31382q208L55087
6159F639485J47402K14288K37138J44608J13869K0381J67755J88955L80244J3131
6149H267256J85601P03888M04302Q7400N8204L50815L66458K00370J99489K57736
6139A1081519K39706N88306M12845K37372L80203M36983O03661N12892P10314
$$ plain form
6130 15203801 15463612 15722608 16323987 16887030 17432747 18185419 18547459 19300504 20177671
6121 20177671 21034504 21956715 23061013 24091559 25206926 26582926 28032732 29596687
6113 29596687 31013638 32466358 34426033 36305863 38501775 40668627 42978940 45234272
6105 45234272 47685173 50205924 52470993 54518696 56652287 58639601 60356010 62275250
6097 62275250 63714643 64701619 65345716 66272580 66914062 67314790 67899456 68765859 69545865
6088 69545865 70727800 72056407 73481868 75437959 77494605 79883616 82823106 85415566
6080 85415566 88292012 90857294 93380530 95849208 97878078 99214938 99576925 99288085
6072 99288085 98857508 97727950 95767256 93240315 90576621 87607797 84568017 81494020
$$ packed form
6130A5203801K59811K58996O01379N63043N45717P52672L62040P53045Q77167
6121B0177671Q56833R22211J104298J030546J115367J376000J449806J563955
6113B9596687J416951J452720J959675J879830K195912K166852K310313K255332
6105D5234272K450901K520751K265069K047703K133591J987314J716409J919240
6097F2275250J439393R86976O44097R26864O41482M00728N84666Q66403P80006
6088F9545865J181935J328607J425461J956091K056646K389011K939490K592460
6080H5415566K876446K565282K523236K468678K028870J336860L61987k88840
6072I9288085m30577j129558j960694k526941k663694k968824l039780l073997
$$ plain form
6064 81494020 78213187 75542352 73238868 71190123 69328779 68299864 67482474 66575705
6056 66575705 66096465 65472149 65106343 64631216 64238199 63697471 62916876 61649128 60250213
6047 60250213 58297381 55999575 54205817 51551816 48756609 45883077 43115196 40837286
6039 40837286 38335673 35612680 32964606 30756076 28959941 27342616 25662750 24194836
6031 24194836 22931077 21683111 20693683 19503827 18612974 18004098 17211973 16457018 15793159
6022 15793159 15304990 14785200 14056513 13704347 13103787 12791344 12396777 11563865 11168897
6013 11168897 10967573 10677946 10415445 10088142 9645990 9406095 9391444 9044782 8583331 8482127
6003 8482127 8339911 8045470 7805085 7625974 7441214 7105889 6832991 6614878 6448589 6268825
$$ packed form
6064H1494020l280833k670835k303484k048745j861344j028915q17390r06769
6056F6575705m79240o24316l65806m75127l93017n40728p80595j267748j398915
6047F0250213j952832k297806j793758k654001k795207k873532k767881k277910
6039D0837286k501613k722993k648074k208530j796135j617325j679866j467914
6031B4194836j263759j247966r89428j189856q90853o08876p92125p54955o63859
6022A5793159m88169n19790p28687l52166o00560l12443l94567q32912l94968
6013A1168897k01324k89627k62501l27303m42152k39895j4651l46662m61451j01204
6003H482127j42216k94441k40385j79111j84760l35325k72898k18113j66289j79764
$$ plain form
5993 6268825 6361545 6261864 6222463 6324487 6032556 5747398 5515942 5454484 5616360 5483926
5983 5483926 5444860 5080549 5023385 5046609 5094950 4816695 4363936 4327250 4173146 4174950 4213811
5972 4213811 4099378 4017404 4088703 4113035 4038369 3890495 3771857 3683999 3599961 3370166 3582439
5961 3582439 3577386 3442995 3334466 3015398 2981494 3024876 2900013 3128498 3231039 3085489
5951 3085489 2959804 2966197 2771398 2539598 2725946 2654708 2616413 2711800 2575482 2489040 2465706
5940 2465706 2601295 2575198 2572678 2597968 2561181 2576671 2471777 2536517 2567542 2334301 2379121
5929 2379121 2143222 2188660 2340876 2255142 2491912 2687773 2484341 2361461 2407253 2366467
5919 2366467 2467559 2417450 2276171 2584873 2570144 2379720 2762227 2889533 2977291 3151023
$$ packed form
5993F268825R2720r9681l9401J02024k91931k85158k31456o1458J61876j32434
5983E483926l9066l64311n7164K3224M8341k78255m52759l6686j54104J804L8861
5972D213811j14433q1974P1299K4332p4666j47874j18638q7858q4038k29795K12273
5961C582439n053j34391j08529l19068l3904M3382j24863K28485J02541j45550
5951C085489j25685O393j94799k31800J86348p1238l8295R5387j36318q6442k3334
5940B465706J35589k6097k520K5290l6787J5490j04894O4740L1025k33241M4820
5929B379121k35899M5438J52216q5734K36770J95861k03432j22880M5792m0786
5919B366467J01092n0109j41279L08702j4729j90424L82507J27306Q7758J73732
$$ plain form
5909 3151023 2796888 2667935 2923899 2800059 2834874 3071102 3172024 2881519 3069475 3082738
5899 3082738 3094285 3223088 3104144 3152323 3241077 3233282 3180754 3069336 2805186 2870802 2798055
5888 2798055 2835136 2758579 2576606 2458527 2562779 2676815 2694586 2565112 2497322 2611051
5878 2611051 2421407 2270263 2344409 2474616 2479831 2428658 2259956 2358847 2130458 1786287
5868 1786287 1725205 1734844 1911355 1888081 1824355 1855547 1712132 1552862 1421459 1175764 1149357
5857 1149357 1225418 1212531 1282196 1325321 1099517 774640 855163 958722 1024234 1182096 1051034
5846 1051034 977344 1049175 1015964 1077788 958983 877418 753604 653524 546371 624503 714269
5835 714269 952319 886967 905156 945484 798409 775201 699592 962505 902731 769280 793146
$$ packed form
5909C151023l54135j28953K55964j23840L4815K36228J00922k90505J87956J3263
5899C082738J1547J28803j18944M8179Q8754p795n2528j11418k64150O5616p2747
5888B798055L7081p6557j81973j18079J04252J14036J7771j29474o7790J13729
5878B611051j89644j51144P4146J30207N215n1173j68702R8891k28389l44171
5868A786287o1082R639J76511k3274o3726L1192j43415j59270j31403k45695k6407
5857A149357P6061j2887O9665M3125k25804l24877Q0523J03559O5512J57862j31062
5846A051034p3690P1831l3211O1824j18805q1565j23814j00080j07153P8132Q9766
5835G14269K38050o5352J8189M0328j47075k3208p5609K62913n9774j33451K3866
$$ plain form
5824 793146 893992 885405 948634 1080024 1054338 771504 1004793 957113 786384 704804 741634
5813 741634 880984 773407 778979 689142 854295 860443 609011 965182 948333 845880 730623
5802 730623 734399 869463 894227 806117 870756 768544 486874 899084 1071030 1049120 1008770
5791 1008770 975267 1133749 939211 956186 1006025 1005605 1057155 1032411 1081441 1205576 1020973
5780 1020973 1167375 1075301 984450 1425442 1452165 1303948 1197962 1375261 1227537 1227486 1439537
5769 1439537 1187286 1167401 1102597 988517 1297240 1251516 1359981 1390875 1152489 1323701
5759 1323701 1648016 1618763 1426048 1244904 1526253 1497699 1444657 1216603 1393524 1311486
5749 1311486 1305001 1360046 1173835 1033234 798893 1211241 1361654 1343946 1147203 1161858
$$ packed form
5824G93146J00846q587O3229J31390k5686k82834K33289m7680j70729q1580L6830
5813G41634J39350j07577N572q9837J65153O148k51432L56171j6849j02453j15257
5802G30623L776J35064K4764q8110O4639j02212k81670M12210J71946k1910m0350
5791A008770l3503J58482j94538J6975M9839m20N1550k4744M9030J24135j84603
5780A020973J46402r2074r0851M40992K6723j48217j05986J77299j47724n1K12051
5769A439537k52251j9885o4804j14080L08723m5724J08465L0894k38386J71212
5759A323701L24315k9253j92715j81144K81349k8554n3042k28054J76921q2038
5749A311486o485N5045j86211j40601k34341M12348J50413j7708j96743J4655
$$ plain form
5739 1161858 1264220 1135744 1147541 1427424 1389837 1203337 1144675 1034740 956592 772565
5729 772565 994716 1240376 984069 949016 1061234 963227 966163 753025 703094 650274 689962
5718 689962 750721 694676 553347 776960 949907 774419 790042 669294 798370 916638
5708 916638 722804 502389 357102 409987 483239 629417 657242 712677 967303 1011191 816251
5697 816251 931977 790819 656798 439659 584450 797881 709344 557239 422924 514560
5687 514560 650438 779036 845474 867671 803274 707477 771190 945623 899323 775246 672813
5676 672813 693251 704330 864544 940465 789429 840214 949471 824944 750048 743428 818902
5665 818902 612560 681739 1043004 964322 896695 1069800 928265 842753 1055921 1317114
$$ packed form
5739A161858J02362j28476J1797K79883l7587j86500n8662j09935p8148j84027
5729G72565K22151K45660k56307l5053J12218r8007K936k13138m9931n2820L9688
5718F89962O0759n6045j41329K23613J72947j75488J5623j20748J29076J18268
5708I16638j93834k20415j45287N2885P3252J46178K7825N5435K54626M3888j94940
5697H16251J15726j41158j34021k17139J44791K13431q8537j52105j34315R1636
5687E14560J35878J28598O6438K2197o4397r5797O3713J74433m6300j24077j02433
5676F72813K0438J1079J60214P5921j51036N0785J09257j24527p4896o620P5474
5665H18902k06342O9179L61265p8682o7627J73105j41535q5512K13168K61193
$$ plain form
5655 1317114 1174953 1217875 953305 1026718 1172106 1135654 1046796 1260974 1290761 1210718 1359738
5644 1359738 1520728 1455265 1184567 1074312 1241111 1186531 1210311 1310038 1315200 1346600 1313710
5633 1313710 1314711 1468276 1254281 1241308 1351144 1397787 1502676 1352488 1344147 1436573 1517943
5622 1517943 1535443 1445762 1505814 1467629 1681081 1912848 1824340 1833114 1716504 1593777 1656067
5611 1656067 1666951 1735977 1996625 2096740 2136158 2207606 2319653 2390682 2523849 2456394 2527171
5600 2527171 2536700 2615193 2896886 3049302 3070218 3341655 3524725 3370872 3275619 3126845
5590 3126845 3270711 3299297 3231060 3395021 3397934 3278397 3239503 3408226 3627708 3369418
5580 3369418 3239119 3476755 3487115 3767686 3886362 3914704 3846965 4131021 4288852 4237030
$$ packed form
5655A317114j42161M2922k64570P3413J45388l6452q8858K14178K9787q0043J49020
5644A359738J60990o5463k70698j10255J66799n4580K3780R9727N162L1400l2890
5633A313710J001J53565k13995j2973J09836M6643J04889j50188q341R2426Q1370
5622A517943J7500q9681O0052l8185K13452K31767q8508Q774j16610j22727O2290
5611A656067J0884O9026K60648J00115L9418P1448J12047P1029J33167o7455P0777
5600B527171R529P8493K81693J52416K0916K71437J83070j53853r5253j48774
5590C126845J43866K8586o8237J63961K913j19537l8894J68723K19482k58290
5580C369418j30299K37636J0360K80571J18676K8342o7739K84056J57831n1822
$$ plain form
5570 4237030 4392377 4590814 4372048 4466942 4325970 4374344 4677974 4573156 4120098 3864499
5560 3864499 4144672 4458167 4032243 3920708 4138814 4218824 4353249 4444363 4436403 4434492 4387806
5549 4387806 4615780 4439171 4555596 4510065 4506814 4789755 4713995 4944835 5201130 5214645
5539 5214645 5268690 5131663 5285513 5577326 5560459 5342038 5289403 5293134 5300005 5535201 5680124
5528 5680124 5730339 5819654 5847937 5814638 5934819 6025811 6271878 6573826 6801556 6992600
5518 6992600 7079108 7149256 7386221 7584226 7865014 7856751 8109663 8283019 8480649 8666923
5508 8666923 9018068 9115046 9368202 9583099 9748055 9918625 10494584 10939164 11142362 11424374
5498 11424374 11724599 12072434 12676809 12977043 13298816 13946319 14445915 14830183 15304682
$$ packed form
5570D237030J55347J98437k18766R4894j40972M8374L03630j04818m53058k55599
5560C864499K80173L13495m25924j11535K18106Q0010J34425R1114p960j911m6686
5549D387806K27974j76609J16425m5531l251K82941p5760K30840K56295J3515
5539E214645N4045j37027J53850K91813j6867k18421n2635L731O871K35196J44923
5528E680124N0215Q9315K8283l3299J20181R0992K46067L01948K27730J91044
5518F992600Q6508P0148K36965J98005K80788q263K52912J73356J97630J86274
5508H666923L51145R6978K53156K14897J64956J70570N75959M44580K03198K82012
5498A1424374L00225L47835O04375L00234L21773O47503M99596L84268M74499
$$ plain form
5489 15304682 15599998 16343095 16743677 17066969 17977226 18839471 19854416 20870319 21848265
5480 21848265 22802960 23922774 25437071 26610781 27637117 29402991 31093307 33038615
5472 33038615 34912172 36757705 39011052 41126614 43544599 45926912 48752705 51471799
5464 51471799 53948928 56630339 59125601 61335553 63679619 65875819 67488997 68752822
5456 68752822 69665781 70725239 71532126 72052067 72345243 72668408 73090911 73801345 74456201
5447 74456201 75254250 76707016 78453785 80375392 82707332 85151402 88194106 91095421
5439 91095421 93530290 96665095 98985291 100810021 101994282 102638317 102439619 101373101
5431 101373101 99864675 97670307 94969617 91339871 87825866 84086940 80343551 77291588
$$ packed form
5489A5304682K95316P43097M00582L23292R10257Q62245J014945J015903R77946
5480B1848265R54695J119814J514297J173710J026336J765874J690316J945308
5472C3038615J873557J845533K253347K115562K417985K382313K825793K719094
5464E1471799K477129K681411K495262K209952K344066K196200J613178J263825
5456F8752822R12959J059458Q06887N19941K93176L23165M22503P10434O54856
5447G4456201P98049J452766J746769J921607K331940K444070L042704K901315
5439I1095421K434869L134805K320196J824730J184261O44035j98698j066518
5431A01373101j508426k194368k700690l629746l514005l738926l743389l051963
$$ plain form
5423 77291588 74021481 71159228 68770940 66818996 65214799 63886433 63058831 62280807
5415 62280807 61799923 61261341 60658699 59876987 59146289 58539017 57609116 56030977 54152157
5406 54152157 52394613 50449595 47891299 45602469 43213437 40464650 37962338 36012569
5398 36012569 33947033 31825321 29807620 28251309 26798194 25322453 23799908 22774070
5390 22774070 21868864 21068328 20513575 19879125 18959801 18325645 17753937 17079790 16641108
5381 16641108 16049425 15467443 15084081 14661956 14216938 14149955 13954429 13870367 13507054 13231326
5371 13231326 12903813 12611141 12617874 12197373 11928849 11759741 11664071 11684576 11196301 10970216
5361 10970216 10810745 10505015 10466327 10398675 10163993 9936529 9591834 9406133 9268849 9506074
$$ packed form
5423G7291588l270107k862253k388288j951944j604197j328366q27602p78024
5415F2280807m80884n38582o02642p81712p30698o07272r29901j578139j878820
5406E4152157j757544j945018k558296k288830k389032k748787k502312j949769
5398C6012569k065536k121712k017701j556311j453115j475741j522545j025838
5390B2774070r05206q00536n54753o34450r19324o34156n71708o74147m38682
5381A6641108n91683n81982l83362m22125m45018o6983j95526q4062l63313k75728
5371A3231326l27513k92672O733m20501k68524j69108r5670K0505m88275k26085
5361A0970216j59471l05730l8688o7652k34682k27464l44695j85701j37284K37225
$$ plain form
5351 9506074 9301421 9097729 9055264 8733234 8699413 8393459 8127014 7952043 7736649 7512452
5341 7512452 7496448 7072592 6928299 6913495 6862842 6427279 6324705 6300313 6243687 6330714 6205151
5330 6205151 5826148 5599711 5599914 5514341 5630802 5506661 5482545 5521629 5465691 5147256 5045965
5319 5045965 4936424 4874533 4593848 4600398 4839405 4863362 4777380 4580927 4482486 4448127 4375029
5308 4375029 4428260 4467035 4272598 4143041 4165314 3895678 3907362 3912187 3915211 3962505 4015264
5297 4015264 4010945 4100291 3998812 4018414 4025816 4020994 4009200 3816273 4119357 3931732 3944948
5286 3944948 4201729 4145712 4097305 4169439 4219525 4104705 3837908 3721014 3721287 3828629 4090227
5275 4090227 4267128 4123693 4005099 3822015 3891083 4236737 4187895 4263387 4104806 4253449
$$ packed form
5351I506074k04653k03692m2465l22030l3821l05954k66445j74971k15394k24197
5341G512452j6004m23856j44293j4804n0653m35563j02574k4392n6626Q7027j25563
5330F205151l79003k26437K03q5573J16461j24141k4116L9084n5938l18435j01291
5319E045965j09541o1891k80685O550K39007K3957q5982j96453r8441l4359p3098
5308D375029N3231L8775j94437j29557K2273k69636J1684M825L024M7294N2759
5297D015264m319Q9346j01479J9602P402m822j1794j92927L03084j87625J3216
5286C944948K56781n6017m8407P2134N0086j14820k66797j16894K73J07342K61598
5275D090227J76901j43435j18594j83084O9068L45654m8842P5492j58581J48643
$$ plain form
5265 4253449 4295618 4326207 4349777 4213931 4335526 4398114 4515057 4759211 4899185 4814678
5255 4814678 4818148 4984001 4775769 4720329 4928302 5051733 5234942 5425808 5363888 5769145
5245 5769145 6018787 6128749 6415597 6433807 6673968 6544009 6475355 7033237 7153076 7297422
5235 7297422 7309856 7480928 7622215 7703494 7922306 8079861 8356715 8783048 9060583 9198725
5225 9198725 9330590 9542058 9814739 9899280 10047165 10299025 10759107 11081544 11463520 11322152
5215 11322152 11515376 11697047 11979841 12434650 12640097 12795827 12977538 13493238 13955291
5206 13955291 14010680 14493110 14882814 15529000 16031775 16408522 16940904 17224942 17646157 18171940
5196 18171940 18807753 19660575 20417094 21085317 21934846 22863101 23722428 24339012 25355934
$$ packed form
5265D253449M2169L0589K3570j35846J21595O2588J16943K44154J39974q4507
5255D814678L470J65853k08232n5440K07973J23431J83209J90866o1920M05257
5245E769145K49642J09962K86848J8210K40161j29959o8654N57882J19839J44346
5235G297422J2434J71072J41287Q1279K18812J57555K76854M26333K77535J38142
5225I198725J31865K11468K72681Q4541J47885K51860M60082L22437L81976j41368
5215A1322152J93224J81671K82794M54809K05447J55730J81711N15700M62053
5206A3955291N5389M82430L89704O46186N02775L76747N32382K84038M21215N25783
5196A8171940O35813Q52822P56519O68223Q49529R28255Q59327O16584J016922
$$ plain form
5187 25355934 26640139 27817207 29019533 30371576 31854772 33242533 34947179 36932050
5179 36932050 39389378 41832211 44697347 47576565 51039157 55408050 60070769 65303775
5171 65303775 71351799 78100714 86281703 95758773 106621192 119409813 133588732 149178153
5163 149178153 166202864 184656866 205033467 225990409 245929463 263237309 273644894
5156 273644894 271436706 256248624 232098016 204036676 177280116 153842923 134098109
5149 134098109 117479208 104189595 93394276 84095251 76664289 70267575 64497618 60025717
5141 60025717 56114361 52624262 49795790 47111789 44434954 42351491 40549546 38780771
5133 38780771 37265209 35330486 33575073 32029347 30378118 29021377 27865303 26834650
$$ packed form
5187B5355934J284205J177068J202326J352043J483196J387761J704646J984871
5179C6932050K457328K442833K865136K879218L462592M368893M662719N233006
5171F5303775O048024O748915Q180989R477070J0862419J2788621J4178919J5589421
5163A49178153J7024711J8454002K0376601K0956942J9939054J7307846J0407585
5156B73644894k208188j5188082k4150608k8061340k6756560k3437193j9744814
5149A34098109j6618901j3289613j0795319r299025p430962o396714n769957m471901
5141F0025717l911356l490099k828472k684001k676835k083463j801945j768775
5133C8780771j515562j934723j755413j545726j651229j356741j156074j030653
$$ plain form
5125 26834650 25386165 24286284 23517084 22981131 22041430 21029696 20432064 19769259 18735525
5116 18735525 17997462 17474886 16900749 16313260 15931249 15420505 14896973 14392961 14159273
5107 14159273 13618782 13225116 12892820 12530208 12139822 11823730 11127676 10737721 10517339
5098 10517339 10538655 10144014 9642658 9453720 9085144 8887514 8656627 8762701 8678071 8392914
5088 8392914 8157129 8015829 7992948 7884824 7769386 7627165 7426797 7068484 6715783 6715996
5078 6715996 6652003 6355454 6232148 6226723 5990176 5765281 5740651 5834699 5676695 5397562
5068 5397562 5381782 5425046 5150603 4987182 4877819 4835132 4691412 4725639 4430525 4291703
5058 4291703 4579011 4335757 4194423 4342558 4227533 4085333 3858864 3904277 3842763 3816239
$$ packed form
5125B6834650j448485j099881p69200n35953r39701j011734n97632o62805j033734
5116A8735525p38063n22576n74137n87489l82011n10744n23532n04012k33688
5107A4159273n40491l93666l32296l62612l90386l16092o96054l89955k20382
5098A0517339K1316l94641n01356j88938l68576j97630k30887J06074q4630k85157
5088H392914k35785j41300k2881j08124j15438j42221k00368l58313l52701K13
5078F715996o3993k96549j23306n425k36547k24895k4630R4048j58004k79133
5068E397562j5780M3264k74443j63421j09363m2687j43720L4227k95114j38822
5058D291703K87308k43254j41334J48135j15025j42200k26469M5413o1514k6524
$$ plain form
5048 3816239 3607236 3534324 3615536 3401858 3093467 3111352 3049892 3171165 3053901 3121116
5038 3121116 2718195 2686822 2853977 2783292 2695407 2472657 2247250 2248568 2417766 2802790
5028 2802790 2675506 2696689 2513273 2307902 2504562 2182134 2010678 1841911 1711970 1879221
5018 1879221 1782862 1724009 1901905 1747332 2134284 2336723 2059343 2066456 2010216 1699958
5008 1699958 1619853 1438490 1388348 1576859 1927914 1828132 1894084 1657163 1867186 1883295
4998 1883295 1664141 1607577 1441704 1685719 1829428 1524910 1383829 1252637 1457903 1518838
4988 1518838 1356034 1365226 1639277 1832140 1989779 1784238 1649520 1676419 1599424 1615897
4978 1615897 1822923 1821499 1628791 1522157 1375772 1233805 1414686 1494287 1275932 1124288
$$ packed form
5048C816239k09003p2912Q1212k13678l08391J7885o1460J21273j17264O7215
5038C121116m02921l1373J67155p0685q7885k22750k25407J318J69198L85024
5028B802790j27284K1183j83416k05371J96660l22428j71456j68767j29941J67251
5018A879221r6359n8853J77896j54573L86952K02439k77380P113n6240l10258
5008A699958q0105j81363n0142J88511L51055r9782O5952k36921K10023J6109
4998A883295k19154n6564j65873K44015J43709l04518j41081j31192K05266O0935
4988A518838j62804R192K74051J92863J57639k05541j34718K6899p6995J6473
4978A615897K07026j424j92708j06634j46385j41967J80881P9601k18355j51644
$$ plain form
4968 1124288 1060285 1197748 1178047 1172651 1177836 1420367 1282605 1337923 1113511 1169046 1145903
4957 1145903 1092124 907436 806596 921321 982250 1253367 1322537 1117175 953814 1131028
4947 1131028 1220667 1075443 1048817 1092007 991832 822614 610475 387680 581180 795128
4937 795128 960850 752357 683311 748846 801630 737718 806410 832802 842106 981605 804300
4926 804300 658522 676113 817810 793491 886336 834578 796849 589052 672556 632759 705388
4915 705388 687181 598715 544939 678487 547467 554324 507502 343886 562411 787749 608296
4904 608296 419889 539670 513147 664549 750431 558595 598453 677460 704330 898832 698268
4893 698268 662855 451163 468784 489741 532420 410348 294979 306791 362844 469035 477517
$$ packed form
4968A124288o4003J37463j9701n396N185K42531j37762N5318k24412N5535k3143
4957A145903n3779j84688j00840J14725O0929K71117O9170k05362j63361J77214
4947A131028Q9639j45224k6626M3190j00175j69218k12139k22795J93500K13948
4937G95128J65722k08493o9046O5535N2784o3912O8692K6392R304J39499j77305
4926H04300j45778J7591J41697k4319R2845n1758l7729k07797Q3504l9797P2629
4915G05388j8207q8466n3776J33548j31020O857m6822j63616K18525K25338j79453
4904F08296j88407J19781k6523J51402Q5882j91836L9858P9007K6870J94502k00564
4893F98268l5413k11692J7621K0957M2679j22072j15369J1812N6053J06191Q482
$$ plain form
4882 477517 753052 872893 718938 634213 776965 814475 738894 814278 766355 801280 557880
4871 557880 341715 684000 788733 518281 501510 820275 877693 828807 815117 766858 479998
4860 479998 516835 827759 944719 613333 626349 747862 791649 627253 708398 638968 727160
4849 727160 808625 953194 848538 722000 1109259 1270907 1052916 900727 1075466 1105486
4839 1105486 1009621 1005725 1209051 1322062 1228403 1249274 1220539 1267240 1315244 1206511 1209123
4828 1209123 1408141 1697380 1639887 1684908 1934880 2008511 2299345 2739448 2967307 3406214
4818 3406214 3666089 3901507 4354633 4671732 4952842 5616713 6327562 6684732 7101111 7214397
4808 7214397 6741744 6468408 6045332 5387967 4830995 4299695 3534106 3118188 2855567 2747647
$$ packed form
4882D77517K75535J19841j53955q4725J42752L7510p5581P5384m7923L4925k43400
4871E57880k16165L42285J04733k70452j6771L18765N7418m8886j3690m8259k86860
4860D79998L6837L10924J16960l31386J3016J21513M3787j64396Q1145o9430Q8192
4849G27160Q1465J44569j04656j26538L87259J61648k17991j52189J74739L0020
4839A105486r5865l896K03326J13011r3659K0871k8735M6701M8004j08733K612
4828A209123J99018K89239n7493M5021K49972P3631K90834M40103K27859M38907
4818C406214K59875K35418M53126L17099K81110O63871P10849L57170M16379J13286
4808G214397m72653k73336m23076o57365n56972n31300p65589m15918k62621j07920
$$ plain form
4798 2747647 2597495 2325386 2103335 1912495 1541669 1540973 1479441 1515506 1189649 1129222 1040808
4787 1040808 1073670 1055193 895303 998056 1027860 971598 941836 1191842 1041333 719467
4777 719467 752789 945288 836353 843512 982888 906152 770670 685078 971604 996760 768181
4766 768181 716652 618616 555896 416237 387989 476757 539040 752509 557452 585314 788183
4755 788183 772899 599062 638117 622751 733271 874653 949633 890986 529478 608484 448200
4744 448200 567259 623498 586884 450013 476662 521752 633768 558409 531079 220901 282310
4733 282310 141117 78706 323903 533663 482047 246240 -29546 -204388 159483 266499
4723 266499 17192 -157564 -86340 -76295 -66856 -98796 58894 287803 367820 328474 174369
$$ packed form
4798B747647j50152k72109k22051j90840l70826o96o1532L6065l25857o0427q8414
4787A040808L2862j8477j59890J02753K9804n6262k9762K50006j50509l21866
4777G19467L3322J92499j08935P159J39376p6736j35482q5592K86526K5156k28579
4766G68181n1529r8036o2720j39659k8248Q8768O2283K13469j95057K7862K02869
4755G88183j5284j73837L9055j5366J10520J41382P4980n8647l61508P9006j60284
4744D48200J19059N6239l6614j36871K6649M5090J12016p5359k7330l10178O1409
4733B82310j41193o2411K45197K09760n1616k35807k75786j74842L63871J07016
4723B66499k49307j74756P1224J0045R439l1940J57690K28909Q0017l9346j54105
$$ plain form
4712 174369 -17229 -40059 278597 416418 474850 657987 608298 290574 230948 403603
4702 403603 692985 508180 573560 687723 656392 460270 300775 122770 314025 791859
4692 791859 729881 321942 538606 652700 554090 619765 501115 578073 902880 686697
4682 686697 573905 637089 740382 641330 489483 480242 359262 572968 539847 594403 690384
4671 690384 661719 771412 765877 505174 598932 540210 526593 444266 533064 426208 475125
4660 475125 320380 289377 454857 382202 337692 258820 210625 357167 307512 334485 360629
4649 360629 222612 230392 271505 230978 287696 124318 283163 315081 363845 377637 422280
4638 422280 389722 587484 605986 432851 557850 636682 570911 585599 356871 428716 603337
$$ packed form
4712A74369j91598k2830L18656J37821N8432J83137m9689l17724n9626J72655
4702D03603K89382j84805O5380J14163l1331j96122j59495j78005J91255M77834
4692G91859o1978m07939K16664J14094r8610O5675j18650P6958L24807k16183
4682F86697j12792O3184J03293r9052j51847r241j20980K13706l3121N4556R5981
4671F90384k8665J09693n535k60703R3758n8722j3617q2327Q8798j06856M8917
4660D75125j54745l1003J65480p2655m4510p8872m8195J46542m9655K6973K6144
4649C60629j38017P780M1113m0527N6718j63378J58845L1918M8764J3792M4643
4638D22280l2558J97762J8502j73135J24999P8832o5771J4688k28728P1845J74621
$$ plain form
4627 603337 228402 3122 106261 188808 289220 237402 291195 385169 414389 349401 181075
4616 181075 503672 551043 309097 314147 404240 372027 336672 229126 131393 251489 632379
4605 632379 271467 222136 36955 176104 217569 108978 261378 419966 632225 385056
4595 385056 460910 684992 430994 274904 126087 184110 378831 418671 497039 432265 457885
4584 457885 400713 191830 353821 398004 218126 103148 235735 215314 302374 44604
4574 44604 -184030 170316 189174 186361 419325 347541 284163 539507 400485 244339 192689
4563 192689 213320 257790 598891 489721 476671 85763 108030 407557 282391 233184 308161
4552 308161 284604 195548 199748 249712 546789 622584 595294 472993 544401 723219 772772
$$ packed form
4627F03337l74935k25280J03139Q2547J00412n1818N3793R3974K9220o4988j68326
4616A81075L22597M7371k41946N050R0093l2213l5355j07546r7733J20096L80890
4605F32379l60912m9331j85181J39149M1465j08591J52400J58588K12259k47169
4595C85056P5854K24082k53998j56090j48817N8023J94721L9840P8368o4774K5620
4584D57885n7172k08883J61991M4183j79878j14978J32587k0421Q7060k57770
4574D4604k28634L54346J8858k813K32964p1784o3378K55344j39022j56146n1650
4563A92689K0631M4470L41101j09170j3050l90908K2267K99527j25166m9207P4977
4552C08161k3557q9056M200M9964K97077P5795k7290j22301P1408J78818M9553
$$ plain form
4541 772772 400182 415612 480951 349388 353292 222563 309175 295922 333431 750286 587142
4530 587142 652198 447338 718029 693539 492379 431317 610050 749281 499849 585289
4520 585289 671453 830222 828957 645914 758125 862072 676920 820199 833870 788197 669714
4509 669714 718452 568580 800338 855063 596652 456233 395254 532002 695310 879121
4499 879121 1302133 1148126 932918 989399 895642 810215 638301 566011 724350 750956 677329
4488 677329 966389 929584 799456 797145 1124861 1052623 933270 1243797 986002 883496
4478 883496 1080090 1255198 1320324 992897 945419 1061599 1154089 1126923 1275234 1481422
4468 1481422 1321888 1374494 1457925 1503141 1165446 1100919 918429 1104717 1110895 1341700 1563332
$$ packed form
4541G72772l72590J5430O5339j31563L904j30729Q6612j3253L7509M16855j63144
4530E87142O5056k04860K70691k4490k01160o1062J78733J39231k49432Q5440
4520E85289Q6164J58769j265j83043J12211J03947j85152J43279J3671m5673j18483
4509F69714M8738j49872K31758N4725k58411j40419o0979J36748J63308J83811
4499H79121M23012j54007k15208N6481r3757q5427j71914p2290J58339K6606p3627
4488F77329K89060l6805j30128k311L27716p2238j19353L10527k57795j02506
4478H83496J96594J75108O5126l27427m7478J16180R2490k7166J48311K06188
4468A481422j59534N2606Q3431M5216l37695o4527j82490J86288O178K30805K21632
$$ plain form
4457 1563332 1458299 1613413 1470156 1812480 2033262 2125695 2050986 2115340 2160649 2075922
4447 2075922 2176339 2077361 2136277 2269803 2248630 2364069 2595885 2702431 2841798 3055252
4437 3055252 3143255 3335031 3226763 3341646 3235375 3278511 3313098 3555284 3897381 4066689
4427 4066689 4137110 4015532 4204120 4187278 4344612 4371809 4634971 4686509 4854022 4838231
4417 4838231 4818956 5308790 5309226 5406871 5698331 5918229 6288110 6517108 6460403 6637620 6930874
4406 6930874 7048803 7252670 7660169 7844190 8193161 8860889 8966040 9213304 9725092 10317621
4396 10317621 10853341 11381849 12131550 13102219 14181578 15077136 15959829 17327211 18626923
4387 18626923 20052734 21644289 23336941 25152551 27408704 29563467 31643717 34278150
$$ packed form
4457A563332j05033J55114j43257L42324K20782R2433p4709O4354M5309q4727
4447B075922J00417r8978N8916J33526k1173J15439K31816J06546J39367K13454
4437C055252Q8003J91776j08268J14883j06271M3136L4587K42186L42097J69308
4427D066689P0421j21578J88588j6842J57334K7197K63162N1538J67513j5791
4417D838231j9275M89834M36R7645K91460K19898L69881K28998n6705J77217K93254
4406F930874J17929K03867M07499J84021L48971O67728J05151K47264N11788N92529
4396A0317621N35720N28508P49701R70669J079359Q95558Q82693J367382J299712
4387A8626923J425811J591555J692652J815610K256153K154763K080250K634433
$$ plain form
4379 34278150 36218632 38501127 40698469 42752346 45176634 47474461 49415388 51756962
4371 51756962 53696050 55118134 56618552 57604262 58281887 59071980 59819506 60443265 60676192
4362 60676192 60622514 59738416 58332132 56657082 54876550 53055082 51179720 49703460 48024991
4353 48024991 45952457 43733567 41259104 38454462 35705996 33453198 31581494 29337809
4345 29337809 27334469 25651523 23643745 21591714 19709483 17999906 16784381 15527418
4337 15527418 14401589 13464931 12641839 12162324 11350868 10733794 10425650 9804559 9255423
4328 9255423 8930228 8634098 8186807 7951394 7834822 7216504 6652217 6649604 6447693 6275963
4318 6275963 5939627 5408090 5392168 5580785 5251871 5004565 4935806 4774072 4669088 4357414
$$ packed form
4379C4278150J940482K282495K197342K053877K424288K297827J940927K341574
4371E1756962J939088J422084J500418R85710O77625P90093P47526O23759K32927
4362F0676192n3678q84098j406284j675050j780532j821468j875362j476260j678469
4353D8024991k072534k218890k474463k804642k748466k252798j871704k243685
4345B9337809k003340j682946k007778k052031j882231j709577j215525j256963
4337A5527418j125829r36658q23092m79515q11456o17074l08144o21091n49136
4328I255423l25195k96130m47291k35413j16572o18318n64287k613k01911j71730
4318F275963l36336n31537j5922J88617l28914k47306o8759j61734j04984l11674
$$ plain form
4308 4357414 4125398 4162929 4010103 3990301 3858050 3996563 3865869 3493330 3376684 3254592
4298 3254592 3169606 2930246 3140918 3276360 3210422 2881074 2767442 2641755 2421257 2713896
4288 2713896 2893334 2780950 2430622 2370571 2333469 2419917 2345874 2165282 2197430 2143858 2177593
4277 2177593 2061806 2162208 2108677 2186269 1989229 1742671 1691686 1713847 1693082 1674383 1882967
4266 1882967 1950229 1866390 1799932 1721623 1453850 1534998 1512360 1293593 1449999 1436120 1509973
4255 1509973 1592912 1400567 1206183 1139872 1125090 1131742 1237735 1354950 1343148 1373254 1076212
4244 1076212 1016962 974631 822433 968140 1026495 881069 846796 898918 1006513 1088238 989466
4233 989466 1048681 715792 978292 1136616 998863 713627 630337 1020123 838005 844399
$$ packed form
4308D357414k32016L7531j52826j9802j32251J38513j30694l72539j16646j22092
4298C254592q4986k39360K10672J35442o5938l29348j13632j25687k20498K92639
4288B713896J79438j12384l50328o0051l7102Q6448p4043j80592L2148n3572L3735
4277B177593j15787J00402n3531P7592j97040k46558n0985K2161k0765j8699K08584
4266A882967O7262q3839o6458p8309k67773Q1148k2638k18767J56406j3879P3853
4255A509973Q2939j92345j94384o6311j4782O652J05993J17215j1802L0106k97042
4244A076212n9250m2331j52198J45707N8355j45426l4273N2122J07595Q1725r8772
4233I89466N9215l32889K62500J58324j37753k85236q3290L89786j82118O394
$$ plain form
4223 844399 420393 400525 717493 483136 392913 386909 584690 611513 919761 877261 809561
4212 809561 829536 1117700 1020581 798630 964531 1091576 947449 951861 1079540 1051164 862943
4201 862943 714422 1263511 1752882 1717967 1876644 2077609 2437760 2568748 2427977 2653534
4191 2653534 2417423 1995684 1755035 1682742 1413200 1206521 1059567 1120114 1240757 1238715
4181 1238715 840512 829153 1037325 931074 936904 719313 744752 647250 412918 782777
4171 782777 824379 892728 648780 557395 631431 524782 554097 548060 530572 449355 425154
4160 425154 574995 561776 342173 183221 166984 377125 616213 292965 182994 432883
4150 432883 529109 419094 433217 272999 208799 304154 291936 277944 419859 431579 237059
$$ packed form
4223H44399m24006j9868L16968k34357r0223o004J97781K6823L08248m2500o7700
4212H09561J9975K88164r7119k21951J65901J27045j44127M412J27679k8376j88221
4201H62943j48521N49089M89371l4915J58677K00965L60151J30988j40771K25557
4191B653534k36111m21739k40649p2293k69542k06679j46954O0547J20643k042
4181A238715l98203j1359K08172j06251N830k17591K5439r7502k34332L69859
4171G82777M1602O8349k43948r1385P4036j06649K9315o037j7488q1217k4201
4160D25154J49841j3219k19603j58952j6237K10141K39088l23248j09971K49889
4150D32883R6226j10015J4123j60218o4200R5355j2218j3992J41915J1720j94520
$$ plain form
4139 237059 312293 370626 189532 74072 288957 297010 336317 102512 17533 441142 394602
4128 394602 177487 165969 192479 194219 276490 401534 315776 171252 272624 380330 154926
4117 154926 375013 269145 184864 55356 89436 228428 350237 187073 250758 398367
4107 398367 527080 590908 490194 410191 397933 303356 285122 315842 377102 230505 89806
4096 89806 94782 -5081 211604 301868 410449 315472 254340 345482 261471 83825 182881
4085 182881 42215 108971 135106 83378 388566 384871 571098 288714 241347 561366 499187
4074 499187 276132 131858 295966 474362 500970 704869 922124 860716 786256 785276 581843
4063 581843 693261 879966 808829 751129 532765 647206 642253 557442 715118 876828 525616
$$ packed form
4139B37059P5234N8333j81094j15460K14885Q053L9307k33805q4979M23609m6540
4128C94602k17115j1518K6510J740Q2271J25044q5758j44524J01372J07706k25404
4117A54926K20087j05868q4281j29508L4080J38992J21809j63164O3685J47609
4107C98367J28713O3828j00714q0003j2258r4577j8234L0720O1260j46597j40699
4096H9806M976r9863K16685R0264J08581r4977o1132R1142q4011j77646R9056
4085A82881j40666O6756K6135n1728L05188l695J86227k82384m7367L20019o2179
4074D99187k23055j44274J64108J78396K6608K03899K17255o1408p4460r80k03433
4063E81843J11418J86705p1137n7700k18364J14441m953q4811J57676J61710l51212
$$ plain form
4052 525616 583362 834323 694784 639209 801914 639594 631701 679565 396181 434121 585228
4041 585228 516379 515253 321036 328069 315343 407594 498172 771489 642238 539319 504822
4030 504822 427395 346813 443908 552276 294371 661809 731242 769253 793403 748940 780469
4019 780469 841891 867058 702145 785965 1041627 1234086 1240108 1070947 1349156 1129638 940741
4008 940741 1036149 1121651 1006428 1114898 1307203 1522474 1749958 1854281 1877658 2025645
3998 2025645 2462678 2807102 2829769 2823998 3203118 3699987 3901297 4233898 4498427 4998269
3988 4998269 5833762 6271219 6715050 7082645 7456571 7362292 7151617 6509881 5659696 4859191
3978 4859191 4229865 3593218 3155723 2711057 2463402 2301432 1884810 1794407 1706256 1408818
$$ packed form
4052E25616N7746K50961j39539n5575J62705j62320p893M7864k83384L7940J51107
4041E85228o8849j126j94217P033j2726R2251R0578K73317j29251j02919l4497
4030E04822p7427q0582R7095J08368k57905L67438O9433L8011K4150m4463L1529
4019G80469O1422K5167j64913Q3820K55662J92459O022j69161K78209k19518j88897
4008I40741R5408Q5502j15223J08470J92305K15271K27484J04323K3377J47987
3998B025645M37033L44424K2667n771L79120M96869K01310L32601K64529M99842
3988D998269Q35493M37457M43831L67595L73926r4279k10675o41736q50185q00505
3978D859191o29326o36647m37495m44666k47655j61970m16622r0403q8151k97438
$$ plain form
3968 1408818 1452591 1317281 1218573 1281836 1148804 1148062 1240359 1113158 798177 734973 951093
3957 951093 891844 1034394 1082895 904831 908992 742307 571059 712384 893037 1057831
3947 1057831 811560 442450 657970 428507 352651 152869 147572 446530 501021 658800
3937 658800 687802 779001 559844 379927 458073 602492 534491 489289 701815 551864 522383
3926 522383 271820 182012 129589 154485 232579 256891 386682 463153 427032 319390 -222427
3915 -222427 146712 445244 409023 537931 394626 291716 157877 78393 304717 234863
3905 234863 407967 399180 350434 356434 181077 199977 161610 260272 310355 457184 330079
3894 330079 322853 445196 512095 364990 203353 247918 336423 162668 336208 292303 245872
$$ packed form
3968A408818M3773j35310r8708O3263j33032p42R2297j27201l14981o3204K16120
3957I51093n9249J42550M8501j78064M161j66685j71248J41325J80653J64794
3947A057831k46271l69110K15520k29463p5856j99782n297K98958N4491J57779
3937F58800K9002R1199k19157j79917P8146J44419o8001m5202K12526j49951k9481
3926E22383k50563q9808n2423K4896P8094K4312J29791P6471l6121j07642n41817
3915b22427L69139K98532l6221J28908j43305j02910j33839p9484K26324o9854
3905B34863J73104q787m8746O000j75357J8900l8367R8662N0083J46829j27105
3894C30079p226J22343O6899j47105j61637M4565Q8505j73755J73540m3905m6431
$$ plain form
3883 245872 172556 131171 426919 352508 325377 369672 450446 338163 346609 352326 429121 627591
3871 627591 277762 214810 91540 4008 -75444 172723 261416 132330 379387 169256
3861 169256 190212 205472 32523 196521 293409 184409 270982 338833 202435 92240 -22059
3850 -22059 241354 422539 261310 251945 428816 184201 236592 167389 74092 -25008 215173
3839 215173 394551 370699 235098 238537 81250 198913 161882 142516 326753 205826 500251
3828 500251 470902 274302 -27900 226945 534093 480048 245480 272959 183749 293345
3818 293345 500980 411295 250333 316481 535046 643150 346311 281800 677061 680278 437187
3807 437187 494976 458699 553503 455456 266205 417766 575103 489811 483866 371653 313564
$$ packed form
3883B45872p3316m1385K95748p4411k7131M4295Q0774j12283Q446N717P6795J98470
3871F27591l49829o2952j23270q7532p9452K48167Q8693j29086K47057k10131
3861A69256K0956J5260j72949J63998R6888j09000Q6573O7851j36398j10195j14299
3850b2059K63413J81185j61229r365J76871k44615N2391o9203r3297r9100K40181
3839B15173J79378k3852j35601L439j57287J17663l7031j9366J84237j20927K94425
3828E00251k9349j96600l02202K54845L07148n4045k34568K7479q9210J09596
3818B93345K07635q9685j60962O6148K18565J08104k96839o4511L95261L217k43091
3807D37187N7789l6277R4804r8047j89251J51561J57337q5292n945j12213n8089
$$ plain form
3796 313564 192138 150659 192136 436181 668480 371900 329226 410655 335384 105642 35472
3785 35472 96701 452180 497449 538199 377333 171017 143712 195650 228147 184531 333527
3774 333527 372480 364819 277525 172384 212745 408402 461824 513555 206167 338637 201540
3763 201540 158646 527285 662348 417354 374901 565378 588752 520361 500849 480883 327457
3752 327457 522960 580251 379857 315089 388317 560365 606316 186438 343954 561204
3742 561204 520410 575582 584499 560827 399710 443136 687673 600685 640355 592118 708182
3731 708182 639363 734808 752725 697633 540634 613953 730118 665987 686984 659313 801485
3720 801485 760980 772955 815206 662848 640290 751724 763780 879968 964155 918328 789803
$$ packed form
3796C13564j21426m1479M1477K44045K32299k96580m2674Q1429p5271k29742p0170
3785C5472O1229L55479M5269M0750j60866k06316k7305N1938L2497m3616J48996
3774C33527L8953p661q7294j05141M0361J95657N3422N1731l07388J32470j37097
3763B01540m2894L68639J35063k44994m2453J90477K3374o8391j9512j9966j53426
3752C27457J95503N7291k00394o4768P3228J72048M5951m19878J57516K17250
3742E61204m0794N5172Q917k3672j61117M3426K44537q6988L9670m8237J16064
3731G08182o8819R5445J7917n5092j56999P3319J16165o4131K0997k7671J42172
3720H01485m0505J1975M2251j52358k2558J11434J2056J16188Q4187m5827j28525
$$ plain form
3709 789803 810084 911562 1027066 1077823 934429 955004 1010555 1019920 894514 946144 1041165
3698 1041165 1153916 1127921 997626 1202624 1284043 1202315 1143913 1241962 1180306 1342096 1043027
3687 1043027 962285 1300439 1423848 1507247 1160184 1188045 1319861 1432973 1603819 1584662
3677 1584662 1641255 1550965 1389809 1223932 1027229 892925 1017951 950024 995721 1120829
3667 1120829 1194634 1137724 1114362 1088745 1092355 989006 975280 1168949 1106830 1182446 1022904
3656 1022904 1042716 926909 884110 1080657 951569 914426 911177 944665 965389 915916 857599
3645 857599 897568 801476 874242 1178977 1125719 783112 801769 783885 918033 979194 830459
3634 830459 665131 603259 305099 549337 873922 775107 437534 395810 627661 709785
$$ packed form
3709G89803K0281J01478J15504N0757j43394K0575N5551R365j25406N1630R5021
3698A041165J12751k5995j30295K04998Q1419q1728n8402R8049o1656J61790k99069
3687A043027q0742L38154J23409Q3399l47063K7861J31816J13112J70846j9157
3677A584662N6593r0290j61156j65877j96703j34304J25026o7927M5697J25108
3667A120829P3805n6910k3362k5617L610j03349j3726J93669o2119P5616j59542
3656A022904J9812j15807m2799J96547j29088l7143l249L3488K0724m9473n8317
3645H57599L9969r6092P2766L04735n3258l42607J8657j7884J34148O1161j48735
3634H30459j65328o1872k98160K44238L24585r8815l37573m1724K31851Q2124
$$ plain form
3624 709785 800257 563703 558723 692478 981077 747407 691431 636297 721171 678270 604186
3613 604186 914391 798296 742855 846991 881604 837059 711872 693967 932036 910314 949615
3602 949615 1012401 714518 709857 935799 815519 717432 824497 635236 612505 639207 815679
3591 815679 929499 813221 963502 821881 856236 748703 657710 746545 838948 874551 441274
3580 441274 385296 713158 1068063 1049604 1029167 1108520 1069860 986605 963311 936007 1015606
3569 1015606 924404 911392 849385 1002849 856604 714749 720890 781426 691844 614360 753745
3558 753745 667915 987137 1077512 888647 990100 982246 646562 598445 790771 761085 589855
3547 589855 922535 903228 721216 589593 613767 603109 715990 802809 854736 993227 1009556
$$ packed form
3624G09785R0472k36554m980J33755K88599k33670n5976n5134Q4874m2901p4084
3613F04186L10205j16095n5441J04136L4613m4545j25187j7905K38069k1722L9301
3602I49615O2786k97883m661K25942j20280r8087J07065j89261k2731K6702J76472
3591H15679J13820j16278J50281j41621L4355j07533r0993Q8835R2403L5603m33277
3580D41274n5978L27862L54905j8459k0437P9353l8660q3255k3294k7304P9599
3569A015606r1202j3012o2007J53464j46245j41855O141O0536q9582p7484J39385
3558G53745q5830L19222R0375j88865J01453p854l35684m8117J92326k9686j71230
3547E89855L32680j9307j82012j31623K4174j0658J12881Q6819N1927J38491J6329
$$ plain form
3536 1009556 996557 1092313 1099695 953589 741037 807469 931283 586383 643900 1048845 904335
3525 904335 439516 778789 766730 737771 705111 889642 914183 815955 832255 722136 794002
3514 794002 851581 700895 999743 1051111 838158 790063 834298 983909 1087669 1124146 1072123
3503 1072123 1160538 1003807 1177421 926014 1001257 1116256 1273587 1139972 1062347 782331
3493 782331 748197 801590 889733 1085494 1171143 1340572 1333790 1340023 1128989 1058623 1061207 1353429
3481 1353429 1179923 1267187 1284085 1098580 907415 932950 950568 874827 865039 1116128 1377534
3470 1377534 1105751 957114 933335 1025795 958285 1099463 944265 970449 1166662 1302874
3460 1302874 1363280 1059533 1049888 1136449 1214072 883783 765296 999987 1093689 1241114 1210263
$$ packed form
3536A009556j2999R5756P382j46106k12552O6432J23814l44900N7517M04945j44510
3525I04335m64819L39273j2059k8959l2660J84531K4541r8228J6300j10119P1866
3514G94002N7579j50686K98848N1368k12953m8095M4235J49611J03760L6477n2023
3503A072123Q8415j56731J73614k51407P5243J14999J57331j33615p7625k80016
3493G82331l4134N3393Q8143J95761Q5649J69429o782O233k11034p0366K584K92222
3481A353429j73506Q7264J6898j85505j91165K5535J7618p5741r788K51089K61406
3470A377534k71783j48637k3779R2460o7510J41178j55198K6184J96213J36212
3460A302874O0406l03747r645Q6561P7623l30289j18487K34691R3702J47425l0851
$$ plain form
3449 1210263 1252837 1214710 1236505 1256636 1150426 1074576 1100868 1347794 1374946 1176729 1222174
3438 1222174 1165246 936108 1073960 1152302 1173078 1059627 1136898 1225452 1352841 1447003 1442482
3427 1442482 1268958 1076201 996264 947968 1057069 1077942 981142 1152185 1204261 1110867 1170435
3416 1170435 1243952 1081480 1093475 1014563 1287920 1483604 1205189 1396523 1141808 986116
3406 986116 1078876 1213242 1430627 1312076 1240278 1230191 1154013 1492674 1637532 1386494
3396 1386494 1319212 1431031 1269984 1070248 947175 1097571 1197957 1163693 1271585 1299867
3386 1299867 1241330 1353312 1418900 1443979 1275225 1468110 1346567 1190355 1318171 1716049
3376 1716049 1654298 1267644 1202350 1490850 1787987 1701424 1451730 1373922 1457069 1488584 1755459
$$ packed form
3449A210263M2574l8127K1795K0131j06210p5850K6292K46926K7152j98217M5445
3438A222174n6928k29138J37852P8342K0776j13451P7271Q8554J27389R4162m521
3427A442482j73524j92757p9937m8296J09101K0873r6800J71043N2076r3394N9568
3416A170435P3517j62472J1995p8912K73357J95684k78415J91334k54715j55692
3406I86116R2760J34366K17385j18551p1798j0087p6178L38661J44858k51038
3396A386494o7282J11819j61047j99736j23073J50396J00386l4264J07892K8282
3386A299867n8537J11982O5588K5079j68754J92885j21543j56212J27816L97878
3376A716049o1751l86654o5294K88500K97137q6563k49694p7808Q3147L1515K66875
$$ plain form
3365 1755459 1754266 1641379 1565400 1786553 1605575 1453554 1655039 1643947 1611172 1589438 1716574
3354 1716574 1915902 2020568 2139412 1898676 1609750 1774523 1752537 1869156 1914884 1856797
3344 1856797 1989926 1931986 1723293 1774243 1721704 1817639 1808913 1858383 1887553 1967155 1948402
3333 1948402 1928818 1988968 1649549 1737952 1445365 1674721 1964417 1840245 1921127 2109235
3323 2109235 2051007 1990711 1970148 2314062 2208059 2114315 2128749 2161916 2325877 2391320 2406709
3312 2406709 2363821 2372060 2890634 3075707 3000153 3219351 3512560 3500809 3233736 3084034
3302 3084034 3160217 3063869 3037865 3172481 3222195 2865734 2787022 2884756 3082300 3205551 3183903
3291 3183903 3261771 3219969 3254674 3062693 3236187 3029664 3293736 3507645 3492364 3541113
$$ packed form
3365A755459j193j12887p5979K21153j80978j52021K01485j1092l2775k1734J27136
3354A716574J99328J04666J18844k40736k88926J64773k1986J16619M5728n8087
3344A856797J33129n7940k08693N0950n2539R5935q726M9470K9170P9602j8753
3333A948402j9584O0150l39419Q8403k92587K29356K89696j24172Q0882J88108
3323B109235n8228o0296k0563L43914j06003r3744J4434L3167J63961O5443J5389
3312B406709m2888Q239N18574J85073p5554K19198K93209j1751k67073j49702
3302C084034P6183r6348k6004J34616M9714l56461p8712R7734J97544J23251k1648
3291C183903P7868m1802L4705j91981J73494k06523K64072K13909j5281M8749
$$ plain form
3281 3541113 3602639 3696497 3813326 3946210 3978789 4199447 4582408 4585194 4443938 4612174
3271 4612174 4716169 4903318 4894468 4649946 4664685 4562522 4585846 4459642 4249119 4299144
3261 4299144 4120616 4007812 4022542 4155009 4071254 4198683 4431292 4367486 4346708 4262728
3251 4262728 4480613 4610534 4638471 4753303 4606601 4765600 4792990 4813659 5069126 5093031
3241 5093031 4861325 4967243 5084853 5264254 5376039 5540647 5529962 5294892 5576530 5641610
3231 5641610 5552236 5289610 5483195 5463823 5733169 5501761 5439323 5688480 5773692 5905197
3221 5905197 5989295 5950858 5988502 6167344 6061680 6351475 6657950 6849596 6979798 7100105
3211 7100105 7421215 7433480 7468783 7592811 7764571 7875769 7965034 8319863 8383375 8351386
$$ packed form
3281C541113O1526R3858J16829J32884L2579K20658L82961K786j41256J68236
3271D612174J03995J87149q850k44522J4739j02163K3324j26204k10523N0025
3261D299144j78528j12804J4730J32467q3755J27429K32609o3806k0778q3980
3251D262728K17885J29921K7937J14832j46702J58999K7390K0669K55467K3905
3241E093031k31706J05918J17610J79401J11785J64608j0685k35070K81638O5080
3231E641610q9374k62626J93585j9372K69346k31408o2438K49157Q5212J31505
3221E905197Q4098l8437L7644J78842j05664K89795L06475J91646J30202J20307
3211G100105L21110J2265L5303J24028J71760J11198Q9265L54829O3512l1989
$$ plain form
3201 8351386 8576915 8565467 8468623 8553140 8604647 8699081 8923115 8823392 8689284 8802737 8897705
3190 8897705 8553020 8686168 8881025 8748161 8663688 8787948 9075796 9022469 8850580 8748810
3180 8748810 8972877 8716084 8534890 8667201 8952318 8804720 8683409 8634901 8527853 8649865
3170 8649865 8658088 8648123 8365925 8286902 8287961 8173795 7953217 7893529 7899535 7663389 7308299
3159 7308299 7095298 7291119 7315464 7126062 7052839 7040445 6989221 6845065 6509556 6529942
3149 6529942 6416691 6271651 6472660 6516174 6361956 6234781 6182534 6301080 6006541 5960096
3139 5960096 6009766 5873467 5695482 5814926 5609896 5835101 6157878 5793674 5626579 5480517
3129 5480517 5692378 5678796 5342755 5212691 4887170 4837973 5051823 4814891 4914846 4904132
$$ packed form
3201H351386K25529j1448r6844Q4517N1507R4434K24034r9723j34108J13453R4968
3190H897705l44685J33148J94857j32864q4473J24260K87848n3327j71889j01770
3180H748810K24067k56793j81194J32311K85117j47598j21311m8508j07048J22012
3170H649865Q223r965k82198p9023J059j14166k20578n9688O006k36146l55090
3159G308299k13001J95821K4345j89402p3223j2394n1224j44156l35509K0386
3149F529942j13251j45040K01009M3514j54218j27175n2247J18546k94539m6445
3139E960096M9670j36299j77985J19444k05030K25205L22777l64204j67095j46062
3129E480517K11861j3582l36041j30064l25521m9197K13850k36932R9955j0714
$$ plain form
3119 4904132 4637982 4512883 4278206 4357746 4386905 4092772 4107903 3985325 3777171 4091599
3109 4091599 4139444 4177596 3900755 3760127 3725899 3752264 3822400 3766199 3651996 3535271 3638916
3098 3638916 3548231 3468198 3426553 3642651 3456700 3456734 3523278 3151403 3173687 3121320 3239319
3087 3239319 3282385 3297186 3167691 3022731 3065408 3037688 2893582 2956249 3097319 3045321 3141916
3076 3141916 2816605 2818170 2815485 2712921 2789617 2755756 2993367 3129007 2941795 2562085 2487919
3065 2487919 2610227 2829081 2757964 2454859 2544426 2431681 2798435 2637950 2548589 2358799
3055 2358799 2534630 2305518 2219459 2519425 2447927 2321421 2373712 2689325 2480181 2541498
3045 2541498 2416717 2456776 2489562 2308036 2322981 2307668 2389915 2624971 2455212 2222916
$$ packed form
3119D904132k66150j25099k34677P9540K9159k94133J5131j22578k08154L14428
3109D091599M7845L8152k76841j40628l4228K6365P0136n6201j14203j16725J03645
3098C638916r0685q0033m1645K16098j85951L4O6544l71875K2284n2367J17999
3087C239319M3066J4801j29495j44960M2677k7720j44106O2667J41070n1998R6595
3076C141916l25311J565k685j02564P6696l3861K37611J35640j87212l79710p4166
3065B487919J22308K18854p1117l03105Q9567j12745L66754j60485q9361j89790
3055B358799J75831k29112q6059K99966p1498j26506N2291L15613k09144O1317
3045B541498j24781M0059L2786j81526J4945j5313Q2247K35056j69759k32296
$$ plain form
3035 2222916 2414803 2482831 2361448 2502400 2282564 2394811 2648669 2245126 2330878 2403659
3025 2403659 2162094 2149443 2254408 1979210 1949621 2110759 1917056 2178798 2421889 2407526
3015 2407526 2481186 2414512 2438669 2388813 2337149 1992054 1865570 2092551 2053289 1905945 1860404
3004 1860404 2003215 1810591 1842429 1857606 1977643 2053359 1944995 2172400 2150780 1794107
2994 1794107 1785696 1887694 2000840 2018677 1863687 2122735 2088192 1970765 2160520 2148300
2984 2148300 1937877 1852473 2046724 1963472 2030022 1987366 1998892 1931235 1935179 1769622 1571959
2973 1571959 1618023 1638450 1680493 1706817 1650952 1695724 1914214 2220266 2113536 2082955 1817707
2962 1817707 1556205 1832203 1784126 1868167 1998702 1903312 1847339 1719574 1561975 1845472
$$ packed form
3035B222916J91887O8028j21383J40952k19836J12247K53858m03543Q5752P2781
3025B403659k41565j2651J04965k75198k9589J61138j93703K61742K43091j4363
3015B407526P3660o6674K4157m9856n1664l45095j26484K26981l9262j47344m5541
3004A860404J42811j92624L1838J5177J20037P5716j08364K27405k1620l56673
2994A794107q411J01998J13146J7837j54990K59048l4543j17427J89755j2220
2984B148300k10423q5404J94251q3252O6550m2656J1526o7657L944j65557j97663
2973A571959M6064K0427M2043K6324n5865M4772K18490L06052j06730l0581k65248
2962A817707k61502K75998m8077Q4041J30535r5390n5973j27765j57599K83497
$$ plain form
2952 1845472 1898090 1844891 1744090 1836327 1931984 1925800 1837866 1974767 1959601 1824875 1858651
2941 1858651 1859397 1947410 2263030 2233139 2067249 2149576 2332057 2422390 2261584 2007003 2008005
2930 2008005 2012438 1944079 2078658 2246354 2084979 2252707 2112384 1924900 2160446 2194066
2920 2194066 2151541 2319574 2387146 2482905 2276307 2285447 2427587 2459361 2612226 2331986 2335577
2909 2335577 2439499 2626627 2745204 2544034 2572806 2568468 2632268 2676381 2462393 2517693 2569458
2898 2569458 2523218 2677664 2949265 3107984 3048666 2933020 2898458 2878255 2733217 2838877
2888 2838877 2985862 2835838 3201272 3495121 3173894 3069395 3333351 3415567 3488294 3440495
2878 3440495 3487175 3477858 3707160 3599072 3846217 3608077 3690398 4076582 4030988 3860454
$$ packed form
2952A845472N2618n3199j00801R2237R5657o184q7934J36901j5166j34726L3776
2941A858651P46Q8013L15620k9891j65890Q2327J82481R0333j60806k54581J002
2930B008005M433o8359J34579J67696j61375J67728j40323j87484K35546L3620
2920B194066m2525J68033O7572R5759k06598R140J42140L1774J52865k80240L591
2909B335577J03922J87128J18577k01170K8772m338O3800M4113k13988N5300N1765
2898B569458m6240J54446K71601J58719n9318j15646l4562k0203j45038J05660
2888B838877J46985j50024L65434K93849l21227j04499K63956Q2216P2727m7799
2878C440495M6680r317K29302j08088K47145k38140Q2321L86184m5594j70534
$$ plain form
2868 3860454 4024462 4186245 4195491 4304548 4470029 4317842 4273850 4461405 4550395 4531810
2858 4531810 4453167 4370031 4442871 4582076 4438053 4465825 4482202 4503430 4718943 4594501 4608181
2847 4608181 4857470 4873361 4943570 4906158 4909312 5083058 5220935 5265709 5245495 5192244 5151563
2836 5151563 5172823 5001836 5134124 5088943 4959491 4825742 4944517 5173829 5000274 5072700
2826 5072700 5009561 5031464 5027371 5162522 5118380 5126031 5299869 5256960 5082084 4967492 4876165
2815 4876165 4858159 4994277 5000323 4934415 5110900 4962532 4790585 4662251 4704339 4683422 4684756
2804 4684756 4621065 4842876 4576072 4401578 4218573 4340469 4321276 4272482 4123540 4342667
2794 4342667 4402727 4163781 4040655 4048391 4283101 4078801 4015111 3883646 3724771 3684649
$$ packed form
2868C860454J64008J61783R246J09057J65481j52187m3992J87555Q8990j8585
2858D531810p8643q3136P2840J39205j44023K7772J6377K1228K15513j24442J3680
2847D608181K49289J5891P0209l7412L154J73746J37877M4774k0214n3251m0681
2836E151563K1260j70987J32288m5181j29452j33749J18775K29312j73555P2426
2826E072700o3139K1903m093J35151m4142P651J73838m2909j74876j14592r1327
2815D876165j8006J36118O046o5908J76485j48368j71947j28334M2088k0917J334
2804D684756o3691K21811k66804j74494j83005J21896j9193m8794j48942K19127
2794D342667O0060k38946j23126P736K34710k04300o3690j31465j58875m0122
$$ plain form
2784 3684649 3802005 3689672 3597499 3556464 3585204 3687211 3507382 3501698 3336895 3179130
2774 3179130 3114249 3111802 3255083 3399926 3207953 2805403 2762309 2736169 2812469 2752297 2794120
2763 2794120 2700687 2580689 2424186 2476812 2726552 2620957 2374252 2465983 2487772 2336757
2753 2336757 2244671 2047558 2202052 2233746 2168559 1977234 1726560 1891323 1766648 1782042
2743 1782042 1980254 1885677 1810394 1635686 1352795 1463952 1612690 1673628 1910145 1632873
2733 1632873 1631853 1861689 1742158 1655053 1515806 1713964 1663911 1524009 1359144 1468911
2723 1468911 1454320 1239211 1189117 1376838 1344171 1230046 1163519 1090910 1263857 1421169
2713 1421169 1481495 1185648 1274827 1341868 1246315 1170920 1043399 876261 908523 1106375 1259814
$$ packed form
2784C684649J17356j12333r2173m1035K8740J02007j79829n684j64803j57765
2774C179130o4881k447J43281J44843j91973m02550m3094k6140P6300o0172M1823
2763B794120r3433j19998j56503N2626K49740j05595k46705R1731K1789j51015
2753B336757r2086j97113J54494L1694o5187j91325k50674J64763j24675J5394
2743A782042J98212r4577p5283j74708k82891J11157J48738O0938K36517k77272
2733A632873j020K29836j19531q7105j39247J98158n0053j39902j64865J09767
2723A468911j4591k15109n0094J87721l2667j14125o6527p2609J72947J57312
2713A421169O0326k95847Q9179O7041r5553p5395j27521j67138L2262J97852J53439
$$ plain form
2702 1259814 1164194 1231459 1307636 1300897 1248893 1201765 1206368 1189993 1255103 926935 1077871
2691 1077871 1103982 987062 1148792 1062412 760077 794645 918523 899492 761023 894234
2681 894234 1025712 887365 824484 661937 669201 818020 694293 615779 699452 729293 662623
2670 662623 659428 688339 678667 609131 723903 651283 724418 758086 598467 745124 703995
2659 703995 666325 488851 188428 217594 540139 679739 444464 535285 535707 495318 308829
2648 308829 539290 603629 602345 494890 364300 455476 513246 509111 552340 742460 700220
2637 700220 597094 466019 611817 430819 390260 489802 280696 372067 202792 270455
2627 270455 449785 423172 649460 433164 424702 386594 149100 139919 271130 367706 320134
$$ packed form
2702A259814r5620O7265P6177o739n2004m7128M603j6375O5110l28168J50936
2691A077871K6111j16920J61730q6380l02335L4568J23878j9031j38469J33211
2681H94234J31478j38347o2881j62547P264J48819j23727p8514Q3673K9841o6670
2670F62623l195K8911r672o9536J14772p2620P3135L3668j59619J46657m1129
2659G03995l7670j77474l00423K9166L22545J39600k35275R0821M22m0389j86489
2648C08829K30461O4339j284j07455j30590R1176N7770m135M3229J90120m2240
2637G00220j03126j31075J45798j80998m0559R9542k09106R1371j69275O7663
2627B70455J79330k6613K26288k16296q462l8108k37494r181J31211R6576m7572
$$ plain form
2616 320134 613247 661802 340602 387139 334143 270763 493733 640013 551562 345148 505655
2605 505655 370611 292183 486346 203550 312917 265607 380419 331783 591026 327774
2595 327774 295758 341227 355383 394534 389178 511561 566642 733726 507817 578462 506911
2584 506911 510563 670910 484182 266009 178362 256911 386202 448875 300398 265097 386664
2573 386664 503624 608452 518848 383691 338104 255341 61095 64908 124771 218066 321051
2562 321051 459107 263435 157196 101621 110231 218372 406858 179352 133071 182035 173145
2551 173145 373561 248489 464462 245361 87879 223751 173725 192440 426595 198079
2541 198079 176567 227013 350866 294622 311425 278456 446512 341636 54879 222954 309976
$$ packed form
2616C20134K93113M8555l21200M6537n2996o3380K22970J46280q8451k06414J60507
2605E05655j35044p8428J94163k82796J09367m7310J14812m8636K59243k63252
2595C27774l2016M5469J4156L9151n356J22383N5081J67084k25909P0645p1551
2584E06911L652J60347j86728k18173q7647P8549J29291O2673j48477l5301J21567
2573C86664J16960J04828q9604j35157m5587q2763j94246L813N9863R3295J02985
2562C21051J38056j95672j06239n5575Q610J08141J88486k27506m6281M8964q890
2551A73145K00416j25072K15973k19101j57482J35872n0026J8715K34155k28516
2541A98079k1512N0446J23853n6244J6803l2969J68056j04876k86757J68075Q7022
$$ plain form
2530 309976 315390 256930 37657 317810 333056 73575 251095 241683 194823 191019 198023 188794
2518 188794 289391 228076 12211 -217974 -98829 -171819 -43453 98050 58806 144825
2508 144825 222396 35011 164271 130183 49980 218245 155584 84098 198287 264721 51829
2497 51829 -94281 64029 185204 131058 135801 316924 318416 183707 -91854 -78029 86252
2486 86252 260253 467874 410131 258735 -7768 -35726 61988 112493 147569 107008 -22338
2475 -22338 -142673 -62002 -324670 -203831 -18561 132234 -14144 -5450 -11656 -16804 -23959
2464 -23959 280258 247563 103379 400398 295578 -3601 18056 134352 -7484 -107426
2454 -107426 -119158 -108756 -84115 -140357 39271 186133 176058 30595 89050 49282 -212911
$$ packed form
2530C09976N414n8460k19273K80153J5246k59481J77520r412m6860l804P004r229
2518A88794J00597o1315k15865k30185J19145p2990J28366J41503l9244Q6019
2508A44825P7571j87385J29260l4088q0203J68265o2661p1486J14189O6434k12892
2497E1829j46110J58310J21175n4146M743J81123J492j34709k75561J3825J64281
2486H6252J74001K07621n7743j51396k66503k7958R7714N0505L5076m0561j29346
2475b2338j20335Q0671k62668J20839J85270J50795j46378Q694o206n148p155
2464b3959L04217l2695j44184K97019j04820k99179K1657J16296j41836r9942
2454a07426j1732J0402K4641n6242J79628J46862j0075j45463N8455l9768k62193
$$ plain form
2443 -212911 -116220 161096 -54032 -142101 -183408 -279379 -295336 -265815 -37439 294579 283490
2432 283490 268686 178167 82226 279325 119722 93802 -102538 86322 474822 191966
2422 191966 48929 106631 158244 97371 -164833 224578 263424 204727 48125 104416 170365
2411 170365 158447 166711 15772 -11522 28498 -141951 -181032 -209223 19105 189647 200253
2400 200253 16220 -18611 94961 2848 250455 375528 16540 -79483 193210 172921
2390 172921 -189694 -34935 18099 118730 55639 370676 342994 193356 113884 209300 173428
2379 173428 57824 15670 105167 361951 134067 198152 99813 166552 -63564 -9389 314541
2368 314541 145831 165884 139397 300895 388934 141315 88344 74924 -151822 -173586 -39487
$$ packed form
2443b12911R6691K77316k15128q8069m1307r5971j5957K9521K28376L32018j1089
2432B83490j4804r0519r5941J97099j59603k5920j96340J88860L88500k82856
2422A91966j43037N7702N1613o0873k62204L89411L8846n8697j56602N6291O5949
2411A70365j1918Q264j50939k7294M0020j70449l9081k8191K28328J70542J0606
2400B00253j84033l4831J13572r2113K47607J25073l58988r6023K72693k0289
2390A72921l62615J54759N3034J00631o3091L15037k7682j49638p9472R5416l5872
2379A73428j15604m2154Q9497K56784k27884O4085r8339O6739k30116N4175L23930
2368C14541j68710K0053k6487J61498Q8039k47619n2971j3420k26746k1764J34099
$$ plain form
2357 -39487 -129096 -190189 134459 312440 428966 40143 -226257 -148377 -12319 169282
2347 169282 -116204 -87334 11499 109383 43935 70687 78030 102742 -37085 -198741 -64127
2336 -64127 210902 73555 195633 177868 81403 -7938 -57541 297374 206584 194342 244626
2325 244626 133329 205413 188621 159860 6102 -178831 -452208 -251401 89230 300681
2315 300681 188410 135357 -56791 -9862 147366 176289 257735 -138064 -95062 -262326 -169803
2304 -169803 820 -56267 -118951 -35934 -121905 -193632 -195647 -114588 -298405 -162013 -72693
2293 -72693 -344333 30739 65260 -47693 39023 -134205 -148561 -42970 -7082 201974 -97403
2282 -97403 -66557 -85902 23853 59763 134866 36193 -29884 -75739 12641 34496 234038
$$ packed form
2357c9487q9609o1093L24648J77981J16526l88823k66400P7880J36058J81601
2347A69282k85486K8870R8833R7884o5448K6752P343K4712j39827j61656J34614
2336f4127K75029j37347J22078j7765r6465q9341m9603L54915r0790j2242N0284
2325B44626j11297P2084j6792k8761j53758j84933k73377K00807L40631K11451
2315C00681j12271n3053j92148M6929J57228K8923Q1446l95799M3002j67264R2523
2304a69803J70623n7087o2684Q3017q5971p1727k015Q1059j83817J36392Q9320
2293g2693k71640L75072L4521j12953Q6716j73228j4356J05591L5888K09056k99377
2282i7403L0846j9345J09755L5910P5103r8673o6077m5855Q8380K1855J99542
$$ plain form
2271 234038 319691 -33457 -258370 -215110 46171 -42978 9630 271251 316319 267595 378591
2260 378591 231409 -31226 -130530 111553 140701 59521 97000 -991 103629 -78677 -201037
2249 -201037 -166326 -161483 47449 -188885 -119289 28847 -65203 15323 302441 113465 17120
2238 17120 192635 185034 -15151 -41381 -26343 91262 -110346 -33213 -228501 -228009 129494
2227 129494 -102403 45410 73449 166091 -27887 186474 265750 61667 -33702 109186
2217 109186 398056 531798 520357 320977 6563 18031 209439 330211 182455 154811
2207 154811 199250 165908 269603 574464 382049 315156 405918 528756 508199 256020 189127
2196 189127 161204 180689 123129 260019 116493 151655 298585 284776 218440 272617 381845
$$ packed form
2271B34038Q5653l53148k24913M3260K61281q9149N2608K61621M5068m8724J10996
2260C78591j47182k62635r9304K42083K9148q1180L7479r7991J04620j82306j22360
2249b01037L4711M843K08932k36334O9596J48136r4050Q0526K87118j88976r6345
2238A7120J75515p601k00185k6230J5038J17605k01608P7133j95288M92L57503
2227A29494k31897J47813K8039R2642j93978K14361P9276k04083r5369J42888
2217A09186K88870J33742j1441j99380l14414J1468J91408J20772j47756k7644
2207A54811M4439l3342J03695L04861j92415o6893R0762J22838k0557k52179o6893
2196A89127k7923J9485n7560J36890j43526L5162J46930j3809o6336N4177J09228
$$ plain form
2185 381845 305397 304077 368495 469216 774555 568417 607255 523972 721217 594205 582871
2174 582871 442888 562191 835489 861315 618924 554046 854437 1024271 878426 889199
2164 889199 964191 902506 1303951 1183346 1003539 1191368 1246094 1068483 1039539 1142911
2154 1142911 1072166 1273090 1373471 1226243 1061891 1167471 1269463 1584600 1475606 1333294
2144 1333294 1314709 1413460 1626468 1595848 1876561 1699422 1872144 2063026 2261412 2175631
2134 2175631 2354375 2399360 2248970 2094902 2171260 2477152 2823165 2885624 2772527 2810377
2124 2810377 2976330 3423967 3566891 3724942 3938857 4147804 4441879 4612789 5057481 5426921
2114 5426921 5704913 6251885 6660598 7142996 8057892 8695102 9279191 9938145 10874546 11850104
$$ packed form
2185C81845p6448j320O4418J00721L05339k06138L8838q3283J97245j27012j1334
2174E82871j39983J19303K73298K5826k42391o4878L00391J69834j45845J0773
2164H89199P4992o1685M01445j20605j79807J87829N4726j77611k8944J03372
2154A142911p0745K00924J00381j47228j64352J05580J01992L15137j08994j42312
2144A333294j8585R8751K13008l0620K80713j77139J72722J90882J98386q5781
2134B175631J78744M4985j50390j54068P6358L05892L46013O2459j13097L7850
2124B810377J65953M47637J42924J58051K13915K08947K94075J70910M44692L69440
2114E426921K77992N46972M08713M82398R14896O37210N84089O58954R36401R75558
$$ plain form
2104 11850104 12997057 14187121 15776062 17590649 19095757 21103430 23073032 25120163
2096 25120163 27534137 30227112 32571034 34538292 35578798 35484625 33230217 30003131
$$ packed form
2104A1850104J146953J190064J588941J814587J505108K007673J969602K047131
2096B5120163K413974K692975K343922J967258J040506r4173k254408l227086
$$ [...]
##END NTUPLES=NMR SPECTRUM
##END=
