##TITLE=1H_CG-1179-a
 CDCl3+DMSO
 8 sc, 
 1.11.2023
##JCAMPDX= 6.0         $$ Bruker NMR JCAMP-DX V2.0
##DATA TYPE= NMR SPECTRUM
##DATA CLASS= NTUPLES
##ORIGIN= UXNMR, Bruker Analytische Messtechnik GmbH
##OWNER= root
$$ XWIN-NMR		Version 3.5
$$ Wed Nov  1 14:32:46 2023 Russian Standard Time (UT+4h)  she@DPX200
##.OBSERVE FREQUENCY= 200.13135
##.OBSERVE NUCLEUS= ^1H
##.ACQUISITION MODE= SIMULTANEOUS
##.ACQUISITION SCHEME= undefined
##.AVERAGES= 8
##.DIGITISER RES= 18
##SPECTROMETER/DATA SYSTEM= spect
##.PULSE SEQUENCE= zg30
##.SOLVENT NAME= DMSO
##.SHIFT REFERENCE= (INTERNAL, DMSO, 0, 15.9155)
##AUDIT TRAIL= $$ (NUMBER, WHEN, WHO, WHERE, WHAT)
$$ ##TITLE= Audit trail, XWIN-NMR		Version 3.5
$$ ##JCAMPDX= 5.01
$$ ##ORIGIN= Bruker BioSpin GmbH
$$ ##OWNER= she
$$ F:/spectra/data/she/nmr/H-F/1/pdata/1/auditp.txt
$$ ##AUDIT TRAIL=  $$ (NUMBER, WHEN, WHO, WHERE, WHAT)
(   1,<2023-11-01 14:31:37.57 +0400>,<she>,<DPX200>,
      <created by zg, POWCHK disabled, PULCHK disabled
       configuration hash MD5:
       00 E9 B6 7A A2 85 ED C7 34 08 36 98 17 FE 4E 26
       data hash MD5: 16K
       F0 F9 49 4B 3A 7B AB FF 8E 56 55 61 BE 9F 23 28>)
(   2,<2023-11-01 14:31:41.35 +0400>,<she>,<DPX200>,
      <Start of raw data processing
       efp BC_mod = 2 LB = 0.24 FT_mod = 6 PKNL = 1 PHC0 = -23872.78 PHC1 = 6.452709 SI = 16K 
       data hash MD5: 16K
       5D 3E D1 6D 12 D0 5E 2C 4C D5 89 FD 79 38 0C F8>)
(   3,<2023-11-01 14:31:56.62 +0400>,<she>,<DPX200>,
      <pk PHC0 = 1.176872 PHC1 = -1.4 
       data hash MD5: 16K
       BB 06 69 9B 25 BA 13 3D F4 D4 91 22 C7 3F 46 FE>)
(   4,<2023-11-01 14:32:00.60 +0400>,<she>,<DPX200>,
      <abs ABSG = 5 
       data hash MD5: 16K
       BA 77 E8 FE 76 7A 13 A3 3C 81 37 51 FA 91 AF 85>)
$$ ##END=
$$ 
$$ hash MD5
$$ E6 7D 81 B0 F6 74 28 4E 48 E2 2A A8 E5 BE 46 A0
##$RELAX= 
##$RELAX= 
##$RELAX= 
##$RELAX= 
##$RELAX= 
##$RELAX= 
$$ Bruker specific parameters
$$ --------------------------
##$DU= <F:/spectra>
##$EXPNO= 1
##$NAME= <H-F>
##$PROCNO= 1
##$TYPE= <nmr>
##$USER= <she>
##$AMP= (0..31)
100 100 100 100 100 100 100 100 100 100 100 100 100 100 100 100 100 100 
100 100 100 100 100 100 100 100 100 100 100 100 100 100 
##$AQSEQ= 0
##$AQ_mod= 1
##$AUNM= <au_zg>
##$AUTOPOS= <>
##$BF1= 200.13
##$BF2= 200.13
##$BF3= 200.13
##$BF4= 200.13
##$BF5= 200.13
##$BF6= 200.13
##$BF7= 200.13
##$BF8= 200.13
##$BYTORDA= 1
##$CFDGTYP= 0
##$CFRGTYP= 5
##$CHEMSTR= <none>
##$CNST= (0..31)
1 1 145 1 1 1 1 1 1 1 1 1 1 1 1 1 1 1 1 1 1 1 1 1 1 1 1 1 1 1 1 1 
##$CPDPRG= <>
##$CPDPRG1= <>
##$CPDPRG2= <>
##$CPDPRG3= <>
##$CPDPRG4= <mlev>
##$CPDPRG5= <mlev>
##$CPDPRG6= <mlev>
##$CPDPRG7= <mlev>
##$CPDPRG8= <mlev>
##$CPDPRGB= <>
##$CPDPRGT= <>
##$D= (0..31)
0 1.2 0 0 0 0 0 0 0 0.06 0 0.03 0 0 0 0 0.0002 0 0 0 0 0 0 0 0 0 0 0 0 
0 0 0 
##$DATE= 1698834696
##$DBL= (0..7)
120 120 120 120 120 120 120 120 
##$DBP= (0..7)
150 150 150 150 150 150 150 150 
##$DBP07= 0
##$DBPNAM0= <>
##$DBPNAM1= <>
##$DBPNAM2= <>
##$DBPNAM3= <>
##$DBPNAM4= <>
$$ [...]
##$SUBNAM3= <"">
##$SUBNAM4= <"">
##$SUBNAM5= <"">
##$SUBNAM6= <"">
##$SUBNAM7= <"">
##$SUBNAM8= <"">
##$SUBNAM9= <"">
##$SW= 18.05172834244
##$SWIBOX= (0..15)
0 0 2 0 0 0 0 0 0 0 0 0 0 0 0 0 
##$SW_h= 3612.71676300578
##$TD= 16384
##$TD0= 1
##$TE= 0
##$TE2= 300
##$TE3= 300
##$TEG= 300
##$TL= (0..7)
0 120 120 120 120 120 120 120 
##$TP= (0..7)
150 150 150 150 150 150 150 150 
##$TP07= 0
##$TPNAME0= <>
##$TPNAME1= <>
##$TPNAME2= <>
##$TPNAME3= <>
##$TPNAME4= <>
##$TPNAME5= <>
##$TPNAME6= <>
##$TPNAME7= <>
##$TPOAL= (0..7)
0.5 0.5 0.5 0.5 0.5 0.5 0.5 0.5 
##$TPOFFS= (0..7)
0 0 0 0 0 0 0 0 
##$TUNHIN= 0
##$TUNHOUT= 0
##$TUNXOUT= 0
##$USERA1= <user>
##$USERA2= <user>
##$USERA3= <user>
##$USERA4= <user>
##$USERA5= <user>
##$V9= 5
##$VALIST= <valist>
##$VCLIST= <CCCCCCCCCCCCCCC>
##$VD= 0
##$VDLIST= <DDDDDDDDDDDDDDD>
##$VPLIST= <PPPPPPPPPPPPPPP>
##$VTLIST= <TTTTTTTTTTTTTTT>
##$WBST= 1024
##$WBSW= 4
##$XGAIN= (0..3)
0 0 0 0 
##$XL= 0
##$YL= 0
##$YMAX_a= 86754
##$YMIN_a= -115630
##$ZGOPTNS= <>
##$ZL1= 120
##$ZL2= 120
##$ZL3= 120
##$ZL4= 120
##$ABSF1= 15.85818
##$ABSF2= -2.193671
##$ABSG= 5
##$ABSL= 3
##$ALPHA= 0
##$AQORDER= 0
##$ASSFAC= 0
##$ASSFACI= 0
##$ASSFACX= 0
##$ASSWID= 0
##$AUNMP= <proc_1d>
##$AZFE= 0.1
##$AZFW= 0.1
##$BCFW= 0
##$BC_mod= 2
##$BYTORDP= 0
##$COROFFS= 0
##$CY= -3
##$DATMOD= 1
##$DC= 0
##$DFILT= <>
##$DTYPP= 0
##$F1P= 0
##$F2P= 0
##$FCOR= 1
##$FTSIZE= 16384
##$FT_mod= 6
##$GAMMA= 0
##$GB= 0
##$INTBC= 1
##$INTSCL= 3.70164e-10
##$ISEN= 128
##$LB= 0.24
##$LEV0= 0
##$LPBIN= 0
##$MAXI= 10000
##$MC2= 0
##$MEAN= 0
##$ME_mod= 0
##$MI= 1.114404
##$NCOEF= 0
##$NC_proc= -8
##$NLEV= 6
##$NOISF1= 3.799351
##$NOISF2= 2.8
##$NSP= 0
##$NTH_PI= 0
##$NZP= 0
##$OFFSET= 15.91547
##$PC= 1
##$PHC0= -23871.6
##$PHC1= 5.052709
##$PH_mod= 1
##$PKNL= yes
##$PPARMOD= 0
##$PSCAL= 0
##$PSIGN= 0
##$REVERSE= no
##$SF= 200.129971197127
##$SI= 16384
##$SIGF1= 3
##$SIGF2= 2
##$SINO= 5.538805
##$SIOLD= 16384
##$SREGLST= <1H.CDCl3>
##$SSB= 0
##$STSI= 16384
##$STSR= 0
##$SW_p= 3612.71676300578
##$SYMM= 0
##$S_DEV= 0
##$TDeff= 16384
##$TDoff= 0
##$TI= <>
##$TILT= no
##$TM1= 0
##$TM2= 0
##$TOPLEV= 0
##$USERP1= <user>
##$USERP2= <user>
##$USERP3= <user>
##$USERP4= <user>
##$USERP5= <user>
##$WDW= 1
##$XDIM= 16384
##$YMAX_p= 365687230
##$YMIN_p= -1266759
$$ End of Bruker specific parameters
$$ ---------------------------------
##NTUPLES= NMR SPECTRUM
##VAR_NAME=  FREQUENCY,     SPECTRUM/REAL,   SPECTRUM/IMAG
##SYMBOL=    X,             R,               I
##VAR_TYPE=  INDEPENDENT,   DEPENDENT,       DEPENDENT
##VAR_FORM=  AFFN,          ASDF,            ASDF
##VAR_DIM=   16384,         16384,           16384
##UNITS=     HZ,            ARBITRARY UNITS, ARBITRARY UNITS
##FACTOR=    0.220516191357247, 1,           1
##FIRST=     3185.16257736297, 0,            0
##LAST=      -427.554185642814, 0,           0
##MIN=       -427.554185642814, -1266759,    0
##MAX=       3185.16257736297, 365687230,    0
$$ Real data points
##PAGE= N=1
##DATA TABLE= (X++(R..R)), XYDATA
$$ [...]
14006 -219131 -236254 117234 331829 -196732 -142162 -104046 -50468 213363 161384 -307392
13996 -307392 -552751 -302019 -114888 182615 -135826 -244305 -217700 -45909 -123180 -106003
13986 -106003 27458 48889 -179068 -233199 -273956 132615 213758 243279 361292 583065
13976 583065 574277 322014 214139 98832 225308 466155 -179548 -430730 -61603 115224
13966 115224 97025 234405 65012 -6729 101411 84459 -555 -316010 170517 191418
13956 191418 549085 617283 584467 322641 -152057 -225584 -259443 -211184 -17087 108110
13946 108110 -46808 259629 -88203 -201213 -206810 -29011 131895 201403 -141111 -240239
13936 -240239 -279677 -537685 -289160 340751 181445 -103550 -10859 -40780 221862 -133680
13926 -133680 -520216 -137256 -307490 -371166 -228670 -32781 -107317 174979 126968 20123
13916 20123 533720 109973 -173686 34226 -226968 -33210 315594 214344 -79336 53301
13906 53301 28468 -322603 -355368 -431688 205536 -162888 -8683 80386 72193 260751 380504
13895 380504 31969 -335629 -533252 -396309 -259744 75538 27970 274738 46394 91508
13885 91508 172580 49747 43641 -109054 -168637 -31431 -17502 -25069 355969 124579 110640
13874 110640 57459 -7723 -162070 46867 -268584 -678284 -268667 -97550 -48760 69938
13864 69938 57124 -169505 -23147 403402 581462 124025 -221428 217350 31381 375953
13854 375953 434840 445648 311288 71093 114551 190143 347239 -33368 -159647 280102
13844 280102 48185 100554 228139 -42425 6917 -222431 -489518 -328923 409182 144876
13834 144876 10999 357992 118018 -25168 -57485 31721 99173 193625 60663 388863
13824 388863 523024 190222 85020 -293728 -429317 -349916 -366662 -404561 -192338 -105459
13814 -105459 55109 319327 -16745 -16141 -276622 -273797 305806 295537 -6593 -191199 -422093
13803 -422093 -564536 -86737 156289 124128 -37007 -249293 -131705 20512 112489 -62749
13793 -62749 -628152 -205926 201682 595 -203730 -353236 -150823 213942 80564 345948
13783 345948 394151 24177 491627 708526 228514 74652 111485 -437189 -530826 -384574
13773 -384574 -224927 72998 -249542 -41132 17899 23401 94696 163584 38590 37437 167431
13762 167431 147345 -4177 137136 -123223 -14460 100809 16215 78750 -205394 -160236
13752 -160236 158410 -233181 -670482 -456177 -268325 212800 -169689 -100301 -13730 -170167
13742 -170167 -124997 -52258 -276829 -279503 -195531 102185 138436 30349 132600 91116 181327
13731 181327 331559 490145 322054 301841 480123 -22370 33522 -40757 -244242 -565900
13721 -565900 -316060 66066 -75556 -11963 -113620 -285253 -85980 -280153 -42389 -212467
13711 -212467 -160776 108817 237562 17095 41275 137683 333250 -180393 -478941 -213841
13701 -213841 92692 29124 -17584 235106 289426 509488 343826 422207 366448 290518 115797
13690 115797 -278958 -442513 186064 212640 -138573 -98246 267042 -726 324530 166330
13680 166330 -53806 -61968 62190 109493 -63190 -394090 -205106 -124410 258215 192537
13670 192537 614195 292526 -162258 -261585 -87594 19183 5721 40046 -284923 -353225
13660 -353225 -343476 -324681 -299159 -54127 31372 -113906 -184216 134783 229006 624233 105645
13649 105645 -404703 -572787 -269495 -14688 -16025 -401370 -318205 -396940 -218149 -83495
13639 -83495 -98460 192116 -91883 -603951 -440249 -292124 -171715 78231 -128541 -280956
13629 -280956 -266316 -22446 382129 641314 269586 165459 -266463 -405896 -625911 -511814
13619 -511814 38675 -74158 87217 434383 343962 483254 406328 84680 -536976 -353262
13609 -353262 -114357 -166050 8627 -255201 -179263 361890 401376 345852 490876 475816
13599 475816 376360 -23649 36295 382064 284006 440675 425486 217340 -75702 -376700
13589 -376700 -118395 -199328 -414179 -18266 257803 317206 423458 9233 -239521 -395045
13579 -395045 -266606 -317502 -109287 91139 -109989 -77346 -182710 39967 215753 -168209
13569 -168209 -175469 -204491 142659 -230041 -360828 284452 636299 38910 26434 54771
13559 54771 37765 50645 -555368 -205672 247236 -215315 -111557 79509 -85803 -152389
13549 -152389 -217498 -47211 6129 72081 165555 315429 20619 147941 152943 -127370 -346506
13538 -346506 -162647 15301 -242049 -195237 -11837 -367936 -191218 58255 168909 -45586
13528 -45586 -588322 -610053 -157873 88282 -9881 -14519 -806 -138034 -503423 -600404 -435577
13517 -435577 -144808 -429360 -626882 -550478 -228290 -235832 -158713 28726 -275187 -250101
13507 -250101 -264314 -284084 32483 45680 -133017 57035 117818 79899 255586 134487
13497 134487 -26591 18745 -297680 -628578 -380454 166865 -74510 -90643 -31219 188413
13487 188413 -46322 10134 -54488 186489 333271 133747 -166385 -662149 -180554 8243
13477 8243 75269 -135298 -136535 -738 -126098 -96733 -70634 -65176 24392 473968 478341 -79020
13465 -79020 -44154 106001 314634 401832 495284 409728 112683 -87712 -223274 -271801 -309208
13454 -309208 -387055 -523929 -185275 -123137 -271332 -33204 -182094 -66421 42372 -178380
13444 -178380 -160801 118452 186066 -183671 -380724 -446759 -369115 62309 -601101 -628556
13434 -628556 -381484 -250555 74851 172121 113856 -91266 -129437 -70886 -242837 63477
13424 63477 242246 -136548 -166901 -79433 -91007 -220525 81769 142669 111959 -42120 175090
13413 175090 285022 -130687 -208468 263659 94233 132948 187534 75527 235627 46020
13403 46020 310490 156654 319695 281991 -111017 -124677 -345929 -75694 -93768 -46617
13393 -46617 -589930 -467909 114802 106630 -152851 -370350 -253214 -518196 -378069 -2867
13383 -2867 -264539 -342155 -10974 11259 -160051 92403 -119670 -425987 -232995 157313
13373 157313 -71767 -265323 114869 113977 -86777 -240468 -18250 -86222 -485136 -354231
13363 -354231 -336466 113112 283533 -402811 -305555 -81134 56334 -6776 -518629 -383308
13353 -383308 -289973 -189949 -270193 -213698 473500 420593 -8475 -228691 389986 218806
13343 218806 126681 129174 166759 82072 2948 295642 203865 -155126 -143167 -224684 45009
13332 45009 376900 305511 104929 -284613 -153018 359442 347101 316162 91053 221311
13322 221311 122105 -49276 341532 400989 423633 248910 -122540 -170525 136455 192716
13312 192716 266154 -70240 -133727 18624 -9118 -445860 -444218 34039 -67284 61597
13302 61597 290070 367819 369312 202335 -4963 -98805 20355 -103901 81348 51340 14117
13291 14117 -4101 302917 30745 -177127 -414173 -457324 -300737 48374 207252 89527
13281 89527 82866 65772 337639 185881 197507 370622 301586 -98656 203510 321800 60162
13270 60162 -105018 -417314 -206578 -275239 -151751 -433617 -594066 81799 -16791 -115882
13260 -115882 -315021 -446973 -471307 -253636 -137916 -259052 -198477 -230013 -179467 -79333
13250 -79333 -30561 -91605 96393 59672 -30310 -79751 -540313 -395777 -320427 -343861 -223072
13239 -223072 147879 36033 -176208 204248 332189 433682 229711 -2884 194800 408401
13229 408401 369614 179068 68888 -202201 -311089 -337790 -396768 -78615 22936 104579
13219 104579 -197040 -227063 -177109 49499 227467 303093 286418 -88115 -251386 -198936
13209 -198936 -285270 -256884 28184 -6998 -272388 42737 34271 -589538 -644951 -405347 229324
13198 229324 394583 108679 -147453 -200003 -104697 -298167 -470269 -236010 -487645 -433079
13188 -433079 -391647 -363040 -464142 -797436 -737056 -476689 -469718 -303110 -101595 218911
13178 218911 259482 84204 238928 106721 -133316 145919 -15503 212981 273762 53961
13168 53961 -76568 -146938 -217828 64884 -135920 -315527 -523143 -246705 -199769 -99617
13158 -99617 -32976 16385 84425 -43779 43012 -74486 101655 99940 -137979 -410085 125314
13147 125314 -171196 -139158 -325684 -268222 -207173 152958 238753 267105 277611 -184451 -526155
13136 -526155 -168133 -100959 -195399 -286328 -221863 -327357 -396688 -324955 -360735 -197828 -329745
13125 -329745 -249866 56758 209371 340328 258188 120210 83245 5723 90787 393734
13115 393734 520789 95538 120637 -95658 -295580 109341 44743 179413 226797 285759
13105 285759 39901 -287492 -236933 -165356 -41799 173385 182139 133382 454661 84605
13095 84605 -329811 -550779 -341791 106092 52307 268992 -87104 211764 103017 -389891
13085 -389891 -27669 154689 -223210 -161812 -148349 134098 173652 41924 -209511 -68857
13075 -68857 39862 -165732 -545652 -25934 -116189 -391750 37347 -208686 -599374 -435168
13065 -435168 204828 144715 -61751 81577 168717 -425957 -132009 -181569 66194 195149
13055 195149 278909 227227 70057 132493 182181 -139609 -74940 289192 127727 -62060
13045 -62060 264616 174714 106309 -164551 137192 -230859 -133784 -199659 -201821 -377265 -213971
13034 -213971 212151 363589 406805 996 389759 328805 144732 251698 144510 -136509
13024 -136509 -42120 -314837 -505243 -320004 8975 -271647 -394077 -276194 65428 187148
13014 187148 -234971 -848093 -872999 -346576 -638376 -404208 155221 47302 137762 443358
13004 443358 320464 150492 -26221 69080 -1310 146078 -8546 210089 93169 -87338
12994 -87338 120773 47673 -184505 -257277 -133210 -25787 -159722 110011 23923 8950
12984 8950 -55110 203307 243508 -230024 -234663 -215562 -69488 50008 -183470 -151403 622738
12973 622738 241481 -122482 -221365 349987 482421 -171951 -145658 -67308 -268253 -117523
12963 -117523 -162468 -12326 62483 164734 20744 165940 16828 -177679 -60754 -86441
12953 -86441 101345 628620 429314 -82216 68967 223597 142797 124619 -122591 -157333
12943 -157333 62588 211715 158867 212256 382286 -128755 -269398 22246 -128161 -86125
12933 -86125 -658201 -217470 -262732 -341024 -57384 -191236 199866 -15058 -329920 -105763
12923 -105763 -11979 58802 126488 -292873 -674625 -69894 -235166 -88850 -276902 -286321
12913 -286321 -513238 -638310 -59850 -314501 -180786 -112134 -249526 -346462 -280625 -8204
12903 -8204 288386 421615 161199 163911 -147799 -52244 444723 466820 338108 172201 321226
12892 321226 -17766 178315 162277 19188 -209969 -5077 -78684 -324037 -85542 -2860
12882 -2860 -313082 211142 250598 170786 -273344 -268577 -16928 -165297 -81379 -319113 29426
12871 29426 106822 -57573 -246148 -541753 -404441 -123617 -154035 -300530 152761 -89579
12861 -89579 269833 -7264 -360191 -76482 -344445 -115184 -124397 -217180 -785176 -621687
12851 -621687 -451500 -331174 -207734 153300 25470 -213987 -41336 -319715 -555060 -482704
12841 -482704 90724 -237753 -793774 -553726 -297808 -389381 -211781 -12320 -324690 -465424
12831 -465424 -95361 47657 81770 60385 383750 -186001 -507961 12412 264398 88112
12821 88112 -47236 -46963 283440 505001 129251 -147282 -36766 123381 -128109 37059
12811 37059 78631 -107548 -87081 -329032 -171143 6335 1617 -156648 -155934 -55577 -129261
12800 -129261 -286867 1208 -100182 -131780 -263483 -462407 -551163 -87091 -235109 -399788
12790 -399788 59207 -143894 -289238 -85050 -3656 -56181 529391 350937 175064 180977
12780 180977 106124 214181 48336 -243496 85670 150106 444485 450076 439420 228704
12770 228704 102065 -178753 259862 31793 70523 248578 381312 389914 87961 158819
12760 158819 35485 -217187 -293323 72329 -76502 -127022 -55940 -209961 210209 339251
12750 339251 117779 290541 73215 -79509 -198891 36478 -194235 -139441 -191872 -137598
12740 -137598 191507 196757 328755 369925 -78208 -319221 -119472 -129512 -115669 -344198
12730 -344198 -74594 -58410 -103003 265852 124853 79583 -244750 -14882 207872 -14284
12720 -14284 186316 -26684 -134543 -66867 -402305 -620034 -447725 -319673 -21888 -60768
12710 -60768 271164 -125082 -572275 -323486 -223884 225319 -15458 147769 20534 20199
12700 20199 146309 -176418 -134372 292781 -55502 53089 238698 -249493 -189713 -205621
12690 -205621 -266915 -391242 -165883 -118765 -177630 -255143 -488883 -568126 -231240 71944
12680 71944 53248 -28805 -118930 -104757 -204811 -517253 -248312 -112504 -260942 -3936
12670 -3936 -32452 72332 129985 49976 -112359 76689 -68014 -8555 -161858 -318377 -362135
12659 -362135 -308007 -223114 15782 112160 -365744 -255627 -106442 283193 265291 206075
12649 206075 -77230 -466984 -593241 -126907 -146879 6140 -121575 -446757 -450418 -76094
12639 -76094 -86983 -329382 -254283 -228730 -256819 -161244 -2441 15738 -196949 -360678 -338310
12628 -338310 -7192 -175895 -12229 387432 -102768 -215826 142435 119559 225496 253330
12618 253330 -208383 -234550 308482 -23015 364541 570080 363229 318647 -115586 283419
12608 283419 409 202703 -9051 24294 160629 315929 44625 -242742 33094 29842
12598 29842 -195083 -230689 50305 260814 -169188 -411607 -302793 -100688 -346399 -116323
12588 -116323 64808 -124229 -518519 -282585 -65040 -208649 -6269 204028 115893 -255192
12578 -255192 -323041 -469873 -389589 -228384 -497248 -86781 72974 187037 230609 -93559
12568 -93559 245284 250997 741699 608072 119637 -253280 -111027 221959 53310 -340452
12558 -340452 -439229 -162644 -222654 -112491 -222981 215730 344286 318539 525719 462024
12548 462024 -330098 -277468 40480 246801 577777 -132317 -303717 -109126 -66872 -387593
12538 -387593 -410927 -198294 -82552 -41704 25932 209095 -103945 -220189 -124493 -429143
12528 -429143 -426888 -448827 -352120 -184714 -268943 94520 208162 -245214 -271521 46476 -176721
12517 -176721 -334958 -565251 -505944 -97485 -190990 -248559 -149213 86535 -225439 -518889
12507 -518889 -142937 79227 176034 60427 -416580 -177032 -187700 -235454 -63689 -272265
12497 -272265 -1068 555724 373690 358216 469800 284224 197390 -74703 -282055 167282
12487 167282 203573 -85597 -654505 -453113 -158145 -118236 -205681 -553900 -442990 -63362
12477 -63362 42787 214586 147930 42078 -104403 -231179 -179020 -315821 -136556 -149379
12467 -149379 -149592 -21329 -88325 -357979 -133531 249939 299857 195080 -105561 -84162 18853
12456 18853 124365 206085 64999 -418413 -427927 -65090 326150 113825 -84686 -78553 -29814
12445 -29814 -129330 41769 -53092 -158544 124888 1820 -249777 -172573 -160553 86155
12435 86155 9916 -333849 -614740 -307835 -172151 -302052 69991 474220 445423 -38240
12425 -38240 207033 62498 -147776 -263308 70036 -615662 -310927 -254018 32027 145207
12415 145207 -276230 -305658 -243792 -422109 -54066 226795 171204 335057 479268 214639
12405 214639 57077 355083 91053 210560 173381 394369 223614 192422 -139391 -150156
12395 -150156 141975 316572 325068 203826 496661 544745 533026 105742 104897 28731 90161
12384 90161 341845 454449 716462 62308 -190840 -287499 -332427 -393952 71990 41700
12374 41700 357244 294721 -155002 -28745 321106 182488 -246040 288437 111183 -139471
12364 -139471 -154491 -194025 -476020 -517797 -601778 -10140 367431 420703 184808 66363
12354 66363 10302 -347022 -213920 223674 120383 24181 196381 75610 40991 216877
12344 216877 -166254 183641 346117 149789 -277774 -392702 -448971 -279245 201581 160161
12334 160161 -46513 -371652 -373523 48704 142786 41368 15982 -230602 -455935 -393424
12324 -393424 -86435 -409822 -286339 -290528 -283645 -211071 -440277 -225742 -139669 83847 331210
12313 331210 -212748 -392825 166265 183287 -49643 -128979 827 -27806 -345501 -321370
12303 -321370 -196015 185647 391313 181004 27815 -404267 -336231 -161629 -460204 217868
12293 217868 418208 273319 -9414 28794 537122 393475 284584 411004 303064 -164033
12283 -164033 -118565 38439 192682 -40082 26307 110681 -341803 -317885 24940 189403
12273 189403 163531 -107473 -244501 -107968 -480092 -347397 -237431 -146557 16076 117543
12263 117543 -18686 -186982 -356800 -242690 -35700 342228 -454600 -470026 188792 -79536
12253 -79536 -294901 -416099 142672 421673 61408 204925 199144 205885 -137141 -162027 264271
12242 264271 243393 121706 163605 150207 130439 312713 -98613 46905 536819 438969
12232 438969 138406 -289302 -207672 -203545 -253993 -54097 -172475 -354586 -429589 -249242
12222 -249242 -176718 -296421 -2328 24572 296107 31819 10510 -9206 -208466 -258759
12212 -258759 21797 37108 -27141 176512 236254 15247 34843 -129938 -317348 -81212
12202 -81212 252619 262355 -125162 -554390 -362037 -349677 -346641 -305845 -403020 98736 383435
12191 383435 118319 -21456 -76614 51235 63732 -247545 41286 -8434 109357 125608
12181 125608 199923 187283 244904 -67922 19361 -2328 34160 17707 -20862 -62226 -18422
12170 -18422 -188619 149179 -96721 -50994 -54043 -159985 5277 -215924 -18837 493369
12160 493369 280597 382253 -226285 -261633 -116800 -58030 123779 -45862 -70133 198574
12150 198574 260900 552444 -89120 -415731 50431 45215 -119733 3301 -227335 -253215
12140 -253215 -281267 106757 21472 -197364 288541 180867 137060 124739 155949 221064 107623
12129 107623 -5736 82959 131333 109671 -79249 80082 294694 -126975 67254 350855
12119 350855 61925 438710 -48325 3981 253917 262112 239483 -1814 -336501 -128950
12109 -128950 -192591 -179459 -62867 -150576 -244238 238647 267270 132166 293427 318091 32369
12098 32369 -175130 -100308 408072 572787 69299 -238420 -67037 51799 -118706 34269
12088 34269 234493 -263256 -237770 17890 140684 -185205 86867 98239 -98590 9526
12078 9526 -246448 8674 322348 -52325 -55746 151190 150765 -109196 162710 83088 -86680
12067 -86680 -91448 -518266 -618258 -235518 -159317 -326355 -37477 205991 289336 185729 -6917
12056 -6917 -39575 399274 11654 -501215 -530399 -534881 91029 314617 102106 335384 496273
12045 496273 226475 -248003 -540224 -96581 32090 74328 151262 439894 262649 80794
12035 80794 -122979 -338475 -260231 -38045 255229 32835 103200 295925 -47960 -437890
12025 -437890 -408720 -77255 -274294 -3627 373020 205995 -61644 -52441 4098 -407304
12015 -407304 -340026 -4637 395820 -82948 -31881 155355 450127 -54317 -408379 -264540
12005 -264540 259329 210192 -101452 -150168 -235243 -69843 -95322 258411 400595 22189
11995 22189 -114926 -31098 -6802 50521 101942 -159804 -251538 28831 115739 -96163 -123657
11984 -123657 78395 488629 285932 57512 -2569 468452 90577 -245125 -183374 -99593
11974 -99593 -182271 160644 111784 -103608 -87716 -183392 93574 119773 26382 33739 -21867
11963 -21867 -249149 -129040 -105905 -37150 -235719 -421719 -350789 428415 284228 67701
11953 67701 485572 195397 -146770 267904 242395 -68388 -53640 31991 -222296 68649
11943 68649 589130 289858 -268753 -103979 -61400 -154930 -100096 196431 204559 64466 180370
11932 180370 326343 446121 63460 293309 637597 103651 23693 263655 -103791 24533
11922 24533 -21303 -332178 -86506 307392 576970 618171 619517 289983 23818 324303
11912 324303 163370 -268837 234253 746271 567953 387728 152481 267218 174607 183378
11902 183378 93652 192935 -109377 -2800 203607 151706 359719 -11028 -8127 -80657 218193
11891 218193 315672 292990 95123 85888 130366 -21388 -7708 129063 68874 11591 -458796
11880 -458796 -692818 -307744 -329953 -128384 137960 -77410 12526 392808 282059 -270130
11870 -270130 -243091 151983 182582 243620 20827 179705 -118625 -205791 -146309 -72519 -197678
11859 -197678 -76499 -139998 -374021 108422 -51956 -171763 -619415 -127900 -207128 -348262
11849 -348262 -75169 -201011 -97325 234064 192375 -215561 58024 28049 -106181 -150618
11839 -150618 16194 -96508 -22534 97465 107896 -86415 64936 88975 162570 82180
11829 82180 60770 -21333 -112097 -28133 -181146 223922 -253850 -444556 -453769 -255457 -264321
11818 -264321 -831802 -708983 -240061 -175534 -50169 182441 -29398 -2140 338054 363989
11808 363989 -237469 -258938 -157913 205855 495082 64749 -368531 -22737 -11534 -243129
11798 -243129 -31388 28569 457543 90491 -122449 -190003 -81246 -259357 -326656 -358881
11788 -358881 211409 11680 -163699 153616 113454 135433 -123625 -378209 -298527 -269743
11778 -269743 -89673 309269 189872 397362 173505 3901 28070 143516 279541 -32832
11768 -32832 -276441 -282510 -368097 -369943 -329338 -184348 -86294 -149604 -234147 -361847 -197747
11757 -197747 -109972 -700957 -156611 276417 193725 -66139 -196926 -171807 39789 65113
11747 65113 1935 269123 297199 268158 -145126 -99335 -52245 160493 -5695 -165547 263992
11736 263992 268624 251910 133422 48281 186250 68867 -94671 167975 88575 -61685
11726 -61685 -158266 14738 -7509 -102757 390207 276369 -95176 116344 145213 -24869
11716 -24869 -362548 -261438 306619 18665 -216416 -86197 160711 383689 300338 307205
11706 307205 -178367 -349061 70787 16255 316755 -6933 -342462 -50249 -88158 -100962
11696 -100962 265532 50161 74662 -37693 -531672 -402628 -504231 -49134 -175903 -311636
11686 -311636 -728539 -527910 22754 74902 -180015 -102429 -39350 -52016 245332 173134
11676 173134 -138664 -63750 -31309 -100521 313001 570366 451104 268740 120154 -145836
11666 -145836 214858 62642 86019 195604 300896 -21961 -209832 -169158 58456 362955
11656 362955 439956 384325 181893 184448 530153 705511 326853 237923 451246 115645
11646 115645 -9483 173733 286902 247677 -50114 -138294 68646 269979 131855 -294852
11636 -294852 -156429 -57848 20119 221002 -49467 263890 208837 134749 122419 90724 -26882
11625 -26882 -246995 -318496 222395 299242 322385 165514 246266 488711 258933 238363 407376
11614 407376 611336 380351 280305 243992 221704 523575 723453 492114 583062 434567
11604 434567 90060 23625 -38660 76941 247556 416560 480885 269966 339033 468661
11594 468661 564547 40960 -240127 338744 269493 -14966 -46455 285406 164601 -51901
11584 -51901 193669 491827 971450 483435 222559 488084 265919 466710 512186 774417
11574 774417 862336 254823 120415 473254 842344 720102 451503 203807 424837 742432
11564 742432 489024 670654 159329 -4937 398131 432607 880741 863792 514201 186167
11554 186167 232980 268949 354445 425472 484262 398811 673334 381673 141579 459329 260979
11543 260979 -434421 -257764 459425 492054 300792 216420 -85534 90541 483866 656283
11533 656283 404572 670028 543483 677800 666956 762825 807458 803935 735048 541698 275588
11522 275588 334514 266561 585679 666487 256378 550478 607015 868399 682928 929514
11512 929514 918382 543289 610521 529104 323557 1202025 869356 1005401 630619 612957
11502 612957 1060203 755784 318852 539312 1154083 1104896 1214258 1453351 1131029 931446
11492 931446 875697 464785 1074674 1358425 914893 907654 946608 847229 795457 1017714 1163661
11481 1163661 956423 1242413 1171391 874483 860189 741147 726854 767018 1081237 1698587
11471 1698587 1388205 1149321 1298746 575626 591874 1130011 1401734 1450207 1164442 1424500
11461 1424500 1495154 1360187 1637962 1481722 1428080 1017230 887066 1139335 1357078 1288351
11451 1288351 1549703 1319416 1394480 1114953 980485 1196563 1581764 1185447 1074877 1603242
11441 1603242 1668979 1859691 1972826 2097314 1684631 1323104 1651174 2060255 2125601 1841158
11431 1841158 1687922 2091794 2123564 2246390 2191230 2486016 2575050 2293891 1962113 2195755
11421 2195755 2362418 2329685 2360851 2304903 2553314 2702291 2170607 2114853 2580730 2834687
11411 2834687 3030556 2766234 3121694 3123375 2914675 3168515 3422505 3174434 3178194 3099247
11401 3099247 2709952 2822986 3100914 3017192 2993803 3567864 3729905 3925657 3750773 3539724
11391 3539724 3903916 4231448 4310171 4603274 4210604 4421230 4271395 4424159 4504313 4381074
11381 4381074 4631967 4918462 4958308 5229638 5203840 5732687 5465956 5185123 5275049 5518325
11371 5518325 5556553 5628463 6423791 6263764 5955998 5849610 5991222 6277558 6485559 6703536
11361 6703536 6729332 6854521 7103960 7003350 7243242 7199998 7213457 7353175 7383396 7417097
11351 7417097 7527006 7374268 7403081 7755979 7822229 7950298 8277629 8157359 8801239 8894889
11341 8894889 8933216 9234939 9043170 9109176 8887130 9623544 10054042 9718844 9770643 9973131
11331 9973131 10160948 10535483 10776943 10859136 11117423 11434713 11847301 12148336 12290518 11739381
11321 11739381 12117191 12206493 12792842 13357914 13044055 13046645 13356545 13507539 13622160 13992115
11311 13992115 14531329 14633334 14432240 14598347 15198138 15652540 15546088 15816155 15962724
11302 15962724 16409213 16758471 16754814 17050284 17273755 17277474 17587448 17818656 17963033 18146124
11292 18146124 17918895 17916547 18282842 18475203 18853064 19079461 19328094 19648814 19665712 19977296
11282 19977296 20312425 20370035 20057150 20373003 20826235 21214503 20933864 21075117 21434277
11273 21434277 21092681 21322089 21794682 21805730 21541660 21586730 21877894 22006939 22035361 21797957
11263 21797957 21547784 22065124 22553148 22816099 22728861 23192674 23081819 23192779 22835277
11254 22835277 23089925 23185741 22869680 23279997 23393337 23514041 23183667 23370594 23589030
11245 23589030 23768058 23611893 23384594 23474866 23403744 23444414 23272249 23333137 22830037 22856271
11235 22856271 22986944 22707999 22888803 22911979 22985235 22490458 22728251 22443294 21837464 21580958
11225 21580958 21568660 21685971 21431176 21411191 21829641 21521504 21412503 21342251 21687648 21591858
11215 21591858 21542753 21630926 21615868 21387340 21029432 21243021 21124121 20873186 21015677 21195467
11205 21195467 21083178 20764502 20407296 19991637 20062469 20517298 20276111 20188426 19747675 19605481
11195 19605481 19278633 19190418 19049046 19084566 19471776 19403043 18895838 18449612 18194213 17928562
11185 17928562 17984888 17556705 17474529 17388530 17620571 17409473 17245960 17111929 17028032 17086873
11175 17086873 16870445 16801759 16518659 16314292 16213287 16387616 16406393 16138690 15657816 15879148
11165 15879148 15652892 15780463 15786043 15817311 15875993 15765665 15237113 15064927 15145942 14955795
11155 14955795 14874238 14791153 15030534 15083429 15041631 15132505 15131157 15030216 14925379 14500233
11145 14500233 14558125 14490400 14671934 14372687 14306160 14690533 14347291 14430496 14737284 14790638
11135 14790638 14404221 14113784 14505974 14567136 14073344 13644962 13556173 13646215 13315839 13289007
11125 13289007 13354176 13461714 13432933 13429439 13268445 13100784 12893918 12737969 12650437 12889285
11115 12889285 12838716 12821374 12680840 12705664 12882566 12986608 12856797 12591774 12802431 12472248
11105 12472248 12514846 12706341 12377939 12575230 12557364 12058665 12071548 11879150 11712065 12036664
11095 12036664 11825721 11890803 12056980 11490098 11171216 11389076 11276426 11347019 11168528 10673417
11085 10673417 11097830 10735661 10928687 10987050 11006649 10944666 10812405 10899887 10997643 11523713
11075 11523713 11238398 10886280 10767300 10786780 11228403 10760865 10744201 10364790 9867745 10113540
11065 10113540 10276676 10322138 9975930 9861272 9785967 9851222 9483164 9135274 9439305 9502669
11055 9502669 9385672 9555749 9754205 9476499 9114675 8632237 8862777 8943972 8594612 8208972
11045 8208972 8316083 8546977 8137307 8362493 8295664 8354842 8475941 8184416 7943301 7829619
11035 7829619 7749381 7750625 7707866 7304290 7187078 7433207 7030142 7166228 7318347 6938590
11025 6938590 6857548 6948366 7084120 6908852 6701724 6506962 6281235 6369581 6029020 5884090
11015 5884090 6373909 6527639 6240216 5859951 5727798 5764635 5698838 5355822 5203683 5552739
11005 5552739 5835270 5716605 5374186 5549954 5589263 5535681 5677000 5105799 4735418 4555251
10995 4555251 4533221 4672102 5282177 5082371 5004634 4968571 4856176 5017780 4933218 4687344
10985 4687344 4451991 4470284 4691201 4549043 4661365 4357615 4418833 4517345 4054226 4132031
10975 4132031 4462387 4233056 3942995 4326361 4062279 4003622 4130862 4207903 3900240 4051454
10965 4051454 4034063 3758460 3259842 3434767 3350872 3253239 3723877 3790875 3193430 3152066
10955 3152066 3275967 3666955 3795775 3387886 3131114 3244087 3343628 3255238 3463718 3313864
10945 3313864 3008183 3038417 3269457 3339299 2971162 3172984 3242676 3418239 3539881 2984969
10935 2984969 2819327 2588451 2641497 3000822 3221982 2899671 2905595 2851868 3197875 2967925
10925 2967925 2572594 2461103 2544619 2644390 3037216 3015467 2392541 2359405 3061997 2723534
10915 2723534 2794569 2963813 2108775 2467092 2467292 2447326 2268243 2512633 2750680 2484454
10905 2484454 2511464 2384224 2191598 2033582 2124392 2353043 2074482 2412855 2164806 2046334
10895 2046334 2111564 1791121 2115283 2069165 2330267 1965776 1940148 2227936 2269323 2270197 2204364
10884 2204364 2121173 2282519 1801010 1944832 2417977 2330010 1608473 1632147 2079645 2230560
10874 2230560 2135796 2257467 2067552 2218149 2201981 2002283 1953345 1572813 1447560 1462283
10864 1462283 1516059 1323459 1720935 1883750 1880896 2018578 2044545 1750211 2221488 2351143
10854 2351143 2204912 2041129 1492280 1288982 1610240 1351747 1678514 1814916 1591148
10845 1591148 1517513 2007224 1662721 1561614 1263965 1411160 1339448 1629080 1733661 1781723
10835 1781723 2181604 2309906 1637715 1551122 1729153 1589611 1540330 1559646 1805942 1407914
10825 1407914 1364802 1707324 1655125 1369175 1510493 1554932 1766332 1564786 1682008 1748556
10815 1748556 2165197 1654588 976367 998399 1104860 995013 882561 772872 1044286 1125906
10805 1125906 1304751 1299399 1112894 892108 910038 907338 1244446 1537985 1041032 753413
10795 753413 792148 1071509 1362938 1285398 1328083 1182739 1164536 774631 721806 1037298
10785 1037298 929388 1117104 1103998 804592 650299 1286881 1573983 1273056 914229 747100
10775 747100 983629 892578 982356 1309113 937064 585555 729179 909083 751095 594645
10765 594645 755467 766836 861266 675371 521930 502001 532744 828708 630802 385189
10755 385189 640915 440883 705251 499585 536371 774721 683005 788083 1012561 896460
10745 896460 602152 458532 804062 794941 532483 569381 208286 562985 384018 268355
10735 268355 611296 626193 867557 1021595 1290901 990280 277768 409361 273843 327344
10725 327344 311623 -61874 337830 336266 -132026 437945 771854 809464 628923 591954
10715 591954 571290 812026 739262 374716 407741 440458 531485 721003 747483 490201 85746
10704 85746 -72814 310088 224039 -130339 -422653 79711 518570 613461 518790 541886
10694 541886 418416 869017 1239558 909983 561641 448361 561344 475834 169450 -158767
10684 -158767 93315 308423 140586 34211 46010 106912 507790 365379 166081 421386
10674 421386 616798 416905 328604 343958 249416 322634 132132 -53581 -226494 -69888
10664 -69888 311693 297214 -46271 -235246 -130052 -152403 89930 -150758 -38962 -26704
10654 -26704 75198 346921 588846 249327 -8124 271594 237801 -144556 108629 321020
10644 321020 327343 398871 73985 126684 83920 -249348 -19158 -146094 557854 530906 377891
10633 377891 -89864 34386 300952 -91965 296630 750094 782385 693239 247499 48925
10623 48925 146511 231894 599881 289474 200232 -113277 -163888 14137 145100 34024
10613 34024 114037 358861 516123 261144 128908 148896 491091 512171 412211 70602
10603 70602 -101172 26870 349486 571197 687114 569537 618391 674712 393088 89929
10593 89929 351565 175276 256953 336165 299031 953793 635859 804572 483496 32423
10583 32423 301281 534361 780894 646020 473509 390952 527008 327068 212915 310757
10573 310757 316708 30828 247772 161549 431324 561656 435881 363081 536162 511291
10563 511291 570586 402506 396145 389229 341323 -204722 -555295 219098 368488 142152 -256950
10552 -256950 158316 207726 244068 522832 72053 -216953 264438 60631 -211297 -6358
10542 -6358 168437 -16012 -118707 322788 114090 26387 374881 -35275 -210823 54826
10532 54826 192173 -399249 -18992 530851 238103 211437 430084 452667 113099 -150071
10522 -150071 -41318 297831 253882 414330 399013 213136 256955 212901 182865 412760
10512 412760 281261 70557 72322 -43709 81901 168197 245499 215789 -79386 100937
10502 100937 508071 500174 584390 468273 -43391 423010 -49158 -207874 -159480 -461886
10492 -461886 -144133 -103499 -413646 -311421 -21098 148560 -47639 164265 244140 200671
10482 200671 275611 126696 333562 170822 -182609 -116513 -70227 -536267 -560235 75837
10472 75837 231378 188306 526453 399572 253448 87432 321145 11758 -319650 82044
10462 82044 342830 370137 -15829 114961 417120 295577 -110875 -339717 104854 -104395
10452 -104395 33108 -137871 -343463 -318007 66203 16166 -155240 -9813 36082 61721
10442 61721 85325 56698 198346 -79250 -235423 -182199 107018 -16255 -417668 -200543
10432 -200543 -269556 -604464 -334113 -166495 -250571 -137519 -204686 -473174 -437976 -142204
10422 -142204 119864 634182 333131 -46282 -214435 -166534 646417 560298 315837 267377
10412 267377 634705 224565 -245008 -184998 242700 640882 438250 350223 113398 -38119
10402 -38119 -32306 -162587 -558275 -491105 -455934 -191736 113202 100217 105614 484868 86110
10391 86110 -354098 -330286 -124624 9246 -301369 -103781 103912 -129702 -8455 325139
10381 325139 -185085 -531282 -82853 202027 270608 69351 138443 164828 442949 418686
10371 418686 -148954 34226 -260004 -250241 -326686 -255641 -63111 67180 77360 -353680
10361 -353680 -31353 -300125 -83281 -514131 -65951 34289 -339120 29917 24480 40336
10351 40336 -203922 -265082 -328247 -221393 -110329 -33127 337570 289395 -236183 -486514
10341 -486514 -245478 -203068 -28767 252886 446604 344624 338269 273829 46076 217592
10331 217592 204096 -188853 -257473 -138371 82548 251702 -180567 -262053 -115776 -225864
10321 -225864 -360272 -295964 139789 -254374 -409705 -436274 -155767 -257022 119486 -102144
10311 -102144 295601 310521 -70002 -62300 46532 -44819 -300083 9984 96385 -139941
10301 -139941 175517 254160 -17445 254805 347210 139670 112702 319450 464955 182454
10291 182454 387499 523351 227612 384675 -72644 -99463 -114895 26459 315535 466478
10281 466478 156756 -110647 22256 17079 -91260 -178510 -398041 -478802 -712067 -211028
10271 -211028 -408446 554253 650334 441762 488026 271253 -9417 117907 -78929 -4000
10261 -4000 -63731 19174 304395 59195 -37861 138758 215596 -198067 -362724 -57834 -215389
10250 -215389 -196490 63881 206424 121114 -206570 -157943 68374 -22378 -368512 -185900
10240 -185900 -7957 -438405 -761735 -244172 -167894 -218165 -72744 -100741 -109109 -81783 -17193
10229 -17193 -32342 485709 595960 530469 437662 328269 427556 248950 -2190 -670 300919
10218 300919 556921 200197 179217 562226 278974 275033 286218 147639 -175905 -114333
10208 -114333 51835 351329 362135 61927 217300 199355 177698 -58947 -73949 -424954
10198 -424954 -171124 72180 -409045 -154760 -62812 -544229 -142748 136354 150987 252917
10188 252917 -310848 221786 180033 -241659 -256958 -2322 20245 639840 769408 564667
10178 564667 192615 -25028 -402694 -520831 -518912 -447922 229346 216221 -276104 -200930
10168 -200930 -172297 -230965 63842 66092 58287 -335573 -408649 -615737 -467891 -229437 -207053
10157 -207053 -67956 -26854 -12538 -128362 -216365 -40514 324636 118907 358347 -71711
10147 -71711 -473139 -72304 411161 231602 -11791 -98525 -198777 -201926 -317399 -71658
10137 -71658 -62919 273345 -97906 -358909 -318645 -693737 -482494 -190694 -261418 -433058
10127 -433058 -568595 -574819 -297520 -179081 -484508 -541136 -447299 -117641 -304734 -280272
10117 -280272 248463 -289005 -176996 -338303 -194783 -144300 133792 220845 439792 556450
10107 556450 173407 65163 259627 189860 395530 311069 217318 66221 19109 5038
10097 5038 192099 247209 297794 59970 -228604 -95196 -247900 2589 125410 312618
10087 312618 231986 196149 453086 189459 -205067 73575 -154790 145993 51762 -162057
10077 -162057 -221474 -439975 -227653 48634 -494069 -327773 -4006 -199632 -454187 -140214
10067 -140214 156605 99404 -121653 -213067 -538874 -608418 -58246 336337 -97406 -251915
10057 -251915 -25772 139777 80386 -84491 -152785 89950 -321091 -155622 -206415 216383
10047 216383 -81720 218025 455781 441492 799847 -139094 -412566 -320587 -358704 117285
10037 117285 235369 112998 346533 308613 507306 285724 -189318 -360883 -291633 -179272
10027 -179272 -23675 33643 157711 240221 574067 186186 -241368 -136385 185331 26878
10017 26878 -429822 -778298 -616683 -611408 -296682 -401443 -694048 -376204 -111453 -94951
10007 -94951 -325651 -405882 -168324 -3271 -432897 -614750 -480380 111830 241546 267238
9997 267238 127086 -314326 -226818 -91283 -10213 -4354 -340506 -213095 -266823 -259523 -457291
9986 -457291 -584657 -269506 88068 485525 185541 91693 -501295 -29773 -326939 -403969
9976 -403969 -456654 67182 175806 96933 336852 -145242 -381481 -469027 -204523 -607899
9966 -607899 -220643 -168033 -635982 -401668 -82285 35406 -89815 -48193 -64623 140501
9956 140501 -47472 -132582 314870 524766 257167 130721 87617 -171596 -265422 -187502
9946 -187502 371395 582738 127822 39154 -50603 -91345 5820 82203 144343 -283450 -70924
9935 -70924 -377017 -672840 -389138 -668991 -824481 -387007 -485995 -138889 -62656 184352
9925 184352 263693 441423 384311 358711 -20190 -31128 -34097 -84662 220494 165034 385723
9914 385723 130116 24887 -187657 -136903 -440972 -307562 -36792 225508 233511 477399
9904 477399 247377 119922 -148318 -216551 -214442 123287 131223 200927 331804 -67006 -74815
9893 -74815 32606 -191885 -380978 -227528 -155957 -121824 -112869 -339941 -722788 -441159 -134149
9882 -134149 -255410 -202197 -76272 -175912 -268154 -210775 -86156 45036 -9346 -141600 -71747
9871 -71747 -241768 -248133 116391 -13882 239678 82394 -284057 28744 -261921 -41254
9861 -41254 -341007 -692235 -355623 95962 -155109 211604 388816 530682 75660 -23084
9851 -23084 94913 -283237 -110692 597965 246794 -372091 -369212 -381466 45439 466931
9841 466931 72823 105371 527789 132199 161960 136211 -4074 -166081 196407 138274
9831 138274 250008 168559 -204190 -323747 -89634 155014 248750 -125560 -384220 -259828
9821 -259828 -428461 -301538 -145179 -138343 -288350 -49360 -17371 -58086 -327256 -293452 114173
9810 114173 -5612 -243178 -512469 -421200 -509159 -506749 -155297 -232189 -68092 -294101 -303606
9799 -303606 224856 120282 -177057 433803 587043 146347 98566 -184240 -279052 -352549
9789 -352549 -22529 85740 -281485 -459935 -135904 118302 26607 -61428 -54102 -185298
9779 -185298 -105395 308442 65605 17202 -324177 -273842 28179 -273068 -398400 -23349
9769 -23349 309364 -65771 -9063 -106162 -344467 -384760 165995 377807 544434 93432
9759 93432 -38445 116877 120282 246334 240291 134682 -264167 59465 -377692 38920 172371
9748 172371 -127052 -292150 -302076 -270783 -137424 -160580 -474280 -332459 -371732 25820 293932
9737 293932 8444 212421 280426 35182 20852 302304 307920 -93400 402469 369011 103172
9726 103172 87973 196443 205581 167550 803291 772237 482288 18933 169388 602251 561870
9715 561870 538787 152815 30340 -209750 -192768 -100814 145091 416261 111689 -3981
9705 -3981 170274 16427 -30290 -173052 271853 252030 151227 588579 388947 -222863
9695 -222863 178232 664915 553372 247993 505245 348666 17220 -11101 262902 -4718
9685 -4718 129775 267892 184216 369854 329905 288939 44875 92689 334663 553252 792499
9674 792499 418577 -89690 -91170 157167 288811 202840 194423 115324 -246636 -266879 97369
9663 97369 223840 362192 213774 287950 -316358 4620 292055 372130 523752 489429
9653 489429 696317 741601 735316 718603 641348 338150 -42118 42005 154384 248612 288547
9642 288547 642832 627812 526713 587532 592614 227071 -130420 59651 445718 446710 596631
9631 596631 833121 1109078 731576 194960 219494 306660 377490 798598 940668 1311770
9621 1311770 1359332 1271991 1676628 1590406 1321927 1719387 1845496 1875053 1744292 1490683
9611 1490683 1939435 1659885 1296851 1095396 1006118 432781 397132 809274 798959 475334
9601 475334 737581 937176 1006499 1190927 1240675 1234142 570321 870750 1252219 1375455
9591 1375455 1194362 1685449 1977696 2414115 2729189 2747283 3557266 3676868 3720581 4157821
9581 4157821 4433996 4800653 5429782 5352783 5213868 4637175 4098992 3549048 2885320 2605778
9571 2605778 2497963 2503951 2364391 1807183 1422265 1098109 1064269 1076450 854502 1005272
9561 1005272 869291 635017 674871 1028307 993577 756817 933661 577030 456157 541596
9551 541596 567277 1029389 1095838 755025 903809 626795 655936 960864 1120450 789641
9541 789641 705878 419475 542090 630559 636785 156445 -163978 -244412 -196706 335844 656936
9530 656936 142696 116735 -20378 116294 424422 43863 91417 130105 459867 557736
9520 557736 716783 769296 237150 -141958 -81776 487512 685796 423960 719512 434462
9510 434462 486590 656182 710953 1005452 734031 160957 457786 545985 373873 656666
9500 656666 441710 52141 342189 340761 55384 526401 567130 227462 523080 213267
9490 213267 684594 445263 783458 1054640 751776 809234 809957 741502 767903 723625 1030816
9479 1030816 851685 438405 442493 402430 590606 617434 531141 438933 621827 831968 1076210
9468 1076210 816801 574233 423987 439263 220106 280479 215660 161337 110893 304599
9458 304599 754161 971688 644207 591386 750301 733616 627786 548669 439825 410741
9448 410741 471531 383908 369203 553699 438539 219764 77931 -272121 -345972 -111315
9438 -111315 148789 259482 31026 178356 216086 -31317 57293 192657 -6903 178903
9428 178903 827834 639992 441282 501966 583150 456406 599976 1043445 850005 786746
9418 786746 803196 620203 696149 467552 478520 442572 677293 664906 1052456 1035256 859701
9407 859701 1234946 1599958 1523953 1086731 1345445 1328764 1096435 1136822 1072895 1239208
9397 1239208 1351653 1014089 1434243 1572915 1372880 1864391 2211909 2478122 2692850 2148459
9387 2148459 1885053 1818646 1812080 1801644 1780992 2285624 2340819 2236772 2345618 2266231 2252605
9376 2252605 2652461 2749961 3329885 3109751 3006312 3416612 3301756 3601370 3409165 3507546
9366 3507546 3759927 3690793 3460508 3358704 3178462 2787569 2490639 2815550 3292102 3054993
9356 3054993 3262385 3583563 3608275 3455227 3351548 3726446 3834524 3660171 4321775 4302373
9346 4302373 4024886 4218372 4682782 5079323 5327212 5916267 6088332 6261294 6392965 6748317
9336 6748317 7097709 7066742 7128286 7076732 7155306 7585861 7796907 7792443 7935454 7685727 7779971
9325 7779971 8435915 8575600 8333007 8492447 9321228 9485963 9983519 9755170 9722618 10157340
9315 10157340 10535912 11264370 11917105 11989801 12444343 12692966 12936818 13072662 13609200 13994271
9305 13994271 14852298 15172700 15521856 15840395 15902732 16455467 17200917 17667942 18411777 18807914
9295 18807914 19071735 19836010 20307403 21015419 21613305 22887780 23652415 24812242 25697072
9286 25697072 26593464 28198675 29966424 31595250 33012821 34383396 36488866 38108298
9278 38108298 40502146 42848887 44767751 47606916 50969667 54674115 59161852 64582236
9270 64582236 70574739 78532900 88121587 99413349 112927719 127746075 144358368 162017330
9262 162017330 179179195 195202146 208941616 218872240 224890737 226397237 223671806 217231319
9254 217231319 206342716 193015017 178390335 162263879 146543964 132050019 119199389
9247 119199389 108611929 100319290 94130777 89618718 86479832 84400716 83160754 82752097
9239 82752097 83281581 84591890 86679054 90222496 94934531 101277050 109120168 119425060
9231 119425060 132182620 147018289 163396791 181353308 199194879 216082698 230044976
9224 230044976 240572686 246643904 248459784 245304756 237505479 225884994 210222152 193002678
9216 193002678 173748413 154362747 135690318 119390380 105242963 93572465 84032801
9209 84032801 75989668 70007831 64841229 60022104 56681977 53866745 51293653 48079113
9201 48079113 45126563 42808685 40378709 38368566 36834838 35420505 33594989 32024496
9193 32024496 30862808 29931962 28989070 28030864 27206691 26206580 25331322 23901045 22791471
9184 22791471 22336669 21677786 21077911 20020747 19778199 19321222 18799722 18303699 17590890
9175 17590890 17065826 16675510 16282190 15462363 14448665 13531708 12726728 12387144 11824077
9166 11824077 11266832 11331105 11382414 10897160 10566732 10333593 10322976 10150940 9613664 9424423
9156 9424423 9182181 8801768 8617308 8178102 7586429 7408907 7261274 6860161 6468802 6463523
9146 6463523 6374932 6503116 5698753 5413233 5525913 5312733 5180593 5641111 5850513 5690031
9136 5690031 5706401 5823787 5856608 5631313 5075048 5108078 5079087 5137161 5237253 5092148
9126 5092148 5191632 5217652 4927355 4855202 4632514 4897895 4658949 4415705 4333751 4185169
9116 4185169 3706973 3318941 2971018 2957197 2992458 2833213 2855798 3127657 3050852 2870934
9106 2870934 3196407 3119819 2739694 2753172 2482585 2634752 2981304 3064919 3418836 3603783
9096 3603783 3943672 3755900 3747253 3090351 2884089 2928902 3463012 3523819 3735202 3817621
9086 3817621 4451007 4185087 4264289 4181096 4286678 4084670 3912603 3557876 2907326 2972172
9076 2972172 2825824 2737756 2379379 2263071 2956127 3362621 3649931 3273307 2891571 2809673
9066 2809673 3120261 2715931 2563834 2653596 2640982 2761363 2945051 3002994 3015803 3274739
9056 3274739 3127731 3233351 3487716 3832326 3399996 3338663 3711579 3851764 3995425 4206770
9046 4206770 3961869 3979370 3789341 3689804 3080103 3099283 3100820 3054594 3047897 2616048 2750197
9035 2750197 3236082 2949496 2938960 3057065 2976294 2520492 2829464 2456718 2270325 2215507
9025 2215507 2360474 2226894 2256182 2135411 2022225 1950536 1976215 2074923 2086840 2381401
9015 2381401 2310387 2153148 2183588 2189064 2227103 2553687 2537070 2397821 2679691 2443239 2574480
9004 2574480 2412647 2317228 2353139 2071112 2055137 2009774 2392847 2504796 2622376 2553238
8994 2553238 2573200 2670761 2533011 2796002 2721170 2113303 2569461 2628141 2375293 2329676
8984 2329676 2399523 1700538 1541958 1646756 2056777 2261647 2332618 1961377 2185577 1900305
8974 1900305 1541128 1641379 1463863 1593225 2296947 2043858 1688317 1564135 1530590 1886966
8964 1886966 2141544 2389277 2049733 1993754 2062286 1938579 1983547 2543043 2577103 1877752
8954 1877752 2180174 1882584 2041853 1960520 1528898 1426392 1521646 1717730 2090997 2047094
8944 2047094 1730484 1653635 1825741 1666979 1660754 1897659 1917133 1964417 2035093 1715369 1691056
8933 1691056 1948000 1516492 1638458 1765929 1761581 1737938 1640445 1632228 1971478 1949886 2088962
8922 2088962 1544172 1785856 1815266 1939256 1788659 1736588 1924674 1645651 1305913 1246044
8912 1246044 1360358 1206902 1388421 1801575 1798815 2048090 1849480 2018157 2066725 2191553
8902 2191553 2447167 2410737 2583668 2497002 2606673 2842721 2853351 2913363 3071005 3033747
8892 3033747 3053466 2691159 2362810 2511035 2216258 2324748 2242881 2397819 1984465 1969010
8882 1969010 2156947 2332385 2312277 2389162 2368876 2331790 2571555 2494836 2465186 1989760 2415267
8871 2415267 2490033 2521376 2522801 2718386 3267179 3421235 3902384 3656504 3740335 4188734
8861 4188734 4375639 4124596 4050640 4236153 3790609 3586907 3550539 3578882 3720625 3770470
8851 3770470 3791396 3783366 4137455 4273450 4018150 4235076 4669673 5179696 5172939 4995081
8841 4995081 4960498 5250648 5172581 5177661 4805245 5069802 5160266 5354194 5254541 5361471 5186416
8830 5186416 5181349 5685107 5999133 5793067 5767937 5824069 5697123 5853305 6243434 6036771
8820 6036771 6312203 6674070 6627682 7051923 7668325 8176309 8346174 8660464 8683567 9013198
8810 9013198 9794433 9787325 9663715 9863403 10107963 10478596 10398487 10545465 10694114 10587714
8800 10587714 10652055 10743105 10560154 10671677 10913447 10691518 11147042 11471639 11609744 12107893
8790 12107893 12159263 12691108 13071357 13356409 13876985 14205885 14335245 14437957 14924048 15371962
8780 15371962 15789165 16204251 16493230 16780744 17045140 17877671 18009876 18335976 19126549
8771 19126549 19991010 20288896 20546076 21150207 21875872 22461956 23580861 24606296 24987730
8762 24987730 25995980 26853496 27839738 28501504 29283177 30846046 32002773 33488707 34404557
8753 34404557 35565449 37113437 38431975 39720877 41226939 42615473 44474196 46583990
8745 46583990 48172729 50770409 53934947 57247156 60611512 64808380 69468663 74328834
8737 74328834 80514205 87434812 95844402 105489899 115885711 125694396 134475767 141774330
8729 141774330 147250014 151962082 155456839 155957373 154085057 150469200 144134016 137078328
8721 137078328 129192386 121043640 112476711 105359822 100656293 98114344 95855056 94457343
8713 94457343 94486978 95100043 96010665 97955772 100578594 103432334 107459982 112191962 118505217
8704 118505217 126678174 136795351 149362114 164234002 182497388 204758013 230320367
8697 230320367 258079080 285438253 310907344 333105051 348184057 356725625 363472298
8690 363472298 365687230 358096219 345368777 329615034 308567602 285723671 262452824
8683 262452824 236886816 211435164 191636180 177823419 168209678 161499822 158409077
8676 158409077 158336143 160058648 164142057 171355909 182398074 195896408 209789531 221917182
8668 221917182 227029866 225915893 222852861 220503063 218980109 213543651 201245486 183219148
8660 183219148 164666963 149282406 136597987 126181965 118491132 112982206 109631068
8653 109631068 106598365 104344100 103184374 102604856 103216839 105229410 109377920 114689563
8645 114689563 121206778 129580356 140646066 154736466 172445396 193088315 214234333
8638 214234333 231705469 240816663 242303707 242598408 243892440 244865403 240895231 226822990
8630 226822990 206169655 184765565 166495220 151550904 138577034 125803301 113993005
8623 113993005 104285299 96421376 89752029 83795514 78812987 74956246 72133620 69920684
8615 69920684 68269812 66307137 65063727 64525975 64989382 65910507 67602348 70490625 74020306
8606 74020306 78567034 84684929 91515700 100279391 108656393 114755250 116834557 114952662
8598 114952662 112212971 110443450 108600482 104476817 96560839 85897376 75616490 66566905
8590 66566905 59281151 53841647 49012418 45365698 42367140 39818765 37861476 35809303
8582 35809303 33913309 31858463 30459863 29144886 27895383 26596706 25546785 24955115
8574 24955115 24684511 24057552 23224283 23116321 22893487 22167269 22067664 22076224 21944781 21346377
8564 21346377 21693990 21416818 20644006 20465092 19842130 18936687 18907669 18945125 19043315 18830238
8554 18830238 18494851 18774257 18846721 18894776 18689079 18775448 19007721 18913406 19061617 18491947
8544 18491947 19092825 19294923 18892557 18911923 18697375 18656818 19256495 19406453 19207132 19067117
8534 19067117 19109176 19464548 19490977 19722956 19644022 19738122 19950218 20086276 20407579 20790637
8524 20790637 20775034 20767252 21353364 21516425 21883193 22448923 23372409 24088264 25030629 25862456
8514 25862456 26776597 27728425 28668843 29726514 30318664 31930118 32873428 33673072 34932399
8505 34932399 35868549 37136253 38752423 40488567 42408054 44332323 46135960 48578181
8497 48578181 52077372 56350118 61894817 68205818 75780910 84770179 95558208 108795432
8489 108795432 123165390 136341455 147206299 153457751 155580917 155774584 155579352 155636623
8481 155636623 155049525 151103044 142164205 130809643 118636077 106466885 96877171 89961192
8473 89961192 84726781 81209752 78757525 77498219 76933504 76778683 77928067 79770347
8465 79770347 82724580 86880486 92044604 99021815 107577626 118322018 131562610 146731050
8457 146731050 162652792 178124939 192643843 205471160 217202567 226319763 231581845
8450 231581845 231675203 227671417 219640637 210014336 198489873 185054705 169781966 153034557
8442 153034557 135732470 119502778 106830733 96954689 88642124 82314174 77869024 74266548
8434 74266548 71452042 69296810 67556096 66709547 66961607 68106347 69976577 72744939
8426 72744939 76721343 81881688 88547595 96014845 103399043 109998022 113859343 114216465
8418 114216465 113715831 112346701 110676162 108644103 104284261 96659581 88031295 77946139
8410 77946139 67935455 59558549 53390548 48464236 43706136 40230899 37165816 34777434
8402 34777434 32767298 31062078 29760804 28448973 27222959 25499320 24352491 23308015
8394 23308015 22239318 21298215 20656766 19673010 18783561 18224184 17770914 17276065 16615102
8385 16615102 16222187 15671406 15033104 14596165 14081987 13155891 12882753 12568729 11615572
8376 11615572 11159088 11009185 10622926 10190184 9829367 9611597 9482569 9395807 8709610 8690170
8366 8690170 8949651 8915553 9344852 9383076 9403980 9551073 9540549 9304940 9213527 9224200 8640728
8355 8640728 8400440 8460339 7938706 7986922 8118601 7341299 6771731 6521305 6275378 6051806
8345 6051806 5967389 6287313 5602373 5353879 4742183 4575424 4395423 4011576 4242834 4221946
8335 4221946 4508063 4299510 4358923 4135063 3592051 4107150 4530299 4526195 4518932 4908600
8325 4908600 5139875 4886408 4768406 4931456 5313887 5284449 4884685 4916495 5141329 4964649
8315 4964649 4775300 4530103 4446603 4525143 4317227 3839106 3750016 3657562 3872314 4099813
8305 4099813 3555561 3102876 3578853 3765682 3397776 3351504 3155943 3129750 3184416 3339262
8295 3339262 3216822 3065441 3047159 3129430 3040709 2893414 3134349 2934651 2621026 2798317
8285 2798317 2932733 3005146 3381015 3157180 2849018 2803058 3233507 3689147 3567280 3522376
8275 3522376 3621632 3409677 3516797 3552159 3571751 3583780 3641423 3250401 2873276 2942527 2885033
8264 2885033 2988654 2932440 2543224 2821092 2450787 2429192 2507339 2322667 2270304 1941085
8254 1941085 2430340 2658296 2117621 2329906 2510135 2064259 2064498 2309120 2458129 2119827
8244 2119827 1955283 1883978 2079497 2803449 2652119 2270403 2387859 2375216 2351683 2213625
8234 2213625 2066169 2484742 2267602 1733626 1672543 1461064 1527332 1690760 1360149 1453090
8224 1453090 1459375 987456 826675 1181308 1286252 1086802 1256700 1307741 1169986 1007975
8214 1007975 1252758 1227930 891600 1010448 1060329 1364313 1190335 856373 780290 909272
8204 909272 1313371 885911 1240738 774740 290804 441198 680941 596677 900819 324811
8194 324811 -60592 -961658 -574520 1913672 1584908 1310897 1191582 1051703 1077084 1324435
8184 1324435 1280975 1143595 668757 383521 413548 873199 1360888 1220215 1028210 728623
8174 728623 927894 1323441 599074 337111 573472 694810 753558 466005 609333 507349
8164 507349 339107 503753 956977 790771 739281 886072 881242 687193 740753 770604 983328
8153 983328 849641 900510 1346312 875747 746159 888756 937744 1125776 904787 862633
8143 862633 887634 715002 920686 868898 659670 823041 802225 1230457 1300596 1087749
8133 1087749 1089878 908718 815288 1035522 1451310 1389154 1019802 1271201 1530760 1584954
8123 1584954 1346228 1323443 1320092 881383 890040 1048401 1341108 1235975 1413730 995065
8113 995065 740443 1065722 1419801 1361915 1400966 1237170 1218167 1131214 918000 917942 841117
8102 841117 913347 1161368 1228697 634849 969909 1133162 1243022 1208542 1309999 1545552
8092 1545552 1989060 2064062 1895501 1628030 1754539 1422840 1210527 1231837 1201130 1112245
8082 1112245 811788 562224 706168 1075136 1109225 730402 801289 982382 800131 268557
8072 268557 575236 993699 1015217 660643 732178 1072444 607432 458935 385861 891527
8062 891527 752697 543926 760870 706388 499293 947968 672301 873528 921663 364663
8052 364663 296588 557267 313317 598909 471428 -190457 -132635 239655 220245 158771
8042 158771 642900 539773 317716 430395 361098 359948 424702 173320 -63059 -144730 209417
8031 209417 352954 354694 621452 98422 181789 175136 416434 517710 581683 344527 36259
8020 36259 264264 431752 242886 -549680 -279133 -19548 48812 230933 117812 258117
8010 258117 139434 -26971 412535 316909 299821 404750 69746 -172351 64045 392873
8000 392873 638711 770265 355996 416376 322956 594898 527781 350491 40962 -148581
7990 -148581 156667 209338 577676 570014 51762 78291 25271 67007 463986 186152 -135680
7979 -135680 37957 308655 26046 11636 69387 182435 -170923 341851 749020 528820
7969 528820 482433 225212 78788 170060 935361 936676 309176 89056 -90068 117324
7959 117324 151263 310304 628608 86786 101257 464929 65547 263468 299809 506890
7949 506890 83764 155771 325833 3421 -11021 -86635 -268895 112299 60130 -342356
7939 -342356 -200003 -18189 -234805 -298121 -25120 -22105 -94660 168726 38153 77193 268220
7928 268220 143194 -38580 -146907 154720 219206 126192 72424 101902 -143047 225618
7918 225618 374986 150025 333853 271594 324382 551733 358499 239341 44582 438490
7908 438490 354488 354499 633654 401726 220141 325282 162506 349538 98050 424053 493449
7897 493449 404587 353816 -11175 254571 137098 284038 373369 150724 169520 286155
7887 286155 164281 -34374 -192883 170514 607227 393257 438571 88878 -109645 77363
7877 77363 202733 407166 152622 225412 287942 209963 110950 291546 193304 -293243 -364355
7866 -364355 -64390 -375398 -1338 387043 230313 597480 794310 633208 335866 727906
7856 727906 414525 -229029 -199186 -49514 107891 -111887 214444 18191 -588073 -345798
7846 -345798 -173399 -178983 -48718 164725 137047 77893 502191 550113 543623 444038 121083
7835 121083 -160907 30639 -82997 92723 -76877 -432951 -666550 -611728 -600641 127810
7825 127810 115100 -175404 -247819 -17812 21150 -17507 142474 236039 374891 530083 347711
7814 347711 -71924 249185 125798 505146 217781 234063 -30012 -530006 -115495 -102994
7804 -102994 -180247 115117 32338 50743 -146442 -96033 -296554 -106037 -60377 17658 -193460
7793 -193460 165203 93473 35246 6746 58599 77854 -251911 -120171 -148926 -151668 36876
7782 36876 153215 470159 265887 38538 -364041 -589287 -232787 -11121 33341 165279
7772 165279 -38672 -152984 -76705 156419 -9380 -151058 -297544 -323334 -132302 -133105 99432
7761 99432 -38822 -510728 -162131 271938 29073 204081 117400 -74754 -270672 70306
7751 70306 -175494 -7972 -58568 -214916 -141194 386047 280515 379297 452314 644602 240187
7740 240187 179869 14563 -228871 7367 298548 489215 123898 123548 278164 63358
7730 63358 -8383 274802 -105972 -259958 23863 -37216 86754 -71093 -17561 -62168 18287
7719 18287 -122744 -167284 183168 207418 236765 267102 160873 -91754 298644 -20571 23031
7708 23031 -243787 -92665 -252696 -120971 -131672 -250854 -567185 -507431 -31454 -23208 -286792
7697 -286792 -214175 -44017 146127 334086 36911 -211053 -301120 -298740 -95989 -135630 -98836
7686 -98836 -2177 -27760 197183 211114 383004 -49821 -19418 258186 105039 8606 456431
7675 456431 722671 691942 373388 -43996 -329166 -154902 -386907 -381493 -359063 -312574 248884
7664 248884 213157 65263 449804 232371 -63010 9536 177553 -248615 -215481 313972
7654 313972 -11823 -90543 -183762 -576179 -200378 40234 -23122 8867 -268593 -221766 410640
7643 410640 378625 20228 -264207 -157844 77096 157095 213545 76441 -350318 -498987
7633 -498987 -398647 -117530 -104469 -109969 -232524 -430978 -282598 -179346 39688 320390
7623 320390 326251 164268 217467 126980 516528 -73913 66775 169842 394599 371237 239183
7612 239183 176463 -78889 -165902 -180282 128479 -47397 -207424 -195229 -358907 -507710
7602 -507710 -329220 -135062 -156553 -402719 -134071 182568 190924 70426 -15804 10543 -398700
7591 -398700 -226595 -264627 -24901 -35667 -468025 -304973 -201388 -86973 -171510 -178987 -143069
7580 -143069 -21161 83659 -81632 -484370 -421361 -129973 -311494 -366201 -277359 -69146
7570 -69146 -13793 -52760 -295671 -111504 -102785 -67601 403726 -149978 -84996 220442 -9566
7559 -9566 -139026 -111246 -434014 -440243 -114856 -285398 -235053 -335862 -220912 216230 440929
7548 440929 368929 46448 -308393 -430585 220535 376674 -81701 -68716 -130075 448498
7538 448498 -113843 -88493 -110253 -209754 378667 12111 145993 -243362 69629 449748
7528 449748 -162815 -503548 -231353 -148391 -549163 -355972 145339 -63118 -48981 -136321
7518 -136321 -285207 26102 49147 -457252 -25591 104191 66523 -191280 -448363 -259346
7508 -259346 -261676 -336810 -135407 -188293 -475576 -269215 -390193 -371246 71512 37537 -41419
7497 -41419 3334 174891 124786 69006 70590 -189727 -317026 -145222 369084 38112 95887
7486 95887 400059 44037 -97374 6554 197931 101970 404504 61140 109368 285449
7476 285449 20989 -84687 38709 -135315 -410185 -144800 -72323 300272 135024 357125
7466 357125 156156 -200882 -426445 -309045 -101193 175356 -199407 52362 248999 -100602
7456 -100602 3878 -78043 89181 39608 370127 417369 324954 156088 43959 -37670 -19069
7445 -19069 89162 -460234 -462845 -539860 -393161 439112 156417 -186859 -26478 -109821 -142036
7434 -142036 -231944 -138869 -173762 -243088 -45145 -13316 213362 101372 -178642 2514 45196
7423 45196 -100819 -257962 -487795 -313920 248760 587422 180572 -131970 -149573 -335650
7413 -335650 -202531 19652 -289425 48381 122749 -52911 83861 -196263 -551241 -535369
7403 -535369 -14186 213448 -36142 -402079 -197452 -223227 -341361 -315259 -114335 146138
7393 146138 197616 -28439 -702738 -724272 -233946 180489 26715 -224677 -14531 -109908
7383 -109908 -143120 -15796 20798 -9452 -202440 -371549 -176347 -195636 -233718 -310081 -365582
7372 -365582 -200957 -162945 8542 122565 63631 60077 -69966 -188900 23905 -49121 -45643
7361 -45643 -227424 129092 322218 -158092 186355 334779 329355 207173 250464 -202471
7351 -202471 -340184 -185416 -416275 -331769 -130050 -367554 -3737 278494 232655 -1855
7341 -1855 -13894 -1719 -457148 -215738 -310596 -109808 15350 288316 -49346 29437 241493
7330 241493 216325 26847 123183 -278169 -283913 -110937 98211 274747 225542 -108905 -231250
7319 -231250 74291 -158424 -83607 -197134 -134684 -434454 -383565 164142 466643 511102
7309 511102 236463 13562 -463044 -195467 -254434 -526415 -180655 -143733 -50681 216407
7299 216407 -32000 -7914 283429 88096 -19868 -194549 -499615 -644956 -656085 -573281
7289 -573281 -592680 83135 189874 -198312 51813 -42760 -3397 72677 258114 60770
7279 60770 272842 267510 808747 611428 136469 -75028 89280 -219381 115776 597
7269 597 12672 57497 20904 415636 186343 377880 347665 92016 237080 339013 431487
7258 431487 -55746 22252 403304 211943 245627 243759 -1764 108227 4800 -59242 70433
7247 70433 233377 -3130 12155 -225547 -559084 -519905 -461838 -352855 -362433 393525 124482
7236 124482 -245957 -191589 -531057 -482223 60662 -313446 -227858 -240022 -200913 -386361 -477680
7225 -477680 -216536 -14672 105726 199852 -68500 -297065 -244619 -132657 247727 246893 110375
7214 110375 -35164 80987 -32965 -359893 -267105 -491906 -316641 -119056 134410 21176
7204 21176 65417 -177669 -133082 133780 57844 -75683 -59468 -186211 -141706 -260015 -569647
7193 -569647 -363123 -164240 154509 216737 200941 -314030 -379968 262216 292856 9197
7183 9197 -170416 -90849 249998 162690 -150662 49615 -86282 -353522 -84831 22136
7173 22136 -306109 132567 -4209 -61847 -353518 -135326 -319925 -509522 -429715 80176
7163 80176 -73260 -205233 189098 -176907 -5575 186545 467666 64610 -241003 -127955
7153 -127955 -35499 -475863 -430147 191387 253810 -547708 -243899 -68346 -116106 -86921 -347268
7142 -347268 -376590 178193 263479 -367958 -230260 -52440 -156644 -124231 58745 160291
7132 160291 -300799 -348150 -955564 -500977 38371 202399 324723 -55436 -66664 157179
7122 157179 141809 254523 290768 230786 94128 136000 129998 -19352 -97049 -547256 -782527
7111 -782527 -353410 -179168 -300286 -222951 -86464 -210876 -450686 -334844 -397392 -335276
7101 -335276 -309635 -566377 -521837 -543456 -591790 -361350 -270121 -338590 -238254 -172846 149274
7090 149274 141817 -287334 59614 131972 63219 515457 394940 -61663 -329062 -136317
7080 -136317 -256575 -429513 -300244 -323076 -443472 -528004 -610444 -448051 -50482 -137532
7070 -137532 -839227 -532113 140688 281332 174169 -221977 22654 51866 208737 -184303
7060 -184303 -42609 91140 -89275 444882 72140 -209181 -505712 -87219 19562 -487897
7050 -487897 -234788 -122649 -283405 -160907 243687 110841 134226 -166891 -420628 -263349
7040 -263349 -233092 -323686 -289597 -255485 -165625 -189220 604 -27273 -511231 -522999 -212945
7029 -212945 -424014 -350987 -361835 62424 -433021 -335999 129186 49003 3860 -73392 -22122
7018 -22122 -214606 -394640 -356803 -339401 -57717 -100247 -399745 -152755 65476 308180
7008 308180 74462 -301580 44305 -179703 19707 558588 455273 152126 60549 383907
6998 383907 -118294 -23667 121094 -31642 -325907 395876 146803 -408254 -334053 -417929
6988 -417929 -659469 -427291 -484455 -216935 96822 -288819 -165680 -186851 -63885 -200698
6978 -200698 -394546 -318653 -216737 -74405 21944 -108248 -65841 -85637 -45555 88602 -31810
6967 -31810 190157 -65981 -346172 26278 57410 84449 -233302 -61631 -120835 -220461 -215214
6956 -215214 -148383 59988 -173408 21169 261545 95629 -36727 12797 469111 393467
6946 393467 -87695 -139029 384029 514641 -44299 -635289 -689132 -281712 -107424 162188
6936 162188 42263 -188427 4252 293235 94600 6241 -9232 181689 -15280 2254
6926 2254 88233 -210960 -488154 -622154 -270779 217735 228211 84808 332091 341376 602212
6915 602212 228236 -283163 -601605 -339039 228840 292189 152182 -286634 -412251 -369409
6905 -369409 -229859 -493810 -909512 -1105340 -753863 -103380 -208011 185076 4850 222308
6895 222308 236155 17600 154533 -188549 -278001 -627466 -323931 -352192 -478080 -294756
6885 -294756 -219882 -277338 -554526 -780410 -623647 -578550 -536648 -721577 -760401 -77687 54867
6874 54867 -555522 -500019 -130763 -54984 -504050 -274978 -483314 -627614 -182113 -289494
6864 -289494 -511170 -421919 -325403 -434426 -334323 -354904 -89355 -92023 -294845 -96414 75077
6853 75077 -137176 -180755 -42040 -92364 -173068 -319893 -175847 -116583 -399316 -5677 305514
6842 305514 389159 237809 442163 20215 -213816 -43794 6041 240707 -101903 -210411
6832 -210411 -295002 132054 -225438 -153110 -145809 354599 141701 -479954 -371332 -351948 -89250
6821 -89250 96505 84310 -63896 97455 -71347 -86765 -306992 -368005 200421 345979
6811 345979 57714 300256 194711 112034 -240579 -278421 -60492 19246 -446605 -872447
6801 -872447 -435269 -340015 -87321 219492 -44118 -493706 -722152 -390309 -114420 12037
6791 12037 54375 -206650 -171455 -87770 1582 405929 147248 75043 127334 107720 89090
6780 89090 23248 -112031 -163255 6802 -159819 63005 -72230 -81767 153581 286582 402874
6769 402874 407807 314328 -158019 39922 18999 -11195 -387960 -409754 -469690 -463472 -376355
6758 -376355 -252068 -510736 -417090 -38643 -61258 -366965 -279777 -216968 -403622 -264842
6748 -264842 -137903 -263566 -314593 -287680 -561604 -150427 -200126 -214625 -565720 -819149
6738 -819149 -489540 -132198 -454272 -711669 -351857 -399110 -855177 -600359 -471741 -40094
6728 -40094 -292231 -692814 -649949 -356165 -219902 -538611 -118589 -51570 -272624 -271774 -255540
6717 -255540 -351266 -361082 -529605 -27609 -210786 -341082 -553460 -506081 -21634 -34238 461112
6706 461112 257392 -410194 -409014 -47223 -249896 -348865 -101914 241618 431048 -157190
6696 -157190 -349799 3221 -331367 -137036 -448768 -237285 -44043 62257 -19993 -94661
6686 -94661 -157179 31298 -40261 -405998 -173597 248247 661033 422241 250963 -219081
6676 -219081 15003 218398 313477 408293 -23153 -554714 -272006 -267310 -259102 7188 -157741
6665 -157741 -350483 -361750 -5376 77788 -35569 -457391 -491697 332813 259830 162785 11527
6654 11527 -96249 -26261 144268 296509 -33974 -103421 -81236 289596 80586 -411105
6644 -411105 -338339 -428964 -78570 -38771 -524758 -558161 -365109 -237182 -256733 -534868 -571986
6633 -571986 -588398 -251223 -16344 -222723 -345875 -555701 -201985 71665 71027 -258763
6623 -258763 67966 528882 605740 356284 129332 -462260 -491018 -264156 75053 194236
6613 194236 -36589 -411627 -312263 -216267 -248976 -122649 112824 242990 -88423 38980
6603 38980 305060 76175 -113932 -337675 -219592 222152 26616 -258321 -609747 -203893
6593 -203893 78156 106018 60925 -436182 -326111 283465 211617 629145 283305 8133
6583 8133 -405901 -13242 -5988 -253367 -172523 -222234 239819 -221511 -588566 -513699 -303213
6572 -303213 -464141 95085 -65417 -687360 -624221 -512248 -643704 -598393 -632135 -329054
6562 -329054 -42191 91759 -253832 -599975 -311851 -278281 -169344 -444507 -361479 -550689
6552 -550689 -216064 201725 58657 -641922 -760700 -722339 -529690 -100268 -251709 -100147
6542 -100147 -54703 -205652 -258075 -473614 -586719 -114905 -134231 -307312 -633650 -455990
6532 -455990 -45874 119037 375721 96346 69338 245384 -361635 -202600 -94625 -622736
6522 -622736 -624867 -515568 -1057270 -1266759 -917029 -623564 -432257 -259279 75329 -180088
6512 -180088 -144329 -279694 -336716 -239355 148999 437493 277252 137717 492166 274341
6502 274341 -451141 -674638 -524367 -520109 76923 134647 -501911 -268725 -270729 28539 -153665
6491 -153665 -553432 -416638 -221416 -456478 -493796 -186293 -38612 -394209 -427465 -123193
6481 -123193 -200430 -203823 -15159 -212883 -262888 -322740 -49008 197008 484178 206017 -379781
6470 -379781 -213902 -768756 -677097 -450867 -261682 -429394 -543249 -163174 -114149 -138209
6460 -138209 -176034 -330318 -147936 -174220 -118945 143708 -191881 -326844 -387658 87893
6450 87893 -171675 -382214 -196623 -10626 -292756 -755876 -577671 -323059 -259931 -241266
6440 -241266 -119057 -253229 -181200 -337911 -748240 -662131 -606567 -267044 -132787 -128182 16391
6429 16391 -197398 -135729 176654 -107959 -173250 256697 112780 104657 302734 504664 348409
6418 348409 -288366 -378263 -375894 -427078 -108691 107785 115937 101064 -115991 28033 459054
6407 459054 268768 -266287 -384334 191228 674587 -7892 -126186 -474 -23209 82131
6397 82131 103470 -68234 -118981 -251066 -503039 -159791 -470673 -232844 -106692 108204
6387 108204 -205736 -634846 -647973 -571693 -453197 -499065 -56139 -253802 -351669 -160052
6377 -160052 -475690 -191222 -188684 -283436 -576588 -815557 -198886 -118687 -443878 -137656
6367 -137656 -186422 -720912 -757240 -483703 -120837 -221684 -272455 -541494 -299087 -190853
6357 -190853 -480992 -539873 -137468 -358079 -229331 -93625 -429797 102543 123570 67463
6347 67463 -320554 59215 26524 -458730 -353739 213293 179132 47513 -222284 -314219
6337 -314219 -280926 -451761 -314140 -318401 -134662 -139417 -111649 -136609 229109 -53400 -140993
6326 -140993 265483 165480 -19700 -75329 -33662 143530 -75118 -279028 15712 -100984
6316 -100984 -175988 120968 71581 -64085 114409 264622 -20274 -80018 -114133 -275049
6306 -275049 -354239 -671558 -327303 -278252 -335085 56954 138334 66907 -127299 -50073 -82792
6295 -82792 -364214 -560379 -402198 -689925 -762512 -267753 218158 210772 55555 -190460
6285 -190460 67444 -96485 -486315 -194498 -130274 -115864 -473596 -298622 -214606 -185691
6275 -185691 61465 97753 -341674 -193377 -281240 -234462 -392223 -741403 -239052 11788
6265 11788 68629 -72733 29345 326518 47085 -252493 208170 437704 163775 188087
6255 188087 256145 239420 262345 495912 440494 472931 180220 -192415 -176690 414917 172606
6244 172606 -10041 175795 -54842 -116654 -173411 -138695 213327 97185 -582334 -214805
6234 -214805 -54202 217379 -148465 -7859 128471 -163609 -205136 -95139 -341124 168974
6224 168974 308845 157130 355903 71167 -149859 -124020 -187066 -431531 -52472 -140571
6214 -140571 185244 163790 6656 -89233 -97745 147871 132951 226475 109291 -125891 -184413
6203 -184413 -335526 -366721 -41979 189852 344370 -58497 -294331 -236012 -401816 -355203
6193 -355203 -185487 -232771 -102691 110582 -232495 -224692 -139942 -244957 -57724 88020
6183 88020 -250308 -348909 -84381 -251786 -381553 -339315 -153328 -235560 -139153 -113166 -49537
6172 -49537 -358606 -223612 -380633 -185372 79779 -157577 -351901 -52907 53590 194163
6162 194163 115006 17469 149327 164964 138412 -200163 -213267 -537981 -365974 74132 -70809
6151 -70809 46585 251769 -124553 -354816 -315360 -249682 -269829 -221720 -270782 -181440 -397855
6140 -397855 -83626 312076 325464 1337 -6387 -52250 -115891 -229175 75174 68935 407940
6129 407940 173235 -33187 139798 -6987 -189081 50049 -73562 -243751 -68002 -253524
6119 -253524 99136 -148023 -328349 -398878 -269408 -67887 -327930 -335592 71598 209483
6109 209483 81204 326712 151136 -7249 71602 -193973 -115087 148330 71969 -151090
6099 -151090 -368915 -376366 -483189 -432594 -474001 -171058 -420980 -569701 -376398 -292028 -486221
6088 -486221 -489773 -282767 -651980 -455340 -106411 93682 -254466 -126408 321945 306348
6078 306348 -75676 -166137 173194 -261769 -536397 -240268 -38920 67514 -366654 -371498
6068 -371498 -541423 -855478 -912099 -1010833 -868008 -296058 -275120 465050 694997 341352
6058 341352 -313216 -533797 -96805 4850 -28803 -118587 365917 -109468 -521344 -533901
6048 -533901 -317343 -239865 -127189 -294318 268742 253154 255703 451679 106059 320798
6038 320798 122162 277606 92252 367502 -25304 -50104 -156134 70166 259795 109876
6028 109876 -102928 -123271 435010 727396 523650 -1426 -54761 107759 84970 159662
6018 159662 -8175 -130738 223799 413100 653336 620678 479129 205038 44219 -111492
6008 -111492 -331020 -428370 -348480 -114697 -358005 -190466 100230 93715 438538 210551
5998 210551 -58472 202403 201501 -37946 -208628 -188968 169458 485731 446333 467868 619060
5987 619060 360583 -117642 -149783 244881 148156 252097 -31240 27019 -185337 -194676 298318
5976 298318 413800 -71344 -1811 -88254 -389148 -496328 -680802 -185424 -295943 -303991
5966 -303991 -139055 -127964 82302 176640 79534 81200 61632 191427 -101743 -53232 -15987
5955 -15987 -388311 -270331 -83621 101753 19861 65540 282751 243486 -245155 -420421
5945 -420421 -26279 -259548 -251807 -123994 -268711 -166709 -116257 -230435 -159042 -285907
5935 -285907 -429902 -400566 -499046 -561306 159456 573801 113289 -74760 -178004 -244050
5925 -244050 -247389 -361357 193353 310643 146733 118940 -272692 110832 77049 -198568
5915 -198568 22703 -243351 -480827 78145 316505 57658 185090 632310 608782 103166
5905 103166 -275211 -300360 -186830 -219550 8496 399383 212220 223610 124166 268446
5895 268446 474625 830024 1281551 1362155 1106896 877169 726036 949392 885057 568681
5885 568681 467105 729696 453788 652474 723029 734322 982176 1243502 1068313 1112518
5875 1112518 1153121 1037492 1395831 1258143 1472769 1629266 1685599 1366923 1246759 1318052
5865 1318052 1190042 799843 940295 1166195 1585870 1160608 937036 1062231 953451 606388
5855 606388 897732 1028715 746468 698507 788506 881724 738329 753014 591046 606745 632405
5844 632405 677424 441205 83664 39108 224907 322084 38717 -87561 37754 -293033
5834 -293033 -76414 351440 269066 146185 -30625 199755 183992 283470 252493 103292
5824 103292 495453 108634 10152 157176 76406 385149 124680 -177706 98147 453764
5814 453764 41667 -137904 91539 214675 81497 -170239 -35559 551958 610908 677779
5804 677779 317951 11999 105125 256384 391686 461335 201338 181624 12552 -123176
5794 -123176 -126219 179919 173380 117162 282998 117523 85935 83145 -270329 35737 89210
5783 89210 -240543 -59950 26381 109225 -132362 25448 262915 64917 11385 194480
5773 194480 296283 504668 406285 -237768 -673578 -123990 137772 19055 -244662 -125155
5763 -125155 226 -34325 73235 146226 -63506 -223006 -165318 -6774 -45470 -164266
5753 -164266 -178599 -407189 -559490 142360 164454 168148 -181747 -72067 -51719 54292 228790
5742 228790 448993 332930 332327 289533 182348 -197162 -147072 -402776 -310025 -308853 -314906
5731 -314906 104506 86298 235769 -13524 59417 125923 403370 717705 820009 782706
5721 782706 518703 428422 182411 242329 40018 -296735 -72393 -258498 67911 286017
5711 286017 193019 216708 -21055 7393 191364 362412 332921 253092 110839 108835 412313
5700 412313 244431 319540 150466 76459 243323 481155 594217 700601 -84027 -148237
5690 -148237 55304 142454 757909 348070 -269872 -259944 -16024 -80231 -195319 -38856
5680 -38856 -263819 -143585 -72088 302798 469691 312551 -280470 -344430 -201694 -24390
5670 -24390 -128943 -61747 99347 56333 -151121 -405413 128508 206926 46650 266552
5660 266552 378623 241125 117741 171028 44254 -547443 -281084 -159073 -183822 239636
5650 239636 129106 -43580 -87221 -92167 18947 -169885 -208575 -218909 -73229 290110 276763
5639 276763 325420 47135 -25016 -256496 -22207 -76525 -237044 -449181 -664684 -230770
5629 -230770 -140237 -60467 253603 289300 -136207 -145376 -287841 -11165 454 -233293 -177411
5618 -177411 -77993 158815 211513 81451 -43212 -125197 -250198 -442959 -767525 -340931
5608 -340931 -17208 -271323 -689901 -251543 -237794 -798496 -748596 -374880 -288688 -507282
5598 -507282 -596773 -206491 -278014 -122784 -45132 -67499 -317624 -355278 227730 42894 219175
5587 219175 238037 215089 -294640 -255916 -505099 -365567 -123922 -211346 -417962 -92774
5577 -92774 -264999 -187230 -389370 -517178 -288151 -318707 -261226 -11068 -18746 4507 91285
5566 91285 412924 669506 119802 13143 -420588 -117060 268392 125084 642900 159360
5556 159360 26319 267533 200393 277786 -79527 -184275 71109 -166938 69949 -100222
5546 -100222 -416683 -142863 -144590 -93458 -483903 -245992 352384 296029 305787 451736 -53678
5535 -53678 87336 587402 662435 544708 209095 119389 -124527 -366559 -178001 -279922
5525 -279922 -93673 58467 -209656 -96601 250306 1483 -31653 88789 -324764 -391907
5515 -391907 -326072 55664 616820 243219 -143244 -219895 -120896 227996 199684 155605 231759
5504 231759 -52735 299751 -132095 -334223 -168709 202115 399539 36762 -29738 -79016
5494 -79016 -333535 -454826 -184181 200597 348561 273903 510015 512940 189126 5813
5484 5813 17997 31820 -76742 -81941 -13645 160814 91414 576373 888285 993650 955366
5473 955366 922920 821513 841210 905859 449690 356207 365507 467516 582193 776686 542050
5462 542050 333393 325992 413207 295752 234892 427942 498603 792830 430611 205415 126142
5451 126142 -43642 134865 -185809 -284055 -240592 -125847 283637 747678 520242 185977
5441 185977 -129992 -141617 -25562 51228 -102691 -66583 -270727 68773 253044 174740
5431 174740 392590 343792 119199 -410329 -499796 -493160 -226096 -330705 -152283 -77362 -36306
5420 -36306 -50297 -3779 -6760 -348196 -168969 201099 3197 -282091 79613 201800 -145158
5409 -145158 41499 -195107 -139924 -200611 -130464 325294 -264327 -306220 -330146 -334205 49679
5398 49679 258122 244435 49330 -199478 -46932 -585260 -651853 139168 246370 94731
5388 94731 223785 188894 125796 -154773 -293085 -176313 -127862 -86950 -136123 179815 524652
5377 524652 113421 23640 144730 277974 291710 116457 132448 268106 426123 155409
5367 155409 174444 -141036 -351867 -254955 177493 273395 -35186 -48217 -181107 186125
5357 186125 -76364 434926 966994 372853 376696 614099 1414928 1179472 1041260 1195581
5347 1195581 930543 1025622 1455921 1463154 1417636 1112812 696754 718399 735325 627439 895773
5336 895773 958757 866400 869116 1100633 1170658 1003008 936412 1100376 1227644 900372 1063418
5325 1063418 1530672 1707973 1770556 1574305 1437479 1560249 1454669 1412785 1004459 874064
5315 874064 1112440 1386378 1413712 1075550 560881 1110499 1375053 1258221 1072430 1077362
5305 1077362 1045240 883657 803773 838779 1150716 1106490 1010655 752451 524880 549949 741235
5294 741235 277127 320451 421364 197964 770248 128897 206444 638930 171989 17456
5284 17456 25019 183021 433087 471860 380757 533698 481424 521636 616344 272792 -304108
5273 -304108 -22722 -95050 78583 290979 -57880 72765 43184 70454 40558 -21425 439972
5262 439972 334963 -1874 42376 44530 -51567 -20236 196995 427560 457624 835130 837130
5251 837130 846278 694613 376562 530034 369376 555987 427134 97031 -184018 202646
5241 202646 459688 397106 52247 -18028 201740 -125584 -417132 -133838 412036 659981
5231 659981 -58383 -173421 -134574 -69913 52963 -400807 209652 454478 318471 360950
5221 360950 46593 -183690 115079 246115 276100 88967 -80622 154256 265029 89641
5211 89641 340839 290794 207237 723785 557834 160331 184656 16363 -8249 323948 543158
5200 543158 242632 258530 361732 154234 177708 182627 313662 79151 -34775 316605
5190 316605 379827 153044 407733 258348 150885 429091 426215 931554 503263 414232
5180 414232 41412 48739 102156 169866 800885 528273 590309 775056 252705 217558 468728
5169 468728 779989 693130 410019 550427 526108 735011 782996 611799 345564 209734
5159 209734 192926 324031 839105 526339 262090 349725 552402 568004 227935 57335
5149 57335 -360642 -370868 232168 515068 543048 307696 259148 780550 437215 345637 200814
5138 200814 65355 348762 214675 352283 -139310 -80658 72796 158188 847087 154251
5128 154251 269310 468523 165008 -49181 -243567 -139664 200215 455033 536792 434011
5118 434011 335199 217366 222587 338149 338869 270067 309099 476808 220055 -61446 -26281
5107 -26281 -87171 351666 282811 101108 264072 577389 473708 185748 -86036 -108163
5097 -108163 -160506 -399784 -155141 -17900 -8566 -130372 -222558 -109166 34888 -61313 121767
5086 121767 104010 195146 546870 568548 478946 -212222 -284455 -84157 -77446 196450 403134
5075 403134 260486 416437 522044 663114 729993 428179 359961 56851 167311 686864
5065 686864 43324 -364363 147603 265279 576181 425027 179787 202552 533 244298
5055 244298 490715 205986 -206916 108801 321946 -46159 114053 95314 215416 244822
5045 244822 455064 64360 -56107 -110803 -19939 155211 215835 593066 701640 526135
5035 526135 231197 274208 313589 125855 140141 -179912 -181559 -395 89598 -473915 -396607
5024 -396607 377095 516213 219497 148226 367068 -38424 86067 299389 -59266 -198496
5014 -198496 223496 404299 476447 413908 176474 45905 42103 -59436 251632 102576
5004 102576 -180881 -555946 -480182 -172262 26972 57479 278709 -10049 -205414 -85972
4994 -85972 107918 428894 404393 553837 132458 280663 74611 357049 172095 -119823
4984 -119823 -88741 -137980 83995 304546 -157267 -435338 -94292 314661 261698 230260
4974 230260 261016 -84422 -293269 -193538 -363960 -265357 114496 502475 346401 -199574
4964 -199574 183212 81599 353175 243652 380072 269852 141872 439686 573080 453535
4954 453535 321805 666925 332800 -45531 -534498 -608417 -105987 -257668 124322 249745
4944 249745 142363 564903 229748 50644 -262021 -259283 -62270 381262 490300 243262
4934 243262 411984 -10365 -187807 161307 271224 -119064 462468 719830 624036 169501
4924 169501 292761 332124 -179410 -64334 53774 150130 281939 413432 473962 495543
4914 495543 356959 271078 -254017 -86365 432819 422952 144169 78146 378066 731109
4904 731109 266589 320649 339602 -120474 240883 348913 352527 -2760 -125271 -116749 8255
4893 8255 205134 323459 179588 131472 516127 621625 605609 726553 1167035 699229
4883 699229 480754 397531 109221 313666 213581 122563 253150 351594 222491 193655
4873 193655 351757 579959 727844 498026 418719 502193 643116 470855 95321 15163
4863 15163 348941 301794 304475 430811 -171296 388412 309887 245433 563845 -16265 -44649
4852 -44649 28715 345533 480969 798567 979836 853664 798811 791431 731793 513260 242909
4841 242909 -91589 119153 801015 1113027 869453 342573 240695 333940 506747 883296
4831 883296 771354 779831 183515 73821 84842 5807 13836 682728 623340 588113 728988
4820 728988 873114 886637 538241 714162 667549 925098 927748 877204 610143 815838 950359
4809 950359 755349 814589 1123715 1110193 830371 1035161 947299 475932 537469 1230358
4799 1230358 1078907 503966 570084 988126 1043297 1048074 991706 822318 950653 1077993
4789 1077993 1018393 1143051 1080327 1410760 1662061 1369771 1591582 1162074 1165468 1478198
4779 1478198 1504218 1527104 1546663 1174094 1634442 1929194 1777767 1905638 1640557 1621873
4769 1621873 1835427 1700605 1429049 1615740 1889915 1942983 2255950 2521124 2660290 2426358
4759 2426358 2156462 2430691 2223311 2205890 2696384 2639253 2975735 2821685 2725542 2581518
4749 2581518 2440785 2544105 3049830 2992980 3004753 3043839 3125555 3304233 3249770 3711504
4739 3711504 3872127 3661375 4003021 4179886 4351765 4709539 4680084 4952227 4907210 5050062
4729 5050062 4656849 4953921 5388829 5947111 5960244 5959643 5840020 5591240 6147195 6328721
4719 6328721 6171902 6123258 6569456 6878827 7134404 7392037 7379034 7404452 7902153 8565424
4709 8565424 9051298 9786253 10259058 11036546 11755876 12009731 12327568 12255240 12067525 11053143
4699 11053143 10469614 10199157 9833445 9652679 9559856 9381122 9693436 9771822 9778955 9773980
4689 9773980 10125961 10505258 10823771 10779769 10611076 10860699 11051420 10952078 10958480 11542142
4679 11542142 11881350 12342449 12352333 12811665 13589116 13880019 13698232 14008973 14393866 14736459
4669 14736459 15078519 15481998 15836030 16575445 17192089 17775201 18375788 18775544 19875396
4660 19875396 20543498 20840268 21563511 21880425 22610314 23074714 23240196 23339354 23112967 23070069
4650 23070069 23343929 23452468 23477229 23470997 24018152 23858269 23492004 23441404 23587702 23314243
4640 23314243 23046071 23105344 23402327 23708117 24068717 24854641 25417531 26581699 27648805
4631 27648805 28381932 29307043 29698978 29804979 29933492 29995182 29709761 28863744 27363442
4622 27363442 26359120 26024610 25748161 25284198 25131734 25152849 24882213 24516593 24470681 25118304
4612 25118304 25448536 25738323 25871930 25759212 25893737 26057725 26446618 26881673 27047519
4603 27047519 27020081 27285132 27292857 26841175 26284767 24884634 24097528 22944083 22317058 21694474
4593 21694474 21040799 20450720 20202578 20005262 19361132 19126780 18981661 18393258 18310031 17739411
4583 17739411 17171325 17300254 17159435 16418571 16168946 16573422 16167953 16069417 15784604 16078753
4573 16078753 16181411 16529724 16630835 16878025 17202425 17331989 17397565 17054749 17549431 18053393
4563 18053393 18370048 17568074 17726433 17584168 16940311 16706859 16337309 16284590 16570135 16375028
4553 16375028 16127223 16033188 15852897 15942369 15506503 15394016 15704850 15331842 15055700 15232943
4543 15232943 14897717 14397002 14275063 14652842 14645612 14285470 14739172 14881798 14966063 14743641
4533 14743641 14269940 14169204 13783636 13236398 13389337 13154950 13002869 12919586 12439392 12095888
4523 12095888 11990496 11906463 11928128 11609370 10905328 10744148 10801114 10554647 10181135 10062375
4513 10062375 10253847 10226402 10202624 9772938 9466481 9576032 9374487 9463699 9809349 9569106
4503 9569106 9357201 9046574 8923323 8973535 8557039 8740046 8359537 8260898 8210094 7603073
4493 7603073 7490176 7301633 7528608 7559320 7392869 7526736 7112625 6766822 6302597 5902424
4483 5902424 6129931 6020838 5627555 5654636 5012146 4651794 4226608 4660585 4657495 4992459
4473 4992459 4730666 4436513 4573526 4345405 4315080 4065797 4007433 4153346 3718168 3530031
4463 3530031 3661616 3829206 3657309 3660912 3454476 3302904 3789280 3962010 3722576 3596100
4453 3596100 3630609 3482505 3223761 3128290 3202748 3046707 3042930 3097042 3028047 3289880 2817180
4442 2817180 2993791 3143383 2816699 2582953 2742759 3144266 2947105 3201375 2824367 2955106
4432 2955106 2997111 3282294 3300377 3064891 2963904 3074449 3054454 2956427 2974670 2441923
4422 2441923 2346268 2707955 2450875 2090510 2276816 2048680 2069746 1984340 1947401 2031299
4412 2031299 2425554 2446111 2178390 2302878 2238086 1890969 2107413 2542032 2250837 2108395
4402 2108395 1912542 2210903 2135852 2221202 1860158 1940606 1708242 1961473 2443530 2195166
4392 2195166 2227903 1999911 2042848 2320319 2280289 1835943 1977994 1933443 1515308 1300668
4382 1300668 1436519 1249073 1262157 1913404 1629986 1645357 1490495 1416345 1395497 1808194
4372 1808194 1861429 1516998 1796482 1764145 1616653 1089243 1018957 1206608 1425934 1350557
4362 1350557 1311790 1752328 1571496 1214639 1407172 1332945 1124533 1290421 939311 1119733
4352 1119733 1532408 1088752 1166228 1026737 631972 873869 753842 883526 1603599 1872084
4342 1872084 1250731 1291637 1343282 1422495 1433240 1287413 1324129 1473785 1962595 2057599 1685877
4331 1685877 1624153 1666386 1423292 1333018 1538411 1261188 1279555 1557749 1615843 1860847
4321 1860847 1775817 1954851 1734541 1811158 1689799 1710759 1595623 1926245 2216306 2044671
4311 2044671 2372013 2427463 2604256 2501013 2656189 2863130 2768622 2577892 2165085 2365881
4301 2365881 2756321 2824174 2482976 2555263 2769673 2331213 2250729 2029171 2336037 2845954
4291 2845954 2488689 2246502 2498016 2949332 3114185 2631664 2903449 3301705 3506631 3844667
4281 3844667 3979102 4521524 4470560 4736577 5149741 5809993 6886022 7723944 7964049 8614697
4271 8614697 9063918 9173750 9401498 9619625 10736705 11923419 12600026 13161909 12918792
4262 12918792 12998561 13029332 13511404 13975565 14614869 15047462 15534835 15319428 14622147 13575241
4252 13575241 12641186 12252942 12523233 12481890 11987205 12100307 11109584 10551304 10199077 9328654
4242 9328654 8750033 8421103 8111823 7794562 7422506 6693403 5746701 5326861 4962404 4346266
4232 4346266 3815185 3330249 3025646 2832614 2855262 2875839 2661900 2356320 2279248 2236791
4222 2236791 1796076 1756806 1429405 1817813 1786665 1925772 1911987 1684451 1758377 2024516
4212 2024516 1876421 1517327 1692426 1554157 955491 692557 556300 651161 696324 936715
4202 936715 616303 602271 740465 632077 449505 508804 499942 502440 176121 457321 611452
4191 611452 471562 33957 -59032 403616 495040 525302 248355 761336 544600 434070
4181 434070 69867 175216 342382 942381 1131748 519522 232824 167177 320720 145603
4171 145603 107994 362752 -38285 -253396 -461912 -428357 -352345 -52942 106460 -82990
4161 -82990 -81424 -116697 -407033 -101255 13484 -102184 141619 -179521 36759 279412
4151 279412 395876 65878 -243428 -116582 65660 95374 149909 109903 -299179 -51428
4141 -51428 -60778 170942 284913 -80456 -156916 -25303 -68091 -47064 -8282 295155 524902
4130 524902 498728 201642 330270 98012 -235495 -439868 -879989 -554586 -35907 26683
4120 26683 113803 424887 278377 61146 145283 180967 -74314 187061 324447 462280
4110 462280 216351 149683 39947 425328 339943 315239 188632 84930 290692 13055
4100 13055 382415 497361 176652 40702 -128183 76757 28905 -360457 -355693 -223690
4090 -223690 -289582 -46545 -375199 -197952 -67809 277926 110179 100952 277078 375867
4080 375867 562943 244089 100561 274112 201830 -61138 -137506 39303 263830 -310864
4070 -310864 -306092 -213851 238016 188726 378207 200846 28201 -22848 -231174 118652 246348
4059 246348 261323 220997 -19977 356040 252016 171397 263691 -269909 -74264 -81276 -369887
4048 -369887 -153649 41109 137384 -155321 235678 241667 221505 605363 442315 -290748
4038 -290748 -375134 116161 270880 215527 226462 90161 98469 -58268 -84339 -227442 -219990
4027 -219990 -87238 155439 360776 -65775 129461 225631 211004 -269884 -270145 201655 398382
4016 398382 -10045 -229715 -132752 -185082 93048 -25534 -219598 -415116 -427111 -188935
4006 -188935 -269108 -681179 -439173 -282643 -232539 -118836 -62795 -196370 -50155 338032
3996 338032 -51217 -175113 -19474 -167225 -486547 -354724 -228052 30830 397473 37342
3986 37342 -90946 -260874 -72688 141064 334541 428750 -133683 -117807 -511683 -602055
3976 -602055 -413333 -536642 -624765 -189363 -272477 -43846 170762 137787 319317 353988
3966 353988 73065 566954 155813 112982 299048 -31475 36591 -281237 -289499 -76881
3956 -76881 -66646 127374 258331 90710 152094 170589 262352 22290 165765 236737 269304
3945 269304 101738 696494 220341 51030 198362 543735 450296 340502 278781 -26299
3935 -26299 239008 344793 183854 239697 368012 4791 120517 -100075 230998 296913
3925 296913 222979 547499 702902 372702 324903 452899 438842 659718 644670 432792
3915 432792 260772 225967 549105 854144 758821 243405 458825 1100826 1315982 1225822
3905 1225822 1389276 1406855 1440886 1672317 1947985 2036898 2130065 2594964 3370446 3805512
3895 3805512 4830358 5714999 6746803 7379690 7299578 6588737 5104099 4622266 3618269
3886 3618269 3046241 2445066 1830103 1609597 1686619 1837557 1292347 791586 926574 742598
3876 742598 488712 294804 529539 655772 573321 1003680 782338 230297 26591 -104564
3866 -104564 -278199 -235834 -22228 479407 345347 287743 -57986 -121426 -490188 -376187
3856 -376187 -184559 -133808 67543 64523 -133510 -175058 263861 -281206 -218530 184798 459434
3845 459434 446178 313020 384173 55313 -186012 -82538 59688 83178 -350607 -419885
3835 -419885 -500312 -328872 -10550 49965 -244344 -470600 -317129 -184139 -54246 554919
3825 554919 336130 310253 -162645 -196980 63896 194997 -227097 -269949 137288 -108069
3815 -108069 -22826 37468 233509 417143 170552 173050 270272 212801 268172 467235 536556
3804 536556 41041 -268252 -37115 327700 194929 476831 240653 185501 194494 332875
3794 332875 446562 358869 407825 233860 317567 271541 152145 326796 304710 333910 532697
3783 532697 852593 655254 464654 601580 487072 532996 309197 122459 -26360 -16637
3773 -16637 480057 256016 -201437 -27520 119608 221917 381115 204566 72558 164887
3763 164887 422360 504789 384084 113281 -635 -153986 -78324 -259494 -747613 -687242
3753 -687242 -238139 -106395 -104068 -428657 -224430 -133212 -155454 -136599 31086 94716 -280968
3742 -280968 -515005 -155905 306667 355007 47230 -520871 -294229 -144424 -244627 -221482
3732 -221482 -541465 -516732 -609059 -631450 119959 96851 20651 -114572 -170995 -4778 -81573
3721 -81573 -101648 105406 151463 82725 90290 75550 277658 -91280 -374165 -163542 -129870
3710 -129870 335104 417977 211117 -78476 -31841 208245 329080 238772 111926 61754
3700 61754 138752 147273 298925 65793 -377869 -431028 -336608 33710 325314 253260 -105018
3689 -105018 -91613 -140564 -147345 36724 26650 -32744 -449577 -279958 -287560 -195490 -73344
3678 -73344 -379689 -159067 -215507 -82250 -135243 -41336 245723 207385 317540 183400 256507
3667 256507 279953 -91057 -388412 -262823 -241777 46296 -187168 -134913 443225 265853
3657 265853 312537 275966 462158 593456 445332 656188 651916 340234 249139 255687 316458
3646 316458 226706 442419 -26370 -124136 -5887 -218170 -105494 76419 58730 152144
3636 152144 353423 188093 127411 -330687 26951 -86500 -188703 124465 -533388 -202333
3626 -202333 -226130 -342871 -341629 69545 16494 -283420 -78422 94731 -64566 86920
3616 86920 -81260 -158427 -165857 -156532 416282 201639 -272040 -324799 -302344 -435212 -636104
3605 -636104 -822756 -381295 -92303 -220443 -406354 -142212 17370 -90736 93190 -34534
3595 -34534 -204543 -131915 -148753 129326 -132627 -360199 -8941 282183 17915 80153
3585 80153 -41698 53469 -197352 -563395 118152 304814 -150117 -262993 -119923 -153575
3575 -153575 27559 -26608 -253743 -509096 -232652 -253923 -269071 -131987 -443074 -532544
3565 -532544 -471195 197398 65681 117341 247386 -84263 -43316 27180 310606 473609
3555 473609 292277 331836 293405 256676 -37727 33744 -209545 -427659 -497219 83654 67569
3544 67569 -350662 -464581 -216571 -87870 368465 83664 -235520 -534616 -532081 243781
3534 243781 309416 147202 200782 168142 368225 562676 142126 -113337 -102615 97100
3524 97100 -165855 -154042 -218715 -363883 -355366 29777 -322746 158150 251652 275822 -155597
3513 -155597 64040 190104 63398 -72610 -219215 -146959 115566 544637 293458 76520
3503 76520 359273 155817 54362 -269795 -265653 196190 248060 -1792 -244911 -302963 -614730
3492 -614730 -263407 95575 -228580 -207028 68056 102631 32290 273887 348656 343264 281944
3481 281944 111877 195040 -38388 132988 647332 553428 296812 330524 49562 -149754
3471 -149754 268829 304440 -76799 129809 391245 84278 -11275 215618 427364 193790
3461 193790 193992 58012 -72027 217257 329277 370253 352501 274581 506176 620538 761305
3450 761305 279207 -11895 350616 299899 -24313 -117811 19719 160228 -21033 33581
3440 33581 261754 -203978 -569569 -297090 121857 -132866 -433434 -569159 -414440 38982
3430 38982 81947 -248535 -98908 -271704 187497 266647 239465 135227 72808 -104163 7897
3419 7897 -64029 -35996 -603957 -316184 -226335 -135289 350094 530489 16284 230826 199573
3408 199573 -143920 -171232 -240585 -405341 216960 -68685 -465633 -365200 -193366 6749
3398 6749 -181850 317612 377946 271021 113171 557784 323125 13700 -101545 -281114
3388 -281114 -132051 -52543 -149868 -52374 -127157 -167900 -419072 -476827 -295846 106367 116293
3377 116293 -127251 -221622 -337053 -32904 68947 -335573 -401160 -252141 -119056 -358827
3367 -358827 160837 54407 -34797 -214134 -242012 -170468 -211798 -375499 -55086 705955
3357 705955 756680 170749 134980 54918 -330003 -149138 180291 430947 35653 -38791
3347 -38791 515848 465791 260221 -28462 -85739 104014 125505 385056 455612 219185 -35473
3336 -35473 29411 295204 190351 34468 68403 136595 63758 -18925 249010 399076 506514
$$ [...]
##END NTUPLES=NMR SPECTRUM
##END=
