##TITLE=1H_CG-1179-I
 CDCl3
 8 sc, 
 2.11.2023
##JCAMPDX= 6.0         $$ Bruker NMR JCAMP-DX V2.0
##DATA TYPE= NMR SPECTRUM
##DATA CLASS= NTUPLES
##ORIGIN= UXNMR, Bruker Analytische Messtechnik GmbH
##OWNER= root
$$ XWIN-NMR		Version 3.5
$$ Thu Nov  2 12:59:44 2023 Russian Standard Time (UT+4h)  she@DPX200
##.OBSERVE FREQUENCY= 200.13135
##.OBSERVE NUCLEUS= ^1H
##.ACQUISITION MODE= SIMULTANEOUS
##.ACQUISITION SCHEME= undefined
##.AVERAGES= 8
##.DIGITISER RES= 18
##SPECTROMETER/DATA SYSTEM= spect
##.PULSE SEQUENCE= zg30
##.SOLVENT NAME= CDCl3
##.SHIFT REFERENCE= (INTERNAL, CDCl3, 0, 15.6599)
##AUDIT TRAIL= $$ (NUMBER, WHEN, WHO, WHERE, WHAT)
$$ ##TITLE= Audit trail, XWIN-NMR		Version 3.5
$$ ##JCAMPDX= 5.01
$$ ##ORIGIN= Bruker BioSpin GmbH
$$ ##OWNER= she
$$ F:/spectra/data/she/nmr/H-F/1/pdata/1/auditp.txt
$$ ##AUDIT TRAIL=  $$ (NUMBER, WHEN, WHO, WHERE, WHAT)
(   1,<2023-11-02 12:58:16.25 +0400>,<she>,<DPX200>,
      <created by zg, POWCHK disabled, PULCHK disabled
       configuration hash MD5:
       00 E9 B6 7A A2 85 ED C7 34 08 36 98 17 FE 4E 26
       data hash MD5: 16K
       34 63 B7 2A 1E 72 7B 0B 35 95 67 20 6A 96 E4 41>)
(   2,<2023-11-02 12:58:20.10 +0400>,<she>,<DPX200>,
      <Start of raw data processing
       efp BC_mod = 2 LB = 0.24 FT_mod = 6 PKNL = 1 PHC0 = -23873.57 PHC1 = 5.652704 SI = 16K 
       data hash MD5: 16K
       1F 61 68 74 EF A4 26 16 9E 68 E6 CF F5 88 6E 98>)
(   3,<2023-11-02 12:58:50.54 +0400>,<she>,<DPX200>,
      <pk PHC0 = 1.030467 PHC1 = 3.8 
       data hash MD5: 16K
       E5 CD B3 17 E1 47 3F D0 A3 8A 7B C0 65 A4 AA 67>)
(   4,<2023-11-02 12:58:54.21 +0400>,<she>,<DPX200>,
      <abs ABSG = 5 
       data hash MD5: 16K
       C6 72 17 EB 4D DD C1 D0 5A 29 30 A0 1F 9C B0 8B>)
$$ ##END=
$$ 
$$ hash MD5
$$ DA 9B 47 82 73 F0 65 AF 24 2C 17 06 9D 9F E9 E5
##$RELAX= 
##$RELAX= 
##$RELAX= 
##$RELAX= 
##$RELAX= 
##$RELAX= 
$$ Bruker specific parameters
$$ --------------------------
##$DU= <F:/spectra>
##$EXPNO= 1
##$NAME= <H-F>
##$PROCNO= 1
##$TYPE= <nmr>
##$USER= <she>
##$AMP= (0..31)
100 100 100 100 100 100 100 100 100 100 100 100 100 100 100 100 100 100 
100 100 100 100 100 100 100 100 100 100 100 100 100 100 
##$AQSEQ= 0
##$AQ_mod= 1
##$AUNM= <au_zg>
##$AUTOPOS= <>
##$BF1= 200.13
##$BF2= 200.13
##$BF3= 200.13
##$BF4= 200.13
##$BF5= 200.13
##$BF6= 200.13
##$BF7= 200.13
##$BF8= 200.13
##$BYTORDA= 1
##$CFDGTYP= 0
##$CFRGTYP= 5
##$CHEMSTR= <none>
##$CNST= (0..31)
1 1 145 1 1 1 1 1 1 1 1 1 1 1 1 1 1 1 1 1 1 1 1 1 1 1 1 1 1 1 1 1 
##$CPDPRG= <>
##$CPDPRG1= <>
##$CPDPRG2= <>
##$CPDPRG3= <>
##$CPDPRG4= <mlev>
##$CPDPRG5= <mlev>
##$CPDPRG6= <mlev>
##$CPDPRG7= <mlev>
##$CPDPRG8= <mlev>
##$CPDPRGB= <>
##$CPDPRGT= <>
##$D= (0..31)
0 1.2 0 0 0 0 0 0 0 0.06 0 0.03 0 0 0 0 0.0002 0 0 0 0 0 0 0 0 0 0 0 0 
0 0 0 
##$DATE= 1698915495
##$DBL= (0..7)
120 120 120 120 120 120 120 120 
##$DBP= (0..7)
150 150 150 150 150 150 150 150 
##$DBP07= 0
##$DBPNAM0= <>
##$DBPNAM1= <>
##$DBPNAM2= <>
##$DBPNAM3= <>
##$DBPNAM4= <>
$$ [...]
##$SUBNAM3= <"">
##$SUBNAM4= <"">
##$SUBNAM5= <"">
##$SUBNAM6= <"">
##$SUBNAM7= <"">
##$SUBNAM8= <"">
##$SUBNAM9= <"">
##$SW= 18.05172834244
##$SWIBOX= (0..15)
0 0 2 0 0 0 0 0 0 0 0 0 0 0 0 0 
##$SW_h= 3612.71676300578
##$TD= 16384
##$TD0= 1
##$TE= 0
##$TE2= 300
##$TE3= 300
##$TEG= 300
##$TL= (0..7)
0 120 120 120 120 120 120 120 
##$TP= (0..7)
150 150 150 150 150 150 150 150 
##$TP07= 0
##$TPNAME0= <>
##$TPNAME1= <>
##$TPNAME2= <>
##$TPNAME3= <>
##$TPNAME4= <>
##$TPNAME5= <>
##$TPNAME6= <>
##$TPNAME7= <>
##$TPOAL= (0..7)
0.5 0.5 0.5 0.5 0.5 0.5 0.5 0.5 
##$TPOFFS= (0..7)
0 0 0 0 0 0 0 0 
##$TUNHIN= 0
##$TUNHOUT= 0
##$TUNXOUT= 0
##$USERA1= <user>
##$USERA2= <user>
##$USERA3= <user>
##$USERA4= <user>
##$USERA5= <user>
##$V9= 5
##$VALIST= <valist>
##$VCLIST= <CCCCCCCCCCCCCCC>
##$VD= 0
##$VDLIST= <DDDDDDDDDDDDDDD>
##$VPLIST= <PPPPPPPPPPPPPPP>
##$VTLIST= <TTTTTTTTTTTTTTT>
##$WBST= 1024
##$WBSW= 4
##$XGAIN= (0..3)
0 0 0 0 
##$XL= 0
##$YL= 0
##$YMAX_a= 452326
##$YMIN_a= -461301
##$ZGOPTNS= <>
##$ZL1= 120
##$ZL2= 120
##$ZL3= 120
##$ZL4= 120
##$ABSF1= 15.74358
##$ABSF2= -2.30827
##$ABSG= 5
##$ABSL= 3
##$ALPHA= 0
##$AQORDER= 0
##$ASSFAC= 0
##$ASSFACI= 0
##$ASSFACX= 0
##$ASSWID= 0
##$AUNMP= <proc_1d>
##$AZFE= 0.1
##$AZFW= 0.1
##$BCFW= 0
##$BC_mod= 2
##$BYTORDP= 0
##$COROFFS= 0
##$CY= -3
##$DATMOD= 1
##$DC= 0
##$DFILT= <>
##$DTYPP= 0
##$F1P= 0
##$F2P= 0
##$FCOR= 1
##$FTSIZE= 16384
##$FT_mod= 6
##$GAMMA= 0
##$GB= 0
##$INTBC= 1
##$INTSCL= 3.70164e-10
##$ISEN= 128
##$LB= 0.24
##$LEV0= 0
##$LPBIN= 0
##$MAXI= 10000
##$MC2= 0
##$MEAN= 0
##$ME_mod= 0
##$MI= 1.114404
##$NCOEF= 0
##$NC_proc= -7
##$NLEV= 6
##$NOISF1= 3.799351
##$NOISF2= 2.8
##$NSP= 0
##$NTH_PI= 0
##$NZP= 0
##$OFFSET= 15.65985
##$PC= 1
##$PHC0= -23872.54
##$PHC1= 9.452703
##$PH_mod= 1
##$PKNL= yes
##$PPARMOD= 0
##$PSCAL= 0
##$PSIGN= 0
##$REVERSE= no
##$SF= 200.130022352292
##$SI= 16384
##$SIGF1= 3
##$SIGF2= 2
##$SINO= 5.538805
##$SIOLD= 16384
##$SREGLST= <1H.CDCl3>
##$SSB= 0
##$STSI= 16384
##$STSR= 0
##$SW_p= 3612.71676300578
##$SYMM= 0
##$S_DEV= 0
##$TDeff= 16384
##$TDoff= 0
##$TI= <>
##$TILT= no
##$TM1= 0
##$TM2= 0
##$TOPLEV= 0
##$USERP1= <user>
##$USERP2= <user>
##$USERP3= <user>
##$USERP4= <user>
##$USERP5= <user>
##$WDW= 1
##$XDIM= 16384
##$YMAX_p= 509574579
##$YMIN_p= -4095051
$$ End of Bruker specific parameters
$$ ---------------------------------
##NTUPLES= NMR SPECTRUM
##VAR_NAME=  FREQUENCY,     SPECTRUM/REAL,   SPECTRUM/IMAG
##SYMBOL=    X,             R,               I
##VAR_TYPE=  INDEPENDENT,   DEPENDENT,       DEPENDENT
##VAR_FORM=  AFFN,          ASDF,            ASDF
##VAR_DIM=   16384,         16384,           16384
##UNITS=     HZ,            ARBITRARY UNITS, ARBITRARY UNITS
##FACTOR=    0.220516191357247, 1,           1
##FIRST=     3134.0061546581, 0,             0
##LAST=      -478.71060834768, 0,            0
##MIN=       -478.71060834768, -4095051,     0
##MAX=       3134.0061546581, 509574579,     0
$$ Real data points
##PAGE= N=1
##DATA TABLE= (X++(R..R)), XYDATA
$$ [...]
$$ plain form
6058 40687491 41345121 42338530 43559415 45538918 47778970 50214928 53091663 56395448
6050 56395448 60047984 64291963 68951080 73822833 78433558 83201301 86809641 89318986
6042 89318986 89897191 89046852 87055909 84518095 81978710 79317082 76917541 75013790
6034 75013790 73561867 72637634 72675123 73159206 74296509 76267490 79079755 82698056 87290238
6025 87290238 92749005 98819675 106166550 114546129 123380490 132815662 141280296 147729121
6017 147729121 151278651 150185388 145025689 136902579 127270358 117373007 108103687 99938389
6009 99938389 92981821 87192034 82280576 78235394 75306916 73112654 71523974 70652704
6001 70652704 70142419 70609549 71858737 73443381 75750920 78588243 81784903 85377204
$$ packed form
6058D0687491O57630R93409J220885J979503K240052K435958K876735L303785
6050E6395448L652536M243979M659117M871753M610725M767743L608340K509345
6042H9318986N78205q50339j990943k537814k539385k661628k399541j903751
6034G5013790j451923r24233L7489M84083J137303J970981K812265L618301M592182
6025H7290238N458767O070670P346875Q379579Q834361R435172Q464634O448825
6017A47729121L549530j093263n159699q123110r632221r897351r269320q165298
6009I9938389o956568n789787m911458m045182k928478k194262j588680q71270
6001G0652704n10285M67130J249188J584644K307539K837323L196660L592301
$$ plain form
5993 85377204 88635900 90888645 91395156 89911495 86391701 81513249 75694434 69755078
5985 69755078 63910729 58713046 54013932 49629418 45967594 43076329 40165760 37523481
5977 37523481 35546736 33617515 31748840 30023760 28614344 27299483 25997341 24883690
5969 24883690 23860483 22912251 22153757 21709798 21308588 20442402 19762556 19235296 18900674
5960 18900674 18697519 18207821 17722924 17382743 17068364 16718098 16083850 15774730 15646029
5951 15646029 15031367 14756545 14625229 14546401 14581814 14603075 14402934 14119210 14056187 13958055
5941 13958055 13900986 13584251 13449609 13631586 13785791 13672492 13625597 13448019 13408106 13461979
5931 13461979 13677883 14021764 13979954 14240352 14379229 14479327 14309302 14611972 14659670 14793052
$$ packed form
5993H5377204L258696K252745N06511j483661l519794m878452n818815n939356
5985F9755078n844349n197683m699114m384514l661824k891265k910569k642279
5977C7523481j976745j929221j868675j725080j409416j314861j302142j113651
5969B4883690j023207r48232p58494m43959m01210q66186o79846n27260l34622
5960A8900674k03155m89698m84897l40181l14379l50266o34248l09120j28701
5951A5646029o14662k74822j31316p8828L5413K1261k00141k83724o3023r8132
5941A3958055n7069l16735j34642J81977J54205j13299m6895j77578l9913N3873
5931A3461979K15904L43881m1810K60398J38877J00098j70025L02670M7698J33382
$$ plain form
5921 14793052 15175829 15144389 15102795 15465199 15644354 16144478 16554616 16668276 16864955 17215057
5911 17215057 17652576 18213282 18648480 19234649 20072825 20854947 21879561 22949761 23888879
5902 23888879 25147758 27060467 28824113 30920259 33154850 35897172 38995102 42357508
5894 42357508 46184684 50398888 54394626 57674912 58996772 59042671 58138425 56465681 54907600
5885 54907600 53931117 53762491 54342102 55903347 57786863 60100288 62433218 63819118 64851061
5876 64851061 65903270 66773219 68054997 70010206 71595882 72275375 72210895 70777773 68520042
5867 68520042 66153723 64328750 63005701 62600848 62806000 62495326 61741746 60305376 58601375
5858 58601375 57505824 56765443 56682932 57378815 58913946 60879812 62225297 62817714 61837581
$$ packed form
5921A4793052L82777l1440m1594L62404J79155N00124M10138J13660J96679L50102
5911A7215057M37519N60706M35198N86169Q38176P82122J024614J070200R39118
5902B3888879J258879J912709J763646K096146K234591K742322L097930L362406
5894D2357508L827176M214204L995738L280286J321860M5899r04246j672744j558081
5885E4907600r76483j68626N79611J561245J883516K313425K332930J385900J031943
5876F4851061J052209Q69949J281778J955209J585676O79493o4480j433122k257731
5867F8520042k366319j824973j323049m04853K05152l10674p53580j436370j704001
5858E8601375j095551p40381q2511O95883J535131J965866J345485N92417r80133
$$ plain form
5849 61837581 58702217 54264373 49484444 44738062 40390481 36836164 33694297 30804684
5841 30804684 28696903 26573223 24442836 22845059 21699883 20415469 19405837 18192182
5833 18192182 17176718 16701950 15993265 15171910 14551076 14049742 13693962 13126801 12679123
5824 12679123 11947224 11583913 11372580 11434080 11190525 10909698 10718771 10219021 10002189 9896428
5814 9896428 9551949 9181371 8953487 8753007 8768045 8470530 8461544 8069626 7733758 7723171
5804 7723171 7856552 7773239 7627329 7388523 6993316 7002480 7088082 7222163 6998286 6860226
5794 6860226 6835117 6759572 6671375 6561250 6587307 6574617 6273350 6375290 6421678 6456342 6322162
5783 6322162 6288713 6318858 6342961 6447790 6155387 6193666 6320189 6102765 5732583 5914338
$$ packed form
5849F1837581l135364m437844m779929m746382m347581l554317l141867k889613
5841C0804684k107781k123680k130387j597777j145176j284414j009632j213655
5833A8192182j015464m74768p08685q21355o20834n01334l55780n67161m47678
5824A2679123p31899l63311k11333O1500k43555k80827j90927m99750k16832j05761
5814I896428l44479l70578k27884k00480J5038k97515q986l91918l35868j0587
5804G723171J33381q3313j45910k38806l95207R164Q5602J34081k23877j38060
5794F860226k5109p5545q8197j10125K6057j2690l01267J01940M6388L4664j34180
5783F322162l3449L0145K4103J04829k92403L8279J26523k17424l70182J81755
$$ plain form
5773 5914338 6027486 6019854 5907455 5752244 5822056 5898123 5903952 5789732 5625664 5818158 5821269
5762 5821269 6035093 6124099 6074421 5987469 6169287 6391172 6140914 5798344 5700181 5712957
5752 5712957 5879666 5753245 5904391 5855418 5712393 5550592 5560217 5576030 5590186 5660170 5518941
5741 5518941 5582808 5837163 6028535 6259721 6172682 6136001 6538608 6320939 6456373 6625651
5731 6625651 6785067 6902700 6747908 7082484 7296545 7514497 7744326 7826412 8009872 8584924
5721 8584924 8962490 9167400 9404781 9430543 9685414 9811251 9740948 9293070 8920731 9267887
5711 9267887 9362530 9261166 9067053 8969733 8760692 8758264 8983898 8751919 8596267 8850194
5701 8850194 9096180 9073324 8812542 8865599 9048964 9206683 9388156 9688244 9625421 9816244
$$ packed form
5773E914338J13148p632j12399j55211O9812P6067N829j14220j64068J92494L111
5762E821269K13824Q9006m9678q6952J81818K21885k50258l42570r8163J2776
5752E712957J66709j26421J51146m8973j43025j61801R625J5813J4156O9984j41229
5741E518941O3867K54355J91372K31186q7039l6681M02607k17669J35434J69278
5731F625651J59416J17633j54792L34576K14061K17952K29829Q2086J83460N75052
5721H584924L77566K04910K37381K5762K54871J25837p0303m47878l72339L47156
5711I267887R4643j01364j94113r7320k09041k428K25634k31979j55652K53927
5701H850194K45986k2856k60782N3057J83365J57719J81473L00088o2823J90823
$$ plain form
5691 9816244 10281825 10148566 10370670 10534261 10755200 10880948 11208230 11630358 12122885 12544482
5681 12544482 12939835 13284593 13498560 13591282 14057737 14618000 15154479 15580285 15858039 16277568
5671 16277568 17012999 17701295 18231528 18904006 19815204 20862015 21675802 22951915 24519102
5662 24519102 25782263 27396837 29455439 31326191 33687416 36416693 38953161 42334243
5654 42334243 46008950 49890431 53403953 56569098 59092327 59986938 58966857 57034194
5646 57034194 54340353 51973533 49811513 47884475 46493084 45650160 45293568 45164053 46004167
5637 46004167 47240306 48918122 50915370 53280724 56218613 59642015 63800045 68385577
5629 68385577 73854488 80087374 85934105 91156951 94168188 94388917 91435107 86092410
$$ packed form
5691I816244M65581j33259K22104J63591K20939J25748L27282M22128M92527M21597
5681A2544482L95353L44758K13967R2722M66455N60263N36479M25806K77754M19529
5671A6277568P35431O88296N30233O72478R11198J046811Q13787J276113J567187
5662B4519102J263161J614574K058602J870752K361225K729277K536468L381082
5654D2334243L674707L881481L513522L165145K523229Q94611j020081j932663
5646E7034194k693841k366820k162020j927038j391391q42924l56592j29515Q40114
5637D6004167J236139J677816J997248K365354K937889L423402M158030M585532
5629F8385577N468911O232886N846731N222846L011237K20729k953810n342697
$$ plain form
5621 86092410 79817895 73557660 67827286 62975657 58501555 54875508 52181814 50125136
5613 50125136 48418287 47368019 47041998 46779876 46842426 47103144 48078621 49358319 50699953
5604 50699953 52684155 54853924 57355516 59708990 61006768 61384525 60524802 58462849
5596 58462849 56089583 53423896 51108121 49506298 48332460 47644317 46887566 46105902 44918440
5587 44918440 43465657 42499782 41422409 40578169 39816315 39208779 38971279 38896286 38995999
5578 38995999 39061486 39342995 39477796 39941277 40591474 41103777 41794300 42698313 43335722 44028852
5568 44028852 44648025 45827594 47172173 48702692 50352645 52222708 54028701 55526154
5560 55526154 56713559 57041027 55954183 54014239 52197108 50398133 48795042 47523660
$$ packed form
5621H6092410o274515o260235n730374m851629m474102l626047k693694k056678
5613E0125136j706849j050268l26021k62122O2550K60718R75477J279698J341634
5604E0699953J984202K169769K501592K353474J297778L77757q59723k061953
5596E8462849k373266k665687k315775j601823j173838o88143p56751p81664j187462
5587D4918440j452783r65875j077373q44240p61854o07536k37500p4993R9713
5578C8995999O5487K81509J34801M63481O50197N12303O90523R04013O37409O93130
5568D4028852O19173J179569J344579J530519J649953J870063J805993J497453
5560E5526154J187405L27468j086844j939944j817131j798975j603091j271382
$$ plain form
5552 47523660 46568694 45786196 44861559 44362172 43819693 42900300 42025262 41456471 40954689
5543 40954689 40426123 39906192 39594047 39352479 39293234 39601678 39819881 40035612 40108817 40348813
5533 40348813 40550477 40859391 40867544 41067264 40922389 40405235 39364838 38306015 37599611
5524 37599611 36679176 35683005 35087823 34461724 34347526 34041174 33694519 33272848 32988344
5515 32988344 32541826 32142132 31495590 31265288 31322540 31260086 31114476 31169871 31105627 31084920
5505 31084920 31391467 31355347 31096235 31185621 31420147 31724933 31853334 32369447 32599223 32561778
5495 32561778 32110885 31212396 30980162 30839541 30674138 30183016 30281935 30530844 30705181 30908807
5485 30908807 31703688 32346724 32835110 33538318 34643313 36040433 37506649 38922607 40301141
$$ packed form
5552D7523660r54966p82498r24637m99387n42479r19393q75038n68791n01782
5543D0954689n28566n19931l12145k41568n9245L08444K18203K15731P3205K39996
5533D0348813K01664L08914Q153J99720j44875n17154j040397j058823p06404
5524C7599611r20435r96171n95182o26099j14198l06352l46655m21671k84504
5515C2988344m46518l99694o46542k30302N7252o2454j45610N5395o4244k0707
5505C1084920L06547l6120k59112Q9386K34526L04786J28401N16113K29776l7445
5495C2561778m50893q98489k32234j40621j65403m91122R8919K48909J74337K03626
5485C0908807P94881O43036M88386P03208J104995J397120J466216J415958J378534
$$ plain form
5476 40301141 42639777 44985017 47372060 50208115 53279396 57094076 61380091 66255366
5468 66255366 71401917 76979494 82781420 88765362 93509875 96763942 97776667 96507226
5460 96507226 93594283 89741140 85824858 81954964 78647663 75962235 74186964 73111097
5452 73111097 72230565 72534212 73732295 75952468 78846288 82448232 87025877 92343530
5444 92343530 98917937 106626093 115043735 124474636 135046679 145550829 154117490 159540065
5436 159540065 159780237 154853156 146392847 135974445 125383165 115204861 105898574 97839511
5428 97839511 91027627 85396350 80962061 77205773 74165720 72119182 70818084 70287017
5420 70287017 70362398 71050529 72077036 73759401 75950217 78423656 81566803 84537166 87049277
$$ packed form
5476D0301141K338636K345240K387043K836055L071281L814680M286015M875275
5468F6255366N146551N577577N801926N983942M744513L254067J012725j269441
5460I6507226k912943l853143l916282l869894l307301k685428j775271j075867
5452G3111097q80532L03647J198083K220173K893820L601944M577645N317653
5444I2343530O574407P708156Q417642R430901J0572043J0504150Q566661N422575
5436A59540065K40172m927081q460309j0418402j0591280j0178304r306287q059063
5428I7839511o811884n631277m434289l756288l040053k046538j301098n31067
5420G0287017P5381O88131J026507J682365K190816K473439L143147K970363K512111
$$ plain form
5411 87049277 88355395 88072229 85644127 81384948 76141369 70465877 64842066 59686837
5403 59686837 55131226 51018119 47430423 44337132 41592771 39324852 37382672 35547507
5395 35547507 33887561 32442275 31422748 30193249 29382766 28633683 27846179 27179737 26467623
5386 26467623 25703403 25035838 24607280 24329307 24287420 23786874 23245421 22697716 22171400 21943690
5376 21943690 21428301 21232764 20986313 20864260 20574009 20624487 20918763 20878868 20872380 20802615
5366 20802615 21019480 21184736 21133679 21496916 21986026 22063564 22461024 22955725 23483196 23724128
5356 23724128 24459698 25167359 25621639 26236846 26809604 27658061 28663085 29651621 30942017
5347 30942017 32257026 34008228 36473147 38858423 41580499 44705618 48593090 52563352
$$ packed form
5411H7049277J306118k83166k428102m259179n243579n675492n623811n155229
5403E9686837m555611m113107l587696l093291k744361k267919j942180j835165
5395C5547507j659946j445286j019527j229499q10483p49083p87504o66442p12114
5386B6467623p64220o67565m28558k77973m1887n00546n41453n47705n26316k27710
5376B1943690n15389j95537k46451j22053k90251N0478K94276l9895o488o9765
5366B0802615K16865J65256n1057L63237M89110P7538L97460M94701N27471K40932
5356B3724128P35570P07661M54280O15207N72758Q48457J005024R88536J290396
5347C0942017J315009J751202K464919K385276K722076L125119L887472L970262
$$ plain form
5339 52563352 56829590 61351658 65169692 67984926 68740031 67926221 65969981 64184775
5331 64184775 62618563 61712383 61715528 62367673 63693864 65208860 66208401 66986251 67072467
5322 67072467 66684238 66998688 67934330 69484376 71467822 73206563 74215812 73906568 72559642
5313 72559642 70398194 68370356 66787867 65694502 64773711 63700165 61882230 59966060
5305 59966060 58036984 56180591 55084143 54616731 54962870 55686926 57102048 58502201 59138479
5296 59138479 58677886 56293024 52802164 48952054 44798152 41035921 37844033 35192711
5288 35192711 32489065 30273958 28467549 26473117 25099518 23984096 22928618 21695261
5280 21695261 20241100 19239837 18280123 17616299 17171042 16788794 16055180 15381083 15129274
$$ packed form
5339E2563352M266238M522068L818034K815234P55105q13810j956240j785206
5331F4184775j566212r06180L145O52145J326191J514996R99541P77850Q6216
5322F7072467l88229L14450R35642J550046J983446J738741J009249l09244j346926
5313G2559642k161448k027838j582489j093365r20791j073546j817935j916170
5305E9966060j929076j856393j096448m67412L46139P24056J415122J400153O36278
5296E9138479m60593k384862l490860l850110m153902l762231l191888k651322
5288C5192711k703646k215107j806409j994432j373599j115422j055478j233357
5280B1695261j454161j001263r59714o63824m45257l82248p33614o74097k51809
$$ plain form
5271 15129274 14676260 14490248 14393423 14090320 13776912 13597483 13433721 13278001 13085763 12801659
5261 12801659 12492845 12088135 11570982 11282143 10877099 10540853 10374610 10056729 9842068
5252 9842068 9708727 9260724 9030007 8873539 8629993 8720667 8655494 8533379 8101988 7968491
5242 7968491 7776223 8020725 8098434 7985239 7851611 7766935 7527990 7566234 7675148 7581132
5232 7581132 7531997 7554441 7607590 7487066 7336775 7441845 7243665 6934814 6838144 6644986
5222 6644986 6629767 6499554 6311634 6235298 6110784 5859182 5770210 5800759 5654686 5617474
5212 5617474 5596237 5714804 5619323 5473941 5429638 5086851 5220171 5334806 5304204 5176792
5202 5176792 5259123 5300407 5145563 5252872 5152220 5099645 5034975 5163322 5225708 4976388
$$ packed form
5271A5129274m53014j86012r6825l03103l13408j79429j63762j55720j92238k84104
5261A2801659l08814m04710n17153k88839m05044l36246j66243l17881k14661
5252I842068j33341m48003k30717j56468k43546R0674o5173j22115m31391j33497
5242G968491j92268K44502P7709j13195j33628q4676k38945L8244J08914r4016
5232G581132m9135K2444N3149j20524j50291J05070j98180l08851r6670j93158
5222F644986j5219j30213j87920p6336j24514k51602q8972L0549j46073l7212
5212E617474k1237J18567r5481j45382m4303l42787J33320J14635l0602j27412
5202E176792Q2331M1284j54844J07309j00652n2575o4670J28347O2386k49320
$$ plain form
5192 4976388 5051139 5096100 4815049 4775627 4792338 4698217 4595993 4646789 4682362 4729614 4774431
5181 4774431 5003129 4926255 4807774 4851358 5038832 4918392 5140245 5362373 5259256 5313128
5171 5313128 5259896 5058130 5426893 5696926 5303038 5317402 5349968 5323089 5296920 5209607 4796187
5160 4796187 4587417 4454595 4609658 4694183 4691681 4520620 4474608 4453665 4514714 4474941 4598076
5149 4598076 4620777 4719755 4736592 4910524 4736311 4381873 4548183 4753854 4729781 4659588
5139 4659588 4629158 4525848 4556116 4644396 4668919 4516201 4421496 4574131 4436009 4227880
5129 4227880 4342186 4177194 4068439 4091334 4100997 4316005 4492692 4601982 4855378 5065949
5119 5065949 5100422 5477251 5769513 6013435 6248204 5991432 5712410 5742024 5339734 5239801
$$ packed form
5192D976388P4751M4961k81051l9422J6711r4121j02224N0796L5573M7252M4817
5181D774431K28698p6874j18481M3584J87474j20440K21853K22128j03117N3872
5171E313128n3232k01766L68763K70033l93888J4364L2566k6879k6169q7313m13420
5160D796187k08770j32822J55063Q4525k502j71061m6012k0943O1049l9773J23135
5149D598076K2701R8978J6837J73932j74213l54438J66310K05671k4073p0193
5139D659588l0430j03310L0268Q8280K4523j52718r4705J52635j38122k08129
5129D227880J14306j64992j08755K2895R663K15008J76687J09290K53396K10571
5119E065949L4473L76829K92262K43922K34769k56772k79022K9614m02290r9933
$$ plain form
5109 5239801 5140104 4838629 4774878 4480594 4211296 4137110 4366620 4511037 4478336 4295781
5099 4295781 4200269 4154223 3888606 3848405 3821409 3933668 3827865 3820120 3691220 3835534 4163622
5088 4163622 4176134 4521765 4649110 4844423 4899656 5037852 5113427 5128701 4960901 4921067
5078 4921067 4577874 3986357 3689648 3566132 3722310 3379944 3252010 3134494 2828853 2938006
5068 2938006 3086146 3006095 2839374 2912996 2933491 2550774 2307795 2690913 2547585 2379075
5058 2379075 2321505 2408016 2538705 2334340 2363509 2603704 2699329 2656049 2519576 2922800
5048 2922800 2863249 2526007 2698683 2554451 2279337 2145115 1893195 1845880 2032720 1847219
5038 1847219 1945508 1964011 1908700 2117488 1787714 2004881 1904145 1811369 1868243 1813180 1914076
$$ packed form
5109E239801r9697l01475o3751k94284k69298p4186K29510J44417l2701j82555
5099D295781r5512m6046k65617m0201k6996J12259j05803p745j28900J44314L28088
5088D163622J2512L45631J27345J95313N5233J38196P5575J5274j67800l9834
5078D921067l43193n91517k96709j23516J56178l42366j27934j17516l05641J09153
5068B938006J48140q0051j66721P3622K0495l82717k42979L83118j43328j68510
5058B379075n7570Q6511J30689k04365K9169K40195R5625m3280j36473M03224
5048B922800n9551l37242J72676j44232k75114j34222k51920m7315J86840j85501
5038A847219R8289J8503n5311K08788l29774K17167j00736r2776N6874n5063J00896
$$ plain form
5027 1914076 1969476 1966742 1733895 1712952 1939464 2031481 1718552 1801266 1686647 1726807 1882434
5016 1882434 1673763 1697045 1840328 1912563 1982401 1867026 2155513 2499720 2252567 1998241
5006 1998241 1916916 2025631 2204443 2218282 2132868 1838435 1764257 2018269 2206633 1971217
4996 1971217 1886434 2243752 2507709 2367362 2269070 2306014 2113053 1921451 2006427 2041097
4986 2041097 1942496 2118289 2166839 2107502 1987650 2037826 1950948 1949818 1706111 1802005 2177777
4975 2177777 2007205 1940894 1972571 2061828 1977072 1970625 2188951 2099961 2157840 2174445 2147966
4964 2147966 2046626 2171273 2129083 2148884 2052406 1932692 2062249 2113062 2037062 2003051 2018420
4953 2018420 1817751 2039267 1975173 1803355 1790527 2099853 2219148 2429236 2362199 2229401
$$ packed form
5027A914076N5400k734k32847k0943K26512R2017l12929Q2714j14619M0160J55627
5016A882434k08671K3282J43283P2235O9838j15375K88487L44207k47153k54326
5006A998241q1325J08715J78812J3839q5414k94433p4178K54012J88364k35416
4996A971217q4783L57318K63957j40347r8292L6944j92961j91602Q4976L4670
4986B041097r8601J75793M8550n9337j19852N0176q6878j130k43707R5894L75772
4975B177777j70572o6311L1677Q9257q4756o447K18326q8990N7879J6605k6479
4964B147966j01340J24647m2190J9801r6478j19714J29557N0813p6000l4011J5369
4953B018420k00669K21516o4094j71818j2828L09326J19295K10088o7037j32798
$$ plain form
4943 2229401 2294695 2375296 2683200 2781253 2855560 3117187 2931393 2727820 2416603 2694932
4933 2694932 2851279 2974420 3235828 3414162 3432894 3334964 3330989 3636352 3974178 3904427
4923 3904427 4183114 4222027 4245691 4602111 4821676 4698144 4755280 4988839 5212011 5387905
4913 5387905 5902264 6356931 6715104 7121151 7637604 8159261 8864875 10060944 11308654
4904 11308654 12629869 14125818 15543957 17568478 19831593 22065869 23587676 23669324
4896 23669324 22425043 20307484 18241036 16158783 14704367 13551539 12830001 12299668
4888 12299668 11886340 11681596 11347945 10954053 10782642 10717822 10508372 10546068 10948920 10966714
4878 10966714 10995078 11662980 12210755 12623367 12926020 12899243 12393676 11482657 10487867 9577901
$$ packed form
4943B229401O5294Q0601L07904R8053P4307K61627j85794k03573l11217K78329
4933B694932J56347J23141K61408J78334J8732r7930l975L05363L37826o9751
4923C904427K78687L8913K3664L56420K19565j23532N7136K33559K23172J75894
4913E387905N14359M54667L58173M06047N16453N21657P05614J196069J247710
4904A1308654J321215J495949J418139K024521K263115K234276J521807Q1648
4896B3669324j244281k117559k066448k082253j454416j152828p21538n30333
4888A2299668m13328k04744l33651l93892j71411o4820k09450L7696M02852J7794
4878A0966714K8364O67902N47775M12612L02653k6777n05567r11019r94790r09966
$$ plain form
4868 9577901 8813073 8315484 7517664 6911534 6577638 6515276 6094694 5643068 5516438 5577656
4858 5577656 5538362 5288056 5083688 5109237 5130618 4914553 5071930 5154018 5206304 5016240
4848 5016240 4907068 5073020 5339772 5336563 5220649 5384339 5566410 5978270 6256189 6699554
4838 6699554 7105109 7607453 8351747 9161965 9827206 10616244 11186311 11310691 11378810 11213021
4828 11213021 10586558 9878863 9531639 9075139 8537360 8097287 7722071 7603299 7329607
4819 7329607 7404713 7785653 7890713 8218314 8481772 9061908 9336147 9905005 10804115 11850385
4809 11850385 13339046 14350625 16143662 17963013 19770914 21395904 21885786 21241370
4801 21241370 19817629 17950726 15722312 13849725 12557392 11214218 10158972 9076565
$$ packed form
4868I577901p64828m97589p97820o06130l33896o2362m20582m51626j26630O1218
4858E577656l9294k50306k04368K5549K1381k16065J57377Q2088N2286j90064
4848E016240j09172J65952K66752l209j15914J63690J82071M11860K77919M43365
4838F699554M05555N02344P44294Q10218O65241P89038N70067J24380O8119j65789
4828A1213021o26463p07695l47224m56500n37779m40073l75216j18772k73692
4819G329607P5106L80940J05060L27601K63458N80136K74239N68858Q99110J046270
4809A1850385J488661J011579J793037J819351J807901J624990M89882o44416
4801B1241370j423741j866903k228414j872587j292333j343174j055246j082407
$$ plain form
4793 9076565 8256029 7943181 7549905 7029877 6623406 6113356 5627890 5304474 4835532 4819907
4783 4819907 4659222 4760910 4536484 4376263 4034540 3953900 4121820 3890243 3677360 3284403
4773 3284403 3202234 3389644 3240322 3191491 3287985 3397733 3131324 3220975 3043947 2966809
4763 2966809 2885411 2758032 2684140 2412231 2594448 2401100 2560202 2969471 2705801 2739721
4753 2739721 2541991 2467472 2365106 2686476 2801880 2640841 2429584 2444249 2698765 2545289
4743 2545289 2407622 2523046 2448120 2099898 2242146 2089558 2039124 2259571 2473924 2378061
4733 2378061 2124291 1958194 2244368 2318083 2247346 2373606 2465576 2316293 2319790 2280898 1994437
4722 1994437 2002831 2134423 2351756 2614316 2626322 2629068 2759426 2666991 2546710 2387497 2413316
$$ packed form
4793I076565q20536l12848l93276n20028m06471n10050m85466l23416m68942j5625
4783D819907j60685J01688k24426j60221l41723q0640J67920k31577k12883l92957
4773C284403q2169J87410j49322m8831R6494J09748k66409Q9651j77028p7138
4763B966809q1398j27379p3892k71909J82217j93348J59102M09269k63670L3920
4753B739721j97730p4519j02366L21370J15404j61039k11257J4665K54516j53476
4743B545289j37667J15424p4926l48222J42248j52588n0434K20447K14353r5863
4733B378061k53770j66097K86174P3715p0737J26260R1970j49283L497l8892k86461
4722A994437Q394J31592K17333K62560J2006K746J30358r2435j20281j59213K5819
$$ plain form
4711 2413316 2546860 2486351 2591501 2827659 3085661 2819245 2759509 2910375 2912923 2820081
4701 2820081 2859706 2811296 2902600 3075145 3339091 3417959 3361059 3240414 3502541 3604683
4691 3604683 3886086 4028385 4330154 4640743 5104628 5574177 6324907 6719161 7293389 7921174
4681 7921174 8419919 8379322 7689843 7111576 6296200 5546611 5124389 4610456 4188616 4019593
4671 4019593 3672690 3471471 3396840 3219766 2993769 2796107 2668021 2804887 2687322 2660544
4661 2660544 2457644 2445141 2294329 2075679 1970919 2058460 2212743 2024805 1894412 2027791
4651 2027791 2055601 2198838 1899527 2014983 1949299 1902202 1944534 2008955 1906179 2174687
4641 2174687 2369507 2046034 2068016 2180049 1967809 1945711 2072076 2155359 2223850 2196478
$$ packed form
4711B413316J33544o0509J05150K36158K58002k66416n9736J50866K548r2842
4701B820081L9625m8410R1304J72545K63946P8868n6900j20645K62127J02142
4691C604683K81403J42299L01769L10589M63885M69549P50730L94254N74228O27785
4681G921174M98745m0597o89479n78267q15376p49589m22222n13933m21840j69023
4671D019593l46903k01219p4631j77074k25997j97662j28086J36866j17565k6778
4661B660544k02900j2503j50812k18650j04760Q7541J54283j87938j30393J33379
4651B027791K7810J43237k99311J15456o5684m7097M2332O4421j02776K68508
4641B174687J94820l23473K1982J12033k12240k2098J26365Q3283O8491k7372
$$ plain form
4631 2196478 2045482 2098202 2113676 2160473 2476361 2632236 2451422 2313451 2411059 2268452
4621 2268452 2264955 2268870 2280373 2300577 2253176 2230629 2285705 2311512 2402626 2365376 2371940 2353076
4609 2353076 2431709 2427393 2291945 2306058 2590366 2693093 2510710 2626317 2470030 2340390
4599 2340390 2533843 2961242 2863793 2949304 3072514 3071226 3086880 3351435 3410989 3203759 3247892
4588 3247892 3464478 3531084 3457807 3557740 3513270 3577667 3904098 3917273 3653459 3893230 4086442
4577 4086442 4232355 4327424 4093696 3940413 4281515 4723881 4866793 5229386 5250032 5151601
4567 5151601 5464698 5566419 5462599 5571787 5681049 5793872 5806901 6213138 6355732 6358064
4557 6358064 6797845 6743993 6692589 7283804 7808272 7637555 7957805 8189272 8592543 8680518
$$ packed form
4631B196478j50996N2720J5474M6797L15888J55875j80814j37971R7608j42607
4621B268452l497L915J1503K0204m7401k2547N5076K5807R1114l7250O564j8864
4609B353076P8633m316j35448J4113K84308J02727j82383J15607j56287j29640
4599B340390J93453M27399r7449Q5511J23210j288J5654K64555N9554k07230M4133
4588C247892K16586O6606p3277R9933m4470O4397L26431J3175k63814K39771J93212
4577D086442J45913R5069k33728j53283L41102M42366J42912L62593K0646r8431
4567E151601L13097J01721j03820J09188J09262J12823J3029M06237J42594K332
4557F358064M39781n3852n1404N91215N24468j70717L20250K31467M03271Q7975
$$ plain form
4547 8680518 8743701 8973536 8968300 9064677 9254860 9581405 9674949 9596446 9905569 10159843 10501515
4536 10501515 10844748 11357909 11896257 12033947 12625127 13154977 13439833 13879253 14313404
4527 14313404 14793059 15441672 15994327 16504299 17058019 17654021 18148604 18965337 19900668
4518 19900668 21010123 22092448 22996149 23758668 24606493 25806023 27292266 28432869 29487467
4509 29487467 31181905 32728998 34442064 35902365 37629766 39941544 42456572 44922252
4501 44922252 47752480 51403810 55612148 60672745 67217814 74984479 84141221 94704285
4493 94704285 107014480 120902929 137369264 156451717 178809099 204137376 230685345
4486 230685345 253199033 264118097 257184973 234647003 206037305 178245733 153833184
$$ packed form
4547H680518O3183K29835n236R6377J90183L26545R3544p8503L09123K54274L41672
4536A0501515L43233N13161N38348J37690N91180N29850K84856M39420M34151
4527A4313404M79655O48613N52655N09972N53720N96002M94583Q16733R35331
4518A9900668J109455J082325R03701P62519Q47825J199530J486243J140603J054598
4509B9487467J694438J547093J713066J460301J727401K311778K515028K465680
4501D4922252K830228L651330M208338N060597O545069P766665R156742J0563064
4493I4704285J2310195J3888449J6466335J9082453K2357382K5328277K6547969
4486B30685345K2513688J0919064o933124k2537970k8609698k7791572k4412549
$$ plain form
4479 153833184 132942891 115306820 101043154 89842761 80794540 73214442 66911399
4472 66911399 61416286 56283239 52039389 47943074 44378293 41164482 38318262 35612447
4464 35612447 33528186 31684726 30237401 28707245 27255556 26239614 25333785 24342512
4456 24342512 23435521 22722616 21833383 20828654 20109124 19369526 18185672 17646807 17158960
4447 17158960 16519234 16080263 15450851 14791039 14528055 14434064 14099476 13687748 13266668 12973458
4437 12973458 12424117 12238332 12049030 11940434 11675163 11320853 11194255 10987289 10771713
4428 10771713 10774666 10447451 9975225 9828227 9559998 9104345 8922696 8734470 8393417 8223634
4418 8223634 8131600 8014422 7910371 7774741 7621145 7535571 7272007 7280445 7339836 6897991
$$ packed form
4479A53833184k0890293j7636071j4263666j1200393r048221p580098o303043
4472F6911399n495113n133047m243850m096315l564781l213811k846220k705815
4464C5612447k084261j843460j447325j530156j451689j015942r05829r91273
4456B4342512r06991p12905q89233j004729p19530p39598j183854n38865m87847
4447A7158960o39726m38971o29412o59812k62984r3991l34588m11728m21080k93210
4437A2973458n49341j85785j89302j08596k65271l54310j26598k06966k15576
4428A0771713K953l27215m72226j46998k68229m55653j81649j88226l41053j69783
4418H223634r2034j17178j04051j35630j53596q5574k63564Q438N9391m41845
$$ plain form
4408 6897991 6576347 6759811 6712497 6464071 6249884 6117255 6171320 6133198 5752478 5504784
4398 5504784 5527670 5606897 5446001 5041941 5118999 5320988 5091819 4806117 4722032 4845252
4388 4845252 4799995 4743570 4472137 4199502 4295868 4483945 4363538 4508294 4547003 4513328
4378 4513328 4581126 4448401 4560336 4471833 4647467 4580516 4682438 4901229 4794732 5128480
4368 5128480 5170409 5133828 5316358 5640316 5718338 5811513 5557015 4898020 4725478 4443442
4358 4443442 4154216 4085823 4071113 3842461 4021948 4089395 3829851 3855792 3580598 3324505
4348 3324505 3474967 3455647 3497607 3291734 3549032 3658683 3445229 3349663 3173011 2866689
4338 2866689 3061368 3158902 3053871 2929212 3110721 3179756 3138639 3112060 3096472 2879868
$$ packed form
4408F897991l21644J83464m7314k48426k14187j32629N4065l8122l80720k47694
4398E504784K2886P9227j60896m04060P7058K01989k29169k85702q4085J23220
4388D845252m5257n6425k71433k72635R6366J88077j20407J44756L8709l3675
4378D513328O7798j32725J11935q8503J75634o6951J01922K18791j06497L33748
4368E128480M1929l6581J82530L23958P8022R3175k54498o58995j72542k82036
4358D443442k89226o8393j4710k28652J79487O7447k59544K5941k75194k56093
4348C324505J50462j9320M1960k05873K57298J09651k13454r5566j76652l06322
4338B866689J94679R7534j05031j24659J81509O9035m1117k6579j5588k16604
$$ plain form
4328 2879868 2756904 2765557 2695782 3141882 3176953 3167011 2809605 2699828 2832017 2632017 2698874
4317 2698874 2715789 2569228 2633198 2729165 2777163 2610523 2469305 2348426 2465579 2340340
4307 2340340 2257266 2138190 2283041 2192348 2279777 2447214 2204840 2014183 1999471 1929326
4297 1929326 2077021 2133388 2274782 2147237 1944908 1802350 2099806 2237236 2318111 2121422
4287 2121422 2190831 2240052 2027256 2126304 2401122 2272309 2205080 2346360 2158131 2102406
4277 2102406 2073939 2461367 2423172 2459818 2549736 2667192 2623032 2556780 2589552 2617059 2714211
4266 2714211 2785893 2690217 2522944 2288101 2377608 2552382 2727690 2854086 2794115 2881973
4256 2881973 2995760 2984533 2739758 2922947 2829205 2804999 2883145 2794777 2767319 3012737 2986086
$$ packed form
4328B879868j22964Q653o9775M46100L5071r942l57406j09777J32189k00000O6857
4317B698874J6915j46561O3970R5967M7998j66640j41218j20879J17153j25239
4307B340340q3074j19076J44851r0693Q7429J67437k42374j90657j4712p0145
4297A929326J47695N6367J41394j27545k02329j42558K97456J37430Q0875j96689
4287B121422O9409M9221k12796R9048K74818j28813o7229J41280j88229n5725
4277B102406k8467L87428l8195L6646Q9918J17456m4160o6252L2772K7507R7152
4266B714211P1682r5676j67273k34843Q9507J74774J75308J26396n9971Q7858
4256B881973J13787j1227k44775J83189r3742k4206P8146q8368k7458K45418k6651
$$ plain form
4245 2986086 3141085 3392121 3243217 3464446 3369086 3672955 3681254 3648131 3476604 3280866
4235 3280866 3373108 3283837 3273842 3480414 3417796 3662148 4028598 3996117 3897349 4270910 4437922
4224 4437922 4371090 4520765 4700272 5059861 5095668 5377082 5749003 6313249 6739167 7324569
4214 7324569 8205748 8806655 9708468 11126756 12431454 13298266 14532059 15585465 15625387
4205 15625387 14558765 12914638 11513873 10608163 9481529 8572253 7851360 7219893 6896134
4196 6896134 6637844 6426819 6055505 5567859 5382471 5079947 4830221 4715168 4426171 4444825
4186 4444825 4448192 4322175 4362211 4183666 4039850 4067168 4024343 3879351 3877880 3944513 4218992
4175 4218992 4406337 4354031 4492697 4416226 4367589 4564039 4801081 4882924 4701255 4717566
$$ packed form
4245B986086J54999K51036j48904K21229r5360L03869Q299l3123j71527j95738
4235C280866R2242q9271r995K06572o2618K44352L66450l2481r8768L73561J67012
4224D437922o6832J49675J79507L59589L5807K81414L71921N64246M25918N85402
4214G324569Q81179O00907R01813J418288J304698Q66812J233793J053406L9922
4205A5625387j066622j644127j400765r05710j126634r09276p20893o31467l23759
4196F896134k58290k11025l71314m87646j85388l02524k49726j15053k88997J8654
4186D444825L367j26017M0036j78545j43816K7318m2825j44992j471O6633K74479
4175D218992J87345n2306J38666p6471m8637J96450K37042Q1843j81669J6311
$$ plain form
4165 4717566 4820871 4743643 4475702 4374064 4329896 4148852 4270325 4310897 4522991 4882875
4155 4882875 4989390 4898135 4991879 5261370 5388994 5460532 5488402 5631189 5321365 4845909
4145 4845909 4687054 4483433 4400967 4058986 3701557 3489412 3300365 3399166 3270667 3212027
4135 3212027 3111591 3002875 2892270 3110694 3225770 3141112 3086752 2938344 3006233 3179910
4125 3179910 2950257 2723118 2685562 2628532 2627003 2863976 2781369 2615129 2757507 2753921 2726833
4114 2726833 2455027 2726359 2544392 2552537 2681265 2798265 2932501 2975559 2873321 2777803
4104 2777803 2849287 2907867 3026287 2919773 2748182 2734026 2644067 2704163 2846175 2908994 2624184
4093 2624184 2831381 3038479 3014338 3186584 3218016 3097095 2703368 2842401 2988785 3095925
$$ packed form
4165D717566J03305p7228k67941j01638m4168j81044J21473M0572K12094L59884
4155D882875J06515r1255R3744K69491J27624P1538K7870J42787l09824m75456
4145D845909j58855k03621q2466l41981l57429k12145j89047R8801j28499n8640
4135C212027j00436j08716j10605K18424J15076q4658n4360j48408O7889J73677
4125C179910k29653k27139l7556n7030j529K36973q2607j66240J42378l586k7088
4114B726833k71806K71332j81967Q145J28728J17000J34236M3058j02238r5518
4104B777803P1484N8580J18420j06514j71591j4156q9959O0096J42012O2819k84810
4093B624184K07197K07098k4141J72246L1432j20921l93727J39033J46384J07140
$$ plain form
4083 3095925 3083299 2927605 2817123 2874420 2911369 3078536 3003789 2935750 3141131 2965215
4073 2965215 3013577 3058252 3139749 3153514 3283159 3358512 3408801 3577389 3659017 3788892 3801811
4062 3801811 3874705 4043703 3857515 3793226 3809397 3916837 3895567 3969775 4129995 4257890
4052 4257890 4284599 4429044 4498117 4752255 5078723 5018376 5307075 5807424 6149107 6263843
4042 6263843 6447277 7005884 7362252 7570900 7824741 8134141 8238555 7842141 7537655 7257253
4032 7257253 6640995 6344333 5965130 5480152 5433555 5245297 5385852 5450379 5315882 5138086
4022 5138086 4830373 4703322 4856468 5247079 4977390 4801600 4958757 4846902 5027120 4931673
4012 4931673 4992219 4887560 4936610 4666015 4640780 4632534 4594145 4643976 4734631 4858377 4991373
$$ packed form
4083C095925j2626j55694j10482N7297L6949J67167p4747o8039K05381j75916
4073B965215M8362M4675Q1497J3765J29645P5353N0289J68588Q1628J29875J2919
4062C801811P2894J68998j86188o4289J6171J07440k1270P4208J60220J27895
4052D257890K6709J44445O9073K54138L26468o0347K88699N00349L41683J14736
4042F263843J83434N58607L56368K08648K53841L09400J04414l96414l04486k80402
4032G257253o16258k96662l79203m84978m6597j88258J40555O4527j34497j77796
4022E138086l07713j27051J53146L90611k69689j75790J57157j11855J80218r5447
4012D931673O0546j04659M9050k70595k5235q246l8389M9831R0655J23746J32996
$$ plain form
4001 4991373 5038662 4701058 4759805 4827618 4988162 4877626 4781228 4999451 4959601 4873976 5025034
3990 5025034 5304851 5301502 5330969 5259471 5146960 5273318 5514965 5475790 5269429 5430990
3980 5430990 5525503 5363588 5382811 5385082 5474278 5748018 5765681 5382233 5517670 5672967 5411762
3969 5411762 5338865 5506270 5286251 5495435 5668760 5451355 5500326 5590170 5696497 5988237
3959 5988237 5908988 5904681 6047485 6082903 5980004 5922129 6099584 6241974 6136323 6213654 6255255
3948 6255255 6477181 6613380 6638396 6498539 6606593 6503407 6708223 6903097 6740648 7131711
3938 7131711 7086678 6991729 6880643 7138416 7089324 7123171 7129326 7234530 7381702 7516840 7500160
3927 7500160 7478447 7709979 8021816 7818477 8071878 8243631 8600684 8623716 8572467 8622906
$$ packed form
4001D991373M7289l37604N8747O7813J60544j10536r6398K18223l9850q5625J51058
3990E025034K79817l349K9467p1498j12511J26358K41647l9175k06361J61561
3980E430990R4513j61915J9223K271Q9196K73740J7663l83448J35437J55297k61205
3969E411762p2897J67405k20019K09184J73325k17405M8971Q9844J06327K91740
3959E988237p9249m307J42804L5418j02899n7875J77455J42390j05651P7331M1601
3948F255255K21926J36199K5016j39857J08054j03186K04816J94874j62449L91063
3938G131711m5033r4949j11086K57773m9092L3847O155J05204J47172J35138j6680
3927G500160k1713K31532L11837k03339K53401J71753L57053K3032n1249N0439
$$ plain form
3917 8622906 8690855 8653097 8761427 8803790 9094816 9327768 9469177 9439869 9574848 9799273
3907 9799273 9863943 9915399 10186543 10105030 10064104 10200047 10438541 10651583 10687813 10916677
3897 10916677 10973538 11377929 11511472 11734587 11858873 12302131 12298536 12545895 12587933 12570804
3887 12570804 12789614 12816175 13020428 13022088 13126819 13388821 13609759 13678609 13844319 14320624
3877 14320624 14502075 14923424 15149635 15681357 16071575 16507419 17186010 17707377 18533933
3868 18533933 19429376 20278154 21214621 22142893 23049470 24268536 25494460 26729833 27832195
3859 27832195 29281452 30397137 30916524 31084174 30835928 30735936 30546276 30664436 31061852
3850 31061852 31304120 32031167 33205403 34449945 35805741 36885071 37730675 38221301 38274183
$$ packed form
3917H622906O7949l7758J08330M2363K91026K32952J41409k9308J34979K24425
3907I799273O4670N1456K71144q1513m0926J35943K38494K13042L6230K28864
3897A0916677N6861M04391J33543K23115J24286M43258l595K47359M2038j7129
3887A2570804K18810K6561K04253J660J04731K62002K20938O8850J65710M76305
3877A4320624J81451M21349K26211N31722L90218M35844O78591N21367Q26556
3868A8533933Q95443Q48778R36467R28272R06577J219066J225924J235373J102362
3859B7832195J449257J115685N19387J67650k48246r9992j89660J18160L97416
3850C1061852K42268P27047J174236J244542J355796J079330Q45604M90626N2882
$$ plain form
3841 38274183 38498550 38825387 39331116 39661104 40368165 41225505 42325158 43670032 45305374
3832 45305374 47484643 50268801 52955633 54905460 55599373 54588049 52369273 49540682
3824 49540682 46817319 44669293 42811998 41306407 40813259 40385529 39852615 39573770 39446392
3815 39446392 39271552 39255114 38798040 38238410 37478715 36391253 35306628 34151690 32808742
3806 32808742 31861765 31522990 31240961 31388405 31833410 32179274 32234316 32143767 32109367 31575548
3796 31575548 30318160 28772850 27288063 26283095 25281018 24445003 23624228 23017653 22488548
3787 22488548 22090924 21688023 20973525 20647405 20238402 19952531 19679787 19517732 19388132
3778 19388132 19234986 19202529 19330121 19162452 19078344 19331713 19265466 19238296 19387727 19402966
$$ packed form
3841C8274183K24367L26837N05729L29988P07061Q57340J099653J344874J635342
3832D5305374K179269K784158K686832J949827O93913j011324k218776k828591
3824D9540682k723363k148026j857295j505591m93148m27730n32914k78845j27378
3815C9446392j74840j6438m57074n59630p59695j087462j084625j154938j342948
3806C2808742r46977l38775k82029J47444M45005L45864N5042r0549l4400n33819
3796C1575548j257388j545310j484787j004968j002077q36015q20775o06575n29105
3787B2488548l97624m02901p14498l26120m09003k85871k72744j62055j29600
3778A9388132j53146l2457J27592j67669q4108K53369o6247k7170J49431J5239
$$ plain form
3768 19402966 19519862 19610594 19944557 19857419 19742996 19551844 19470081 19282553 19186357 19215354
3758 19215354 19267534 19465642 19591634 19897938 20150106 20126400 20034245 20106845 20329248 20292042
3748 20292042 20447616 20670850 20789728 20762546 20707679 21027154 21140757 21113483 21153588 21217477
3738 21217477 21582344 21699049 21591909 21863865 21776010 22043774 22426260 22313441 22201046 22404050
3728 22404050 22541839 22854507 22673217 22726816 22709633 22675743 22813153 23370156 23620971 23587072
3718 23587072 23576125 23458897 23639893 23891987 23827714 23794430 23977086 24001984 23957199 24167222
3708 24167222 24251413 24144732 24205234 24313687 24580107 24549263 24469282 24745859 24783243 24643713
3698 24643713 24507119 24791423 24980129 24926648 25098901 25198131 25305362 25485322 25600402 25771621
$$ packed form
3768A9402966J16896R0732L33963q7138j14423j91152q1763j87528r6196K8997
3758A9215354N2180J98108J25992L06304K52168k3706r2155P2600K22403l7206
3748B0292042J55574K23234J18878k7182n4867L19475J13603k7274M0105O3889
3738B1217477L64867J16705j07140K71956q7855K67764L82486j12819j12395K03004
3728B2404050J37789L12668j81290N3599j7183l3890J37410N57003K50815l3899
3718B3587072j0947j17228J80996K52094o4273l3284J82656K4898m4785K10023
3708B4167222Q4191j06681O0502J08453K66420l0844p9981K76577L7384j39530
3698B4643713j36594K84304J88706n3481J72253R9230J07231J79960J15080J71219
$$ plain form
3688 25771621 25666463 25676773 25928381 26051597 26052931 25879982 25764275 25851261 25897799 26061520
3678 26061520 26131753 26057836 25920039 25892465 25908753 25662233 25552140 25443047 25456291 25467736
3668 25467736 25193876 24980331 25063303 25138851 24898752 24839517 24810155 25008840 24921219 24727736
3658 24727736 24454661 24401552 24430586 24377489 24264177 24080134 24279458 24248709 24163014 23833111
3648 23833111 23872365 23925686 23873651 23610858 23786048 23608097 23461663 23353398 23329006 23348035
3638 23348035 23112671 23079809 22923336 23053377 23026482 23024020 23117786 22878817 22841071 22676596
3628 22676596 23026585 23182247 22998969 22852867 22914870 22844799 23133892 23246478 23020055 22929943
3618 22929943 23112415 23274322 23522841 23404080 23322580 23515822 23632486 23595177 23498934 23334345
$$ packed form
3688B5771621j05158J0310K51608J23216J334j72949j15707Q6986M6538J63721
3678B6061520P0233p3917j37797k7574J6288k46520j10093j09093J3244J1445
3668B5467736k73860k13545Q2972P5548k40099n9235k9362J98685q7621j93483
3658B4727736k73075n3109K9034n3097j13312j84043J99324l0749q5695l29903
3648B3833111L9254N3321n2035k62793J75190j77951j46434j08265k4392J9029
3638B3348035k35364l2862j56473J30041k6895k462R3766k38969l7746j64475
3628B2676596L49989J55662j83278j46102O2003p0071K89093J12586k26423r0112
3618B2929943J82472J61907K48519j18761q1500J93242J16664l7309r6243j64589
$$ plain form
3608 23334345 23452356 23627651 23787719 23811810 23585652 23613800 23505575 23730436 23703580 23680426
3598 23680426 23635639 23762548 23853350 23944890 23896998 24065335 24189691 24283831 24006729 23950017
3588 23950017 24408284 24821128 24849459 25002537 25131862 24944228 24991522 24850625 24986503 24838042
3578 24838042 24774426 24796871 25188608 25510995 25370524 25480105 25426999 25276984 25621082 25588532
3568 25588532 25602532 25471838 25635034 25571514 25481330 25515050 25626027 25809775 25583533 25727989
3558 25727989 25627467 25634995 25675663 26076954 26197859 26378455 26323076 26498397 26548889 26655686
3548 26655686 26919146 26927834 26927570 26988111 26994620 27033574 27167549 27304242 27164285 27021272 26991664
3537 26991664 27030762 26910235 26982363 27070267 26976821 26925642 27244172 27409513 27496889 27608030
$$ packed form
3608B3334345J18011J75295J60068K4091k26158K8148j08225K24861k6856k3154
3598B3680426m4787J26909R0802R1540m7892J68337J24356R4140k77102n6712
3588B3950017M58267M12844K8331J53078J29325j87634M7294j40897J35878j48461
3578B4838042o3616K2445L91737L22387j40471J09581n3106j50015L44098l2550
3568B5588532J4000j30694J63196o3520r0184L3720J10977J83748k26242J44456
3558B5727989j00522P528M0668M01291J20905J80596n5379J75321N0492J06797
3548B6655686K63460Q688k64O0541O509L8954J33975J36693j39957j43013k9608
3537B6991664L9098j20527P2128Q7904r3446n1179L18530J65341Q7376J11141
$$ plain form
3527 27608030 27485864 27445400 27865124 27936008 27839300 27836579 28213257 28427216 28478616 28605796
3517 28605796 28566393 28693156 28639550 28687579 28731480 28721095 28987538 29003423 29145414 29271707
3507 29271707 29412038 29467483 29334174 29517877 29526518 29637986 29868134 29785440 29728445 30170772
3497 30170772 30362929 30469553 30697169 31115069 31614287 31615132 31501196 31461814 31743823 31904154
3487 31904154 32117235 32307663 32148850 32716015 33105507 33226255 33228196 33302021 33623593 33917321
3477 33917321 34248904 34759921 35061515 35484362 35924798 36142288 36688558 37441736 38282839
3468 38282839 38930200 39812033 40841899 41844704 43093328 44639574 46216469 47605357
3460 47605357 48925922 49916564 50452768 50215669 49603785 48732199 47995118 47370006 46988883
$$ packed form
3527B7608030j22166m0464M19724P0884r6708k721L76678K13959N1400J27180
3517B8605796l9403J26763n3606M8029M3901j0385K66443J5885J41991J26293
3507B9271707J40331N5445j33309J83703Q641J11468K30148q2694n6995M42327
3497C0170772J92157J06624K27616M17900M99218Q45j13936l9382K82009J60331
3487C1904154K13081J90428j58813N67165L89492J20748J941P3825L21572K93728
3477C3917321L31583N11017L01594M22847M40436K17490N46270P53178Q41103
3468C8282839O47361Q81833J029866J002805J248624J546246J576895J388888
3460D7605357J320565R90642N36204k37099o11884q71586p37081o25112l81123
$$ plain form
3451 46988883 47017889 46982534 46889712 46749873 46942120 47332184 47695611 48227926 48278138 48602036
3441 48602036 49103484 49686292 50063317 51199628 52102551 53120830 54022523 55688800 57531105
3432 57531105 59390586 61505832 63664752 66217219 69052005 71352786 73101399 73331753
3424 73331753 71881262 69812141 67665048 66091344 64750236 63521802 62659681 62299410
3416 62299410 61995460 62012933 62129110 62413654 62710263 63105773 63288671 63629822 63861813 64056547
3406 64056547 64441425 65314920 66184727 67074613 67816297 69081921 70632302 72083611 73835761
3397 73835761 75557802 77563636 79713708 81518066 82493393 83097722 83366724 83116541 83279005
3388 83279005 83728170 84238612 84734775 85158767 85928665 86574636 86967355 87567681 88468902
$$ packed form
3451D6988883K9006l5355r2822j39839J92247L90064L63427N32315N0212L23898
3441D8602036N01448N82808L77025J136311R02923J018279R01693J666277J842305
3432E7531105J859481K115246K158920K552467K834786K300781J748613K30354
3424G3331753j450491k069121k147093j573704j341108j228434q62121l60271
3416F2299410l03950J7473J16177K84544K96609L95510J82898L41151K31991J94734
3406F4056547L84878Q73495Q69807Q89886P41684J265624J550381J451309J752150
3397G3835761J722041K005834K150072J804358R75327O04329K69002k50183J62464
3388H3279005M49165N10442M96163M23992P69898O45971L92719O00326R01221
$$ plain form
3379 88468902 89237786 90182367 90889095 91725885 92885385 94037742 95001570 96279388 97912342
3370 97912342 99240692 100814735 102303299 104076498 105806680 107442840 108932379 111116154
3362 111116154 113276744 115359569 117264214 119315716 121272185 123608613 125739038 127962497
3354 127962497 130502929 133056007 135325902 137774088 140621493 143288013 146147434 149038896
3346 149038896 152006292 155253518 158591604 162063680 165734416 169592378 173452470 177672195
3338 177672195 182213939 186817817 191238419 196174628 201454406 206924452 212927304 219577669
3330 219577669 226522589 233808979 241925154 250714237 259795365 269301705 279548981 290595892
3322 290595892 302896078 316033808 330095364 345480563 362002179 379271881 397361399
$$ packed form
3379H8468902P68884R44581P06728Q36790J159500J152357R63828J277818J632954
3370I7912342J328350J574043J488564J773199J730182J636160J489539K183775
3362A11116154K160590K082825J904645K051502J956469K336428K130425K223459
3354A27962497K540432K553078K269895K448186K847405K666520K859421K891462
3346A49038896K967396L247226L338086L472076L670736L857962L860092M219725
3338A77672195M541744M603878M420602M936209N279778N470046O002852O650365
3330B19577669O944920P286390Q116175Q789083R081128R506340J0247276J1046911
3322B90595892J2300186J3137730J4061556J5385199J6521616J7269702J8089518
$$ plain form
3315 397361399 415512584 433779350 451913409 468840881 484068646 496353108 504995929
3308 504995929 509574579 508665012 501953968 490544166 475149851 457372309 438739023 419940250
3300 419940250 402183009 385732712 370293378 356098493 343287051 331543880 320630422
3293 320630422 310532030 301459755 292987491 285172098 277809121 271288177 265184097 259444477
3285 259444477 254035363 248933784 244357765 239926089 235819221 231435291 227006358 223013689
3277 223013689 218740999 214297459 210071479 205490740 200989638 196838863 192354201 188225034
3269 188225034 184055714 180172205 176373807 172622222 168909099 165320017 162008182 158564456
3261 158564456 155268783 152286783 148953332 145774612 142879248 140033138 137458205 134846089
$$ packed form
3315C97361399J8151185J8266766J8134059J6927472J5227765J2284462Q642821
3308E04995929M578650r09567o711044j1409802j5394315j7777542j8633286j8798773
3300D19940250j7757241j6450297j5439334j4194885j2811442j1743171j0913458
3293C20630422j0098392r072275q472264p815393p362977o520944o104080n739620
3285B59444477n409114n101579m576019m431676m106868m383930m428933l992669
3277B23013689m272690m443540m225980m580739m501102m150775m484662m129167
3269A88225034m169320l883509l798398l751585l713123l589082l311835l443726
3261A58564456l295673k982000l333451l178720k895364k846110k574933k612116
$$ plain form
3253 134846089 132225306 130033055 127598378 125664217 123794721 121890881 119762737 117722191
3245 117722191 115982847 114304797 112889888 111585391 110182716 108691171 107516150 106313344
3237 106313344 105374473 104494060 103543457 102798372 102197953 101610606 100676814 99912218 98782302
3228 98782302 97553255 95912526 94398010 93201915 91722597 90273284 88873142 87852408
3220 87852408 86870267 85790817 84785379 83752966 83075550 82258191 81268472 80529604 79957233
3211 79957233 79414544 78976252 78645012 77889117 77360002 76783022 76567043 76040983 75794038
3202 75794038 75547734 75324169 75183838 74864015 74502227 73790436 72940766 72145490 71122093
3193 71122093 70223587 69483778 68367368 67359708 66967241 66227698 65513982 64954454 64285234
$$ packed form
3253A34846089k620783k192251k434677j934161j869496j903840k128144k040546
3245A17722191j739344j678050j414909j304497j402675j491545j175021j202806
3237A06313344r38871q80413r50603p45085o00419n87347r33792p64596j129916
3228I8782302j229047j640729j514516j196095j479318j449313j400142j020734
3220H7852408r82141j079450j005438j032413o77416q17359r89719p38868n72371
3211G9957233n42689m38292l31240p55895n29115n76980k15979n26060k46945
3202G5794038k46304k23565j40331l19823l61788p11791q49670p95276j023397
3193G1122093q98506p39809j116410j007660l92467p39543p13716n59528o69220
$$ plain form
3184 64285234 63791698 63164707 62806049 62189902 61735153 61478983 61208151 60726148 60355361
3175 60355361 60173533 59826624 59668950 59684314 59461968 59555076 59410108 59480769 59320774 58785263
3165 58785263 58871042 58374521 57916163 57246275 56837187 56650984 56183129 55699002 55180421 54918842
3155 54918842 54750454 54497973 54190804 53788809 53801961 53423091 52956933 52780633 52355506 51969313
3145 51969313 51975048 51837405 51427231 51044381 50637543 50311093 49964474 49609046 49567975 49286919
3135 49286919 48852670 48400555 48295912 47753245 47437883 47108721 46644884 46297370 45882670
3126 45882670 45335786 44817809 44524582 44077228 43730802 43726594 43444686 43208379 42993412 42771326
3116 42771326 42322856 42045662 42008443 41668635 41165302 41029626 40770914 40484241 40443182 39996275
$$ packed form
3184F4285234m93536o26991l58658o16147m54749k56170k70832m82003l70787
3175F0355361j81828l46909j57674J5364k22346R3108j44968P0661j59995n35511
3165E8785263Q5779m96521m58358o69888m09088j86203m67855m84127n18581k61579
3155E4918842j68388k52481l07169m01995J3152l78870m66158j76300m25127l86193
3145E1969313N735j37643m10174l82850m06838l26450l46619l55428m1071k81056
3135D9286919m34249m52115j04643n42667l15362l29162m63837l47514m14700
3126D5882670n46884n17977k93227m47354l46426m208k81908k36307k14967k22086
3116D2771326m48470k77194l7219l39808n03333j35676k58712k86673m1059m46907
$$ plain form
3106 39996275 39571296 39214943 39059741 38821484 38502467 38268050 37782947 37364309 37548978
3097 37548978 37379095 36974850 36803786 36619108 36316111 36396700 36375713 36365691 36187321 36274527
3087 36274527 36535717 36366886 36358872 36555476 36874119 37180982 37050099 37111474 37305688 37306460
3077 37306460 37440164 37522472 37436529 37479953 37588036 37656750 37591534 37709517 38168867 38198270
3067 38198270 38243783 38513648 38825381 39255921 39357269 39654719 40085501 40288187 40385826 40601226
3057 40601226 40711940 41300626 41625978 41783553 42244770 42898524 43324904 44147366 44470226
3048 44470226 45086606 45531615 45987615 46433113 47061075 47847973 48151370 48785146 49128892
3039 49128892 49593505 50043024 50286484 50584221 51217629 52004941 52669393 53114891 53692386
$$ packed form
3106C9996275m24979l56353j55202k38257l19017k34417m85103m18638J84669
3097C7548978j69883m04245j71064j84678l02997Q0589k0987j0022j78370Q7206
3087C6274527K61190j68831q014J96604L18643L06863j30883O1375J94214P72
3077C7306460J33704Q2308q5943M3424J08083O8714o5216J17983M59350K9403
3067C8198270M5513K69865L11733M30540J01348K97450M30782K02686R7639K15400
3057D0601226J10714N88686L25352J57575M61217O53754M26380Q22462L22860
3048D4470226O16380M45009M56000M45498O27962P86898L03397O33776L43746
3039D9128892M64613M49519K43460K97737O33408P87312O64452M45498N77495
$$ plain form
3030 53692386 54674151 55410796 56143946 56747756 57444200 58184584 58751440 59432708 60401785
3021 60401785 61271243 61782937 62494112 63342598 64443424 65592948 66915460 68243278 69541705
3012 69541705 71007525 72487793 74078887 75823401 77805532 79731066 81845492 84148562
3004 84148562 86434649 88945085 91470588 94001021 95882625 97953281 100040519 102274549
2996 102274549 104193318 105969273 107321549 108545672 109940089 111004480 112367688 113666330
2988 113666330 115142829 116644557 118492518 120527015 122643755 125379182 128294856 131489177
2980 131489177 135145256 139347254 143638884 147902286 152429644 157315699 162259791 167141366
2972 167141366 172123963 176510540 180274555 183066476 184634247 185003526 183547879 180879393
$$ packed form
3030E3692386R81765P36645P33150O03810O96444P40384N66856O81268R69077
3021F0401785Q69458N11694P11175Q48486J100826J149524J322512J327818J298427
3012F9541705J465820J480268J591094J744514J982131J925534K114426K303070
3004H4148562K286087K510436K525503K530433J881604K070656K087238K234030
2996A02274549J918769J775955J352276J224123J394417J064391J363208J298642
2988A13666330J476499J501728J847961K034497K116740K735427K915674L194321
2980A31489177L656079M201998M291630M263402M527358M886055M944092M881575
2972A67141366M982597M386577L764015K791921J567771L69279j455647k668486
$$ plain form
2964 180879393 177491137 174124776 170925366 168336237 166272380 164918584 164477332 164638663
2956 164638663 165305440 166658199 168448631 170673503 173287825 175907893 178613372 181483077
2948 181483077 184513959 187518828 190137839 192345801 194404142 195373240 195376700 194471203 192825300
2939 192825300 190626481 187046566 183237363 179109842 174560935 169665158 164965510 160445509
2931 160445509 156572110 153246450 150336638 148278685 146641491 145060498 144013238 143084542
2923 143084542 142405259 141959305 141073140 139946606 138575763 137022391 134908635 132737054
2915 132737054 129858816 126507683 122502516 118586770 114262685 109757768 105417522 101347204
2907 101347204 97725732 93997744 90588383 87499001 84458763 81775967 79034396 76648368
$$ packed form
2964A80879393l388256l366361l199410k589129k063857j353796m41252J61331
2956A64638663O66777J352759J790432K224872K614322K620068K705479K869705
2948A81483077L030882L004869K619011K207962K058341R69098L460r05497j645903
2939A92825300k198819l579915l809203m127521m548907m895777m699648m520001
2931A60445509l873399l325660k909812k057953j637194j580993j047260r28696
2923A43084542o79283m45954q86165j126534j370843j553372k113756k171581
2915A32737054k878238l351133m005167l915746m324085m504917m340246m070318
2907A01347204l621472l727988l409361l089382l040238k682796k741571k386028
$$ plain form
2899 76648368 74805599 72577783 70517984 68633231 66960353 65755964 64445650 63121737
2891 63121737 61905084 60347630 59057826 57402388 56018801 54783369 53227262 51757422
2883 51757422 50454701 49278597 47739466 46756341 45576207 44520201 43680799 42625447
2875 42625447 41562882 40389788 39563458 38881636 38273423 37244105 36468787 35642447 34745789
2866 34745789 34406277 33680287 33057610 32761224 32329461 31761555 31214872 30714171 30493867
2857 30493867 30223734 29390641 28883995 28638589 28204469 27632548 27217304 26613407 26280728
2848 26280728 26070756 25461572 25359790 24977666 24074913 23705869 23344107 23080604 22547050
2839 22547050 22105008 21543086 21116110 20685934 20373680 20038029 19850906 19904645 19387609 19105041
$$ packed form
2899G6648368j842769k227816k059799j884753j672878j204389j310314j323913
2891F3121737j216653j557454j289804j655438j383587j235432j556107j469840
2883E1757422j302721j176104j539131r83125j180134j056006q39402j055352
2875D2625447j062565j173094q26330o81822o08213j029318p75318q26340q96658
2866C4745789l39512p25990o22677k96386m31763n67906n46683n00701k20304
2857C0493867k70133q33093n06646k45406m34120n71921m15244o03897l32679
2848B6280728k09972o09184j01782l82124r02753l69044l61762k63503n33554
2839B2547050m42042n61922m26976m30176l12254l35651j87123N3739n17036k82568
$$ plain form
2829 19105041 19010477 18645178 18376339 18376213 18116186 17833174 17582643 17331994 16913545 16877023
2819 16877023 16378901 16128018 15644769 15425756 15368845 15214645 14860904 14592595 14430784 14005962
2809 14005962 13701361 13383022 13319617 13434600 13192386 12865952 12479214 12270039 12267226 12274844
2799 12274844 11952800 11767479 11849196 11792502 11525117 11166886 10886302 10853877 10816767 10807655
2789 10807655 10651084 10481303 10233120 10348868 10263910 9889970 9698689 9570567 9565128 9434771
2779 9434771 9134416 9032092 8862614 8806590 9005776 8750541 8376316 8413329 8690784 8624360
2769 8624360 8548038 8336592 8260990 8220316 8186816 8179628 8189534 7786248 7746474 7775797 7729842
2758 7729842 7750941 7523510 7683634 7704821 7489641 7520403 7317254 6977658 6964176 7027295
$$ packed form
2829A9105041r4564l65299k68839j26k60027k83012k50531k50649m18449l6522
2819A6877023m98122k50883m83249k19013n6911j54200l53741k68309j61811m24822
2809A4005962l04601l18339o3405J14983k42214l26434l86738k09175k813P618
2799A2274844l22044j85321Q1717n6694k67385l58231k80584l2425l7110r112
2789A0807655j56571j69781k48183J15748q4958l73940j91281j28122n439j30357
2779I434771l00355j02324j69478n6024J99186k55235l74225L7013K77455o6424
2769H624360p6322k11446p5602m0674l3500p188R906m03286l9774K9323m5955
2758G729842K1099k27431J60124K1187k15180L0762k03149l39596j3482O3119
$$ plain form
2748 7027295 6972548 6919614 6833001 6652390 6675572 6756714 6660406 6546110 6369843 6501991 6374232
2737 6374232 6263670 6105348 6193953 6288014 6454078 6404898 6285077 6421356 6529370 6181476
2727 6181476 6092959 6009238 5975878 6123847 5992695 5996858 6301799 6101087 6188566 6057973 5954772
2716 5954772 6042195 6197185 6134179 5955170 5883302 5833066 5928653 5876951 5955398 5946706 5990521
2705 5990521 6010080 6024442 6038618 5936738 5999196 6197792 6185914 6072107 5990260 6112983 5888120
2694 5888120 5898048 6203353 6012705 5833513 6098256 5973616 5932942 5838852 5821069 5820976 5679752
2683 5679752 5876643 6171106 6015335 5835419 5864611 5774120 5672586 5909506 5791682 5509907
2673 5509907 5523909 5492576 5513446 5526128 5590946 5813413 5748910 5675762 5652001 5872974 6009355
$$ packed form
2748G027295n4747n2934q6613j80611K3182Q1142r6308j14296j76267J32148j27759
2737F374232j10562j58322Q8605R4061J66064m9180j19821J36279J08014l47894
2727F181476q8517q3721l3360J47969j31152M163L04941k00712Q7479j30593j03201
2716E954772Q7423J54990o3006j79009p1868n0236R5587n1702P8447q692M3815
2705E990521J9559J4362J4176j01880O2458J98596j1878j13807q1847J22723k24863
2694E888120R928L05305j90648j79192K64743j24640m0674r4090j7783r3j41224
2683E679752J96891K94463j55771j79916K9192r0491j01534K36920j17824k81775
2673E509907J4002l1333K0870J2682O4818K22467o4503p3148k3761K20973J36381
$$ plain form
2662 6009355 5953417 5879015 5718261 5901888 5776764 5690694 5660646 5511614 5286302 5150462
2652 5150462 5199432 5427745 5371088 5438831 5208605 5165716 5049054 5157803 5109447 4944079
2642 4944079 4861437 4722609 4932857 4872970 4761897 4798710 5072487 4803310 4693039 4498630
2632 4498630 4547558 4736999 4803715 4625457 4386739 4541115 4605997 4275760 4456843 4400464
2622 4400464 4265165 4378031 4347033 4003961 3789813 3825601 3950146 3756556 3586378 3644155
2612 3644155 3592019 3463240 3572792 3617157 3660230 3712493 3549270 3288178 3516377 3388613
2602 3388613 3387575 3365822 3206682 2982231 2812664 2987111 3166887 3257127 3194306 3058323
2592 3058323 2754596 3017198 2904923 2875523 2901732 2800491 2809061 2645710 2832088 2919643
$$ packed form
2662F009355n5938p4402j60754J83627j25124q6070l0048j49032k25312j35840
2652E150462M8970K28313n6657O7743k30226m2889j16662J08749m8356j65368
2642D944079q2642j38828K10248n9887j11073L6813K73777k69177j10271j94409
2632D498630M8928J89441O6716j78258k38718J54376O4882l30237J81083n6379
2622D400464j35299J12866l0998l43072k14148L5788J24545j93590j70178N7777
2612C644155n2136j28779J09552M4365M3073N2263j63223k61092K28199j27764
2602C388613j038k1753j59140k24451j69567J74447J79776R0240o2821j35983
2592C058323l03727K62602j12275k9400K6209j01241Q570j63351J86378Q7555
$$ plain form
2582 2919643 2850758 2765653 2702145 2547061 2555866 2489678 2531254 2444705 2370899 2556246 2453000
2571 2453000 2307541 2367447 2376905 2160778 2111196 2068054 2189242 2253481 2131408 1972242 2032896
2560 2032896 2293555 2228059 1942358 2038570 2056260 2082376 1957764 1836056 1770764 1832922 1872043
2549 1872043 1859542 2019182 2149895 1882365 2068785 2037870 1708236 1654899 1776812 1801649
2539 1801649 1662604 1531647 1741579 1720271 1807976 1728321 1618048 1796439 1690693 1715283
2529 1715283 1758505 1829753 1707346 1423062 1424911 1614993 1683560 1483363 1426128 1335898 1602645
2518 1602645 1621553 1486798 1532497 1516597 1537340 1206749 1127874 1210327 1226192 1171254 1278649
2507 1278649 1141228 970603 1342151 1221563 1010477 872349 981466 1191407 1299579 1077380
$$ packed form
2582B919643o8885q5105o3508j55084Q805o6188M1576q6549p3806J85347j03246
2571B453000j45459N9906R458k16127m9582m3142J21188O4239j22073j59166O0654
2560B032896K60659o5496k85701R6212J7690K6116j24612j21708o5292O2158L9121
2549A872043j2501J59640J30713k67530J86420l0915l29634n3337J21913K4837
2539A801649j39045j30957K09932k1308Q7705p9655j10273J78391j05746K4590
2529A715283M3222P1248j22407k84284J849J90082O8567k00197n7235r0230K66747
2518A602645J8908j34755M5699j5900K0743l30591p8875Q2453J5865n4938J07395
2507A278649j37421j70625L71548j20588k11086j38128J09117K09941J08172k22199
$$ plain form
2497 1077380 1044152 1195334 1256095 1333762 1076742 1001436 1087429 1142428 1361098 1431468 1224884
2486 1224884 777689 924976 1114210 845988 897169 902027 1198468 975418 996682 1040983
2476 1040983 777007 894409 970758 898692 895190 1016512 680797 651468 793303 812156 943875
2465 943875 875997 815224 923986 1083769 1002032 1129252 990212 829017 760380 862664
2455 862664 781820 529808 796107 811964 616269 528823 655187 674594 735155 881080 796441
2444 796441 918735 1013547 1121167 864001 867922 971027 983365 923427 929864 995660 1075675
2433 1075675 959552 887996 791310 799071 859965 889023 848411 1004026 1015392 705914 815521
2422 815521 949216 834017 616876 466045 758062 1082623 820523 583467 588047 666242
$$ packed form
2497A077380l3228J51182O0761P7667k57020p5306Q5993N4999K18670P0370k06584
2486A224884m47195J47287J89234k68222N1181M858K96441k23050K1264M4301
2476A040983k63976J17402P6349p2066l502J21322l35715k9329J41835J8853J31719
2465I43875o7878o0773J08762J59783q1737J27220j39040j61195o8637J02284
2455H62664q0844k52012K66299J5857j95695q7446J26364J9407O0561J45925q4639
2444G96441J22294R4812J07620k57166L921J03105J2338n9938O437O5796Q0015
2433A075675j16123p1556r6686P761O0894K9058m0612J55615J1366l09478J09607
2422H15521J33695j15199k17141j50831K92017L24561k62100k37056M580P8195
$$ plain form
2412 666242 744516 494309 459611 376338 157577 308989 323052 179946 164415 359241 473745
2401 473745 278481 88721 312361 550243 522089 244366 336319 422117 315354 288877
2391 288877 306496 398278 540574 586883 556694 526236 343606 380504 443228 339314 327234
2380 327234 310410 292040 229027 190468 421012 514343 539613 605652 722671 584818 557261
2369 557261 447561 305611 277764 439329 740202 593830 406742 374973 542255 404301
2359 404301 678211 584592 381216 136302 214707 770059 600115 456007 397148 525973
2349 525973 557715 536619 673348 741114 290290 95904 128722 85916 64745 124931 252426
2338 252426 242694 543040 416370 153719 235494 325619 262044 419254 425869 419525 273834
$$ packed form
2412F66242P8274k50207l4698q3273k18761J51412J4063j43106j5531J94826J14504
2401D73745j95264j89760K23640K37882k8154k77723R1953Q5798j06763k6477
2391B88877J7619R1782J42296M6309l0189l0458j82630L6898O2724j03914j2080
2380C27234j6824j8370o3013l8559K30544R3331K5270O6039J17019j37853k7557
2369E57261j09700j41950k7847J61565L00873j46372j87088l1769J67282j37954
2359D04301K73910r3619k03376k44914P8405N55352j69944j44108n8859J28825
2349E25973L1742k1096J36729O7766m50824j94386L2818m2806k1171O0186J27495
2338B52426r732L00346j26670k62651Q1775R0125o3575J57210O615o344j45691
$$ plain form
2327 273834 296941 188338 8401 222977 347974 264397 255438 244206 298628 230274 62752
2316 62752 105088 487989 460561 204434 179371 221409 395555 378521 447576 706995 617055
2305 617055 452733 360384 606402 553017 459641 438584 602694 827018 548492 373745
2295 373745 435214 573577 439354 499324 659685 554619 566562 720310 577012 549182
2285 549182 547339 638384 594500 669975 501565 579843 915629 763275 791989 781270 725586
2274 725586 656687 709084 782298 845614 709217 755475 837834 995875 1133818 890800 954050
2263 954050 791128 765655 931052 1106328 1391859 1415764 1121402 984090 1037954 1173537
2253 1173537 1129476 1082898 1205717 1480962 1568984 1525651 1519236 1661479 1928288 2024325 1924742
$$ packed form
2327B73834K3107j08603j79937K14576J24997q3577q959j1232N4422o8354j67522
2316F2752M2336L82901k7428k56127k5063M2038J74146j7034O9055K59419q9940
2305F17055j64322r2349K46018n3385r3376k1057J64110K24324k78526j74747
2295C73745O1469J38363j34223N9970J60361j05066J1943J53748j43298k7830
2285E49182j843R1045m3884P5475j68410P8278L35786j52354K8714j0719n5684
2274G25586o8899N2397P3214O3316j36397M6258Q2359J58041J37943k43018O3250
2263I54050j62922k5473J65397J75276K85531K3905k94362j37312N3864J35583
2253A173537m4061m6578J22819K75245Q8022m3333o415J42243K66809R6037r9583
$$ plain form
2242 1924742 1871751 1874567 1833269 1773231 1830459 1838694 1851138 1819039 1832164 2338383 2262129 2240092
2230 2240092 2320938 2193830 2343964 2348071 2369390 2576121 2742817 2687153 2800562 2586038
2220 2586038 2937688 3179291 3037980 3232473 3217883 3618041 3754088 3840457 3822957 3770831
2210 3770831 4227961 4255506 4443276 4652959 4729154 5041953 5326919 5544213 5809972 6220392
2200 6220392 6469339 6594072 7177544 7591513 8077156 8180815 8593657 9228434 9962702 10840198
2190 10840198 11394259 11839518 12483273 13361306 14298673 15351603 16533825 17656456 19450099
2181 19450099 21699044 24259376 27470456 30973175 35057616 39854315 45470190 52272096
2173 52272096 60312551 68007632 74279283 76399660 71734680 62978395 53935377 46124236
$$ packed form
2242A924742n2991K816m1298o0038N7228Q235J2444l2099J3125N06219p6254k2037
2230B240092Q0846j27108J50134M107K1319K06731J66696n5664J13409k14524
2220B586038L51650K41603j41311J94493j4590M00158J36047Q6369j7500n2126
2210C770831M57130K7545J87770K09683P6195L12799K84966K17294K65759M10420
2200F220392K48947J24733N83472M13969M85643J03659M12842O34777P34268Q77496
2190A0840198N54061M45259O43755Q78033R37367J052930J182222J122631J793643
2181A9450099K248945K560332L211080L502719M084441M796699N615875O801906
2173E2272096Q040455P695081O271651K120377m664980q756285r043018p811141
$$ plain form
2165 46124236 39637680 34101315 29839847 26222221 23544198 21534997 19631800 17834616
2157 17834616 16577509 15507386 14630462 13292403 11995608 11068970 10587279 9536426 8935850
2148 8935850 8745842 8060223 7458055 7225486 7086897 6741270 6413747 6188359 6063196 5797434
2138 5797434 5163254 4645747 4402356 4372767 4296843 4288193 3865079 3792426 3815992 3701647 3521036
2127 3521036 3196475 3037104 2876864 3007994 3039132 2783780 2529888 2824774 2761805 2668564
2117 2668564 2582085 2612490 2681831 2493222 2513890 2222188 1969383 2062929 2071561 1995968 1800114
2106 1800114 1540088 1568243 1669312 1941642 1864908 1740256 1510162 1195973 1392663 1276091
2096 1276091 1483521 1373040 1213751 1153334 1114430 1132190 1060384 1073596 1164304 1210542 1087028
$$ packed form
2165D6124236o486556n536365m261468l617626k678023k009201j903197j797184
2157A7834616j257107j070123q76924j338059j296795r26638m81691j050853o00576
2148H935850j90008o85619o02168k32569j38589l45627l27523k25388j25163k65762
2138E797434o34180n17507k43391k9589p5924q650m23114p2653K3566j14345j80611
2127C521036l24561j59371j60240J31130L1138k55352k53892K94886o2969r3241
2117B668564q6479L0405O9341j88609K0668k91702k52805R3546Q632p5593j95854
2106A800114k60026K8155J01069K72330p6734j24652k30094l14189J96690j16572
2096A276091K07430j10481j59289o0417l8904J7760p1806J3212R0708M6238j23514
$$ plain form
2085 1087028 979616 1169116 1168507 1117239 933995 883226 720210 792652 797319 777104 659677
2074 659677 745339 652498 840340 761240 746495 844848 773192 523836 353820 525438 669198
2063 669198 692481 727027 793352 603387 554807 562180 505544 783889 489377 221199 286530
2052 286530 471822 540960 559434 716419 411496 531948 768845 593042 507157 486001
2042 486001 555736 440599 338180 515176 105373 321165 295335 225844 266026 402634
2032 402634 283286 243511 241535 202063 174146 441827 221348 191949 447095 571664 524148
2021 524148 298728 322848 282918 310904 318021 285955 281067 131975 171144 332682 414292
2010 414292 724803 538190 205156 153524 18746 298155 539615 495999 325143 254886
$$ packed form
2085A087028j07412J89500o09n1268j83244n0769j63016P2442M667k0215j17427
2074F59677Q5662r2841J87842p9100j4745R8353p1656k49356j70016J71618J43760
2063F69198K3283L4546O6325j89965m8580P373n6636K78345k94512k68178O5331
2052B86530J85292O9138J8474J56985l04923J20452K36897j75803q5885k1156
2042D86001O9735j15137j02419J76996m09803K15792k5830o9491M0182J36608
2032D02634j19348l9775j976l9472k7917K67681k20479k9399K55146J24569m7516
2021E24148k25420K4120l9930K7986P117l2066m888j49092L9169J61538Q1610
2010D14292L10511j86613l33034n1632j34778K79409K41460m3616j70856p0257
$$ plain form
2000 254886 240160 270436 184331 339621 445541 330049 398745 120580 -1097 82774 -95281
1989 -95281 -5922 17695 197434 277724 202548 -32749 -126348 -97803 -38244 6841 86495
1978 86495 191612 134868 146155 228168 18671 -140566 -47395 75284 205759 307332 356449
1967 356449 286893 120602 -92087 33308 -116489 -127155 -127144 184380 127520 -30297 76125
1956 76125 217631 -57790 211100 -2365 -123651 -322885 -147695 129612 20844 125449
1946 125449 -40878 233963 187727 -10736 -46299 277261 348480 352113 439423 267152 247395
1935 247395 82917 155534 61599 325399 386376 226262 106798 52210 -110381 -236195
1925 -236195 -307719 -255532 47015 213355 180359 60672 -204959 -345160 163719 429059
$$ packed form
2000B54886j4726L0276q6105J55290J05920j15492O8696k78165j21677Q3871j78055
1989i5281Q9359K3617J79739Q0290p5176k35297r3599K8545N9559M5085P9654
1978H6495J05117n6744J1287Q2013k09497j59237R3171J22679J30475J01573M9117
1967C56449o9556j66291k12689J25395j49797j0666J1L11524n6860j57817J06422
1956G6125J41506k75421K68890k13465j21286j99234J75190K77307j08768J04605
1946A25449j66327K74841m6236j98463l5563L23560P1219L633Q7310j72271j9757
1935B47395j64478P2617r3935K63800O0977j60114j19464n4588j62591j25814
1925b36195p1524N2187L02547J66340l2996j19687k65631j40201N08879K65340
$$ plain form
1915 429059 232883 142170 245773 528570 449153 159303 151507 298199 359359 100437 197717
1904 197717 422532 393748 121403 303440 461166 299990 -38116 306366 388914 162669
1894 162669 -21336 153463 28881 -57216 149502 17076 -100627 -20949 -9253 47216
1884 47216 -35888 -267251 -56969 159041 -19636 -13382 106128 -7508 52556 308979 332690
1873 332690 391789 53688 -180420 -36260 38428 69418 272223 140741 81437 29762 6602
1862 6602 -69252 -307372 -72425 127123 120177 199293 81032 -37185 -120475 -107522 -77710
1851 -77710 -40536 -125525 -123826 177672 75607 2415 -191348 -70377 -103211 62353 620
1840 620 23451 89036 56767 56424 8115 38759 -67036 -98005 -16134 203114 433675 338666
$$ packed form
1915D29059j96176r0713J03603K82797p9417k89850p796J46692O1160k58922R7280
1904A97717K24815k8784k72345J82037J57726j61176l38106L44482Q2548k26245
1894A62669j84005J74799j24582q6097K06718j32426j17703P9678J1696N6469
1884D7216q3104k31363K10282K16010j78677O254J19510j13636O0064K56423K3711
1873C32690N9099l38101k34108J44160P4688L0990K02805j31482n9304n1675k3160
1862F602p5854k38120K34947J99548o946P9116j18261j18217q3290J2953K9812
1851g7710L7174q4989J699L01498j02065p3192j93763J20971l2834J65564o1733
1840F20K2831O5585l2269l43m8309L0644j05795l0969Q1871K19248K30561r5009
$$ plain form
1828 338666 408364 199633 145374 -69736 -27773 98888 100328 207737 3052 105601 -14788
1817 -14788 255248 326388 -58531 -12485 218282 -9264 155973 248072 88848 92628 54386
1806 54386 -107972 -53428 -38235 -80964 -211784 -472909 -239131 -173433 -190863 -228569 -114448
1795 -114448 -233550 -194854 -95824 -164143 -178079 -134952 26655 9508 27391 -11890 -104935
1784 -104935 25351 7528 211698 97020 -22039 36083 -59143 106924 266949 90523
1774 90523 19341 -33577 -71400 -26406 -215764 -503807 -292036 -113198 1187 -61842 -159761
1763 -159761 -194326 -189976 -33704 -105217 -344333 -29547 181889 32775 89575 155372 314899
1752 314899 130659 -188385 -199736 69829 129689 210278 117366 42452 -35138 -65783 105268
$$ packed form
1828C38666O9698k08731n4259k15110M1963J26661J440J07409k04685J02549j20389
1817a4788K70036P1140l84919M6046K30767k27546J65237R2099j59224L780l8242
1806E4386j62358N4544J5193m2729j30820k61125K33778O5698j7430l7706J14121
1795a14448j19102L8696R9030o8319j3936M3127J61607j7147J7883l9281r3045
1784a04935J30286j7823K04170j14678j19059N8122r5226J66067J60025j76426
1774I0523p1182n2918l7823M4994j89358k88043K11771J78838J14385o3029r7919
1763a59761l4565M350J56272p1513k39116L14786K11436j49114N6800O5797J59527
1752C14899j84240l19044j1351K69565N9860Q0589r2912p4914p7590l0645J71051
$$ plain form
1741 105268 1154 -212993 -230947 -245002 -138903 -288389 -175840 281865 185366 94415
1731 94415 -49261 -95400 160130 -14191 -184642 -230824 -39616 -121444 -11255 -117737
1721 -117737 22800 39193 92506 110594 -93658 -4277 -127262 -166550 -176024 -26458 -67353
1710 -67353 -149623 56694 129190 151184 89941 -15905 -87748 -295290 -256432 124287 24797
1699 24797 94 35310 161606 127015 305094 198632 27586 125667 125498 227288 -165419
1688 -165419 -247946 87334 -10441 -11559 -176366 -322177 -306768 -259876 -182144 -25583 164766
1677 164766 63111 -183099 -326373 -343238 -378999 -301870 -204787 -166498 -457760 -256666 -1913
1666 -1913 -24726 -38467 13705 -44818 65092 -37386 202904 72939 22609 279075 258218
$$ packed form
1741A05268j04114k14147j7954j4055J06099j49486J12549M57705r6499r0951
1731I4415j43676m6139K55530j74321j70451m6182J91208q1828J10189j06482
1721a17737J40537J6393N3313J8088k04252Q9381j22985l9288r474J49566m0895
1710f7353q2270K06317P2496K1994o1243j05846p1843k07542L8858L80719r9490
1699B4797k4703L5216J26296l4591J78079j06462j71046R8081j69J01790l92707
1688a65419q2527L35280r7775j118j64807j45811J5409M6892P7732J56561J90349
1677A64766j01655k46210j43274j6865l5761P7129R7083L8289k91262K01094K54753
1666a913k2813j3741N2172n8523J09910j02478K40290j29965n0330K56466k0857
$$ plain form
1655 258218 345063 280109 73581 139233 178077 -154767 -140926 -103342 88647 206733 54972
1644 54972 245866 207 -80936 -149961 -221724 -177336 -238248 -160486 2086 69708 105817
1633 105817 13408 188155 207460 -37736 -94547 -32974 -254346 -104143 -47000 -277460 -421076
1622 -421076 -77527 34624 -64466 -60754 20905 27466 -18917 -78596 -110194 -316552 -403677
1611 -403677 -23444 40740 -66967 -62129 -2124 -207902 -121592 -157204 -258289 -71519 -35566
1600 -35566 -112448 -10449 172471 -15467 -249001 22239 32799 -16990 -243901 -260819 -559059
1589 -559059 -635758 -528811 -177856 -166754 -379670 -332752 -107616 -340507 -449736 -511354
1579 -511354 -235322 -185371 -241274 -101074 -176145 -11319 54795 -125331 -362078 -286071 -367254
$$ packed form
1655B58218Q6845o4954k06528O5652L8844l32844J3841L7584J91989J18086j51761
1644E4972J90894k45659q1143o9025p1763M4388o0912P7762J62572O7622L6109
1633A05817r2409J74747J9305k45196n6811O1573k21372J50203N7143k30460j43616
1622d21076L43549J12151r9090L712Q1659O561m6383n9679l1598k06358q7125
1611d03677L80233O4184j07707M838O0005k05778Q6310l5612j01085J86770L5953
1600c5566p6882J01999J82920j87938k33534K71240J0560m9789k26911j6918k98240
1589e59059p6699J06947L50955J1102k12916M6918K25136k32891j09229o1618
1579e11354K76032M9951n5903J40200p5071J64826O6114j80126k36747P6007q1183
$$ plain form
1568 -367254 16577 80352 -41415 9882 -230174 -287333 -367636 -190413 -360892 -228573
1558 -228573 -88331 158615 239650 -169677 -157246 -51977 -55591 -57825 84600 103833 290280
1547 290280 267654 150907 161153 106129 -122888 -194089 -136984 134365 8008 -141489 -271503
1536 -271503 -123474 -25048 -100732 -131094 -215068 -234624 -70588 32300 136977 27217 -39559
1525 -39559 -120735 -279971 -156079 -73119 23570 51178 169852 149676 32830 219372 85192
1514 85192 -91910 -262934 -223253 -70907 -307878 -143450 -5394 -207784 -65534 -39738
1504 -39738 59582 106951 29302 125752 57879 -7830 -83227 -71808 -25199 -72572 -250976 -87102
1492 -87102 128789 105449 -248 -286750 -386875 -76725 -42034 -88699 -122227 -26154 187432
$$ packed form
1568c67254L83831O3775j21767N1297k40056n7159q0303J77223j70479J32319
1558b28573J40242K46946Q1035m09327J2431J05269l614k234J42425J9233J86447
1547B90280k2626j16747J0246n5024k29017p1201N7105K71349j26357j49497j30014
1536b71503J48029R8426p5684l0362q3974j9556J64036J02888J04677j09760o6776
1525c9559q1176j59236J23892Q2960R6689K7608J18674k0176j16846J86542j34180
1514H5192j77102j71024L9681J52346k36971J64428J38056k02390J42250K5796
1504c9738R9320M7369p7649R6450o7873o5709p5397J1419M6609m7373j78404J63874
1492h7102K15891k3340j05697k86502j00125L10150L4691m6665l3528R6073K13586
$$ plain form
1481 187432 189615 62559 -76461 -169369 -323963 -94669 255546 122138 -292976 -20942
1471 -20942 -172025 -312005 36691 -71055 -110291 -217492 -287152 -436797 -25920 -35741 77341
1460 77341 131889 34766 -92315 67134 214805 172503 110846 107551 139652 103574 -1207
1449 -1207 -64925 -125208 -7404 154741 -42159 43484 -49448 33861 -64644 -60852 -127574 -228914
1437 -228914 -271430 -41759 41758 -19483 38950 -23831 53392 175860 46152 126225 41858
1426 41858 -24205 229577 76461 -99783 -154434 -75891 -337730 -190103 -158941 -200181 -196119
1415 -196119 -70135 28850 -126386 -42263 34829 66769 -96358 -117467 -398423 -511760 -61711
1404 -61711 105348 -103173 -85149 50728 32738 -36504 -130595 -103039 -119005 -201041 -189648
$$ packed form
1481A87432K183j27056j39020r2908j54594K29294L50215j33408m15114K72034
1471b0942j51083j39980L48696j07746l9236j07201o9660j49645M10877r821J13082
1460G7341N4548r7123j27081J59449J47671m2302o1657l295L2101l6078j04781
1449a207o3718o0283J17804J62145j96900Q5643r2932Q3309r8505L792o6722j01340
1437b28914m2516K29671Q3517o1241N8433o2781P7223J22468j29708Q0073q4367
1426D1858o6063K53782j53116j76244n4651P8543k61839J47627L1162m1240M062
1415a96119J25984R8985j55236Q4123P7092L1940j63127k1109k80956j13337M50049
1404f1711J67059k08521J8024J35877j7990o9242r4091K7556j5966q2036J1393
$$ plain form
1393 -189648 -205681 79496 2932 67590 11842 -167456 -343937 -182268 105225 104176 68516
1382 68516 61154 20038 279629 218402 -115724 -276442 -180341 -203565 -136032 190605 3922
1371 3922 -75594 -53187 175817 168617 83084 136788 62501 152946 70293 267833 4140 31181
1359 31181 176676 -34519 158855 432018 251150 -122131 -64191 132657 134402 -132329
1349 -132329 -110667 -239702 38241 184838 144671 139466 -169506 -366111 -319512 -272597 -168539
1338 -168539 -21560 20913 -177825 -267424 -362484 -364960 -437146 -512117 -229291 -96474 -175141
1327 -175141 -388169 -187329 -35093 -66704 -99395 -144656 104170 215017 -31931 -117632
1317 -117632 -153576 -4904 -224615 -296087 -171325 -110502 36564 129464 275753 30932
$$ packed form
1393a89648j6033K85177p6564O4658n5748j79298j76481J61669K87493j049l5660
1382F8516p362m1116K59591o1227l34126j60718R6101k3224O7533L26637j86683
1371C922p9516K2407K29004p200q5533N3704p4287R0445q2653J97540k63693K7041
1359C1181J45495k11195J93374K73163j80868l73281N7940J96848J745k66731
1349a32329K1662j29035K77943J46597m0167n205l08972j96605M6599M6915J04058
1338a68539J46979M2473j98738q9599r5060k476p2186p4971K82826J32817p8667
1327a75141k13028K00840J52236l1611l2691m5261K48826J10847k46948q5701
1317a17632l5944J48672k19711p1472J24762O0823J47066R2900J46289k44821
$$ plain form
1307 30932 109209 54603 89654 60832 191976 249602 328829 161150 47667 -61153 54780
1296 54780 48095 80813 86317 9626 -46915 178583 257247 144378 371542 247844 32643
1285 32643 -220177 -248631 -200289 -321978 -201755 -147496 -212321 -93181 -172913 -120201 194837
1274 194837 141470 3786 -47413 -102557 -49468 -63899 -60844 23012 202581 126552 117841 -148543
1262 -148543 -304676 -297868 -262668 -156200 -223529 -170698 -104450 -75845 -120453 -61161 9273
1251 9273 57208 -116067 -178396 25965 78872 55926 84799 170626 -170869 -154129 -61875
1240 -61875 26897 -197357 -304123 -235410 -292205 -106933 54632 35834 55314 84356 56996
1229 56996 -72118 -219013 -284168 -38470 56105 8729 -96411 -186013 -343819 -159919 -42031
$$ packed form
1307C0932P8277n4606L5051k8822J31144N7626P9227j67679j13483j08820J15933
1296E4780o685L2718N504p6691n6541K25498P8664j12869K27164j23698k15201
1285C2643k52820k8454M8342j21689J20223N4259o4825J19140p9732N2712L15038
1274A94837n3367j37684n1199n5144N3089j4431L055Q3856J79569p6029q711k66384
1262a48543j56133O808L5200J06468o7329N2831O6248K8605m4608N9292P0434
1251I273M7935j73275o2329K04361N2907k2946K8873Q5827l41495J6740R2254
1240f1875Q8772k24254j06766O8713n6795J85272J61565j8798J9480K9042k7360
1229E6996j29114j46895o5155K45698R4575m7376j05140q9602j57806J83900J17888
$$ plain form
1218 -42031 112416 194199 -39310 189857 -32728 -101980 19254 -52851 -120660 -68713 -4385
1207 -4385 52194 -2979 -87017 37998 -90304 -65881 54837 -25452 -325463 -248703 -68833
1196 -68833 75698 165530 49344 -314786 -219406 -88757 -59602 145634 124809 30037 80583
1185 80583 115149 -170225 -285796 -455437 -406546 -180351 -279111 -311942 444214 433417 -69856
1174 -69856 65716 67526 92137 47651 -57482 -10088 -52891 -18979 -101309 -184747 -340712
1163 -340712 43342 53789 18959 -60185 -63208 -6661 60588 134695 240342 258347 336405
1152 336405 52316 -165070 233402 163372 45826 79550 -66958 -83171 -95445 -182323 16077
1141 16077 -35384 -19943 55794 33738 -124166 -49025 -4053 53608 45515 11359 17383 4385
$$ packed form
1218d2031J54447Q1783k33509K29167k22585o9252J21234p2105o7809N1947O4328
1207d385N6579n5173q4038J25015j28302K4423J20718q0289l00011P6760J79870
1196f8833J44531Q9832j16186l64130R5380J30649K9155K05236k0825r4772N0546
1185H0583L4566k85374j15571j69641M8891K26195r8760l2831P56156j0797n03273
1174f9856J35572J810K4611m4486j05133M7394m2803L3912q2330q3438j55965
1163c40712L84054J0447l4830p9144l023N6547O7249P4107J05647J8005P8058
1152C36405k84089k17386L98472p0030j17546L3724j46508j6213j2274q6878J98400
1141A6077n1461J5441P5737k2056j57904P5141M4972N7661q093l4156O024j2998
$$ plain form
1129 4385 -151794 205604 232393 201854 194624 242811 138693 -40864 53859 153137 226099
1118 226099 303294 152801 -22180 -67058 -179828 94423 13156 -89537 -40333 129868
1108 129868 63400 77784 -139275 -108874 -172946 -180641 -147941 -80011 -163965 3267 19137
1097 19137 -121444 35903 -273546 -261954 -197056 -166707 -156955 -65971 190732 276824 339893
1086 339893 298355 -49589 25390 -39923 -155299 -108417 -171427 -112286 103195 -181 -156788
1075 -156788 -104288 -94501 -300781 -403269 -222896 21715 22724 162548 69210 -70517 -120798
1064 -120798 -10153 -18155 55480 134856 143941 122767 -88901 -76265 -110119 -76909 -258670
1053 -258670 -134578 86548 25185 -108136 -287094 -53862 -29346 25117 2155 -220009
$$ packed form
1129D385j56179L57398K6789l0539p230M8187j04118j79557R4723R9278P2962
1118B26099P7195j50493j74981m4878j12770K74251q1267j02693M9204J70201
1108A29868o6468J4384k17059L0401o4072p695L2700O7930q3954J67232J5870
1097A9137j40581J57347l09449J1592O4898L0349R752R0984K56703Q6092O3069
1086C39893m1538l47944P4979o5313j15376M6882o3010N9141K15481j03376j56607
1075a56788N2500R787k06280j02488J80373K44611J009J39824r3338j39727n0281
1064a20798J10645q002P3635P9376R085k1174k11668J2636l3854L3210j81761
1053b58670J24092K21126o1363j33321j78958K33232K4516N4463k2962k22164
$$ plain form
1043 -220009 -80741 -122927 -171655 -247470 -193459 -126755 -58925 -129852 103327 200924 114914
1032 114914 -133454 -158927 150602 84594 -143097 -179843 -144273 -348831 -253384 -234471 -241853
1021 -241853 -234566 -213701 11989 581 -97373 -114206 13457 -23103 -63258 -63563 -104496 -143120
1009 -143120 36232 -112223 -432434 -417332 -40118 -141303 -276520 -79329 63807 131698
999 131698 95381 -74257 -229606 -101466 -39231 -120012 -341717 -379871 -201666 -13908 60869
988 60869 124685 94997 -9658 -262284 -27934 16651 7804 147865 164840 52673 -46445
977 -46445 118824 232900 191998 -187033 -191592 -79717 244575 220799 -14939 12009 -59591
966 -59591 -130691 -874 -212603 -291342 -184563 -211340 -25328 196952 -135533 -161217 -116428
$$ packed form
1043b20009J39268m2186m8728p5815N4011O6704O7830p0927K33179R7597q6010
1032A14914k48368k5473L09529o6008k27691l6746L5570k04558R5447J8913p382
1021b41853P287K0865K25690j1408r7954j6833J27663l6560m0155l05m0933l8624
1009a43120J79352j48455l20211J5102L77214j01185j35217J97191J43136O7891
999A31698l6317j69638j55349J28140O2235q0781k21705l8154J78205J87758P4777
988F0869O3816k9688j04655k52626K34350M4585q847J40061J6975j12167r9118
977d6445J65269J14076m0902l79031m559J11875L24292k3776k35738K6948p1600
966e9591p1100J29817k11729p8739J06779k6777J86012K22280l32485k5684M4789
$$ plain form
955 -116428 27948 150798 -154662 -172365 -272458 -211323 -138802 -7996 107081 280641
945 280641 81260 -27117 -101638 -345023 -476115 -459319 -545686 -452225 -225081 31731 -8796
934 -8796 37839 12424 15170 -135604 -122064 26024 263323 214529 322044 285974 84319
923 84319 -54132 28168 211798 74822 68843 254750 318427 308193 314406 262889 199411 194184
911 194184 -47629 -273013 291481 181537 147625 155802 158950 -35770 -21481 131717 -229190
900 -229190 -304937 -253272 -109789 -165377 -21279 36408 -229986 -224384 -27158 -72492 -13324
889 -13324 179485 256486 345252 219127 159309 46941 -22413 45670 -35997 4117 9192 -209540
877 -209540 -149816 -137185 -149104 117424 14519 105438 67073 189861 323796 65098 24970
$$ packed form
955a16428J44376J22850l05460j7703j00093O1135P2521J30806J15077J73560
945B80641j99381j08377p4521k43385j31092J6796q6367R3461K27144K56812m0527
934h796M6635k5415K746j50774J3540J48088K37299m8794J07515l6070k01655
923H4319j38451Q2300J83630j36976n979J85907O3677j0234O213n1517o3478n227
911A94184k41813k25384N64494j09944l3912Q177L148j94720J4289J53198l60907
900b29190p5747N1665J43483n5588J44098N7687k66394N602J97226m5334N9168
889a3324J92809P7001Q8766j26125n9818j12368o9354O8083q1667M0114N075k18732
877b09540N9724J2631j1919K66528j02905R0919l8365J22788J33935k58698m0128
$$ plain form
866 24970 -10108 -227505 -195449 -1178 41024 -69016 61142 128063 -204241 -360145 -232490
855 -232490 -230066 -208622 29113 198084 5019 -24407 148703 -128520 -275497 -214416 55144
844 55144 12285 -52632 -12228 211870 15553 11704 -36677 -156624 -292962 -308972 -193717
833 -193717 -102652 34115 79024 -158627 -153904 -207365 -115455 121815 307706 196364 287729
822 287729 388609 209290 23576 95642 122830 288900 222055 32955 55140 110680 130852
811 130852 5096 -129072 -108522 98904 359830 311899 99320 -69838 -204940 152037
801 152037 72308 -41100 246561 148449 -175272 89417 -62926 -281277 99243 228140
791 228140 164074 297419 170521 -84712 32763 31663 41409 207525 -65783 87879 185832
$$ packed form
866B4970l5078k17397L2056J94271M2202j10040J30158O6921l32304j55904J27655
855b32490K424K1444K37735J68971j93065k9426J73110k77223j46977O1081K69560
844E5144m2859o4917M0404K24098j96317l849m8381j19947j36338j6010J15255
833a93717R1065J36767M4909k37651M723n3461R1910K37270J85891j11342R1365
822B87729J00880j79319j85714P2066K7188J66070o6845j89100K2185N5540K0172
811A30852j25756j34168K0550K07426K60926m7931k12579j69158j35102L56977
801A52037p9729j13408K87661r8112l23721K64689j52343k18351L80520J28897
791B28140o4066J33345j26898k55233J17475j100R746J66116k73308J53662R7953
$$ plain form
780 185832 26103 99859 4707 -239738 -6773 46388 48433 195071 318165 11672 -213840
769 -213840 92516 138338 65648 118727 233718 163920 247579 108396 -21211 101410 92097
758 92097 -83902 18741 276547 134217 114557 -82993 24819 -27249 145070 -110907
748 -110907 -153407 -69899 -39850 48338 53470 214401 -5090 29441 120907 -5544 -36328
737 -36328 -11350 54237 129950 253760 51969 -61275 -44946 -78137 -55663 -72983 -43355
726 -43355 -90657 20078 -29762 46720 252951 268323 139097 -10670 -13049 -218528 34710
715 34710 75978 360483 70199 -141212 -31153 -128990 -143074 -151657 223340 136766 280174
704 280174 232837 91262 120581 35011 -155412 -135118 -6392 76450 12463 -63785 93408
$$ packed form
780A85832j59729P3756r5152k44445K32965N3161K045J46638J23094l06493k25512
769b13840L06356M5822p2690N3079J14991o9798Q3659j39183j29607J22621r313
758I2097j75999J02643K57806j42330j9660j97550J07812n2068J72319k55977
748a10907m2500Q3508L0049Q8188N132J60931k19491L4531R1466j26451l0784
737c6328K4978O5587P5713J23810k01791j13244J6329l3191K2474j7320K9628
726d3355m7302J10735m9840P6482K06231J5372j29226j49767k379k05479K53238
715C4710M1268K84505k90284k11411J10059r7837j4084q583L74997q6574J43408
704B80174m7337j41575K9319q5570j90423K0294J28726Q2842o3987p6248J57193
$$ plain form
693 93408 260915 351690 156054 31780 -47626 -135276 53437 116184 154096 263370 201360
682 201360 -61507 30817 133624 294033 346113 233305 30873 -4574 -54881 91591 85464
671 85464 -241499 -58921 -59951 -357395 -400044 -133546 5781 -227354 -63177 -27578 -22736
660 -22736 -35636 -83413 -118378 -226633 -116699 115773 53791 -54362 -61804 85684 21334
649 21334 78147 57917 210290 232010 -64038 -247502 -146926 -22281 142933 27345 207321
638 207321 217521 54747 -88463 9457 180824 127921 -55890 -150649 50331 46385 -95773
627 -95773 -7521 159240 193396 201206 -12437 -215424 -136733 19291 -205190 -13996 -89657
616 -89657 -58192 -66082 -176258 274633 298972 53912 173162 80565 -161760 -123920 192796
$$ packed form
693I3408J67507R0775j95636j24274p9406q7650J88713O2747L7912J09274o2010
682B01360k62867R2324J02807J60409N2080j12808k02432l5447n0307J46472o127
671H5464l26963J82578j030k97444m2649K66498J39327k33135J64177L5599M842
660b2736j2900m7777l4965j08255J09934K32472o1982j08153p442J47488o4350
649B1334N6813k0230J52373K1720k96048j83464J00576J24645J65214j15588J79976
638B07321J0200j62774j43210R7920J71367n2903j83811r4759K00980l946j42158
627i5773Q8252J66761L4156P810k13643k02987P8691J56024k24481J91194p5661
616h9657L1465p890j10176M50891K4339k45060J19250r2597k42325L7840L16716
$$ plain form
605 192796 161021 -44041 -122042 -123360 52084 328617 342997 473186 358634 443856 432401
594 432401 107415 187876 105673 -96637 -63635 -97026 -60631 -84248 20296 118929 255911
583 255911 204314 218758 329528 211123 -7340 -20312 -56016 -45163 -190926 -20290 85324
572 85324 108068 63555 -206900 -212187 35117 -96838 -171247 -159625 -70842 -34247 -226871
561 -226871 127246 199284 5234 65681 -5529 -66277 22514 -115795 -99247 -37184 -53520
550 -53520 -244112 -51340 1644 90 93138 89889 98841 112327 -1941 40753 286747 266932
538 266932 50181 23612 32869 -58825 -130224 -82491 -141198 -41257 120777 101340 -315595
527 -315595 -226145 -225840 -272812 -108410 -154608 239055 84299 40700 293633 252500 87015
$$ packed form
605A92796l1775k05062p8001j318J75444K76533J4380J30189j14552Q5222j1455
594D32401l24986Q0461q2203k02310L3002l3391L6395k3617J04544R8633J36982
583B55911n1597J4444J10770j18405k18463j2972l5704J0853j45763J70636J05614
572H5324K2744m4513k70455n287K47304j31955p4409J1622Q8783L6595j92624
561b26871L54117P2038j94050O0447p1210o0748Q8791j38309J6548O2063j6336
550e3520j90592J92772N2984j554R3048l249Q952J3486j14268M2694K45994j9815
538B66932k16751k6569R257r1694p1399M7733n8707R9941J62034j9437m16935
527c15595Q9450L05m6972J64402m6198L93663j54756m3599K52933m1133j65485
$$ plain form
516 87015 -99968 73208 61045 381224 173666 -5926 30707 -119023 100253 -29533
506 -29533 200258 323209 241146 -18819 -289229 -268444 -144339 -2765 -64826 171870 72859
495 72859 1951 -90998 -19001 -287504 -363696 -140353 6197 17275 -135105 149797 61538
484 61538 -8222 -158632 -143916 -122315 -60030 75493 329678 124362 278680 43624 7442
473 7442 -12329 49941 139962 288818 147155 -156030 77249 159416 107275 130560 -79290
462 -79290 13383 78254 -211023 -105093 -115015 -95026 -5411 45859 132569 93427 425527 367166
450 367166 361755 267312 191166 109207 101846 449216 315504 194106 67351 -147641 -340945
439 -340945 -202058 96772 170629 -30223 -61355 -334064 -237486 7291 97626 67201 -13413
$$ packed form
516H7015j86983J73176j2163L20179k07558j79592L6633j49730K19276j29786
506b9533K29791J22951q2063k59965k70410K0785J24105J41574o2061K36696r9011
495G2859p0908r2949P1997k68503p6192K23343J46550J1078j52380K84902q8259
484F1538o9760j50410J4716K1601O2285J35523K54185k05316J54318k35056l6182
473G442j9771O2270R0021J48856j41663l03185K33279Q2167n2141K3285k09850
462g9290R2673O4871k89277J05930r922J9989Q9615N1270Q6710l9142L32100n8361
450C67166n411r4443p6146q1959p361L47370j33712j21398j26755k14992j93304
439c40945J38887K98830P3857k00852l1132k72709R6578K44777R0335l0425q0614
$$ plain form
428 -13413 56771 -27676 -47871 -25565 -138522 -42836 -136938 29569 -105688 -164163 72372
417 72372 -22097 -180185 -140481 -134368 -122224 -151992 -128760 112301 269415 150473 227889
406 227889 82322 191046 76424 -51361 -217824 -200387 -114489 -14078 -83310 -304330
396 -304330 4408 18157 152880 200625 160209 79861 -62437 196023 -78031 -18400 -52068
385 -52068 -47691 -64460 212302 111934 150834 131122 122114 89796 -14105 -26388 129169 45621
373 45621 -179089 -144659 -115401 258150 131264 214155 109755 46625 112139 149653 71178
362 71178 22969 9412 27600 -102687 13595 36326 156784 -141643 -110420 16241 29806
351 29806 -9285 -61771 91777 -79163 -93236 -174873 -206343 -64903 -164683 54979 -42142
$$ packed form
428a3413P0184q4447k0195K2306j12957R5686r4102J66507j35257n8475K36535
417G2372r4469j58088L9704O113J2144k9768K3232K41061J57114j18942P7416
406B27889j45567J08724j14622j27785j66463J7437Q5898J00411o9232k21020
396c04330L08738J3749J34723M7745m0416q0348j42298K58460k74054N9631l3668
385e2068M377j6769K76762j00368L8900j9712r008l2318j03901j2283J55557q3548
373D5621k24710L4430K9258L73551j26886Q2891j04400o3130O5514L7514p8475
362G1178m8209j3557J8188j30287J16282K2731J20458k98427L1223J26661J3565
351B9806l9091n2486J53548j70940j4073q1637l1470J41440r9780K19662r7121
$$ plain form
340 -42142 28743 102524 159740 80341 23148 -39744 48437 40350 -48044 23642 159660 306437
328 306437 -25168 -134646 67431 162842 192326 -232521 -136558 102546 46502 -213453 -17453
317 -17453 258106 385151 328702 150621 253529 35536 103534 -103596 61314 92800 59187
306 59187 76266 -71793 -21776 -121890 -26690 -33592 159649 87596 263353 68491 81875
$$ packed form
340d2142P0885P3781N7216p9399n7193o2892Q8181q087q8394P1686J36018J46777
328C06437l31605j09478K02077R5411K9484m24847R5963K39104n6044k59955J96000
317a7453K75559J27045n6449j78081J02908k17993O7998k07130J64910L1486l3613
306E9187J7079j48059N0017j00114R5200o902J93241p2053J75757j94862J3384
$$ [...]
##END NTUPLES=NMR SPECTRUM
##END=
