##TITLE=1H_CG-1178
 CDCl3
 8 sc, 
 30.10.2023
##JCAMPDX= 6.0         $$ Bruker NMR JCAMP-DX V2.0
##DATA TYPE= NMR SPECTRUM
##DATA CLASS= NTUPLES
##ORIGIN= UXNMR, Bruker Analytische Messtechnik GmbH
##OWNER= root
$$ XWIN-NMR		Version 3.5
$$ Mon Oct 30 14:04:46 2023 Russian Standard Time (UT+4h)  she@DPX200
##.OBSERVE FREQUENCY= 200.13135
##.OBSERVE NUCLEUS= ^1H
##.ACQUISITION MODE= SIMULTANEOUS
##.ACQUISITION SCHEME= undefined
##.AVERAGES= 8
##.DIGITISER RES= 18
##SPECTROMETER/DATA SYSTEM= spect
##.PULSE SEQUENCE= zg30
##.SOLVENT NAME= CDCl3
##.SHIFT REFERENCE= (INTERNAL, CDCl3, 0, 15.7326)
##AUDIT TRAIL= $$ (NUMBER, WHEN, WHO, WHERE, WHAT)
$$ ##TITLE= Audit trail, XWIN-NMR		Version 3.5
$$ ##JCAMPDX= 5.01
$$ ##ORIGIN= Bruker BioSpin GmbH
$$ ##OWNER= she
$$ F:/spectra/data/she/nmr/H-F/1/pdata/1/auditp.txt
$$ ##AUDIT TRAIL=  $$ (NUMBER, WHEN, WHO, WHERE, WHAT)
(   1,<2023-10-30 14:03:42.18 +0400>,<she>,<DPX200>,
      <created by zg, POWCHK disabled, PULCHK disabled
       configuration hash MD5:
       00 E9 B6 7A A2 85 ED C7 34 08 36 98 17 FE 4E 26
       data hash MD5: 16K
       71 4F 29 E9 05 87 78 4D E5 23 DB 0D 00 0A 72 7A>)
(   2,<2023-10-30 14:03:45.62 +0400>,<she>,<DPX200>,
      <Start of raw data processing
       efp BC_mod = 2 LB = 0.24 FT_mod = 6 PKNL = 1 PHC0 = -23860.58 PHC1 = 7.852712 SI = 16K 
       data hash MD5: 16K
       E1 CB 50 A0 12 43 0C 9C A3 59 EA 56 AD E5 A4 E4>)
(   3,<2023-10-30 14:04:03.15 +0400>,<she>,<DPX200>,
      <pk PHC0 = -7.936499 PHC1 = 8.200001 
       data hash MD5: 16K
       D9 08 0E 75 F8 F9 2F 4B 46 69 90 E1 42 83 71 6A>)
(   4,<2023-10-30 14:04:06.18 +0400>,<she>,<DPX200>,
      <abs ABSG = 5 
       data hash MD5: 16K
       4C 70 C3 90 78 33 99 FB 50 D8 D9 36 DB 47 FA E1>)
$$ ##END=
$$ 
$$ hash MD5
$$ F3 73 E8 29 A7 DA 96 78 1F 57 B6 93 6F 4E 00 76
##$RELAX= 
##$RELAX= 
##$RELAX= 
##$RELAX= 
##$RELAX= 
##$RELAX= 
$$ Bruker specific parameters
$$ --------------------------
##$DU= <F:/spectra>
##$EXPNO= 1
##$NAME= <H-F>
##$PROCNO= 1
##$TYPE= <nmr>
##$USER= <she>
##$AMP= (0..31)
100 100 100 100 100 100 100 100 100 100 100 100 100 100 100 100 100 100 
100 100 100 100 100 100 100 100 100 100 100 100 100 100 
##$AQSEQ= 0
##$AQ_mod= 1
##$AUNM= <au_zg>
##$AUTOPOS= <>
##$BF1= 200.13
##$BF2= 200.13
##$BF3= 200.13
##$BF4= 200.13
##$BF5= 200.13
##$BF6= 200.13
##$BF7= 200.13
##$BF8= 200.13
##$BYTORDA= 1
##$CFDGTYP= 0
##$CFRGTYP= 5
##$CHEMSTR= <none>
##$CNST= (0..31)
1 1 145 1 1 1 1 1 1 1 1 1 1 1 1 1 1 1 1 1 1 1 1 1 1 1 1 1 1 1 1 1 
##$CPDPRG= <>
##$CPDPRG1= <>
##$CPDPRG2= <>
##$CPDPRG3= <>
##$CPDPRG4= <mlev>
##$CPDPRG5= <mlev>
##$CPDPRG6= <mlev>
##$CPDPRG7= <mlev>
##$CPDPRG8= <mlev>
##$CPDPRGB= <>
##$CPDPRGT= <>
##$D= (0..31)
0 1.2 0 0 0 0 0 0 0 0.06 0 0.03 0 0 0 0 0.0002 0 0 0 0 0 0 0 0 0 0 0 0 
0 0 0 
##$DATE= 1698660221
##$DBL= (0..7)
120 120 120 120 120 120 120 120 
##$DBP= (0..7)
150 150 150 150 150 150 150 150 
##$DBP07= 0
##$DBPNAM0= <>
##$DBPNAM1= <>
##$DBPNAM2= <>
##$DBPNAM3= <>
##$DBPNAM4= <>
$$ [...]
##$SUBNAM3= <"">
##$SUBNAM4= <"">
##$SUBNAM5= <"">
##$SUBNAM6= <"">
##$SUBNAM7= <"">
##$SUBNAM8= <"">
##$SUBNAM9= <"">
##$SW= 18.05172834244
##$SWIBOX= (0..15)
0 0 2 0 0 0 0 0 0 0 0 0 0 0 0 0 
##$SW_h= 3612.71676300578
##$TD= 16384
##$TD0= 1
##$TE= 0
##$TE2= 300
##$TE3= 300
##$TEG= 300
##$TL= (0..7)
0 120 120 120 120 120 120 120 
##$TP= (0..7)
150 150 150 150 150 150 150 150 
##$TP07= 0
##$TPNAME0= <>
##$TPNAME1= <>
##$TPNAME2= <>
##$TPNAME3= <>
##$TPNAME4= <>
##$TPNAME5= <>
##$TPNAME6= <>
##$TPNAME7= <>
##$TPOAL= (0..7)
0.5 0.5 0.5 0.5 0.5 0.5 0.5 0.5 
##$TPOFFS= (0..7)
0 0 0 0 0 0 0 0 
##$TUNHIN= 0
##$TUNHOUT= 0
##$TUNXOUT= 0
##$USERA1= <user>
##$USERA2= <user>
##$USERA3= <user>
##$USERA4= <user>
##$USERA5= <user>
##$V9= 5
##$VALIST= <valist>
##$VCLIST= <CCCCCCCCCCCCCCC>
##$VD= 0
##$VDLIST= <DDDDDDDDDDDDDDD>
##$VPLIST= <PPPPPPPPPPPPPPP>
##$VTLIST= <TTTTTTTTTTTTTTT>
##$WBST= 1024
##$WBSW= 4
##$XGAIN= (0..3)
0 0 0 0 
##$XL= 0
##$YL= 0
##$YMAX_a= 75420
##$YMIN_a= -104399
##$ZGOPTNS= <>
##$ZL1= 120
##$ZL2= 120
##$ZL3= 120
##$ZL4= 120
##$ABSF1= 15.73146
##$ABSF2= -2.32039
##$ABSG= 5
##$ABSL= 3
##$ALPHA= 0
##$AQORDER= 0
##$ASSFAC= 0
##$ASSFACI= 0
##$ASSFACX= 0
##$ASSWID= 0
##$AUNMP= <proc_1d>
##$AZFE= 0.1
##$AZFW= 0.1
##$BCFW= 0
##$BC_mod= 2
##$BYTORDP= 0
##$COROFFS= 0
##$CY= -3
##$DATMOD= 1
##$DC= 0
##$DFILT= <>
##$DTYPP= 0
##$F1P= 0
##$F2P= 0
##$FCOR= 1
##$FTSIZE= 16384
##$FT_mod= 6
##$GAMMA= 0
##$GB= 0
##$INTBC= 1
##$INTSCL= 3.70164e-10
##$ISEN= 128
##$LB= 0.24
##$LEV0= 0
##$LPBIN= 0
##$MAXI= 10000
##$MC2= 0
##$MEAN= 0
##$ME_mod= 0
##$MI= 1.114404
##$NCOEF= 0
##$NC_proc= -8
##$NLEV= 6
##$NOISF1= 3.799351
##$NOISF2= 2.8
##$NSP= 0
##$NTH_PI= 0
##$NZP= 0
##$OFFSET= 15.73257
##$PC= 1
##$PHC0= -23868.52
##$PHC1= 16.05271
##$PH_mod= 1
##$PKNL= yes
##$PPARMOD= 0
##$PSCAL= 0
##$PSIGN= 0
##$REVERSE= no
##$SF= 200.130007799908
##$SI= 16384
##$SIGF1= 3
##$SIGF2= 2
##$SINO= 5.538805
##$SIOLD= 16384
##$SREGLST= <1H.CDCl3>
##$SSB= 0
##$STSI= 16384
##$STSR= 0
##$SW_p= 3612.71676300578
##$SYMM= 0
##$S_DEV= 0
##$TDeff= 16384
##$TDoff= 0
##$TI= <>
##$TILT= no
##$TM1= 0
##$TM2= 0
##$TOPLEV= 0
##$USERP1= <user>
##$USERP2= <user>
##$USERP3= <user>
##$USERP4= <user>
##$USERP5= <user>
##$WDW= 1
##$XDIM= 16384
##$YMAX_p= 391139422
##$YMIN_p= -1047567
$$ End of Bruker specific parameters
$$ ---------------------------------
##NTUPLES= NMR SPECTRUM
##VAR_NAME=  FREQUENCY,     SPECTRUM/REAL,   SPECTRUM/IMAG
##SYMBOL=    X,             R,               I
##VAR_TYPE=  INDEPENDENT,   DEPENDENT,       DEPENDENT
##VAR_FORM=  AFFN,          ASDF,            ASDF
##VAR_DIM=   16384,         16384,           16384
##UNITS=     HZ,            ARBITRARY UNITS, ARBITRARY UNITS
##FACTOR=    0.220516191357247, 1,           1
##FIRST=     3148.55929567669, 0,            0
##LAST=      -464.157467329088, 0,           0
##MIN=       -464.157467329088, -1047567,    0
##MAX=       3148.55929567669, 391139422,    0
$$ Real data points
##PAGE= N=1
##DATA TABLE= (X++(R..R)), XYDATA
$$ [...]
5774a26011l0670k4187j51040j38334p7990N4832M23549J20537J86150l22387
5764h5551K15359Q2383k5166l80006l15603K70899J17294K29419j502J16952o4392
5753A60086j88525J66954j0757n46143r6425R8228k6152L09573M0065P1782K35237
5742B13923j3636k13892l8591k12290k05319M10473K45952m33945j27953M05290
5732C0012K20166j03089l54921K61547j50763M5443N2587k71110L73828o0869
5722D2831l7613j39825m2379j24453L2518L34048j81105l26402J7546J71852P6983
5711a75999L65653k7603K52033j10939k72718N9334J43679l32844k90506K93890
5701i6020J83521k70355m56387M82727n72572n4822j19495J84299K87150M64549
$$ y = [-126011, -156681, -180868, -331908, -470242, -548232, -493400, -69851, 50686, 236836, -85551, 129808, 212191, 187025, -192981, -508584, -237685, -120391, 109028, 107526, 224478, 160086, -28439, 138515, 127758, -418385, -514810, -416582, -442734, -133161, -93096, -21314, 213923, 200287, -13605, -52196, -264486, -469805, -59332, 186620, -247325, -375278, 30012, 250178, 147089, -207832, 53715, -97048, -51605, 982, -270128, 103700, 42831, 5218, -134607, -176986, -301439, -268921, 65127, -115978, -442380, -424834, -252982, -175999, 189654, 162051, 414084, 303145, 30427, 89761, 233440, -99404, -389910, -96020, 87501, -182854, -639241, -156514, -729086, -783908, -903403, -719104, -431954, 32595]
5691C2595J3986m02681L9383j4863J82243j03k03782J61498m3327m21430L81791
5680b74690M90363l6085J3165m65566j02846N65864j95322J25741N308k60057
5670a34125o2936J34375L96798l97111k71161j5812Q4948R5008L17863k8146k62966
5659a43265P1039l63175K21043L43864j61275j5710j43863j45234j00673p8245
5649e15494J49070K20336L32345k07836j65705j18481K8207o9711j37713K44282
5639b40700N5231J58142M3386l39737k89332j0833J33538J5296n1470K31355M01023
5628A05899L16591j74961l71844K70607p5014K0615O7475k70425j24953j77274
5618d13284L62380j71301R4327K12815j26287j26212j82729K51742m9002L4522
$$ y = [32595, 46581, -356100, -316717, -331580, -149337, -149440, -353222, -191724, -235051, -656481, -274690, 215673, 179588, 192753, -272813, -375659, 190205, -5117, 120624, 125932, -134125, -197061, -62686, 334112, -62999, -334160, -349972, -265024, -170016, 147847, 119701, -143265, -72226, -435401, -214358, 129506, -31769, -47479, -191342, -336576, -437249, -515494, -366424, -146088, 186257, -21579, -187284, -305765, -277558, -347269, -484982, -240700, -185469, -27327, 16059, -323678, -613010, -623843, -490305, -475009, -526479, -295124, 105899, 422490, 247529, -124315, 146292, 71278, 91893, 159368, -111057, -236010, -413284, -50904, -222205, -127878, 84937, -41350, -167562, -350291, -98549, -147551, -113029]
5608a13029k32330J10261J76415J12040l56130k18762Q23287o9537q6016J18241
5598B64440k23619O1966n7431j95834K43659j49076l73952M9209Q4467K18718
5588g7453j44885K11521m7436l2150J4197J73852L33691J51642k80195m4185j5200
5577B43399K9799j59427o2180L5996p6938j79888n15750N84592K92761L3328M05187
5566F30879k19635J45513k40557m83747K42404O1971n14104K80682J83718m8192
5556C8932K33320k11549k36072J50554o249l83823M49956L04196l09608j23786
5546i4129k5106k31185k4247J162M20675J99800k40771j4284m21442J33207P6297
5535b20023j09508o4259o9744J51204J28139P8205P1739j06414J04239r4753j26825
$$ y = [-113029, -345359, -235098, -58683, 53357, -302773, -521535, 301752, 232215, 146199, 264440, 40821, 102787, 45356, -150478, 93181, -55895, -429847, -380638, -296171, -77453, -222338, -10817, -58253, -90403, -76206, 97646, 431337, 582979, 302784, 258599, 243399, 273198, 113771, 51591, 87587, 10649, -169239, -684989, -100397, 192364, 225692, 630879, 411244, 556757, 316200, -167547, 74857, 136828, -377276, -96594, 87124, 38932, 272252, 60703, -175369, -24815, -31064, -414887, 35069, 339265, 29657, -94129, -119235, -350420, -374667, -373505, 47170, 246970, 6199, -8085, -429527, -296320, -220023, -329531, -393790, -463534, -312330, -184191, -105986, -34247, -140661, -36422, -131175, -258000]
5524b58000K99046m58464k3564n156q4329N39397L9530k13069M1126K80804j72276
5513a4955l18648J72233M76257J56276l66327k55638J08159J72618m9153O3661
5503A44483k80495J45025K47849J30598m74111O5798R9488k1812R7254J72747
5493C26824p5945N8557j14032l54659Q7841k58587J52848l6649J78551J00338
5483F5087m93794K83876N22428o4847j84842O4657l03473k01308J50388K92268
5473A30440J7843k10817M22000L2802m9634L4184j08522Q6154k05658j8571l05469
5462a75248k98129K72940K41858J18127r737n3947J21432k52792q1983M5591j03733
5451a75621J77504L39452l89789l91797O15140M56930k57391k31144J02561j12509
$$ y = [-258000, 41046, -417418, -440982, -446138, -530467, 8930, 48460, -164609, -123483, 157321, -14955, -333603, -161370, 314887, 471163, 104836, -150802, -42643, 129975, 80822, 144483, -136012, 9013, 256862, 387460, -86651, -20853, 78635, 56823, 154077, 326824, 250879, 309436, 195404, -159255, -71414, -330001, -177153, -213802, -35251, 65087, -428707, -144831, 377597, 312750, 127908, 192565, -110908, -312216, -161828, 130440, 148283, -62534, 359466, 392268, 342634, 376818, 268296, 354450, 148792, 130221, -175248, -473377, -200437, 41421, 159548, 149811, 95864, 217296, -35496, -117479, -71888, -175621, 1883, 341335, -48454, -440251, 174889, 631819, 374428, 143284, 245845, 133336]
5441A33336m66158N52761J57546m20699L8028J04614J65014L12508k63646K48481
5431E61785K03483l25954j94141r1634M3959k18069j67070k78895L04173L73145
5421B10782j21888k00520J24860j25854J9344L9502J59788j12832J12991J84066
5411B90239K64560M21496M7283n19664O7665j70840j71341p4002k18709L01617
5401B38304K5268R507N7893P3931j03684J2786Q0250R6825o0480k19172M35588
5390F47016O2748p56767l11046O53713O1787j68568P2987K08209r9187j55126
5380B15766l24094k46387Q53355R8160l27500j5639l16305K53190l8407j10138
5370D2001K01467J42008l06907J05180J9768J69659K1253m9045K22789j36445
$$ y = [133336, -332822, 219939, 377485, -43214, -5186, 99428, 264442, 576950, 313304, 561785, 765268, 439314, 245173, 153539, 197498, -20571, -187641, -466536, -162363, 210782, 88894, -111626, 13234, -112620, -93276, -53774, 106014, -6818, 106173, 290239, 554799, 976295, 1023578, 503914, 571579, 400739, 229398, 155396, -63313, 238304, 263572, 273079, 330972, 404903, 301219, 314005, 394255, 491080, 430600, 211428, 647016, 709764, -47003, -358049, 295664, 357451, 188883, 261870, 470079, 370892, 215766, -108328, -354715, 498640, 596800, 269300, 253661, -62644, 190546, 152139, 42001, 243468, 385476, 78569, 183749, 203517, 373176, 394429, 345384, 568173, 431728]
5360D31728p0933l4375q6415r233M22574r62j73132j45360K47671R622j7494n1993
5348E21698o33894K33598O27497q7388j64783j25410r087J53113R2926J3524k2203
5337E99591j19637J05354j6177R3311K27042J17618k80457k13375n4688j01544
5327C57038j5873J84194Q7918l45975m29641P4445K10772p7554K44278j78385
5317A11217K67057K34610J27661m00202n793j70583k38712J45787k65261N75369
5307C81150j97834j70679L02670N2929k13482J70690L4131j32922k11878J47717
5297A62492j09352j7552J63810n1845J26656j39184k2684J09887j00311J43486
5287B65403k96612M1568P58028M6279K0565k30489l13018K19922L47694k42844
$$ y = [431728, 360795, 326420, 240005, 230772, 653346, 652384, 479252, 333892, 581563, 591185, 573691, 521698, -112196, 121402, 748899, 661511, 496728, 371318, 362231, 515344, 608270, 621794, 599591, 479954, 585308, 569131, 662442, 889484, 1007102, 726645, 513270, 458582, 357038, 341165, 525359, 613277, 267302, -162339, -87894, 122878, 45324, 289602, 111217, 378274, 612884, 740545, 340343, 334550, 163967, -74745, 71042, -194219, 381150, 183316, 12637, 315307, 368236, 154754, 325444, 359575, 226653, 14775, 162492, 53140, 35588, 199398, 147553, 274209, 135025, 112341, 222228, 121917, 265403, -31209, 10359, 768387, 814666, 835231, 604742, 291724, 511646, 859340, 616496]
5277F16496k63783O6431O2537k73813k47230N5240k93442L53170L94909j80159
5267B90356k25394K25228L27468P6516k63873K1078j61034j3710M52888J6752
5257G46275j56814k200l8662l93453J6871K93376N1621K56996r4195p8037j1611
5246E90167k77906J77506j61412n6451K87319k06486k8554j84933K55382m74677
5236h0045k3480L91066k14925K80521J88521O6348P4914O309k61488n305j61098
5225B61338r9025k294J15056J60482k7596J72565k4110J04256J88547L21452l26673
5214H43998k2525j51646Q4319J33065j60441n5253m35780K53482K80592K5506
5204G95317j8268l2139j54836L82459l1895J57895l29324j2791J44062R9465K05782
$$ y = [616496, 352713, 419144, 481681, 207868, -39362, 15878, -277564, 75606, 470515, 290356, 64962, 290190, 617658, 694174, 430301, 451379, 290345, 276635, 729523, 746275, 589461, 587261, 548599, 155146, 172017, 465393, 517014, 774010, 679815, 601778, 590167, 312261, 489767, 328355, 271904, 559223, 352737, 324183, 139250, 394632, -80045, -103525, 287541, 72616, 353137, 541658, 608006, 682920, 689229, 427741, 422436, 261338, 162313, 160019, 275075, 435557, 407961, 580526, 556416, 660672, 849219, 1170671, 843998, 821473, 669827, 754146, 887211, 726770, 671517, 235737, 489219, 769811, 795317, 777049, 744910, 590074, 972533, 940638, 1098533, 769209, 756418, 900480, 999945, 1205727]
5193A205727l29111k61074k66566J49736J11316k36224J10377j40284M97234K05477
5183A046608J86071K61057L27436j87817j6835N5362o36608l78285L91777l6783
5173A011983R1489N32935j84141J69037M8202j72645k65923K19792M79315P8177
5163B008221N2179r5085J98383L66137K27332L61118K44545K20744M16892J66736
5153D167202M32184M32992M02677k1402M42826O15929N21438N40283M45264j79863
5143G799530J28323j0311l86109k112j67710K80021n8805J88123m67153N36233
5133G840030M66341L55352M61853K87963J82524j06029j71141o52328q86260m92461
5123G285844J54025l18538l00832o51745l94527J62854m83742L96032k46492j65314
$$ y = [1205727, 876616, 615542, 348976, 498712, 610028, 373804, 484181, 343897, 841131, 1046608, 1232679, 1493736, 1821172, 1633355, 1616520, 1671882, 1035274, 656989, 1048766, 1011983, 1103472, 1636407, 1452266, 1621303, 1669505, 1496860, 1230937, 1450729, 1930044, 2008221, 2060400, 1965315, 2163698, 2529835, 2757167, 3118285, 3362830, 3583574, 4000466, 4167202, 4599386, 5032378, 5435055, 5413653, 5856479, 6472408, 6993846, 7534129, 7979393, 7799530, 7927853, 7917542, 7531433, 7529321, 7361611, 7641632, 7582827, 7770950, 7303797, 7840030, 8306371, 8661723, 9123576, 9411539, 9594063, 9488034, 9316893, 8664565, 7778305, 7285844, 7439869, 7121331, 6820499, 6168754, 5774227, 5937081, 5453339, 5849371, 5602879, 5437565]
5113E437565o3450o23522M2390L95094j9356R4478L56704M16138P15958N98303
5103G350302Q03372Q35938N7997N41372J031738P35223O76222j57036j07616k67881
5093A1499631j22433J91203P654j75968k40722O9800N26007K66539J0604K38251
5083A2270566j28248j70793m21259k62638j69607l51104k88837m97349q2978M16395
5073A0314148k6327n0582P47805P75301M25804K06640Q5960K6274j74405k8807
5063A2301811k20757j9835l76630j29995l31571M25841j10639J9068J30787o7707
5053A1620373k83041o91470o61733n32452m54128q41063j70031k17421o74828
5044G094206n88219j34047k00992j24284m66289k68718r7639m9397l54482L05032
$$ y = [5437565, 5374115, 4750593, 4792983, 5188077, 5168721, 5263199, 5619903, 6036041, 6751999, 7350302, 8153674, 8989612, 9047609, 9588981, 10620719, 11355942, 12032164, 11875128, 11767512, 11499631, 11377198, 11568401, 11576055, 11400087, 11159365, 11229165, 11755172, 12021711, 12032315, 12270566, 12142318, 11971525, 11550266, 11287628, 11118021, 10766917, 10478080, 9980731, 9897753, 10314148, 10287821, 10237239, 10985044, 11760345, 12186149, 12392789, 12478749, 12505023, 12330618, 12301811, 12081054, 12061219, 11684589, 11554594, 11223023, 11648864, 11538225, 11557293, 11688080, 11620373, 11337332, 10645862, 9984129, 9451677, 8997549, 8156486, 7986455, 7769034, 7094206, 6505987, 6371940, 6170948, 6046664, 5580375, 5311657, 5214018, 5164621, 4810139, 5115171]
5034E115171L08621q2536j89396O92650L30986n108J29676O71045N16471O24093
5024H111673J16347J94481P82479J176989J014204K56122j25364O9820o6885J04173
5014A1634039N05973j93823j37248l2127l13407m16665O798o23678o64862j21119
5004I643881n48046j030699m42607p09973n10371l59464o67004n27122j40871
4995D707724o90506l81604k62529q52300J49710k11670L49270J49542k94807k58731
4985B404099j23402m4459k69878L97521o12439j09738q6901L6417j65436K56709
4975A682493l4460m83515m2731l4331J73254k34464L31721j86119O8686K68683
4965A509217N9987m14837r0805L78194n13426k15044L4218j59392k60652J1157
$$ y = [5115171, 5423792, 5341256, 5151860, 5844510, 6175496, 6170388, 6300064, 6971109, 7487580, 8111673, 8228020, 8422501, 9204980, 10381969, 11396173, 11652295, 11526931, 11596751, 11529866, 11634039, 12140012, 11946189, 11808941, 11776814, 11463407, 11046742, 11053540, 10429862, 9765000, 9643881, 9095835, 8065136, 7622529, 6912556, 6402185, 6042721, 5375717, 4848595, 4707724, 4017218, 3635614, 3373085, 2520785, 2670495, 2458825, 2808095, 2957637, 2662830, 2404099, 2280697, 2236238, 1966360, 2363881, 1751442, 1641704, 1554803, 1591220, 1425784, 1682493, 1648033, 1164518, 1121787, 1087456, 1260710, 1026246, 1357967, 1171848, 1240534, 1509217, 1569204, 1154367, 1063562, 1441756, 928330, 713286, 747504, 588112, 327460, 338617]
4955C38617M15372J82701j97914N9820j15607m50313M5427K75671K01817r2633
4945F62958N2616m53033k91183K40255L73146J29241j75040J62701J13992p7537
4935G38116j73127l20099K0901m6348J69028j36224j24209J60410n2775K88957
4925E24630m18981k26417J49939n3619j636j7203L7296K18022k5944j64948p2369
4914e1230J9388K13108m6365J31750j78413J56601k17690l51800J33379K1644
4904a69628k16521k8631L08227M247K79956l155p7463J60507j36410Q2466J69488
4893C73083k42070J83935k0130k0027J62452K8402m69276p0133J4439o057R664
4882e5718J68935J7153J52385m17144J70985L0496L39799N8873n79640j56356
$$ y = [338617, 753989, 936690, 738776, 798596, 682989, 232676, 278103, 553774, 755591, 662958, 715574, 262541, -28642, 211613, 584759, 714000, 538960, 701661, 815653, 738116, 564989, 244890, 265791, 219443, 388471, 252247, 128038, 288448, 235673, 524630, 105649, -120768, 29171, -24448, -26084, -43287, -5991, 212031, 186087, 21139, -51230, -31842, 181266, 134901, 266651, 88238, 244839, 27149, -324651, -191272, -169628, -386149, -414780, -106553, -102306, 177650, 174495, 97032, 257539, 121129, 203595, 373083, 131013, 314948, 294818, 274791, 437243, 465645, -3631, -73764, -59325, -65382, -55718, 113217, 130370, 282755, -134389, 36596, 67092, 406891, 465764, -113876, -270232]
4872b70232O9160L51134L03605l8682P5495L27345p03829k70546p5714q1277J39009
4861a74532L51759J32297K55859j12516k28656P9688k3420j02287k19252j3508
4851e4568P8924k07963L48786j62694j03113J14274m70908K9493N14172K86993
4841C73396M02387l69461J18389n8950j71638K49665j52762j60731k53721k46022
4831b69448K30909J98624l0612p5988k33590n6048K66338J82910J19726K70817
4821F03638n8596k64293l27217M7273L85679K64527n77185J5707K36300m83023
4811a57190P0141J71189M10197K82354l43078l67814K20307r722J11388j63305
4801B24467m31430K08763L89576J00230J95081l37896k98588L29714J71236J05313
$$ y = [-270232, -201072, 150062, 453667, 414985, 490480, 817825, 113996, -156550, -232264, -313541, -174532, 177227, 309524, 565383, 452867, 224211, 303899, 280479, 178192, -41060, -54568, 24356, -183607, 165179, 2485, -100628, 13646, -457262, -427769, 86403, 373396, 775783, 406322, 524711, 465761, 294123, 543788, 391026, 230295, -23426, -269448, -38539, 160085, 129473, 53485, -180105, -236153, 30185, 213095, 332821, 603638, 545042, 280749, -46468, 805, 386484, 651011, 73826, 89533, 325833, -157190, -87049, 84140, 494337, 776691, 433613, 65799, 286106, 276384, 387772, 224467, -206963, 1800, 391376, 491606, 686687, 348791, 50203, 379917, 551153, 656466]
4791F56466J26398r0469q1981N72393r546J01893k27149K43896L16584N9111l85405
4780A282191l43228k41553J35473J82652K16481l92947l05301m54874p1025J38391
4770A46260Q2243J60374J91419j02618l68279J1687j36388j57501n8L59511J576
4759A88226J64030J86372l32223J40882P1296m05371L49969k16681m0619m5208
4749F0673J48947K63789K22529K6030l99079k41017K31971r3105N7662k8308K97073
4738E47165R0779j66179K87165M9120K5688j06173J83427K21818K92418J6950
4728A442178j5790K59461j21345j08039p5585Q3424l34798k35870L62629o8063
4718A188202J21681L92696K10479Q1619l30640P8824J01395j75657j77538n05561
$$ y = [656466, 782864, 692395, 610414, 1182807, 1173261, 1275154, 1048005, 1291901, 1608485, 1667596, 1282191, 938963, 697410, 832883, 1015535, 1232016, 839069, 533768, 78894, 7869, 146260, 228503, 388877, 580296, 477678, 109399, 121086, -15302, -172803, -172861, 186650, 188226, 352256, 538628, 206405, 347287, 418583, 13212, 363181, 146500, 105881, 60673, 209620, 473409, 695938, 721968, 322889, 81872, 313843, 220738, 278400, 250092, 547165, 637944, 471765, 758930, 808050, 833738, 727565, 910992, 1132810, 1425228, 1442178, 1426388, 1685849, 1564504, 1456465, 1380880, 1464304, 1129506, 893636, 1256265, 1188202, 1309883, 1702579, 1913058, 1994677, 1664037, 1742861, 1844256, 1668599, 1491061, 985500]
4708I85500O4456q9578k06309P8038N3341L93340L66735r2790K38796K71596l11683
4697A751442k44425m85011k63588R5265N7017l39824L2088k36837N4385j15005
4687C05507p7956N9232k38389J54345Q6086K07742j03957k88420j29942l9294
4677f5046K40598K06663j11758J54949R8688J80683l65789K63335L4789R2665
4667G29777k99608m21711K80129l81221n7036K36557J32981N3310j37330J41536
4657B77384N1224j65720j81060J71055m03151Q2469J17939n0327J25899q7178
4647f1466K4841k9816J43475q5337J14645j86882L29250M2258j15627P068k49734
4636f7325o5523j21994j64209M40005L98386N5585Q179j42664k12202J22091J2878
$$ y = [985500, 1049956, 960378, 754069, 832107, 885448, 1278788, 1645523, 1552733, 1791529, 2063125, 1751442, 1507017, 1022006, 758418, 853683, 910700, 570876, 602964, 366127, 420512, 305507, 227551, 286783, 48394, 202739, 288825, 496567, 392610, 104190, -25752, -65046, 175552, 382215, 270457, 425406, 524094, 704777, 338988, 602323, 637112, 729777, 430169, 8458, 288587, -92634, -149670, 86887, 219868, 273178, 135848, 277384, 328608, 162888, -18172, 152883, -250268, -167799, -49860, -100187, 25712, -61466, -36625, -66441, 77034, -8303, 106342, -80540, 248710, 290968, 175341, 182409, -67325, -132848, -254842, -419051, 20954, 419340, 474925, 483104, 340440, 128238, 250329, 263207]
4625B63207k37674M1196J15681k80382J58388L4138m79832j55937K07431n0726
4615c84510L11924N33404j951j62434l52499K67902k46631J22834J80203k21221
4605D7021j85020J01498K57346j33647L12160P2748l77302o8206j2602j54738
4595a40742J12339L2644L15254O563k94087l94073O5885N90645N5538j2932P5292
4584D12326L1718l7455n1601N3634o2230n64612J10445J25528R3560m8382j90754
4573a27823K30211o9728K49200J53790N1782j80497j06349j47923J67364N7466
4563B77493N8729n8210N9682J6446j98669K72167o6340l7953l0059k15908K47
4552G7625J01311L11968L7903l02517l15807K35881O72487j88902Q4753j80031
$$ y = [263207, 25533, 66729, 182410, -97972, 60416, 94554, -385278, -541215, -333784, -384510, -72586, 460818, 458867, 296433, -56066, 211836, -34795, 88039, 268242, 47021, -137999, -36501, 220845, 87198, 399358, 472106, 94804, 26598, 13996, -140742, -28403, 4241, 319495, 326058, 31971, -362102, -296217, 294428, 349966, 337034, 412326, 444044, 406589, 354988, 408622, 346392, -218220, -107775, 17753, 111313, 62931, -127823, 102388, 32660, 281860, 435650, 487432, 306935, 200586, 52663, 220027, 277493, 336222, 278012, 337694, 354140, 155471, 427638, 361298, 323345, 293286, 77378, 77625, 178936, 490904, 528807, 226290, -89517, 146364, 818851, 629949, 714702, 534671]
4542E34671k83711j26964L8370j55857L93253P0626k74106o9471j99775N26085
4532D53121k35209N6704L1199l29740O3683K5245Q01876J46687l45685m58714
4522B09167L4081K61428q446J88019J90156Q5949l09290J17014j14004l05946
4512C48128N1114j94388J6693J13228K20682M45986l50625M9877n950n1550J41180
4501G84375O7321J88095j60980L22000j69552k1376n8653R7125J32540k2530j86451
4490I71914n3475o5929J55011L19602k60911J48674R8131Q7471K27547k70511
4480A357524m3965L20598L4328R9676P5152k83777K56127O0113l9740M6821J298
4469A884155J11449l7724r6418j15730M8697L62877n7331l55352K15487J26487
$$ y = [534671, 250960, 123996, 162366, 6509, 399762, 470388, 196282, 126811, -72964, 453121, 217912, 274616, 305815, -23925, 39758, 65003, 866879, 1013566, 667881, 209167, 243248, 504676, 496230, 684249, 874405, 960354, 651064, 768078, 654074, 348128, 399242, 204854, 221547, 334775, 555457, 1001443, 650818, 700695, 694745, 643195, 784375, 851696, 1039791, 878811, 1200811, 1031259, 1009883, 951230, 1048355, 1180895, 1158365, 971914, 918439, 852510, 1007521, 1327123, 1066212, 1214886, 1313017, 1400488, 1628035, 1357524, 1313559, 1634157, 1668485, 1768161, 1843313, 1559536, 1815663, 1875776, 1836036, 1882857, 1884155, 1995604, 1957880, 1861462, 1745732, 1794429, 2157306, 2099975, 1744623, 1960110, 2086597]
4459B086597j92663j181L77006n7415N0275j82763K16644J13509j9434m68911
4449A921664M79433J92468j81385j5161L9998j31866m74391j64752J44018j3678
4439A796348J32218J41695M03503J2846k88708q442P6457K0133q1263N0135j82467
4428B072455j11180J24148M95208R0306m20316J02583K05502R2612O2419p771
4418B705966M162j5140j15036j62174P6483p2497r6743m1762J41017o50893q6841
4407A686542L73770l12695K780L09368j90757k61227m6157k88695J14200P2283
4397A459412K04067m19655k01487K67486K10301k52563L46294L26648k56656l61633
4387A322214o1022K90003J0454r262p6153J73166j43938M91532j0691j36945M69498
$$ y = [2086597, 1893934, 1892753, 2269759, 2212344, 2262619, 2079856, 2296500, 2410009, 2390575, 1921664, 2401097, 2593565, 2412180, 2397019, 2437017, 2305151, 1830760, 1666008, 1810026, 1796348, 1928566, 2070261, 2473764, 2486610, 2197902, 2189460, 2265917, 2286050, 2204787, 2254922, 2072455, 1961275, 2085423, 2580631, 2670937, 2250621, 2353204, 2558706, 2651318, 2713737, 2705966, 2710128, 2694988, 2579952, 2417778, 2494261, 2421764, 2325021, 2283259, 2424276, 1773383, 1686542, 2060312, 1747617, 1750397, 2059765, 1869008, 1607781, 1561624, 1272929, 1387129, 1459412, 1663479, 1243824, 1042337, 1309823, 1520124, 1267561, 1613855, 1940503, 1683847, 1322214, 1261192, 1551195, 1561649, 1552387, 1476234, 1649400, 1505462, 1996994, 1986303, 1849358, 2318856]
4376B318856P5808p776j74394N1938N90647K58449M9571n70295n40578J87006
4366B239232J679k19803L28430k18073K40134l21657k36898j66499N3134O15458
4356B315137l4504j41974J78073j03103k20304m4164N16248l15186J76095l01813
4346B024505N1564M34313J99774k68786J95425J26094K54654J96638q9880J10764
4336C235065j93306j26194N39094K19497m20577M25793n906L40636p9417J14916
4326D049601j01679J6608L66909l46974J61400k16478j07476K45217M0237J68144
4316D275509k89012N4507J60176O6989k84177M21057K12642j25998O8312j10051
4306D449954m71128K79315J21319j6394q3569j921k22717Q5986K47425M13912
$$ y = [2318856, 2394664, 2386888, 2212494, 2264432, 2855079, 3113528, 3163099, 2592804, 2052226, 2239232, 2240911, 2021108, 2349538, 2131465, 2371599, 2049942, 1813044, 1646545, 1699679, 2315137, 2280633, 2138659, 2316732, 2213629, 1993325, 1949161, 2465409, 2150223, 2326318, 2024505, 2076069, 2510382, 2710156, 2441370, 2636795, 2762889, 3017543, 3214181, 3124301, 3235065, 3041759, 2915565, 3454659, 3674156, 3253579, 3679372, 3673466, 4014102, 3934685, 4049601, 3947922, 3964530, 4331439, 3984465, 4145865, 3929387, 3821911, 4067128, 4107365, 4275509, 3986497, 4041004, 4201180, 4268169, 3983992, 4405049, 4617691, 4491693, 4560005, 4449954, 3978826, 4258141, 4379460, 4363066, 4279497, 4277576, 4054859, 4140845, 4388270, 4802182]
4296D802182k43659l33267j84954R3610M10170Q4629J94731k0122M80364J59886
4286E443570l21914J90263l0916M37721j83578j67089O0632J87490j04735J21360
4276E632804N64465k48772q2962N31334J59789l97640J64825M36867L11556M8519
4266G120785O22985O41496Q05357K89127L74261R92775P46023O62034N23314M5551
4256A2823708k1040k41258j92487m9210O355P644K7501N63279P99532L26785K83037
4245A4333846m41470m42851o17123j017534m56937m69856n75224m67747l42793
4236I502311j46563j65020l20111K79988l03381m15848J58302J39959J65758m10559
4226H484836j52683J91567M87555l3891M971M86219L51927P44327N66695J18855
$$ y = [4802182, 4558523, 4225256, 4040302, 4133912, 4544082, 4628711, 4823442, 4803320, 5283684, 5443570, 5121656, 5311919, 5281003, 5718724, 5535146, 5368057, 5428689, 5616179, 5511444, 5632804, 6197269, 5948497, 5865535, 6396869, 6556658, 6159018, 6323843, 6760710, 7072266, 7120785, 7743770, 8385266, 9190623, 9479750, 9854011, 10846786, 11592809, 12254843, 12778157, 12823708, 12802668, 12561410, 12368923, 12319713, 12326068, 12333712, 12361213, 12924492, 13724024, 14050809, 14333846, 13892376, 13449525, 12832402, 11814868, 11357931, 10888075, 10312851, 9845104, 9502311, 9355748, 9190728, 8870617, 9150605, 8847224, 8431376, 8589678, 8729637, 8895395, 8484836, 8332153, 8523720, 9011275, 8977384, 8982355, 9468574, 9820501, 10564828, 11131523, 11250378]
4216A1250378O25162J335926N65167N08383O92187L55218j28801O45332L39676
4207A6188628l4228Q7270M87826O24037J126787J232388P16899P17243M49178
4198B1596028J47397L60619N47263N70426Q33286P03282Q00840Q82033N318K48094
4188B6694586O0282j74889j13864N82L87547O30804P87184J547824J296512J045470
4178C2162038J267541m23209n27726j425761j606066j682246j777180q37912q32046
4169B4317433r34202r05065o22532l43960j35376K33159n8644P1769N12432P21669
4159B2856683J42964O04346J434774J539642J499787J480300M07798L77886L97002
4150C0741182m46467j65529N97206M22080Q21626O50322J424839J758265R78224
$$ y = [11250378, 11875540, 13211466, 13776633, 14285016, 14977203, 15332421, 15203620, 15848952, 16188628, 16154400, 16241670, 16729496, 17353533, 18480320, 19712708, 20429607, 21146850, 21596028, 21743425, 22104044, 22651307, 23221733, 24055019, 24758301, 25559141, 26441174, 26446492, 26694586, 26754868, 26579979, 26466115, 26466697, 26854244, 27485048, 28272232, 29820056, 31116568, 32162038, 33429579, 33006370, 32478644, 31052883, 29446817, 27764571, 25987391, 25149479, 24317433, 23383231, 22478166, 21855634, 21511674, 21376298, 21609457, 21550813, 21622582, 22135014, 22856683, 22999647, 23603993, 25038767, 26578409, 28078196, 29558496, 29966294, 30344180, 30741182, 30294715, 30129186, 30726392, 31148472, 31970098, 32620420, 34045259, 35803524, 36781748]
4141C6781748M3376o85587r16882j049829j513996r49153j041686n80299M5476
4132C0133168j37826k99080R946l47279l05722k40335m24570p37942o14391l26459
4122B6709510R4520j14760k98039P17542R21966O70882M88878J142086J073249
4113C1405834J412281J368681J536727J002539M61455N42282M90348N54667J021917
4104C9796731J152081J132075J280364J483065J852351J744170J840411K140592
4096E2421840J683486J991976K090762L588899L630043M382076N361045O388161
4088H1538288P935692R294077J1134642J3132294J5802928J9342089K4343394
4081A82523404K9830896L2837271K7508510P581008j3408706k7857253l2766919
$$ y = [36781748, 36825124, 36139537, 35222655, 34172826, 32658830, 31709677, 30667991, 30087692, 30133168, 29995342, 29696262, 29706208, 29358929, 29053207, 28812872, 28388302, 27650360, 27035969, 26709510, 26804030, 26689270, 26391231, 27108773, 28030739, 28701621, 29190499, 30332585, 31405834, 32818115, 34186796, 35723523, 36726062, 37187517, 37729799, 38220147, 38774814, 39796731, 40948812, 42080887, 43361251, 44844316, 46696667, 48440837, 50281248, 52421840, 54105326, 56097302, 58188064, 61776963, 65407006, 69789082, 75150127, 81538288, 89473980, 98768057, 109902699, 123034993, 138837921, 158180010, 182523404, 212354300, 245191571, 272700081, 280281089, 266872383, 239015130, 206248211]
4074B06248211k8161413k1947941j7768091j4738492j0891969q280304o348693
4067I8111308m681366l636319l165880k905219l404171l498776l595077l391650
4059F9832850l387040k921563l036632k475310k229471j489938j414876r21930
4051E1956090l49376j004867o57198j253982j100591j162604j468996j661803
4043D3296673j698277j162315j085643q24986l71647r6587O0411L28833O87271
4034C9133733J26057R9185k77542m56699j018890j972186k601650j873951j235590
4025B9922467k043292r20583n42460j070745j120900m96765l81111r64847m95064
4016B1886700r0505r37132p38306o35215L6521R4378k15943o9122m22426j17031
$$ y = [206248211, 178086798, 156138857, 138370766, 123632274, 112740305, 104460001, 98111308, 93429942, 89793623, 86627743, 83722524, 80318353, 76819577, 73224500, 69832850, 66445810, 63524247, 60487615, 58012305, 55782834, 54292896, 52878020, 51956090, 51606714, 50601847, 49944649, 48690667, 47590076, 46427472, 44958476, 43296673, 41598396, 40436081, 39350438, 38525452, 38153805, 38057218, 38117629, 38446462, 39133733, 39259790, 39358975, 39081433, 38624734, 37605844, 35633658, 33032008, 31158057, 29922467, 27879175, 26958592, 26416132, 25345387, 24224487, 23727722, 23346611, 22381764, 21886700, 21796195, 20859063, 20120757, 19485542, 19522063, 19616441, 19400498, 19331376, 18908950, 18791919]
4006A8791919j53563n86402j73885K95729m05349j70163J05657o03067n00346
3997A6600530r3895j96901m37039k77161j23318l10354m59510j093657M98111
3988A4106806l93790k89407n93054l46080O35595q9831k29437K25482k18846k84984
3978A2522454N69897j13185j76644J435M13309M01765M34461Q63366J022476O73434
3968A6612768P0672k76565k08583j398996r90118q54828m53369n93077o42616
3959A1265288P2531l57846l69244N4000n04796N5776n46117k92457k18312n31794
3949H627029l46589o8547k45500j50925j54891m9706k33636j25827j11026n47943
3939F592439K20583J71035n47025L80079J46901k09516O8390J02306O50049R6481
$$ y = [18791919, 18638356, 18051954, 17878069, 18173798, 17768449, 17598286, 17703943, 17100876, 16600530, 16506635, 16309734, 15872695, 15595534, 15472216, 15161862, 14702352, 13608695, 14106806, 13713016, 13423609, 12830555, 12484475, 13120070, 13030239, 12800802, 13026284, 12807438, 12522454, 13092351, 12979166, 12802522, 12803957, 13217266, 13619031, 14053492, 14916858, 15939334, 16612768, 16683440, 16406875, 16198292, 14799296, 13809178, 12954350, 12500981, 11907904, 11265288, 11337819, 10979973, 10610729, 10664729, 10159933, 10215709, 9669592, 9377135, 9158823, 8627029, 8280440, 8211893, 7966393, 7815468, 7660577, 7610871, 7377235, 7251408, 7140382, 6592439, 6813022, 6984057, 6437032, 6817111, 6964012, 6754496, 6822886, 6925192, 7575241, 7671722]
3929G671722j73509l8329P7595J92156J2018m15230K19663j64399J60921L07471
3919G850079o08420k23791l98369m41547K57634m60968L5530k22793L3712l3299
3909E787768p8801j38747k86404j11338q2367R4238J03193L4596J74485J92796
3899E689419j03823K37713L47170J21056j43132L50497J52529q9805n18227j18643
3889E924754L65849k15652n61089L01645L08007l93584J5925Q4622J51165O4007
3879F045649p6514k63414M3960L02420R437m53883J78692j40398L700J10211k32148
3868E527712J73147K60165L76241N21493j05477K46637m1110Q3587M79718N7268
3858G579381L01052j1639k7450N93200k46179j15011O74511L51034J12587m09203
$$ y = [7671722, 7498213, 7459884, 7537479, 7729635, 7741653, 7326423, 7546086, 7381687, 7542608, 7850079, 7241659, 7017868, 6619499, 6177952, 6435586, 5974618, 6010148, 5787355, 5821067, 5787768, 5708967, 5570220, 5283816, 5172478, 5090111, 5184349, 5287542, 5322138, 5496623, 5689419, 5585596, 5823309, 6170479, 6291535, 6148403, 6498900, 6651429, 6561624, 6043397, 5924754, 6290603, 6074951, 5513862, 5815507, 6123514, 5729930, 5745855, 5830477, 5981642, 6045649, 5969135, 5705721, 5749681, 6052101, 6061538, 5607655, 5786347, 5645949, 5649649, 5759860, 5527712, 5700859, 5961024, 6337265, 6858758, 6753281, 6999918, 6958808, 7042395, 7522113, 7579381, 7880433, 7868794, 7841344, 8434544, 8188365, 8073354, 8747865, 9098899, 9211486, 8802283]
3848H802283q486o2107L25095J1816J19829r8794M99858L20600J04692M39898
3838A0454684K73352O6477N25042L38283j88492K43315N21304m4061j23063N7439
3828A2124280k23039J85955Q8832M35557J08072L5232J8051J83126L28969J49249
3818A3434284K75631Q6630J85021M35551M74715k3255j45993J64951J6090P56974
3808A5660599M96143L62401J09713L28359O05896N57758N62459M19263N32264
3799A9634855J178440Q51425R73174O38327R31583J166790J796166J984206J789036
3790C0944002K263466K649637K902139K584233L254256L322864L527941L464929
3782E4913467K760189K901191K909620L019530K802046K296266J879005J783683
$$ y = [8802283, 8793797, 8731690, 9056785, 9068601, 9188430, 9089636, 9589494, 9910094, 10014786, 10454684, 10728036, 10794513, 11319555, 11657838, 11469346, 11712661, 12233965, 12189904, 12066841, 12124280, 11901241, 12087196, 12176028, 12611585, 12719657, 12754889, 12772940, 12956066, 13285035, 13434284, 13709915, 13796545, 13981566, 14417117, 14891832, 14868577, 14722584, 14887535, 14903625, 15660599, 16156742, 16519143, 16628856, 16957215, 17563111, 18120869, 18683328, 19102591, 19634855, 20813295, 21664720, 22637894, 23276221, 24207804, 25374594, 27170760, 29154966, 30944002, 33207468, 35857105, 38759244, 41343477, 44597733, 47920597, 51448538, 54913467, 57673656, 60574847, 63484467, 66503997, 69306043, 71602309, 73481314, 75264997]
3774G5264997J990340J056870J060752P69844R20045J93796J23045m51789o80690
3765H0247210j159416k163817k140773k015957k474998k394307k163174k008731
3757F3726037k232268k138329k021216k275294j990238j640760j818851j910577
3749D7698504j430781j322493j273170r91907r73439j608065j073319j157434
3741C7867896j147032j221643j513938K3123n24659r28084K50994Q6710n32059
3732C2361308j38757o89181q78723j47173r32832r81135q48879q86519q60966
3723B5997143j85774m84753l21990J24680n46767P1674J27392L19552J32619O12210
3713B5845986O79791J34079K21322Q12430K64921L4392k14208l73730m50923m47270
$$ y = [75264997, 77255337, 78312207, 79372959, 80142803, 81062848, 81256644, 81379689, 80927900, 80247210, 79087794, 76923977, 74783204, 72767247, 70292249, 67897942, 65734768, 63726037, 61493769, 59355440, 57334224, 55058930, 53068692, 51427932, 49609081, 47698504, 46267723, 44945230, 43672060, 42680153, 41706714, 40098649, 39025330, 37867896, 36720864, 35499221, 33985283, 34008406, 33483747, 32555663, 32806657, 32893367, 32361308, 32222551, 31533370, 30654647, 30507474, 29574642, 28593507, 27744628, 26858109, 25997143, 25811369, 25326616, 25004626, 25129306, 24582539, 24654213, 24781605, 25101157, 25233776, 25845986, 26525777, 26659856, 26881178, 27693608, 27958529, 27992921, 27778713, 27404983, 26954060, 26506790]
3703B6506790P4734j10022k9745j316N17695r4341M08657k12296o04997k79250
3693B6175909n38958l08033k82490m68001j87097L13618M62461L75318O40455
3684B6183182N19323Q35850N74426R37480P55431Q08398O80370O16240k7296k39174
3674C1644230l68086l35979l05565m17648K84977K9807K38691M27251L35283K06968
3664C1739929M89626L67981J06475m63212l38222l84707n58290r00320m94477
3655B9564783j62837n56041o90022l13049J31600j73420k99993L63658J08943
3646B7973622L59217J40510L71922N37359M16114M69421L95986N54448O40254
3637C1858853J144718J165898J138744J265274J208114J061510J508938J611350
$$ y = [26506790, 26581524, 26471502, 26441757, 26440441, 26958136, 26863795, 27272452, 27060156, 26455159, 26175909, 25636951, 25328918, 25046428, 24578427, 24391330, 24704948, 25167409, 25542727, 26183182, 26702505, 27538355, 28112781, 29050261, 29805692, 30614090, 31294460, 31910700, 31883404, 31644230, 31276144, 30940165, 30634600, 30216952, 30501929, 30531736, 30770427, 31197678, 31532961, 31739929, 32229555, 32597536, 32704011, 32240799, 31902577, 31517870, 30959580, 30059260, 29564783, 29401946, 28845905, 28155883, 27842834, 27974434, 27801014, 27501021, 27864679, 27973622, 28332839, 28473349, 28845271, 29382630, 29798744, 30268165, 30664151, 31218599, 31858853, 33003571, 34169469, 35308213, 36573487, 37781601, 38843111, 40352049, 41963399]
3629D1963399J638964K390590K420642K839096L175657K701864L497101L916453
3621F4543766M265501N132752M930511N270359O200256O234442O438740O841373
3613A09857700O631455O501425O495738O507021N964455O459207O687720O065762
3605A61170483N518894N120889N104243M227486K629649J176953m21930j732565
3597A82794102k845797m503092n422096o755220p116818p471846q397745q336983
3589A31944505q196246q563325q088591p948972o778588o367031o400186n569916
3581G4031650n547171m349308l998608l529534k923817k991015k518944k125869
3573D6047384k149632k275287j227218j480742j255685r27631j075698j230238
$$ y = [41963399, 43602363, 45992953, 48413595, 51252691, 54428348, 57130212, 60627313, 64543766, 68809267, 73942019, 78872530, 84142889, 90343145, 96577587, 103016327, 109857700, 116489155, 122990580, 129486318, 135993339, 141957794, 148417001, 155104721, 161170483, 166689377, 171810266, 176914509, 181141995, 183771644, 184948597, 184526667, 182794102, 179948305, 175445213, 170023117, 163267897, 156151079, 148679233, 140281488, 131944505, 123748259, 115184934, 107096343, 99147371, 92368783, 86001752, 79601566, 74031650, 68484479, 64135171, 60136563, 56607029, 53683212, 50692197, 48173253, 46047384, 43897752, 41622465, 40395247, 38914505, 37658820, 36731189, 35655491, 34425253]
3565C4425253j126857q07658n21084l52255j061538p25389o52695q59333m02507
3556B7915937n43924n70919o21147l90398n03071m60558m62214m59278j97715
3547B3706713p11994j27489l84847l3775m28921o12164k68221L33183o34609m71451
3537B0366425m43147p82701o56645l42073J23081j55506l23774q2990j85522Q4709
3527A7601857j35935l57626k12250j5400L7271J87776L23641J64923P5924J28214
3517A7798395N21175O10662O18450N66754Q41607O37954R76413O21619J061469
3508B4254498Q06646J016882R38133J49278O17760K65575m2852j47723k30597
3499B7627600j14587r72000p18666j023204j491991j220049r05084r34850j188978
$$ y = [34425253, 33298396, 32490738, 31969654, 31617399, 30555861, 29830472, 29177777, 28318444, 27915937, 27372013, 26801094, 26179947, 25789549, 25286478, 24825920, 24363706, 23904428, 23706713, 22994719, 22867230, 22482383, 22448608, 22019687, 21407523, 21139302, 21472485, 20837876, 20366425, 19923278, 19140577, 18483932, 18141859, 18264940, 18109434, 17785660, 17702670, 17517148, 17601857, 17465922, 17108296, 16896046, 16880646, 16917917, 17105693, 17429334, 17594257, 17670181, 17798395, 18319570, 18930232, 19548682, 20115436, 20957043, 21594997, 22571410, 23193029, 24254498, 25061144, 26078026, 27016159, 27165437, 27783197, 28048772, 28005920, 27858197, 27627600, 27513013, 26541013, 25822347, 24799143, 23307152, 22087103, 21182019, 20247169, 19058191]
3490A9058191j225717j034002p79620n67855r11525l67291o70591k98736l94359
3481A2808495p18704k62553k09558o50561j91586K40255m15636k78766n9756p44886
3471I516744L19029k45611k72296n6493j0303m75814K162J64527m15589q416o9125
3460H448815j24391k07698J84685O3472M34708o3965o64027l39229J62513J37578
3450H032461J11045K03132p4881o4213n03778O2707L85644l99171K89494N5917
3440H098357K66292o51338J72737J68644J99661r580k07645J69805J07452k41868
3430H072517J23895j15398J17064L19258M31154M5291o8298K32269L56492J23664
3420I637908N31165L20989q082O57045M15339M14186Q52308L33238L05834N07623
$$ y = [19058191, 17832474, 16798472, 16018852, 15450997, 14539472, 14172181, 13501590, 13202854, 12808495, 12089791, 11827238, 11617680, 10967119, 10775533, 11015788, 10600152, 10321386, 10261630, 9516744, 9835773, 9590162, 9317866, 9261373, 9251070, 8775256, 8777418, 8941945, 8526356, 8517940, 8448815, 8324424, 8116726, 8301411, 8364883, 8799591, 8735626, 8071599, 7732370, 7894883, 8032461, 8143506, 8346638, 8271757, 8207544, 7703766, 7766473, 8152117, 7752946, 8042440, 8098357, 8364649, 7713311, 7886048, 8054692, 8254353, 8244773, 8037128, 8206933, 8314385, 8072517, 8196412, 8081014, 8198078, 8517336, 8948490, 8993781, 8925483, 9157752, 9514244, 9637908, 10169073, 10490062, 10481980, 11139025, 11554364, 11968550, 12820858, 13154096, 13459930, 13967553]
3410A3967553P34353N09336J033562J142208O12551R46112P23885R43607M21599
3401B1034766P55716J0166k2031O31995j94937k25444L95717J13319j39277M33677
3391B2793667N1002M21088J22871R6793p10747P5534L55241m57997j54746n1742
3381B2540964l16392m32763o70261j55511m14545m37610q8627k54152K52484K38955
3371B0262542L68673K22368Q05975k24870M31351Q43504N44611J088761P88767
3362B5131682O69685J172036J167296J257109J336265K163169K283457K171673
3354C7352372K248146K857506L110988L089026L075238L035631K635203K410558
3346E9814668J841323K205454K066224J400764J158416J041707N34387L33014
$$ y = [13967553, 14701906, 15211242, 16244804, 17387012, 17999563, 18945675, 19669560, 20613167, 21034766, 21790482, 21800648, 21778617, 22410612, 22215675, 21990231, 22385948, 22499267, 22359990, 22793667, 22844669, 23265757, 23388628, 23485421, 22774674, 22850208, 23205449, 22747452, 22592706, 22540964, 22224572, 21791809, 21121548, 20966037, 20551492, 20113882, 20025255, 19771103, 20023587, 20262542, 20631215, 20853583, 21659558, 21434688, 21866039, 22709543, 23254154, 24342915, 25131682, 25801367, 26973403, 28140699, 29397808, 30734073, 32897242, 35180699, 37352372, 39600518, 42458024, 45569012, 48658038, 51733276, 54768907, 57404110, 59814668, 61655991, 63861445, 65927669, 67328433, 68486849, 69528556, 70062943, 70395957]
3338G0395957N82351J36954O41029N35156M10097P6045P2546j22362l67243m36295
3328G1924235n77059q22554j357677p41003j029914l97713j016102o48707J67952
3319F5501458P40811J129169Q05242J120883J745292J568650J334558P98388J180783
3310G5925234J042909Q03727L72795K50170L30222K71137k40951n7963o4735n1554
3300G8580991n03906o67743k30961j133519j505726j697619k331856k214358k846942
3291F5448361k953221k521301k510803k802342k235228k318952l026318j827662
3283D5252534j561715j404172j499648j439409j206629r40351r87958j095278
3275C5117374r02636r50925l75860m5347n68436J34903o17383O9308J71453j50649
$$ y = [70395957, 70978308, 71115262, 71756291, 72291447, 72701544, 72777589, 72850135, 72727773, 72360530, 71924235, 71347176, 70524622, 69166945, 68425942, 67396028, 66998315, 65982213, 65333506, 65501458, 66242269, 67371438, 68176680, 69297563, 71042855, 72611505, 73946063, 74744451, 75925234, 76968143, 77771870, 78144665, 78394835, 78725057, 78996194, 78755243, 78697280, 78632545, 78580991, 78077085, 77409342, 77178381, 76044862, 74539136, 72841517, 70509661, 68295303, 65448361, 62495140, 59973839, 57463036, 54660694, 52425466, 50106514, 47080196, 45252534, 43690819, 42286647, 40786999, 39347590, 38140961, 37200610, 36212652, 35117374, 34214738, 33263813, 32887953, 32842606, 32274170, 32409073, 31791690, 31860998, 32032451, 31881802]
3265C1881802M81643J03882k97438K86753K70573K42187J89023M76400N32307
3256C4167132L27012j60407M0932m29609p7395l82200k38447n60839m14259m53592
3246C1818328l22696k98518l22926k77707l40194m24720n27916j481958o07818
3237B7213875n78064q94370q16357m50894k38772j026052o56478n47402n07632
3228B1497854n84325m04036J1851j76701n77671m50029l79623l71602r416j5n64215
3217A7992072k86837l5763k77881l2582j43627j91550k11604n24125k24594k06377
3207A5857132j74392J03156L6413K3419r1791l8370K17853k99219M44840N48179
3197A6627220m73308j55693K39731J57219Q00757N45957N56230j02519N94414
$$ y = [31881802, 32363445, 32467327, 32169889, 32456642, 32727215, 32969402, 33158425, 33634825, 34167132, 34494144, 34333737, 34374669, 33945060, 33867665, 33485465, 33247018, 32686179, 32271920, 31818328, 31495632, 31197114, 30874188, 30596481, 30256287, 29831567, 29303651, 27821693, 27213875, 26635811, 25741441, 24925084, 24474190, 24235418, 23209366, 22552888, 22005486, 21497854, 20913529, 20509493, 20521344, 20344643, 19766972, 19316943, 18937320, 18565718, 18556302, 18556287, 17992072, 17705235, 17669472, 17391591, 17359009, 17215382, 17023832, 16812228, 16288103, 16063509, 15857132, 15682740, 15785896, 15822309, 15845728, 15753937, 15715567, 15933420, 15634201, 16079041, 16627220, 16153912, 15998219, 16237950, 16395169, 17195926, 17741883, 18298113, 18195594, 18790008]
3188A8790008O07838O05932J69837O60756R99358P57652J217646J216697J510159
3179B6535883J330431J197060K081191K611339K386378K865974L993887L583797
3171D6585940L611499L767983L855486L959598M164436M418829M194176L711749
3163G8269696L223953K864445K242304J720916R58493j03994j154748j658272
3155H6362793k562179l564599m251139m571016m849675m701786m841165m640422
3147E2380812m152730l518954l029067k348088k302747k262851j773575j558231
3139C1434569j173815j034639j066983j197181j063003n17207o53568o60248n98753
3130B3469172o81346k38180r7560k99295p18992M3472k31329j0585M187k28600
$$ y = [18790008, 19397846, 20003778, 20173615, 20834371, 21833729, 22591381, 23809027, 25025724, 26535883, 27866314, 29063374, 31144565, 33755904, 36142282, 39008256, 43002143, 46585940, 50197439, 53965422, 57820908, 61780506, 65944942, 70363771, 74557947, 78269696, 81493649, 84358094, 86600398, 88321314, 89279807, 89175813, 88021065, 86362793, 83800614, 80236015, 75984876, 71413860, 66564185, 61862399, 57021234, 52380812, 48228082, 44709128, 41680061, 39331973, 37029226, 34766375, 32992800, 31434569, 30260754, 29226115, 28159132, 26961951, 25898948, 25381741, 24728173, 24067925, 23469172, 22787826, 22549646, 22452086, 22152791, 21433799, 21477271, 21245942, 21235357, 21239544, 21010944]
3120B1010944l74041J12075j4114K61009J73111L2971j66868k48236K79539l36659
3110B0729731l66210q63335q04070j2829k83965p92794q57056q82898l84675j86280
3100A5295619r49353m28800n29980q22436p01033l46032m59650j20984l79329
3091A0558022n88068j64286l28435k40795k58748m4346l34259J65922m54045j84698
3081H126264J22967l24038o37025r395J25672j75142m5111k91896j57789j97030
3071F537477p9406o7001l13429K0781n8258j89410q3541K2894n1671J39995L59728
3060F238159Q8128n4844M5183J21023J25948n22550o6825K36840l54680P59r7473
3049E759668m83058J97156p5397p2559J36128j01745m8110j03360o2296l17782
$$ y = [21010944, 20636903, 20748978, 20734864, 20995873, 21168984, 21201955, 21035087, 20786851, 21066390, 20729731, 20363521, 19500186, 18696116, 18683287, 18399322, 17606528, 16749472, 15866574, 15481899, 15295619, 14346266, 13917466, 13387486, 12565050, 11864017, 11517985, 11058335, 10937351, 10558022, 9969954, 9805668, 9477233, 9236438, 8977690, 8933344, 8599085, 8765007, 8310962, 8126264, 8249231, 7925193, 7288168, 7278773, 7404445, 7229303, 7184192, 6892296, 6734507, 6537477, 6458071, 6391070, 6077641, 6098422, 6040164, 5850754, 5767213, 5790107, 5738436, 5878431, 6238159, 6326287, 6271443, 6316626, 6437649, 6563597, 6041047, 5974222, 6211062, 5856382, 5857141, 5759668, 5276610, 5473766, 5398369, 5325810, 5461938, 5360193, 5312083, 5208723, 5146427, 4828645]
3039D828645k52932M83511J67721k76351j84526L68863m6784j34070j68985l04215
3029D480877J68121N47899Q7103k60127J48782l57242l5729K32344L931J72674
3019E188633k08443O2748Q9246o7654j08459j79891r6563M6893L39258k36576
3009D829192O4073J39455K20883J25918k43919k19960M71791K76223j70769J37150
2999E630037j45752K5874J16882j81919O9465O56871K16844j59984j26998J30430
2989F231750k95323N6309J41226Q039J84520M56526J24578j35352l29177M16398
2979F859494N91215M2228L50456O8278l16159L52611J74120K53252P79307J57025
2969I311827j58851J69078M15490K53894k5453N91899O20303J64958K44541J43239
$$ y = [4828645, 4575713, 5059224, 5226945, 4950594, 4766068, 5134931, 5088147, 4954077, 4785092, 4480877, 4648998, 5196897, 5284000, 5023873, 5172655, 4815413, 4779684, 5012028, 5015959, 5188633, 4980190, 5042938, 5132184, 5064530, 4956071, 4776180, 4679617, 4726510, 5065768, 4829192, 4893265, 5032720, 5253603, 5379521, 5135602, 4915642, 5387433, 5663656, 5492887, 5630037, 5484285, 5510159, 5627041, 5445122, 5514587, 6171458, 6388302, 6228318, 6101320, 6231750, 5936427, 5992736, 6133962, 6142001, 6326521, 6783047, 6907625, 6772273, 6443096, 6859494, 7450709, 7492937, 7843393, 7911671, 7595512, 7948123, 8122243, 8375495, 9154802, 9311827, 9152976, 9322054, 9737544, 9991438, 9965985, 10557884, 11178187, 11343145, 11587686, 11730925]
2959A1730925K37964M68975L18373j14925Q38632L02452L72923L0783m7312L29928
2949A4468718L33021K12079M41623M99401J34417l6420L42318N12643N21519R3350
2939A7522669J7784Q84202M22372O02755J15404L08703N83649L75819O36670K89456
2929B1759483Q75281P15166N11956R81406Q20938N44153J606637J132380R23843
2920B9871243J273635J472323J187532J690948J534975J502660K129095J908703
2912D2571114J965559K341743J663781K293169K879756K262214L050181L298213
2904F2325730L538213M366813N017193N905480O858156P844904R160225J0813949
2896A15830663J2540570J4568479J6788267J9247096K3528099K7606201L2488580
$$ y = [11730925, 11968889, 12437864, 12756237, 12641312, 13479944, 13782396, 14155319, 14186102, 14138790, 14468718, 14801739, 15013818, 15455441, 15954842, 16089259, 16052839, 16395157, 16907800, 17429319, 17522669, 17540453, 18424655, 18847027, 19449782, 19565186, 19873889, 20457538, 20833357, 21470027, 21759483, 22634764, 23349930, 23861886, 24843292, 25664230, 26208383, 27815020, 28947400, 29871243, 31144878, 32617201, 33804733, 35495681, 37030656, 38533316, 40662411, 42571114, 44536673, 46878416, 48542197, 50835366, 53715122, 55977336, 59027517, 62325730, 65863943, 70230756, 75247949, 81153429, 88011585, 95856489, 105016714, 115830663, 128371233, 142939712, 159727979, 178975075, 202503174, 230109375, 262597955]
2889B62597955L7132949L8028391L3093044J9938143L48940j9003642l2722716
2882C39413064l7765596l6564476l2178816k7046443k2661099j8412566j5163365
2875A49620703j2008667j0484983r020684q003560o961065n659992m651989m604186
2867H8225577l426481k571866j808747j465490q71400j135449j966822j725599
2859G3253723k185369k392384k358727j935177j076137j459670j203002m88547
2851F0154710J62575L26440M69235R06747J006305K106329K083768J822650M58560
2842F9497319j761505k946147l541098n189283m594507m420803l374043l229039
2834D0440894k778095k324195j771829k153331j620226j391111j320682j069161
$$ y = [262597955, 299730904, 337759295, 370852339, 390790482, 391139422, 372135780, 339413064, 301647468, 265082992, 232904176, 205857733, 183196634, 164784068, 149620703, 137612036, 127127053, 118106369, 110102809, 103141744, 97481752, 92829763, 88225577, 84799096, 82227230, 80418483, 78952993, 78081593, 76946144, 74979322, 73253723, 71068354, 68675970, 66317243, 64382066, 63305929, 61846259, 60643257, 60154710, 60317285, 60643725, 61112960, 62019707, 63026012, 65132341, 67216109, 69038759, 69497319, 67735814, 64789667, 61248569, 56059286, 51464779, 47043976, 43669933, 40440894, 37662799, 35338604, 33566775, 31413444, 29793218, 28402107, 27081425, 26012264]
2826B6012264o07170j279997q99724q29701o63612j073197j085849J8622m70134
2817A9121502n10738q56143l40771m09198l18639l72367k04293n3016m70366j69322
2807A5416649q6100k21407o43257k71634k34151j18466l77367q31296p6104l83143
2797A2173724p80463l24405l41011m11123j94987n56702J66333m78651k55190
2788H997525l58317j24682l2216o97951j93380l3163l20243L0661l31659j22013
2778F814562L12205n67769k67514O4400l05759K35855k59772L1647k14328j23785
2768E719742J39409n20001p2317k59405q6586n38419M94049L58518p79622J00351
2758D555719J72699q8427m83116L15797j67035k34240j50435q0809j28325P1432
$$ y = [26012264, 25405094, 24125097, 23225373, 22395672, 21732060, 20658863, 19573014, 19591636, 19121502, 18610764, 17754621, 17413850, 17004652, 16686013, 16313646, 16109353, 16056337, 15585971, 15416649, 15330549, 15109142, 14465885, 14194251, 13960100, 13841634, 13464267, 12632971, 12556867, 12173724, 11393261, 11068856, 10727845, 10316722, 10121735, 9565033, 9731366, 9252715, 8997525, 8639208, 8514526, 8482310, 7784359, 7590979, 7557816, 7237573, 7268234, 6936575, 6814562, 7126767, 6558998, 6291484, 6355884, 6050125, 6285980, 6026208, 6057855, 5843527, 5719742, 5859151, 5339150, 5266833, 5007428, 4920842, 4382423, 4876472, 5234990, 4455368, 4555719, 4728418, 4639991, 4156875, 4472672, 4305637, 4071397, 3920962, 3840153, 3711828, 3783260]
2748C783260O4396m4121k0475m77738L47927l422l8623j80360l01051O40440N8797
2737C829030k76776j15930l46359K18811q8713J1141l67521J16054l84062k36733
2727B358942J98750L1359J93314J31407k92243p918J4612m40026K65864l64662
2717B089399K44858K44319o64998l4541P7148j79736J23370K54031J24621N9477
2707B337948j104j84760q7514J09444J21901l38011K47447N912l75809P6986k995
2696A909445K39852P9861k12880l59976K00652L75365M6875l54312j76172l09447
2686A439263q8208j19973j16184K22199P1911L95759j16682j57218k82787P741
2676A255821n3679K47941N7178k71265q2786K88676j94902k22803j02688K25609
$$ y = [3783260, 3847656, 3803535, 3783060, 3305322, 3653249, 3649827, 3611204, 3430844, 3129793, 3770233, 3829030, 3552254, 3436324, 3089965, 3308776, 3220063, 3231204, 2863683, 2979737, 2595675, 2358942, 2557692, 2589051, 2782365, 2913772, 2621529, 2613611, 2628223, 2188197, 2454061, 2089399, 2334257, 2578576, 1913578, 1879037, 1956185, 1776449, 1899819, 2153850, 2278471, 2337948, 2336844, 2152084, 2064570, 2174014, 2295915, 1957904, 2205351, 2211263, 1835454, 1912440, 1909445, 2149297, 2229158, 2016278, 1656302, 1856954, 2232319, 2279194, 1924882, 1748710, 1439263, 1351055, 1231082, 1114898, 1337097, 1409008, 1804767, 1688085, 1530867, 1248080, 1255821, 1202142, 1450083, 1507261, 1235996, 1153210, 1441886, 1246984, 1024181, 921493, 1147102]
2666A147102J93508j68523j96824k09409j39065L59276N5014k19065L77199J73911
2656A373124k88302K00418P6355R6037l83793K98193j16100p9483J03026k49582
2646A029893J59430l25545j76614K74337L3966k4600J99233N2915K26699n47899
2636I01815J80104l5343P7783p4807J88016J54575l03207l88797j78727K84502
2626H05914K04445K13448P1859j69755j7783J35089K70812n0825m84025j2617
2616I66562k42862M53558L23135L1161k33479j40400L53922M9783K9514N81397
2606B172291M52027n51110R5521L91167K91830l46946k99144l0852q6164l29608
2596A759012k79361J01663j41882K8659j69235l64131K15986j88681L24901j09454
$$ y = [1147102, 1340610, 1172087, 975263, 765854, 626789, 986065, 1041079, 822014, 1199213, 1373124, 1084822, 1285240, 1361595, 1457632, 1073839, 1372032, 1255932, 1176449, 1279475, 1029893, 1189323, 863778, 687164, 961501, 995467, 970867, 1170100, 1223015, 1449714, 901815, 1081919, 1046576, 1124359, 1049552, 1237568, 1392143, 1088936, 700139, 521412, 805914, 1010359, 1223807, 1295666, 1125911, 1108128, 1243217, 1514029, 1463204, 979179, 966562, 723700, 1177258, 1500393, 1531554, 1298075, 1157675, 1511597, 1561380, 1590894, 2172291, 2624318, 2073208, 2168729, 2559896, 2851726, 2504780, 2205636, 2174784, 2088620, 1759012, 1479651, 1581314, 1439432, 1468091, 1298856, 934725, 1150711, 962030, 1286931, 1177477]
2586A177477m39102J04465R925j03309K92282l65934j18792K2917j50915R3899
2576E22913K53405k40131p9938K9153P5749J08912j3109J54886J46750l05590
2566F53000L38423k55262o8058J50378K93849N0956k8631J02125n86368J3124
2556F63536J53073K99627k65276m3805k35924n13102L10162N67021O2750l20263
2546F77799j49312J85318m25470K026J38774P6166l33305p2195L28950J48151
2536E76902k4339r3114o8621p4398j35850j93675q5924L14464L74133q8485j04744
2525C96349j17489m3163m8285K17357J10737j57502Q8176K00563R032n54784l16024
2514b15033N23328L36911m22397J1590j24788M55773k52817O5459p5612j96000
$$ y = [1177477, 738375, 842840, 852765, 749456, 1041738, 675804, 557012, 579929, 429014, 522913, 776318, 536187, 456249, 485402, 561151, 670063, 656954, 811840, 958590, 653000, 991423, 736161, 668103, 818481, 1112330, 1163286, 1134655, 1236780, 650412, 663536, 816609, 1116236, 850960, 807155, 571231, 58129, 368291, 935312, 998062, 677799, 528487, 713805, 288335, 290361, 429135, 505301, 171996, 99801, 428751, 576902, 552563, 459449, 390828, 316430, 180580, -13095, -99019, 215445, 589578, 501093, 396349, 278860, 235697, 187412, 404769, 515506, 358004, 446180, 646743, 655775, 100991, -215033, 308295, 645206, 222809, 234399, 109611, 565384, 312567, 378026, 302414, 106414]
2504A06414J35128k63747K35962L47036j24658k83408n348Q2769k14277j98004
2494a82133M38094K38591j27175J06140k61737K09052l13889k11873J1978J55999
2484F3047J30212o3943L9950j47665j39497K1537J64863L35732J1307j30446p7838
2473B07259J32653K94111k92650J69940q2175K25242m53239n4994K58004j38233
2463B65918k15320k64858o2786J6118J43953n7434J87942L50437R1521k53864
2453B01627k97753l79707L26433K98200j65647m47390J46451K53537J01325p4743
2443c7667j57034M32539J52246J5351j21275k70906k3946J56123n3371l7742l1550
2432B2768J67686J49720j29044k75894K07274P3707q7525k92446k44851N8751
$$ y = [106414, 241542, -22205, 213757, 560793, 436135, 152727, 147379, 230148, 15871, -182133, 255961, 494552, 367377, 473517, 211780, 420832, 106943, -104930, -92952, 63047, 193259, 129316, 169266, 21601, -117896, -96359, 68504, 404236, 415543, 285097, 207259, 339912, 634023, 341373, 511313, 429138, 654380, 201141, 146147, 404151, 265918, 50598, -214260, -277046, -260928, -116975, -174409, 13533, 363970, 455491, 201627, -96126, -475833, -149400, 148800, -16847, -464237, -317786, -64249, 37076, -37667, -194701, 237838, 390084, 405435, 284160, 13254, -10692, 145431, 92060, 54318, 22768, 190454, 340174, 211130, -64764, 142510, 216217, 128692, -163754, -408605, -349854]
2422c49854L99871Q4095k43638l08088O5479K94758K03136j32049q76L07264j37507
2411A82591j07977K13405Q2479j6813o723j85135j28712n5722k3636J37446J28924
2400B20127n7760J06056O2234m8522J02603j95531k62734K19740J25804j01416
2390A70601K99591j36699J0619j91838q1884j34183M60664p2703k77696M2770
2380H9242M0139M57399k24009q0360J96062K29967J74690K09877j94106k0365
2370H78536j60189j12536k22820N0923N9434m49524L0447J72927O1843L69117
2360F78158j24500j68220j83328k2374j45219J04492j52022M28915L6505k42151
2350B10256j42168j53882K36092M06760j10275Q9871P623k87835K20336k72385
$$ y = [-349854, 50017, 134112, -109526, -417614, -352135, -57377, 145759, 13710, 12834, 320098, 182591, 74614, 288019, 370498, 353685, 346962, 161827, 33115, -22607, -46243, 91203, 220127, 162367, 268423, 330657, 282135, 384738, 189207, -73527, 146213, 272017, 170601, 470192, 333493, 344112, 152274, 70390, -63793, 396871, 324168, 46472, 89242, 129381, 586780, 362771, 282411, 478473, 708440, 883130, 1093007, 898901, 878536, 718347, 605811, 382991, 433914, 493348, 43824, 74271, 247198, 309041, 678158, 553658, 385438, 202110, 179736, 34517, 139009, -13013, 415902, 452407, 210256, 68088, -85794, 150298, 557058, 446783, 536654, 544277, 256442, 476778, 204393]
2340B04393p1902l37423L72928L00750j76789l98858j40436n9537K28224o0927
2330a39577J874J0827M7592j47649J07544O5275j63951J89717j25886K41408L14117
2319D01291j03732J0441J14533K78114j18343l5988l87569J93617J04534j12779
2309C44119J52397p091J52053r2361o5097j35911O7117J56367m98368L12793M68968
2298H54986m07496k92154j19211K39737J5627k44849J67317J36396J18952j6720
2288D52585o1303J22232j56181K01320M5607R8572M3824j48639l34688R1663j86293
2277A68699k3458R51888m37533k09740M08451j35816k67637n5030K37588l78965
2267B58447K03213r4582l4611J72210O34558m36767k02487k46168j08300K7289
$$ y = [204393, 132491, -204932, 167996, 468746, 291957, -106901, -247337, -306874, -78650, -139577, -137703, -126876, -79284, -226933, -119389, -54114, -218065, -28348, -154234, 87174, 401291, 297559, 308000, 422533, 700647, 582304, 546316, 158747, 352364, 456898, 344119, 496516, 489425, 641478, 549117, 484020, 348109, 415226, 571593, 73225, 386018, 854986, 447490, 155336, 36125, 275862, 291489, 46640, 213957, 350353, 469305, 452585, 391282, 513514, 357333, 558653, 604260, 702832, 746656, 598017, 263329, 354992, 168699, 145241, 1097129, 659596, 449856, 858307, 722491, 454854, 399824, 637412, 258447, 461660, 367078, 332467, 504677, 1139235, 702468, 499981, 253813, 145513, 172802]
2257A72802K07491K52496R8718k26997j07113J57167j54685J1241J12388K22923
2247G46431j09401J99094P5704k50699K0062R9934l10255R8954O0734Q8910K36193
2236I55661j24563k12568l6953m2889Q6554K63503J42965l43665M6172M0345J87414
2225I61976J71081j34869q2727J89309j67142L49917K13392k95614L5655j79909
2215A061069N0520k90056k37823j09695L07417M60914M3750J79563J78681j74807
2205A469533R9322J47296o6005k49779J787j49744L10881K22052j25105Q0265
2195A740503K28840J64196P630q1868J40739N88809m34009L16633M7805R4176
2185B813454j73238k31750N10941m0798k65359J5493L93168K82413K80399q4464
$$ y = [172802, 380293, 632789, 731507, 504510, 397397, 554564, 399879, 411120, 523508, 746431, 637030, 836124, 911828, 661129, 681191, 781125, 470870, 569824, 630558, 719468, 955661, 831098, 618530, 581577, 538688, 625242, 888745, 1031710, 688045, 734217, 774562, 961976, 1133057, 998188, 915461, 1104770, 937628, 1287545, 1500937, 1205323, 1240978, 1061069, 1111589, 821533, 583710, 474015, 781432, 1242346, 1286096, 1465659, 1644340, 1469533, 1568855, 1716151, 1650146, 1400367, 1402154, 1252410, 1563291, 1785343, 1660238, 1740503, 1969343, 2133539, 2141169, 2059301, 2200040, 2788849, 2354840, 2671473, 2719278, 2813454, 2640216, 2408466, 2919407, 2878609, 2613250, 2628743, 3021911, 3304324, 3584723, 3500259]
2175C500259Q8064q8096j57215O2493K24696K41596M59391l44142j59282M49679
2165D277443l82829K98090J57693O5794L23422m83384L55843N50356l32802N7519
2155D887145M87002K63014L8761M9084L88128l24752j20135J66952M43734K31946
2145F510879J1818P50255K76773K386K37737Q79579K58149R1002O70974L38295
2135A0027847L47486N89104N63970J059354O70521O86195O37269O88065R05569
2126A6175380Q95860J123695J175595J351323J966720K422682J782385J793408
2118B8687048K088730K561704L562603M444248N426787O595106Q381896J0108408
2110G1856530J3323021J7471645K3306300K7738718K5740056K621028j7057460
$$ y = [3500259, 3588323, 3500227, 3343012, 3405505, 3630201, 3871797, 4331188, 3987046, 3827764, 4277443, 3894614, 4192704, 4350397, 4416191, 4739613, 4256229, 4612072, 5162428, 4829626, 4887145, 5374147, 5637161, 5675922, 5725006, 6113134, 5788382, 5668247, 5835199, 6278933, 6510879, 6522697, 7272952, 7549725, 7552111, 7789848, 8669427, 8927576, 9018578, 9689552, 10027847, 10375333, 10964437, 11528407, 12587761, 13258282, 13944477, 14581746, 15269811, 16175380, 17071240, 18194935, 19370530, 20721853, 22688573, 25111255, 26893640, 28687048, 30775778, 33337482, 36900085, 41344333, 46771120, 53366226, 61748122, 71856530, 85179551, 102651196, 125957496, 153696214, 179436270, 182057298, 164999838]
2103A64999838k8054281k7059771j8039429j4317562j1810508r907025o593492
2096D9217770n295147m015225l003062k026904k353738k148285k035782k458770
2088B5880857k033618j313255j549966j383019j920493q00097j331371p66091
2080A4782947m81328q29770p72555J4087p48879l97641o20210r23686p12045r696
2070I301224j80482m29446k71997n45036l85558j40136k66610k84899l40293P2598
2060F529365k54595l87421O006k8599l87486m46818l74413l39144m5667J44170
2050D415398p8341k22455r8006m1462J85653l47132n07095K46925q7372K52211
2040C718324k13228j19552k54437J64517l79023r1007M24398j11128J11772n24548
$$ y = [164999838, 136945557, 109885786, 91846357, 77528795, 65718287, 55811262, 49217770, 43922623, 39907398, 36904336, 34877432, 32523694, 30375409, 28339627, 25880857, 23847239, 22533984, 20984018, 19600999, 17680506, 16880409, 15549038, 14782947, 14301619, 13471849, 12699294, 12713381, 11964502, 11566861, 10946651, 10022965, 9310920, 9301224, 9120742, 8691296, 8419299, 7874263, 7488705, 7348569, 7081959, 6797060, 6456767, 6529365, 6274770, 5887349, 5893355, 5864756, 5477270, 5030452, 4656039, 4316895, 4271228, 4415398, 4337057, 4114602, 4016596, 3975134, 4160787, 3813655, 3306560, 3553485, 3466113, 3718324, 3505096, 3385544, 3131107, 3295624, 2916601, 2825594, 3249992, 3138864, 3250636, 2726088]
2030B726088k54577q9607K39415j99729J2531M54821k54113l71449q4979R2615
2020B271016r5436j28687n2863J20605q788j68255M9635k40825J01116N3489j32129
2009A768878Q0276p599K9252k00737N429J47909l06700Q2184j06407j04193J5025
1998A403317l07621l9432J70149k86378J28678l00333K64042N8814k32842j08508
1988G49886J6790J50005J58171j83989Q6938j37448k10324M53974J39796j27769
1978A096030K42599j66262m8688k73761M6605q6490j31296K95178J41777l86435
1968G29257j26154K71133J86208k23929j22837j11495q918j04178M28369j65443
1958G52013k36689K12206J24766K42838l43460K99161j01370k49204l62091K61092
$$ y = [2726088, 2471511, 2381904, 2621319, 2421590, 2434121, 2888942, 2634829, 2263380, 2178401, 2271016, 2175580, 2046893, 1994030, 2114635, 2105847, 1937592, 1987227, 1746402, 1847518, 1901007, 1768878, 1849154, 1841555, 1870807, 1670070, 1675499, 1823408, 1516708, 1598892, 1492485, 1388292, 1403317, 1095696, 1056264, 1226413, 940035, 1068713, 768380, 1032422, 1091236, 858394, 749886, 766676, 916681, 1074852, 890863, 977801, 840353, 630029, 1084003, 1223799, 1096030, 1338629, 1172367, 1123679, 849918, 896523, 810033, 678737, 973915, 1115692, 729257, 603103, 874236, 1060444, 836515, 713678, 602183, 593265, 489087, 917456, 752013, 515324, 727530, 852296, 1095134, 751674, 1050835, 949465, 700261, 338170, 599262]
1948E99262J49296Q6332L2676J78846M7605m68297k4931J57231R9132k08817j0989
1937F37346o5794l9323J0106l9040J50594k9240j8219J48598k06043m626k93483
1926B50876l96912N29820K88847k36172j49898K64302k43808K87201k54619K8277
1916C67914M24114m954l74676K5845J27825n4844m86308J48588M16057j53499
1906D36062j00027K67765O695l26986j90002l1742P0927k76211K05298o5042j330
1895d593l0260P0740p672o4819q3281L09187k74766P8586M07975K61378j78697
1884D83778k74293k65782K19060K39555j42102O6194L5707r4040k57419L79444
1874C90102Q2417j97840q5734L04609J23799n2356n71322j74438J18494K97355
$$ y = [599262, 748558, 834890, 867566, 1046412, 1094017, 625720, 600789, 758020, 857152, 648335, 637346, 571552, 532229, 542335, 503295, 653889, 624649, 606430, 755028, 548985, 544359, 250876, -146036, 383784, 672631, 436459, 286561, 550863, 307055, 594256, 339637, 367914, 792028, 787074, 412398, 438243, 566068, 511224, 24916, 173504, 589561, 436062, 336035, 603800, 610495, 283509, 93507, 61765, 132692, -143519, 61779, -3263, -4593, -34853, 35887, 28215, -36604, -119885, 189302, -85464, -6878, 401097, 662475, 483778, 209485, -56297, 162763, 402318, 260216, 326410, 362117, 268077, 10658, 390102, 472519, 274679, 188945, 493554, 617353, 564997, -6325, -180763, -62269, 235086]
1864B35086J16236j80357j08869K9282n2067j74789K78542K89787k6244j50916
1854B55691J41984K5721J71295j3855j10030n97795J6211m5535L21798J09534
1844B75019n992L83104o16556K33300J42993K27510L04174L02526K58075j82496
1834A321657l29661l78432K8855K44889l9200q8912P7264j20397p6823m1505M4335
1823F42070O6531J99937l04642k66781j95867p64687O42460L5322Q3873j20703
1813A7513L91147k68887n59871L69060K34191J29134j86259m16859J17475K80691
1803A07335m1065M01126k62592n05919J38204M20837p9479J33676k8078r5193
1793A88852J11204o7798j41422J42324r7358l07536J07191k24519m76773K35121
$$ y = [235086, 351322, 170965, 62096, 91378, 39311, -135478, 143064, 432851, 406607, 255691, 397675, 423396, 594691, 580836, 470806, -126989, -110778, -156313, 165485, 275019, 269027, 652131, 35575, 268875, 411868, 639378, 943552, 1246078, 1504153, 1321657, 991996, 613564, 642419, 887308, 848108, 759196, 836460, 716063, 639240, 597735, 642070, 708601, 908538, 603896, 337115, 141248, -623439, 19021, 54343, 138216, 17513, 408660, 139773, -420098, -51038, 183153, 312287, 126028, -290831, -173356, 107335, 66270, 467396, 204804, -301115, -162911, 257926, 178447, 312123, 284045, 188852, 300056, 232258, 90836, 233160, 135802, -171734, -64543, -289062, -765835, -530714]
1783e30714O3291K86141L33443K31079k90228J34982J24253n88062J04262n6361
1773a87914n01644q5025J68748j31851L09830J79969m46347M34347J34403R979
1763a15505L04911O3709R0797n474m51513r9495k50970L18891M83262n89153P2143
1752a78397K96708k33291L7887K1853J989J89754r2650P8279L0952j31962O8388
1741H9510j28046o013J97509M6380J90177p5086l05128J08388l48746Q8555Q1105
1730f1395k17619J90399j48275J27067M30877j34569l69052j42683J37277J57781
1720c0192J99713J78643m13482J1983j83831l11022P6337m06049L38010M64506
1710g5384M09606j85767l46683J56307l13374J39601K22276l05268j01593J63108
$$ y = [-530714, -467423, -181282, 152161, 383240, 93012, 227994, 352247, -235815, -131553, -187914, -689558, -774583, -605835, -737686, -427856, -247887, -694234, -259887, -125484, -115505, 189406, 253115, 343912, 338438, -113075, -212570, -463540, -144649, 338613, -250540, -178397, 118311, -114980, -77093, -55240, -53251, 136503, 43853, 122132, 153084, 21122, 89510, -38536, -44549, 152960, 199340, 389517, 314431, 9303, 117691, -231055, -142500, -61395, -279014, -88615, -236890, -109823, 321054, 186485, -182567, -325250, -187973, -30192, 169521, 348164, -65318, -53335, -237166, -548188, -471851, -877900, -539890, -75384, 334222, 148455, -198228, -41921, -355295, -215694, 6582, -298686, -400279, -237171]
1700b37171n6199M30479J03354n7254L62026l82609q14239J51148M16495J4366
1690f9604o3195k59724P6950M25731k65903l7376J3271J57490K452J70399j93488
1679d2997j32780J29180j56959r9812K85208O2035j59828k53922r54k16322J27541
1668d59610N28380R7870j86406o51322j11765J98758L17996k11658j12072N60044
1658b9785R5052k10239K4176N1758J52989j84368k48735k11591j55727L66790
1648c49680M34677r4500j06544L4645l1452k66329L76413j50192q9245L16624
1638G4417j42780j25741L10281j24780k97283N80637q1098j21781j66057j53817
1628b48002Q881J86845o4094J9087K17569j01367k32954m37719Q9996K40731J93967
$$ y = [-237171, -293370, 137109, 240463, 183209, 545235, 162626, -651613, -500465, -83970, -69604, -132799, -392523, -315573, 110158, -155745, -193121, -179850, -22360, -19908, 150491, -42997, -175777, -46597, -203556, -303368, -18160, 43875, -115953, -369875, -370829, -587151, -459610, 68770, 166640, -19766, -671088, -782853, -584095, -266099, -477757, -589829, -29785, 65267, -144972, -120796, -69038, 83951, -100417, -349152, -560743, -716470, -349680, 84997, -9503, -116047, -81402, -112854, -379183, -2770, -152962, -242207, 74417, -68363, -194104, 116177, -8603, -305886, 274751, 193653, 71872, -94185, -248002, -239121, -52276, -116370, -97283, 120286, 18919, -214035, -651754, -561758, -321027, -127060]
1617a27060M93399j96483l71064J3183J125Q5213J75958J29182j42594k43646
1607a82787j02174K27663k00071R7685o5972J23135L09006L15826J55636k49838
1597D28109q27452j37513M04698j5788J14459k2215J53816p1200j67852J1158
1587a29780K5571M9862k58885J55717J39693P254j6308l078K1013M125K28278
1576B23462k74412j33910Q784J17445J05408J81140p9773O6492Q4899j11448O3754
1565B51841J36317q8243q4951M5025j17708k35770L00198j16899k18708J6747
1555a12151p922l36147n43762O51925m6488m4244J72922j62315K91476j42457
1545b79163L3098N12815k68695o27314L04914M19842j29596R7945K4652j47193
$$ y = [-127060, 366339, 169856, -201208, -188025, -186900, -101687, 74271, 203453, 60859, -182787, -284961, -57298, -257369, -159684, -225656, -102521, 206485, 522311, 677947, 428109, -399343, -536856, -132158, -147946, -33487, -55702, 98114, 26914, -140938, -129780, -104209, -54347, -313232, -157515, -17822, -10568, -26876, -29954, -8941, -4816, 223462, -50950, -184860, -176076, -58631, 46777, 227917, 148144, 214636, 299535, 188087, 251841, 388158, 299915, 214964, 259989, 142281, -93489, 206709, 89810, -128898, -112151, -120073, -456220, -999982, -348057, -394545, -438789, -265867, -428182, -136706, -279163, -246065, 266750, -1945, -629259, -324345, 95497, -34099, 63846, 88498, -58695]
1535e8695O0725M15109j97202k06030j0828J24546j50428L14906J71428m24551
1525C8980p7130k21309J93580j46621k78015p4902O54509j70843K4835K71458
1515B14542O5825j62136k86204o9393M2141j08159O2441j47764l8050J34645L4483
1504b57629j59888J22623N74990j23872j71822n80991J03737j28046j40N35308
1494h5730K73107L59981m42542m15770L15515k65630j63400K06845R9245j65628
1484b84007j41020j7556K46891L3704k83168N8807q470L98830j4813M1835M2980
1473G4013l40990M57247J42201L6107j17090j65369j12844J90500M4271j78230
1463B9816J43469k98085k4743o883J37014k48435j24181M80087J99472k40315
$$ y = [-58695, 2030, 417139, 219937, 13907, 3079, 127625, -22803, 292103, 463531, 38980, -38150, -259459, -65879, -212500, -490515, -565417, 89092, -81751, -56916, 214542, 280367, 118231, -167973, -237366, -195225, -303384, -240943, -388707, -426757, -292112, -257629, -417517, -294894, 280096, 156224, -15598, -596589, -492852, -620898, -621038, -85730, 187377, 547358, 104816, -310954, 4561, -261069, -424469, -217624, -118379, -284007, -425027, -442583, -195692, -161988, -445156, -386349, -394819, 4011, -10802, 31033, 74013, -266977, 190270, 332471, 368578, 251488, 86119, -26725, 163775, 208046, 29816, 173285, -124800, -149543, -156426, -19412, -267847, -392028, 88059, 287531, 47216]
1453D7216P830j26792l9658j76070J7235j2974J52830L04636K4120j80613K2841
1442D0601k52722k69170M91473p4149m35095N948M74091l3143K90374j10602k19297
1431i1691J36201l91545n32343M74462N23081j26707j98690q4131K28055J56145
1421I2837l29764k66893k98208M11723L29740j12175l5566J41211J6563K71118
1411B20586j10336j10728o9677K14986j32931m7698J29710l96990K40567j03100
1401a65611P1264J51800k71222J6332M5980J60503m73259P578M41044p1195R7593
1390A0807j35922r2738O8670J26387O6630o1998K22358K16155j58353K58747o8548
1379D52195n44485r7606K41774N2227L07959l11834l45105j20532L25463n1860
$$ y = [47216, 55046, -71746, -111404, -287474, -270239, -283213, -130383, 174253, 198373, 17760, 40601, -212121, -481291, 10182, -63967, -499062, -493114, -19023, -52166, 238208, 127606, -91691, 44510, -347035, -879378, -404916, 118165, -8542, -207232, -291363, -63308, 92837, -236927, -503820, -802028, -390305, -60565, -172740, -208306, -67095, -50532, 220586, 110250, -478, -70155, 144831, 11900, -35798, 93912, -303078, -62511, -165611, -94347, 57453, -213769, -197437, -151457, 9046, -464213, -456635, -15591, -86786, 10807, -125115, -217853, -149183, -22796, 43834, -18164, 204194, 420349, 261996, 520743, 452195, -92290, -189896, 51878, 104105, 412064, 100230, -244875, -365407, -39944, -91804]
1369i1804m97531J97939J07262K53400J09798J88910J97231o60045n62763M73138
1359b84465O72636m3709J15846m12031j95170r2581L63922n7628R8843l2989k92195
1348a59521l010o3577M1435O3650j49451K92437J69311n5608j66164k3773r4370
1337a48641j16999K77195j96440L30758J49845j82647j5224o7388m62334O76160
1327B44285j55274k37248j25396O3709J28517N8659l28038r3720J51318N4966
1317b38222J26368r8106M58056l01478L38792m01408k96456Q0002L13854J99308
1307A80710l99260K24412J22770n87017Q8032L06180l53669j32378K19624J14798
1297b15798j91276M04279j5588j98588O330J70178q0945K63982r8834j97972l26983
$$ y = [-91804, -589335, -391396, -284134, -30734, 79064, 267974, 465205, -194840, -757603, -284465, 388171, 344462, 460308, 48277, -146893, -239474, 124448, 66820, 165663, 132674, -159521, -162531, -226108, -184673, -121023, -270474, 21963, 191274, 135666, -30498, -54271, -148641, -265640, 11555, -184885, 145873, 295718, 113071, 97847, 30459, -431875, 244285, 89011, -148237, -273633, -209924, -81407, -22748, -350786, -444506, -293188, -238222, -111854, -209960, 248096, -53382, 285410, -115998, -412454, -332452, -18598, 180710, -218550, 5862, 128632, -458385, -370353, -64173, -417842, -550220, -330596, -215798, -407074, -2795, -18383, -216971, -210641, -40463, -121408, 142574, 43740, -154232, -481215]
1286d81215J65020K51723m19657J2911J82277J51345J21203l8511p224n32983
1276e95111K50039L49135m61897J59165O1230J1073M1748N44235j61820m32422
1266b34625M8388M92953n8037m53616k61907N50263Q1505k63908J61399P4206
1256A36621m19046O3228K69712l71364j6511J17588k07365Q9088K73140L12893
1246B47984K62505n22353j09596j57390J40876j62743J55591J9871K20178p0491
1236B4432k22336K1690r8010j46344J24472J3329Q8009j11075N05511K13453o17965
1225b04834K8175q4032J44617N61K57144K17902l82924k81840N7270J30005K44839
1214A26883k60042j91535L43435O7588J10258O1054l75250K57437p7990k152k31559
$$ y = [-481215, -316195, -64472, -484129, -471218, -288941, -137596, -16393, -54904, -62128, -595111, -345072, 4063, -457834, -298669, -237439, -226366, -184618, 359617, 197797, -234625, -186237, 306716, 248679, -204937, -466844, 83419, 164924, -98984, 62415, 136621, -282425, -219197, 50515, -320849, -337360, -219772, -427137, -338049, -64909, 247984, 510489, -11864, -121460, -278850, -137974, -300717, -145126, -125255, 94923, 24432, -197904, -176214, -274224, -420568, -296096, -282767, -194758, -305833, 199678, 413131, -204834, -176659, -260691, -116074, -115513, 141631, 359533, -23391, -305231, -247961, -117956, 126883, -133159, -324694, 18741, 86329, 196587, 257641, -117609, 139828, 61838, 59686, -171873]
1203a71873M58593J88774m44510l64346n6171O0649K11112l6953k66611n5102
1193d76438J7643L66849l28303J50804J56454j03911J93895J71086M3484p1306
1183A20257m96516J64626M9216q2988J18345M01488k42557l99751L14648L74048
1173C20816j0641m21161j34286j87722J76546L83749j5666o3263j60702k11941
1163c24271R9294L04415Q6038j77988K51016L37457k24406o23984J75572J59464
1153F2607J01967P770n46048j08933N00869R899O8666j28566J02097k44018m61766
1142f35456M19477M06518O919J55761j45697m70220M1305K09078l46186n3408
1132d11909P333L57885L44421m87111L15286k70898J651N5156q3111k38731L78215
$$ y = [-171873, 286720, 475494, 30984, -333362, -389533, -328884, -117772, -154725, -421336, -476438, -458795, -91946, -420249, -269445, -112991, -216902, -23007, 148079, 191563, 120257, -376259, -211633, -162417, -245405, -127060, 274428, 31871, -367880, -53232, 320816, 310175, -110986, -245272, -432994, -256448, 127301, 111635, 48372, -112330, -324271, -224977, 79438, 165476, -12512, 238504, 575961, 351555, -272429, -96857, 62607, 164574, 172344, -373704, -482637, 18232, 28131, 96797, -31769, 70328, -173690, -635456, -215979, 190539, 197458, 353219, 207522, -262698, -221393, -12315, -358501, -411909, -404576, -46691, 297730, -189381, 125905, -144993, -143342, -88186, -171297, -410028, -31813]
1121c1813j2002j76129J56279l2134q609p849O9702l48876N2319k0752K73552
1110h6312Q8586j20199J03201J886r157j32158j999L74758L4420j90297p7417
1099a4688J32730k68046L184K79174J882l56763J97202O3397j89724J10820J53120
1088A12288L48062j26892M1524q9391n817p8403j99533q1962k78906k14630J12443
1077d61217L23355l41374k52896M28707J40224R5260k90578J69440J56770m7164
1067g9473j18982J44331L39443J85722k58935o49210L9109J69264m9787P4502
1057b04016L96365j8618l15498J26327J18148l90402j8358N6356N0689J46979
1047e2028j59236L05305J55229k01600m33157J2698L54539M25824l79811m89080
$$ y = [-31813, -43815, -219944, -63665, -95799, -104408, -112257, -42555, -391431, -339112, -359864, -86312, 2274, -117925, -14724, -12838, -21995, -154153, -156152, 218606, 253026, 62729, -14688, 118042, -150004, -146820, 132354, 134236, -222527, -25325, 38072, -151652, -40832, 112288, 460350, 333458, 374982, 285591, 279774, 201371, 1838, -80124, -359030, -573660, -461217, -137862, -479236, -732132, -303425, -163201, -67941, -358519, -189079, -32309, -79473, -198455, -54124, 285319, 471041, 212106, -437104, -397995, -228731, -278518, -204016, 192349, 173731, -141767, -15440, 102708, -287694, -306052, -249696, -199007, -52028, -211264, 94041, 249270, 47670, -385487, -372789, -18250, 407574, 27763, -461317]
1037d61317L31641L16905J3213j07963j46992P7460m46238j29151M55344l43601
1027d40699K49652O62188j45403j18698K93659n18558m06966J31969K32077R5387
1017C4608l5790N077k8474j08229j06618j85383Q6473K27822P8858j80268L22485
1006A10561J81434o1347k97710j30923m25370J73279M80634m00857J72600Q5966
996a11733k96114J35141k11052L66315J88128j70232J17719o4497L30969M00513
986F85157m16058k79580n09166L52084P3461M0962M99481p02444l84319N70266
976g0156M18434j29319j68346N5692N4148j81653O3883N7154M3493j73495k9239
965e9404O3170O1133k23412J13026n9721M6358k89403J78843J67146j45504r9412
$$ y = [-461317, -129676, 187229, 200442, 92479, -54513, 22947, -423291, -552442, -97098, -440699, -191047, 471141, 325738, 207040, 500699, -17859, -424825, -292856, -60779, 34608, -1182, 3895, -24579, -132808, -239426, -424809, -338336, -110514, -31656, -211924, 110561, 291995, 230648, -67062, -197985, -623355, -450076, 30558, -370299, -197699, -111733, -407847, -272706, -483758, -117443, 70685, -99547, 18172, -46325, 284644, 685157, 269099, -10481, -519647, -167563, -94102, -53140, 446341, -256103, -640422, -70156, 348278, 218959, 50613, 106305, 160453, -21200, 42683, 99837, 143330, -30165, -59404, 3766, 64899, -158513, -45487, -105208, -58850, -348253, -169410, -2264, -147768, -247180]
954b47180M6999k11173M8667K55017j97661j07151p635l4175N5149O8736L02019
943b8388k17297J10348k6111q0828p980k44248L78522O5713Q8880J50768k10151
932b0772K29778k6142m3472j8228m66275J13571K14744k82061J75826M79644l70850
921a4237m6120K53727j33516J91842j598L4126q8488j25407l63918J52099r3086
910b34576L74111J6780J41740k36149j27951K103l610O81728j75691j72295J54668
899D20858J69961K1948n6952m78660r6930Q9828M67575m07988J63906m4778m4681
888B04087q0170j0566K0662L29178n16899N2871k2789k5036O8279l8863N1157
877C1911l07253K2976L4822J88422Q5055k20888K79454q7722q3139K75126l01184
$$ y = [-247180, -200181, -411354, -362687, -107670, -305331, -412482, -420117, -454292, -399143, -330407, -28388, -245685, -135337, -161448, -242276, -250256, -494504, -115982, -50269, 38611, 189379, -20772, 209006, 182864, 139392, 121164, -345111, -231540, -16796, -298857, -123031, 356613, -14237, -60357, 193370, 59854, 251696, 250098, 284224, 195736, 70329, -293589, -141490, -234576, 139535, 156315, 298055, 61906, -66045, -63942, -67552, 614176, 438485, 266190, 420858, 590819, 612767, 555815, 77155, -19775, 70053, 537628, 129640, 293546, 248768, 204087, 123917, 113351, 134013, 463191, -53708, -837, -23626, -48662, 19617, -19246, 31911, -275342, -252366, -217544, -29122, 55933, -164955, 114499, 26777, -56362, 218764, -82420]
866h2420L02891m1899m64107K60605M95481q6963m69704J992l5427j83214K17414
855h5351j03144N238k9229l2901M54704r9718m0460l36005R6525J82394l47580
844c35527N925N20121R5390l49632J36467m3316j6135k40227J16154J49013R9660
833A37893o44786K42073K04638k13064j44567K94899N3387r5790j97593j03869
823d66779J70610J8379L6128J69940J83327J28153K86154j96928J35082m47890
813A6176K51932k63476o5335M22878j44652m01296j38436J91909k96224M62360
803C5836j5979J62607k84895j21531J47352J33760Q7586R9518K02969k74307k86040
792a13124J12663K53676k43373j56663K1622j08847L15311K81468j00985j66769
$$ y = [-82420, 220471, 178572, -285535, -24930, 470551, 383588, -86116, -84124, -119551, -302765, -85351, -188495, -183257, -212486, -245387, 209317, 109599, 69139, -266866, -170341, 12053, -335527, -329602, 190519, 285909, -63723, 72744, 29428, 13293, -226934, -110780, 38233, 137893, -506893, -264820, -60182, -273246, -417813, -122914, -69527, -165317, -362910, -466779, -296169, -277790, -241662, -71722, 111605, 239758, 525912, 328984, 464066, 16176, 268108, 4632, -60703, 362175, 217523, -183773, -322209, -130300, -426524, 35836, 19857, 182464, -102431, -223962, -76610, 57150, 144736, 244254, 447223, 172916, -113124, -461, 253215, 9842, -146821, -125199, -234046, 81265, 362733, 261748, 94979]
782I4979l81530k47630M69389j55690R0616n7224k13532j1728P7655K1559j70666
771d83802J46727K0816M46393j43947J29687K3376l11046K0005j58657j40661
761d51109R7943L0593L19048r1851k37224K0578K28285L70106j03732N0011J13081
750C45729j02009q8518L27925j92551j94925O7725j05048m2482L64910l2L3555
739D14279l23928k40913M81116l80437k8343K33912K59767j75025J69479l93955
729A5952j98106O5296J83564n6530M76090O9634l31424n7681R2273k11578K37810
718B85300M1168p0504M8318l67491k9403J14956q4127K17111M40558n05290J04597
707A95193l98513p7475M10847O0873L35319J18997j52309l44766j54949M30807
$$ y = [94979, -286551, -534181, -64792, -220482, -129866, -187090, -400622, -412350, -334695, -313136, -483802, -337075, -316259, 130134, -13813, 115874, 139250, -171796, -151791, -310448, -451109, -353166, -322573, -3525, -95376, -332600, -312022, -83737, 286369, 182637, 232648, 345729, 243720, 155202, 483127, 290576, 95651, 163376, 58328, 15846, 380756, 380724, 414279, 90351, -150562, 330554, -49883, -78226, 155686, 415453, 240428, 409907, 15952, -182154, -116858, 66706, 10176, 486266, 555900, 224476, 166795, 259068, 47490, 285300, 326468, 255964, 304282, -63209, -92612, 22344, -61783, 155328, 595886, 90596, 195193, -203320, -280795, 130052, 190925, 526244, 645241, 492932, 148166, -6783, 424024]
697D24024j97184J3881k33313K07038l5006n9739j16249r1899Q9234J82763j97292
686a3742K91128k5192k66868k26628M63141M67515m78802j64036k8632R3480j57651
675d6287K21034m46223K5947j40644J60927J37241o6958J60453k82225K17986
665e8749j35180O6083L94549q5646l52676J01929o0053J01559q6760q5403N32726
654C32379j45949j72046l38000L093j19683K6790J78496p6177L94934N78326l4190
643F27973j80643r3724K02402R5474m18197l47705k33741K59042L13537o5304
633A59114n8850j6196R6081J0336k52013J39782j34791o1830J55607m6805p2064
622h1629j680j63972l80613L59442L14101J63013k64392K11953J62386l94117
$$ y = [424024, 226840, 240721, 7408, 214446, 179440, 119701, 3452, -88447, 787, 183550, -13742, 277386, 252194, -14674, -241302, 221839, 689354, 210552, 46516, 17884, 111364, -46287, 174747, -271476, -245529, -386173, -225246, -88005, -154963, 5490, -276735, -58749, -193929, -127846, 266703, 181057, -171619, -69690, -129743, -28184, -114944, -200347, 332379, 186430, 14384, -323616, -320523, -440206, -413416, -234920, -311097, 83837, 662163, 627973, 447330, 353606, 556008, 651482, 233285, -114420, -348161, -89119, 224418, 159114, 100264, 84068, 180149, 190485, -61528, 78254, -56537, -118367, 37240, -9565, -81629, -83309, -247281, -627894, -268452, 45649, 208662, -55730, 156223, 318609, -75508]
612g5508p8907M0336k971J89261l435l35394P4611L34524o5130l5641j76651j60055
600b94960K46476n1061P8224L22897R8931n65849N5996L8605k193M56499r856
589C73709O9571k60900l2962O2884J32825m46467k62400O44482Q563l55379K61961
578A95887L23376n2224k68272l72537k83432j84213L30287k19136j02803J55180
568d77887M17867j88475k18639J91791O1962j20858M50884j98396l27409L06640
558a02520j89588j07088J83922K59888l0069M36079k94369k51007K28185p2586
548F0847K4774k0816K48279j00805j23229k28328j68421K47106K23146k20527
538e7974m31959l5906K95918K51856K01890L24850j91926k46666K71182j20281
$$ y = [-75508, -154415, -114079, -117050, 72211, 68776, -266618, -192007, 142517, 77387, 41746, -134905, -294960, -48484, -99545, -21321, 301576, 400507, -165342, -109346, -70741, -72934, 383565, 373709, 443280, 182380, 149418, 212302, 345127, -101340, -363740, 280742, 289305, -66074, 195887, 519263, 467039, 198767, -173770, -457202, -641415, -311128, -530264, -633067, -477887, -60020, -248495, -467134, -275343, -213381, -334239, 116645, -81751, -409160, -102520, -292108, -399196, -215274, 44614, 14545, 450624, 156255, -94752, 133433, 60847, 85621, 64805, 313084, 212279, 89050, -139278, -307699, -60593, 162553, -57974, -489933, -525839, -229921, 21935, 223825, 548675, 356749, 110083, 381265, 260984]
528B60984M3750l95514K17543K32573l72303P3519j86293J27434p6392M04962
518C30263J84790Q2003O8441N1085k51578j40343Q7779k17059L3360L952j52487
507H0206L79280K67893J49168k96772k98808m4561K52677L4789l67696r2844j03146
496c9814p1540M25584J93196m23837l06627k69248L03058K32818r8835K41649
486A86404k88943k49938K84585M17150J86018Q8278l8394j83943l29810o13698
476e42291K77898N9149P4859L74856K30883l5143l71867j68827L47617l77287
466a30153k52787O02870J61521j02292J67241K0380k39574k44010R9963j16955
456c3796n516L12560j2883k29290J58811J60072j00359j42075m25888l85061K64559
$$ y = [260984, 304734, -90780, 126763, 359336, -12967, 60552, -125741, 1693, -74699, 330263, 515053, 597056, 665497, 716582, 465004, 324661, 412440, 195381, 228741, 232693, 80206, 459486, 727379, 876547, 579775, 280967, 236406, 489083, 523872, 156176, 63332, -39814, -111354, 314230, 507426, 83589, -223038, -492286, -189228, 43590, -55245, 186404, -102539, -352477, -67892, 349258, 535276, 623554, 585160, 401217, 71407, -542291, -264393, -205244, -130385, 244471, 475354, 440211, 68344, -100483, 247134, -130153, -382940, 219930, 381451, 279159, 446400, 466780, 227206, -16804, 83159, -33796, -39312, 273248, 260365, 31075, 189886, 349958, 249599, 107524, -318364, -703425, -438866]
445d38866L23678k5790O1078j05545J20755m3471o5511N16270m52988l5044J56148
434A0714k38008M2743j09785J10062K24582o0080K88504K133m5569j52108k17619
423a44431J64012j67768J3954J57079J06422j13682o3800j43697J87579J78828
413A74496J52497n06823K86568j13214j84219K50622K20899Q6615k07691O0130
403B19880l55466K5846J49792K5487j52303j49300J92112N36635q4673j18931
393B89079M9359k66367k91711l159K00857L45874n9080k15871r9473q6139O2883
382g3748p5810J09805m8641L3437J71353K98213j45112K66048j0729l26304J62128
371C60640j86907K59598N5491l92794R6468k01289L3009M79833l31453m43401
$$ y = [-438866, -115188, -140978, -79900, -185445, -64690, -108161, -173672, 342598, -110390, -145434, 10714, -227294, -184551, -294336, -184274, 40308, -19772, 268732, 270865, 225296, 73188, -144431, 19581, -148187, -134233, 22846, 129268, 15586, -48214, -191911, -4332, 174496, 326993, -179830, 106738, -6476, -190695, 59927, 280826, 367441, 159750, 219880, -135586, -109740, 40052, 65539, -86764, -236064, -43952, 492683, 408010, 289079, 338438, 72071, -219640, -222799, -21942, 323932, 264852, 48981, -50492, -136631, -73748, -149558, -39753, -88394, -54957, 116396, 414609, 269497, 535545, 524816, 198512, 360640, 173733, 433331, 488822, 96028, 192496, -8793, 24216, 504049, 172596, -270805]
361b70805J78526l9270K51959M01224M97295l37505m80094n770k28737J62318
351A29141q4847J23520M7349M5658q6618m5479J2681J56010k89354J04824L67576
340D80461m86589K90429j56792k24045k03009M39671K02025m29609K40593K5392
330A78527J40230p8853j61562J42883j43812J9027l7461j47536N4012k8557M96406
319D33304k76942k13679j53947P2346K8611J41455K85318n21873l59384m1511
309f06302J49599K65361O6661K66102j12278l27437j499M37723l26807Q4399N01062
298C96584j42754J46838m0442j26262k44270M29068K73964k41065l15224k4134
288A12303k44255j1535o5957j20784N18491L50720q9504l91676r3365p3642L23675
$$ y = [-270805, -92279, -131549, 120410, 521634, 1018929, 681424, 201330, 195560, -33177, 129141, 44294, 167814, 215163, 260821, 174203, 128724, 141405, 297415, 8061, 112885, 480461, -6128, 284301, 127509, -96536, -299545, 140126, 342151, -87458, 153135, 178527, 318757, 239904, 78342, 221225, 77413, 96440, 58979, -88557, -34545, -63102, 433304, 156362, -57317, -211264, -138918, -110307, 31148, 316466, -205407, -564791, -606302, -456703, -191342, -124681, 141421, 29143, -298294, -299793, 137930, -188877, -104478, 396584, 253830, 400668, 360226, 233964, -10306, 418762, 692726, 451661, 136437, 112303, -131952, -143487, -209444, -330228, 188263, 538983, 449479, 57803, -35562, -109204, 214471]
277B14471K03082l58189J1847j37398J48853K92292j52156j10875k58887L96645
267B49685J53007J64670k34089k76963L02714n6851J15657m5706l53862k67438
257b49176K60111k45925L25391l65094J02721L55309k20013L71219K18574m72194
247H0923j6843K89013l78686K7698L19706Q4007k46296k21342J5173K09493K3208
236A86054Q9029q4669P6656L6101J33623k30132m25987j99859K76665j73889L45112
225B8704J932L65251m09572l84731M38432J52300L41998m15321l76330K32814
215b4523L39480k75657J29413l24598K17390J25998J57933J58497j90141k15964
205I7828j74719M241K72597k58946J52173J97058J12431p9890k19114K00630o3128
$$ y = [214471, 417553, 59364, 71211, -66187, 82666, 374958, 222802, 111927, -146960, 249685, 402692, 567362, 333273, 56310, 359024, 302173, 417830, 372124, 18262, -249176, 10935, -234990, 90401, -274693, -171972, 183337, -36676, 334543, 553117, 80923, 64080, 353093, -25593, 2105, 321811, 405818, 159522, -61820, -46647, 162846, 186054, 275083, 190414, 267070, 303171, 436794, 206662, -219325, -419184, -142519, -316408, 28704, 30636, 395887, -13685, -398416, 40016, 192316, 534314, 118993, -257337, -24523, 314957, 39300, 168713, -155885, 61505, 187503, 345436, 503933, 313792, 97828, -76891, -72650, 199947, -58999, 93174, 290232, 402663, 322773, 103659, 304289, 241161]
194B41161P2406k28864K99125n9053k16446k93272Q3929m8624J70817M70079j64526
183C26732r2079k4962j22686K675Q7932j63311j20401l9505M6624M71172R9508
172D71699l09802Q9308p2886j54520O4931M0667J34400K7887n6406J1073J0134
161B56485O6199l75637j45228K65643N6689j42211J32206k6135N8355N2441j77769
150B1038j60966j70269J26456l6959L02222j24936k0190L86234p2211J94115r4517
139C50017k84008P8842K2676j5915P3665k18149q9381K31730L2884j42701p9892
128d0232J89206L22906k16210k37819l45782J23705n1291O3729J64238K56518
118B28968L703l80313J52526l7101K23759K48893l82005Q3152L6492j6004j10178
$$ y = [241161, 313567, 84703, 383828, 324775, 108329, -184943, -101014, -149638, 21179, 491258, 326732, 234653, 209691, 87005, 89680, 177612, 14301, -106100, -145605, -98981, 372191, 471699, 161897, 251205, 178319, 23799, 88730, 129397, 263797, 291684, 235278, 246351, 256485, 322684, -52953, -198181, 67462, 124151, -18060, 114146, 88011, 146366, 198807, 21038, -139928, -310197, -183741, -220700, 81522, -43414, -63604, 322630, 250419, 444534, 350017, 66009, 144851, 167527, 151612, 225277, 7128, -82253, 149477, 182361, 39660, -40232, 148974, 471880, 255670, 17851, -327931, -204226, -255517, -191788, -27550, 228968, 232671, -147642, 4884, -32217, 191542, 440435, 58430, 141582, 178074, 162070, 51892]
107E1892j66225P4251P5652L9896p1939L52159j66265P995k33400J04058L1511
96I9585J56035J90497l91815j03914n6999K32439J86552J25546j09997j96774
86A31155j33777O249J51877O7163j10809j50805L17702J67935J2410r454J1916
75D61562j69203k11927J20532k36520L0651J61822j05873j96431J55424K2024
65C2061J86960k14010J10158R4667j71583M8116K19986r7584j01413L41670m41589
54G439j63230m5263m194K60629K71606k83673K68058r3058j70397K66904n53172
43b38351J02814L40158j06408q199J34456J45331j99303J16664k39970L65536
33D12728m8988k77408K30569j46612k93222q6806L80151L7947l60011J43617r9769
$$ y = [51892, -114333, -40082, 35570, 75466, 3527, 355686, 189421, 197416, -35984, 68074, 99585, 255620, 446117, 54302, -49612, -106611, 125828, 312380, 437926, 327929, 131155, -2622, 3627, 155504, 222667, 111858, -38947, 278755, 446690, 459100, 449646, 461562, 292359, 80432, 200964, -35556, -4905, 156917, 51044, -145387, 10037, 32061, 219021, 5011, 115169, 209836, 38253, 86369, 306355, 208771, 107358, 449028, 7439, -155791, -201054, -205248, 55381, 326987, 43314, 311372, 218314, 47917, 314821, -238351, -135537, 204621, 98213, 90014, 224470, 369801, 170498, 287162, 47192, 412728, 363740, 86332, 316901, 170289, -122933, -209739, 170412, 208359, -151652, -8035, -107804]
22a07804j07942L46377N1525k04381K5934k3083j18588j02748K74915J09588N9158
11B02951j35993K06026J17020j16192k45143M0093K41523k05627q3133K25341
1B46866J91814
0D38680
$$ y = [-107804, -215746, 130631, 182156, -22225, 3709, -19374, -137962, -240710, 34205, 143793, 202951, 66958, 272984, 390004, 273812, 28669, 68762, 310285, 104658, 21525, 246866, 438680]
$$ Imaginary data points
##PAGE= N=2
##DATA TABLE= (X++(I..I)), XYDATA
16383b225325K02533J45505j23200M2140j14743K38147Q5142j95500l4334J3405
16373a966230P6278K562J30929K75542j45398l60763j07599O2282m5450K07755
16363a870092M57049O7156J08848k49591J11651N7585m7921J29064o5809J84641
16353a117419J0266p1843p4404P0931O8585L2497J754k45153J04551O7902K19578
16342i32755P0731k29013j87998K86983K32932j93852L13073n0088k11289l8640
16332i39916J8743K80197P874J13041J17586K81958k90532j47967j6495k07777
16322g83288J8167K22404p579L45473k22406k64650J38265J22066L61412j37989
16312b08125J42661j51372j78874O8508J19342O0128J51868J34347j78902l3402
$$ y = [-2225325, -2022792, -1877287, -2000487, -1958347, -2073090, -1834943, -1749801, -1945301, -1979635, -1966230, -1889952, -1887390, -1756461, -1480919, -1626317, -1987080, -2094679, -2032397, -2077847, -1870092, -1413043, -1345887, -1237039, -1486630, -1374979, -1317394, -1365315, -1236251, -1302060, -1117419, -1107153, -1178996, -1253400, -1182469, -1113884, -1081387, -1079633, -1324786, -1220235, -1152333, -932755, -862024, -1091037, -1279035, -992052, -759120, -952972, -639899, -689987, -901276, -939916, -921173, -640976, -633102, -520061, -402475, -120517, -411049, -559016, -575511, -783288, -765121, -542717, -550296, -204823, -427229, -691879, -553614, -431548, -70136, -208125, -65464, -216836, -395710, -327202, -207860, -147732, 4136, 138483, -40419, -73821]
16302g3821q5589p3833K93345p5184M52777J54653j40121k06577k6369l3987j59914
16291B5380K2824J60939J15595j61317K6129j16028J54148j55836J21515J77856
16281C71205Q9287J83631j42875j22899J3951j190k01215J41626M01411k2395
16271G10537J85027k8952J35623j10146j66451p0873r6985n15573K22050K24008
16261D88265J781M9387Q1623O95859j25672k68183j06183J0755K29106r9K9401
$$ y = [-73821, -159410, -233243, 60102, -15082, 437695, 592348, 452227, 245650, 219281, 185294, 25380, 48204, 209143, 324738, 163421, 189550, 73522, 227670, 71834, 193349, 371205, 460492, 644123, 501248, 378349, 392300, 391110, 189895, 331521, 732932, 710537, 895564, 866612, 1002235, 892089, 725638, 654765, 557780, 42207, 264257, 488265, 490046, 539433, 621056, 1316915, 1191243, 923060, 816877, 827632, 1056738, 1056639, 1086040]
$$ [...]
##END NTUPLES=NMR SPECTRUM
##END=
