##TITLE=1H_CG-1177a
 CDCl3
 8 sc, 
 27.10.2023
##JCAMPDX= 6.0         $$ Bruker NMR JCAMP-DX V2.0
##DATA TYPE= NMR SPECTRUM
##DATA CLASS= NTUPLES
##ORIGIN= UXNMR, Bruker Analytische Messtechnik GmbH
##OWNER= root
$$ XWIN-NMR		Version 3.5
$$ Fri Oct 27 15:54:28 2023 Russian Standard Time (UT+4h)  she@DPX200
##.OBSERVE FREQUENCY= 200.13135
##.OBSERVE NUCLEUS= ^1H
##.ACQUISITION MODE= SIMULTANEOUS
##.ACQUISITION SCHEME= undefined
##.AVERAGES= 8
##.DIGITISER RES= 18
##SPECTROMETER/DATA SYSTEM= spect
##.PULSE SEQUENCE= zg30
##.SOLVENT NAME= CDCl3
##.SHIFT REFERENCE= (INTERNAL, CDCl3, 0, 15.7414)
##AUDIT TRAIL= $$ (NUMBER, WHEN, WHO, WHERE, WHAT)
$$ ##TITLE= Audit trail, XWIN-NMR		Version 3.5
$$ ##JCAMPDX= 5.01
$$ ##ORIGIN= Bruker BioSpin GmbH
$$ ##OWNER= she
$$ F:/spectra/data/she/nmr/H-F/1/pdata/1/auditp.txt
$$ ##AUDIT TRAIL=  $$ (NUMBER, WHEN, WHO, WHERE, WHAT)
(   1,<2023-10-27 15:53:21.90 +0400>,<she>,<DPX200>,
      <created by zg, POWCHK disabled, PULCHK disabled
       configuration hash MD5:
       00 E9 B6 7A A2 85 ED C7 34 08 36 98 17 FE 4E 26
       data hash MD5: 16K
       DC 47 EC B5 F9 55 60 20 E4 97 84 8D 8A 22 B1 4A>)
(   2,<2023-10-27 15:53:25.62 +0400>,<she>,<DPX200>,
      <Start of raw data processing
       efp BC_mod = 2 LB = 0.24 FT_mod = 6 PKNL = 1 PHC0 = -23946.84 PHC1 = 7.252732 SI = 16K 
       data hash MD5: 16K
       6A 2B E7 FF C2 44 77 E0 CD 2A D8 FE AE 46 17 E8>)
(   3,<2023-10-27 15:53:44.68 +0400>,<she>,<DPX200>,
      <pk PHC0 = 76.28541 PHC1 = 3.4 
       data hash MD5: 16K
       A5 DB 8E F0 8F 98 06 46 5C 59 84 BF 66 2E 71 EB>)
(   4,<2023-10-27 15:53:47.87 +0400>,<she>,<DPX200>,
      <abs ABSG = 5 
       data hash MD5: 16K
       1B 1A 73 95 BB 84 A5 65 84 F5 6F BF 12 AC FC 0C>)
$$ ##END=
$$ 
$$ hash MD5
$$ 18 C9 53 48 3F 84 05 B7 CF 3B 25 C3 78 A8 BB BC
##$RELAX= 
##$RELAX= 
##$RELAX= 
##$RELAX= 
##$RELAX= 
##$RELAX= 
$$ Bruker specific parameters
$$ --------------------------
##$DU= <F:/spectra>
##$EXPNO= 1
##$NAME= <H-F>
##$PROCNO= 1
##$TYPE= <nmr>
##$USER= <she>
##$AMP= (0..31)
100 100 100 100 100 100 100 100 100 100 100 100 100 100 100 100 100 100 
100 100 100 100 100 100 100 100 100 100 100 100 100 100 
##$AQSEQ= 0
##$AQ_mod= 1
##$AUNM= <au_zg>
##$AUTOPOS= <>
##$BF1= 200.13
##$BF2= 200.13
##$BF3= 200.13
##$BF4= 200.13
##$BF5= 200.13
##$BF6= 200.13
##$BF7= 200.13
##$BF8= 200.13
##$BYTORDA= 1
##$CFDGTYP= 0
##$CFRGTYP= 5
##$CHEMSTR= <none>
##$CNST= (0..31)
1 1 145 1 1 1 1 1 1 1 1 1 1 1 1 1 1 1 1 1 1 1 1 1 1 1 1 1 1 1 1 1 
##$CPDPRG= <>
##$CPDPRG1= <>
##$CPDPRG2= <>
##$CPDPRG3= <>
##$CPDPRG4= <mlev>
##$CPDPRG5= <mlev>
##$CPDPRG6= <mlev>
##$CPDPRG7= <mlev>
##$CPDPRG8= <mlev>
##$CPDPRGB= <>
##$CPDPRGT= <>
##$D= (0..31)
0 1.2 0 0 0 0 0 0 0 0.06 0 0.03 0 0 0 0 0.0002 0 0 0 0 0 0 0 0 0 0 0 0 
0 0 0 
##$DATE= 1698407601
##$DBL= (0..7)
120 120 120 120 120 120 120 120 
##$DBP= (0..7)
150 150 150 150 150 150 150 150 
##$DBP07= 0
##$DBPNAM0= <>
##$DBPNAM1= <>
##$DBPNAM2= <>
##$DBPNAM3= <>
##$DBPNAM4= <>
$$ [...]
##$SUBNAM3= <"">
##$SUBNAM4= <"">
##$SUBNAM5= <"">
##$SUBNAM6= <"">
##$SUBNAM7= <"">
##$SUBNAM8= <"">
##$SUBNAM9= <"">
##$SW= 18.05172834244
##$SWIBOX= (0..15)
0 0 2 0 0 0 0 0 0 0 0 0 0 0 0 0 
##$SW_h= 3612.71676300578
##$TD= 16384
##$TD0= 1
##$TE= 0
##$TE2= 300
##$TE3= 300
##$TEG= 300
##$TL= (0..7)
0 120 120 120 120 120 120 120 
##$TP= (0..7)
150 150 150 150 150 150 150 150 
##$TP07= 0
##$TPNAME0= <>
##$TPNAME1= <>
##$TPNAME2= <>
##$TPNAME3= <>
##$TPNAME4= <>
##$TPNAME5= <>
##$TPNAME6= <>
##$TPNAME7= <>
##$TPOAL= (0..7)
0.5 0.5 0.5 0.5 0.5 0.5 0.5 0.5 
##$TPOFFS= (0..7)
0 0 0 0 0 0 0 0 
##$TUNHIN= 0
##$TUNHOUT= 0
##$TUNXOUT= 0
##$USERA1= <user>
##$USERA2= <user>
##$USERA3= <user>
##$USERA4= <user>
##$USERA5= <user>
##$V9= 5
##$VALIST= <valist>
##$VCLIST= <CCCCCCCCCCCCCCC>
##$VD= 0
##$VDLIST= <DDDDDDDDDDDDDDD>
##$VPLIST= <PPPPPPPPPPPPPPP>
##$VTLIST= <TTTTTTTTTTTTTTT>
##$WBST= 1024
##$WBSW= 4
##$XGAIN= (0..3)
0 0 0 0 
##$XL= 0
##$YL= 0
##$YMAX_a= 334679
##$YMIN_a= -494605
##$ZGOPTNS= <>
##$ZL1= 120
##$ZL2= 120
##$ZL3= 120
##$ZL4= 120
##$ABSF1= 15.93419
##$ABSF2= -2.117663
##$ABSG= 5
##$ABSL= 3
##$ALPHA= 0
##$AQORDER= 0
##$ASSFAC= 0
##$ASSFACI= 0
##$ASSFACX= 0
##$ASSWID= 0
##$AUNMP= <proc_1d>
##$AZFE= 0.1
##$AZFW= 0.1
##$BCFW= 0
##$BC_mod= 2
##$BYTORDP= 0
##$COROFFS= 0
##$CY= -3
##$DATMOD= 1
##$DC= 0
##$DFILT= <>
##$DTYPP= 0
##$F1P= 0
##$F2P= 0
##$FCOR= 1
##$FTSIZE= 16384
##$FT_mod= 6
##$GAMMA= 0
##$GB= 0
##$INTBC= 1
##$INTSCL= 3.70164e-10
##$ISEN= 128
##$LB= 0.24
##$LEV0= 0
##$LPBIN= 0
##$MAXI= 10000
##$MC2= 0
##$MEAN= 0
##$ME_mod= 0
##$MI= 1.114404
##$NCOEF= 0
##$NC_proc= -6
##$NLEV= 6
##$NOISF1= 3.799351
##$NOISF2= 2.8
##$NSP= 0
##$NTH_PI= 0
##$NZP= 0
##$OFFSET= 15.74138
##$PC= 1
##$PHC0= -23870.55
##$PHC1= 10.65273
##$PH_mod= 1
##$PKNL= yes
##$PPARMOD= 0
##$PSCAL= 0
##$PSIGN= 0
##$REVERSE= no
##$SF= 200.130006035066
##$SI= 16384
##$SIGF1= 3
##$SIGF2= 2
##$SINO= 5.538805
##$SIOLD= 16384
##$SREGLST= <1H.CDCl3>
##$SSB= 0
##$STSI= 16384
##$STSR= 0
##$SW_p= 3612.71676300578
##$SYMM= 0
##$S_DEV= 0
##$TDeff= 16384
##$TDoff= 0
##$TI= <>
##$TILT= no
##$TM1= 0
##$TM2= 0
##$TOPLEV= 0
##$USERP1= <user>
##$USERP2= <user>
##$USERP3= <user>
##$USERP4= <user>
##$USERP5= <user>
##$WDW= 1
##$XDIM= 16384
##$YMAX_p= 413015385
##$YMIN_p= -299797
$$ End of Bruker specific parameters
$$ ---------------------------------
##NTUPLES= NMR SPECTRUM
##VAR_NAME=  FREQUENCY,     SPECTRUM/REAL,   SPECTRUM/IMAG
##SYMBOL=    X,             R,               I
##VAR_TYPE=  INDEPENDENT,   DEPENDENT,       DEPENDENT
##VAR_FORM=  AFFN,          ASDF,            ASDF
##VAR_DIM=   16384,         16384,           16384
##UNITS=     HZ,            ARBITRARY UNITS, ARBITRARY UNITS
##FACTOR=    0.220516191357247, 1,           1
##FIRST=     3150.32242193699, 0,            0
##LAST=      -462.394341068793, 0,           0
##MIN=       -462.394341068793, -299797,     0
##MAX=       3150.32242193699, 413015385,    0
$$ Real data points
##PAGE= N=1
##DATA TABLE= (X++(R..R)), XYDATA
$$ [...]
8095 -27946 -55678 -96201 -91320 78783 -127668 -120584 23226 115148 14309 -94028 -26921
8084 -26921 67605 14166 -7811 -137643 66908 38184 -64226 -32163 -135600 37829 -5928
8073 -5928 -66954 -39157 -81711 -52702 -26886 -119394 -39850 -147526 -61726 -50015 -95358 -40149
8061 -40149 -73088 28923 -93481 -141005 -25006 10607 19411 -55414 39634 109245 35127
8050 35127 66659 57337 73728 8721 -91302 -99041 -12003 -12972 -111323 -125002 -77399 -197401
8038 -197401 -213764 -233149 -184366 -214716 -224789 -76605 -117212 -179709 -165855 -63216 -115293
8027 -115293 -56851 -14200 2243 -37397 -91074 1669 81785 76262 -37889 -83345 -119576 -50282
8015 -50282 -174343 21282 25116 46533 -10601 103130 144194 -22793 -100557 -130866 -1045
8004 -1045 -174396 -121483 -62582 -25165 -101302 -96267 -23444 -125267 -71937 -31344 64915 -24119
7992 -24119 -140173 -70235 31050 -20475 -84369 -86755 -118608 -171619 -122887 -42417 -13242 -41874
7980 -41874 -13213 35265 81617 -105969 -129727 -65141 -125282 -53802 -58279 7436 5356 -96682
7968 -96682 -875 -32856 -205296 -163705 -177323 31976 12492 -122173 28380 -32713 48551
7957 48551 10472 -70274 57709 -165476 -34028 -35700 -80120 35564 -82492 -90838 -87083
7946 -87083 -92438 81705 -67249 5663 -112605 -82620 -30547 -181130 -26718 19846 -77360
7935 -77360 22582 -95413 -106842 -108693 -14315 120522 -91921 -55255 69360 103899 57396
7924 57396 3430 100471 45772 -54350 -58419 -79397 -68181 -12177 -4319 -73359 -45484 -71062
7912 -71062 -184794 -104476 -63885 -37380 63250 120145 169514 57860 3478 -32653 -47897
7901 -47897 -62658 -49007 -45573 -92281 -151023 -91518 -75248 -33554 33785 -4190 -34417 87787
7889 87787 -546 46466 59258 61882 97118 52199 64422 -55480 22172 120989 19617 69594
7877 69594 63571 44168 169620 31400 -10351 -56826 -91796 90035 19007 49012 74312
7866 74312 82236 -32590 -115940 -90389 -44099 -118922 -40764 -74724 -108128 -6470 12082 4663
7854 4663 -90950 -180187 -218299 -209983 -89419 -117869 -200337 -117171 -159026 -69052 12012 -33929
7842 -33929 -49932 -194262 -176416 -198943 -206029 -90135 -195383 -208208 -96494 -182756 -82891
7831 -82891 -109126 -125608 -27107 -194416 -88088 -24439 -33421 29017 -100309 -123463 -92829
7820 -92829 -105089 -162376 -156745 -51730 -148723 -127634 -68475 -182517 -176512 -27982 69750 48118
7808 48118 -3973 -49664 -246551 -93410 37096 30288 -32812 -16719 -4676 -60650 11095
7797 11095 -109551 -60257 -3395 -118399 -54099 -154716 4787 -146049 -204402 -59956 -15648
7786 -15648 6348 -70602 -157883 -20393 -84151 -67847 12151 -127029 35658 -89135 -85935
7775 -85935 -111134 -137991 1903 -122567 -142555 -92522 -119162 -145313 -113186 -40451 -129091
7764 -129091 -214060 -50436 -70246 -164541 -88892 -1976 -39987 -204235 -113423 -75325 -154662
7753 -154662 -217897 -150236 -364 -49661 -118520 -85860 -38349 -29322 -93265 -53591 1095 -103063
7741 -103063 -72414 -95553 -15641 -89891 -102162 -67019 -257539 -170540 -275357 -111997 -104005
7730 -104005 -120847 -78732 4726 20865 -56311 -165461 -10913 120445 -51569 5081 -97720
7719 -97720 70114 -16049 -75294 34308 -96875 -51227 -49393 -55021 -117202 -217642 -160516
7708 -160516 -48792 -87811 -37061 -4787 75936 -75168 -123855 -57193 -54513 -79223 -2718
7697 -2718 -11975 -49618 -42619 50824 175721 -39492 -70233 -104756 -72887 10010 28133 64389
7685 64389 23977 -180563 -210627 -148524 -56175 -854 7716 -38922 -56315 15599 35886 55624
7673 55624 50810 85283 124761 53084 84083 9240 21260 -73066 -121313 -85117 -153042 -173082
7661 -173082 -73740 -40046 -15099 -51808 -3038 -68810 -101901 78179 7091 1768 -30980 -61247
7649 -61247 -113364 -127560 -78000 -34753 -60343 81486 -56241 -118289 -175282 -125346 -64141
7638 -64141 -178609 -24452 -117302 -93439 -34578 -164913 -112079 -31573 13440 -71463 -86163
7627 -86163 -58544 -13624 26931 -24036 73727 86278 6498 108172 28945 14746 70351 92998
7615 92998 127753 69431 64762 41827 -2376 111782 34553 -9674 26175 3277 62826 25386
7603 25386 67289 93481 49637 29849 115704 100939 55469 47712 50903 115236 113541 42989
7591 42989 26031 -52853 -29722 25107 52368 39375 68976 90074 35110 140393 192006 87967
7579 87967 121978 142969 82829 137489 28663 117634 143010 62021 131988 53798 145164 221523
7567 221523 108531 169170 238761 111136 225341 130404 172901 199831 104470 223223 41223
7556 41223 58762 157415 36421 87658 37986 138743 151634 95810 150474 130809 192723
7545 192723 211861 134853 225912 193456 223056 229383 243262 351595 162903 161906 237105 251770
7533 251770 344288 235753 308122 321109 137174 341426 273621 99591 138286 110379 221904
7522 221904 261982 291584 389346 324311 337162 371620 323150 344700 279461 376653 364594 388959
7510 388959 387302 277878 383015 273092 303934 421066 462748 548040 506862 471536 505808
7499 505808 511789 601559 577285 482299 545055 477604 509182 483009 468487 536735 459114 620329
7487 620329 513528 516396 554964 618474 663978 627279 581918 630724 554755 719842 714750 713590
7475 713590 689081 585383 640668 650523 593549 760796 772847 823727 797176 713950 836590
7464 836590 847987 968518 1074485 953119 892652 936372 1008131 1034467 884914 1018658 941983
7453 941983 855266 898280 935183 1060021 1118378 1098994 1108678 969491 999908 1063259 1061786 1099634
7441 1099634 1012476 1149217 1094291 994577 1137242 1112757 1105250 1004960 1058171 1142292 1092538
7430 1092538 890079 1141593 1081974 1063712 1125186 1127718 1171513 965853 973795 1094823 1067435
7419 1067435 1024678 1110835 1228986 1318289 1178465 1337533 1422164 1362802 1328750 1286866 1517651
7408 1517651 1277928 1270217 1277278 1351293 1399642 1382505 1573382 1604339 1551154 1566524 1601606
7397 1601606 1526810 1582071 1635198 1875515 1808622 1712335 1791153 1902118 1874803 1904348 2050547
7386 2050547 1962509 2015652 2041503 2120416 2197643 2144125 2184125 2297986 2303238 2400967 2480272
7375 2480272 2663485 2715869 2632564 2730429 2734290 2811065 2757121 2999366 3139929 3165224 3269539
7364 3269539 3321466 3450687 3663558 3791559 3907595 3876397 4070512 4299098 4310028 4471356
7354 4471356 4461538 4745352 4910063 4926193 5227925 5270752 5417727 5518995 5584734 5755898
7344 5755898 5822639 5959892 6102701 6231113 6430894 6579140 6696526 6785888 6808456 7019533
7334 7019533 7125510 7311941 7447903 7536261 7715912 7676358 7806276 7937319 7943170 7995650
7324 7995650 8202276 8340131 8503833 8705708 8994561 9396842 9665505 10076111 10584353 11077333
7314 11077333 11675869 12241438 12913296 13627365 14490853 15495314 16330800 17276573 18348268
7305 18348268 19404913 20421945 21455619 22537066 23593670 24254684 24604693 25110664 25491431
7296 25491431 25582261 25460035 25398313 25127547 24677891 24240689 23911894 23596959 23315285 22789865
7286 22789865 22290283 21951418 21342093 20785952 20026811 19412581 18689514 17863979 17145027
7277 17145027 16263950 15365447 14584863 13844592 13167037 12445232 11701231 11090070 10482868
7268 10482868 9920202 9318990 8803674 8441030 7957213 7579030 7268905 6922077 6589392
7259 6589392 6301169 6057517 5938331 5634881 5583495 5292209 5076172 4912822 4605532 4629166
7249 4629166 4635651 4461137 4343756 4262076 4092761 4051754 3880331 3886405 3634544 3674673 3671372
7238 3671372 3494185 3596805 3409258 3420649 3417037 3281213 3294885 3188942 3123154 3097011 2980792
7227 2980792 3074902 2952433 3000195 3029898 2908157 2942910 2873820 2760415 2831531 2855883 2904774
7216 2904774 2836113 2810423 2815343 2773211 2890204 2869595 2891200 2827693 2919361 3108678 3080264
7205 3080264 3096902 3206096 3276661 3332707 3294098 3459763 3534753 3620874 3689346 3793205 3806406
7194 3806406 3846229 3905142 3974413 4014556 4088134 4176471 4185242 4224742 4204252 4263428 4096334
7183 4096334 4028625 3973624 3926105 3978902 3819713 3856160 3845839 3789500 3725868 3586995 3491858
7172 3491858 3616099 3501499 3443996 3302639 3136916 3099247 3141000 2906452 2888035 2825247
7162 2825247 2718651 2609869 2416940 2416539 2148307 2159604 2156405 2128369 1953637 1872374 1826912
7151 1826912 1833207 1653994 1603272 1598458 1665660 1562107 1496006 1541190 1380420 1340724 1295529
7140 1295529 1360137 1287217 1241831 1189743 1122644 1162517 1224988 1167490 1051462 1117505 1090175
7129 1090175 892830 896962 1038781 958837 922508 960811 995154 879529 845357 796891 872111
7118 872111 914258 938199 891925 884361 937448 924605 912862 890960 969118 918576 886914 941678
7106 941678 980217 976157 1010611 992338 1017767 1004091 1115072 1107060 1183735 1144964 1079704 1185264
7094 1185264 1088699 1096902 1058034 1048201 1011497 1038615 1044288 1062017 877925 949481 865755 736561
7082 736561 792112 695973 734178 748161 609247 544742 637141 712720 715966 599850 706536
7071 706536 566459 571995 658966 769091 824118 759327 775527 669209 513787 616938 683334
7060 683334 556501 566735 539684 637213 510507 573399 577518 599968 487788 423578 443843
7049 443843 567449 559976 624829 673629 430826 588801 679481 664224 614653 709585 670998
7038 670998 751374 707679 716403 697949 749772 846783 896375 892177 729043 770905 768056 746724
7026 746724 826870 875371 737825 760055 824562 763204 761985 627549 717011 708859 690442 607680
7014 607680 742279 646613 568831 435425 488928 630907 497462 478162 382891 469794 572644
7003 572644 540325 607969 592151 510221 546326 457193 487059 570883 652935 662618 579841 632692
6991 632692 647616 551741 749864 721387 719464 885288 857726 809510 639002 818822 858439
6980 858439 813223 844272 868082 976533 1007272 965045 952251 897306 859756 977848 901235
6969 901235 900648 777028 948109 986694 974013 933449 916663 879784 860652 882655 887160 964241
6957 964241 898835 1077795 1019132 1015574 995400 954070 899583 904716 958555 955149 799345 756076
6945 756076 854745 721134 852335 797316 896400 805042 759007 830174 800987 791659 771798
6934 771798 817525 839096 670710 694296 683767 679693 792019 611751 761161 709121 656460
6923 656460 664492 582842 769176 749475 709307 801777 682294 774048 807184 764861 1007713
6912 1007713 1021909 1056422 967717 1006080 1084586 992004 1054365 1030775 1043309 1050823 1082964 1224030
6900 1224030 1198941 1195833 1335058 1255037 1226860 1216055 1257739 1401661 1287697 1235672 1287530
6889 1287530 1262149 1177146 1223767 1180101 1151758 1037383 1141255 1102782 1044282 1148839 1148963
6878 1148963 1141162 1124052 1157265 1105287 1173838 1200613 1222641 1089831 1175180 1097781 1243048
6867 1243048 1188863 1103703 1356591 1294619 1347320 1367488 1474141 1611385 1530578 1450264 1584596
6856 1584596 1630228 1679304 1653347 1875285 1909501 1744929 1964668 1972776 2031817 2144588 2217297
6845 2217297 2236717 2317670 2444534 2583305 2651909 2885471 3011985 3296783 3365782 3564795
6835 3564795 3910213 3999913 4286262 4613759 5056470 5432807 5819250 6093651 6407195 6667766
6825 6667766 6806358 7155611 7308260 7312355 7249159 7169075 7220437 7137653 6896408 6767045 6534828
6814 6534828 6397624 6202117 5832368 5604554 5197735 4834827 4621935 4409595 4225870 3883280
6804 3883280 3691681 3501565 3178395 3112811 2877445 2691893 2596498 2539327 2369385 2308989
6794 2308989 2359886 2192008 2081023 2077644 1992097 1877293 1763940 1558660 1516785 1421516 1434281
6783 1434281 1307553 1244307 1274114 1260145 1245819 1223587 1132917 1117760 1211316 1159435 1178029
6772 1178029 1048345 1008672 1021017 1036103 969778 920146 804809 953850 990866 996216 889298
6761 889298 845584 877951 814360 987523 951906 958578 843212 809940 802822 843730 861042 866422
6749 866422 793056 700014 558216 588846 717204 566929 708799 639215 639458 557829 576049
6738 576049 589209 511959 461005 433124 469066 388282 390921 465138 445882 320248 359789 300936
6726 300936 429049 349861 450019 505723 431518 487359 324972 334788 428891 507163 435048
6715 435048 382918 353000 311041 210898 347301 319920 341961 308333 308163 356963 305050 379266
6703 379266 332653 314452 345048 372453 341217 303508 302566 352353 256149 289568 346561 297626
6691 297626 393026 391510 355134 327614 249788 396599 528537 397176 338491 450652 423017
6680 423017 512536 273011 235572 298741 212554 354097 391780 389623 426207 400930 468516
6669 468516 449924 453040 508954 324458 434595 327467 333684 474884 282978 205807 258933
6658 258933 340878 281663 210071 331520 392485 316003 284258 247557 187909 181571 280803 484263
6646 484263 254428 213719 282761 268486 325880 318856 334259 418089 185459 152468 233224
6635 233224 32898 243774 262089 341068 234308 193788 347253 263204 275092 377306 334699
6624 334699 335657 239528 372939 458243 329704 404448 346446 359440 386815 430494 681964
6613 681964 656105 548093 625759 669429 738746 579275 605469 814232 760172 919719 1061848
6602 1061848 1142257 1168915 1141950 1274049 1461639 1541053 1671113 1723376 1663240 1678216 1721557
6591 1721557 1886378 1683591 1709227 1841461 1664426 1531279 1543665 1717923 1769087 1655436
6581 1655436 1740134 1725776 1617985 1847309 2033466 2182728 2038299 2252570 2572553 2673277
6571 2673277 2679232 2705844 2806882 2671707 2499951 2413976 2364875 2163013 1920825 1671692
6561 1671692 1701529 1420755 1335279 1335055 1147417 1068829 878094 877346 878923 738296 534253
6550 534253 602852 472675 444009 376566 424455 306398 324637 361030 354570 401050 284627
6539 284627 307521 155571 302866 246284 182998 60837 190056 151667 129275 211301 174623
6528 174623 110731 70261 54614 134517 116622 84742 204029 80952 226480 178777 173628
6517 173628 157082 8681 38099 -4911 99655 114786 101136 41936 72453 17614 814
6506 814 -53523 -2114 -56147 -115353 -41887 -19198 40445 35403 63499 85476 91110 -3141 188391
6493 188391 88555 -8566 -74381 -54369 78111 17318 -72215 -48769 64437 -22737 -18093
6482 -18093 119278 41696 -28165 149074 57208 70527 -33948 13646 89970 -88816 45965
6471 45965 55387 136383 103511 -6986 70710 -1500 -42294 54903 38364 78491 -7 -80732
6459 -80732 -104317 -79003 22557 -40714 -7079 -31254 -42548 211037 118770 -1414 -31924
6448 -31924 108247 137740 71879 195922 159292 117085 24766 49307 36832 27152 29420 7966
6436 7966 -13314 63509 209019 114071 17377 94222 89641 6394 -17498 -3392 77388 -78446
6424 -78446 -14603 50402 -15726 1231 -95771 104632 -1183 -54847 33806 -5784 -13303 -28595
6412 -28595 -16913 80433 21642 23574 45036 16634 61599 60995 214141 59625 13846 103736
6400 103736 -28209 -17436 94998 97762 44634 -48125 26324 8285 -84561 -132758 66590
6389 66590 82028 -22307 -139164 -207369 -91853 -8533 -36416 17128 -71505 -70358 33759
6378 33759 11093 -40348 -58480 -11344 -12381 -60104 -110903 36855 -192 -21607 -45860 -38866
6366 -38866 29662 21782 83774 120816 -8988 4183 65847 -25102 881 -2453 93354 51865
6354 51865 -62666 -76581 -101186 -45362 -50009 117883 101932 61131 101033 149981 91463 66659
6342 66659 -6370 159596 11720 -26434 45846 -79617 3427 -44783 68630 140929 52396
6331 52396 98361 241062 249493 116399 10330 125468 59901 46906 52486 15625 27981
6320 27981 24903 158684 33889 1395 86687 84597 134840 153682 169972 276988 220289 157247
6308 157247 221774 270373 390554 232091 291686 254529 136407 179663 261011 357519 285874
6297 285874 389590 302576 174605 178350 246723 327556 282445 208323 304269 431955 374844
6286 374844 329235 359040 452232 364402 420616 504111 508022 414932 433124 447884 493492 609936
6274 609936 650484 668209 546558 603566 768490 767921 669389 601524 709133 732928 692455
6263 692455 745380 833560 812665 812646 917198 926600 905952 824029 915809 902978 782532 847395
6251 847395 912504 845976 864941 765070 903501 899794 943903 996567 826485 959475 858780
6240 858780 831690 857394 828900 973293 934985 856108 1060897 827771 845176 874909 827575
6229 827575 963244 729687 871432 833148 781400 808596 744431 836595 853321 667202 806419
6218 806419 857169 756588 696013 661385 759537 676755 757155 658476 656820 558068 553238 558807
6206 558807 583107 471732 478710 571417 544045 571961 473015 563159 465910 382041 387496 357983
6194 357983 298615 433057 352130 312387 333360 283969 333397 183378 250229 260277 259741 251601
6182 251601 182673 144541 204775 30917 186824 192363 173383 265058 46192 99083 -49270
6171 -49270 55462 87542 22260 68631 102304 27496 111317 120012 195208 75523 -8307 130371
6159 130371 20571 122838 30313 -2129 64090 20809 49109 -45497 7004 111151 53351
6148 53351 64126 224439 28647 54395 1256 55723 -1104 -192515 -13737 92672 71181
6137 71181 -66772 -89091 45010 3538 -106546 -44194 60178 -49817 -88683 39778 -4451
6126 -4451 34319 65426 89181 102900 33307 94064 6486 -139053 -82512 -75324 64637 -1566
6114 -1566 -76089 6834 -18667 -73061 -95697 -105644 -51340 -197022 -42328 89902 1133 34019
6102 34019 40026 89091 -42796 10145 170357 -32467 74859 74573 104036 -18118 4380
6091 4380 2766 67057 -75832 -61454 -18740 -60489 -138949 -48201 42806 -79084 -17844 3830
6079 3830 138488 44834 49010 35589 115943 50724 -13450 18188 127291 80566 72975 50647
6067 50647 -45515 119915 65958 172490 -20510 53908 36390 -28102 124990 125000 114101 106509
6055 106509 171748 46109 95644 -42876 126651 38137 166453 95119 55368 161837 10221
6044 10221 -33848 30788 170049 110642 32188 84334 119740 134419 109951 78700 45824 -41167
6032 -41167 -21454 16524 23240 131715 48001 102594 179394 90413 54317 90347 153741 100097
6020 100097 55838 168736 207985 123567 80410 121530 83264 12340 46268 32895 99638
6009 99638 33762 43843 264191 139731 204819 207060 149110 117898 147521 164638 322428
5998 322428 242247 230298 352394 309208 337386 365765 400360 256349 264064 195043 209376
5987 209376 213202 305220 340908 305524 131889 245677 328186 141241 83430 43537 175098
5976 175098 130304 124153 121637 102863 13278 97427 88686 86491 61412 17707 97998 78682
5964 78682 126873 90242 171123 2342 83137 81251 310739 109218 179824 301890 198230
5953 198230 276209 248382 281109 237803 173914 244904 353017 297712 500993 580424 603081
5942 603081 602907 625758 695077 852345 847506 810298 859005 731180 790945 609343 605444 697876
5930 697876 742097 782978 645776 566880 656390 677502 650430 535322 438178 323747 336514
5919 336514 369687 343020 334297 295593 337290 290526 208986 218236 274731 223513 256891 110725
5907 110725 213339 151007 165668 191920 88231 37613 80552 168436 122030 131862 46439
5896 46439 121142 87669 156993 114681 141112 120753 104749 132838 237533 270561 147295
5885 147295 165779 67741 185550 -31876 142948 208940 373371 338479 248549 291964 251166
5874 251166 217395 251606 305710 286606 272675 319132 379254 288249 457016 508431 535992
5863 535992 419439 440230 466802 443014 320414 321613 317351 291198 245342 293483 416517
5852 416517 362175 281508 269787 314353 246582 338341 269133 249233 309953 158770 233697
5841 233697 455105 414383 405252 270343 333884 269661 172789 250359 262839 219643 225856 228483
5829 228483 220876 218313 106037 159429 105070 179713 82168 70455 120759 76149 25775 53393
5817 53393 93049 56238 87301 99497 110290 57994 125580 84711 80022 116106 7688 98701
5805 98701 234000 149428 132652 72029 88398 110212 -29392 52593 36197 81368 110588
5794 110588 46835 90487 85046 20739 -48487 -28619 97406 -66755 -34458 97112 53908
5783 53908 130401 109361 111733 43200 -63756 -19991 21758 68093 138564 550 66208 48043
5771 48043 -11168 43566 -93220 17252 67998 -90600 -65523 -14017 -10054 -51209 -111925
5760 -111925 33707 -6009 -63950 -157986 17654 195959 66505 31730 27288 199660 79736
5749 79736 -35065 11261 53597 63633 154221 68508 23751 -56929 10780 186018 -8380
5738 -8380 25118 21984 92793 114383 -5070 -12553 51926 35686 -55986 -7477 -3307 97720
5726 97720 6713 87219 21886 109805 44795 -26803 92669 -52751 12248 -29701 65447
5715 65447 28773 19205 91655 107855 -111033 26069 44251 153425 107784 -29809 120057
5704 120057 -51040 -1734 75517 112888 24912 -18723 -74480 -100925 -22939 -2269 25838
5693 25838 31857 -71523 -187915 83830 45799 13507 7025 17182 100430 -39144 -116850
5682 -116850 -52100 -18975 -16961 -1149 -33134 -53790 -25235 47786 83294 3896 83212 41457
5670 41457 48023 81633 112526 89970 76481 107040 16054 42055 113032 115783 -134810 36187
5658 36187 -23528 106270 46588 -39091 91824 122845 103419 24669 162085 224244 150009
5647 150009 30085 155325 37662 46193 -50079 175076 169355 -88174 24105 16257 90595
5636 90595 19834 7690 107195 14619 -68504 56022 -55321 20627 -167829 47336 22503
5625 22503 -59592 173382 114743 234574 132852 139034 246732 92054 18962 151666 156822
5614 156822 150166 55283 132468 78062 -48837 27443 15953 118118 63209 156270 204258
5603 204258 29084 73888 166104 124676 137030 57015 162452 156221 143396 97954 83554
5592 83554 135446 118776 111319 143873 126941 -47832 110410 103220 205239 280590 299944 203842
5580 203842 106698 85982 116504 45693 15882 109073 245105 306565 178676 263591 185605
5569 185605 195797 113673 80722 147957 159520 263779 302421 213397 228977 267059 294810
5558 294810 243136 169530 299656 290633 339648 216388 271080 489377 365289 297844 280891
5547 280891 348663 372856 162997 173697 308571 313966 320916 356571 410232 262115 307487
5536 307487 315721 167817 270256 372151 345537 270942 307433 208485 249892 277302 324392
5525 324392 303681 398865 206088 295735 358806 393235 526862 455650 297541 412009 418508
5514 418508 332337 311284 243672 363482 208133 238919 200969 273983 235135 258110 275708
5503 275708 329321 378718 322782 351097 259595 341260 248327 313481 283988 292971 241404 359803
5491 359803 392151 450425 329477 300070 341535 273865 307105 250499 397312 405167 480067
5480 480067 408787 350378 304302 489322 309931 401089 282130 270036 304124 226617 311499
5469 311499 278132 355250 464106 323495 345255 477019 424743 442531 379853 488915 592564
5458 592564 493139 480237 569793 575797 521861 507411 582118 523108 555921 595507 452222 543519
5446 543519 538471 645403 538709 322706 361135 388215 382780 535498 511541 576553 569572
5435 569572 492726 540162 435641 636859 714220 738786 738391 768899 847126 901477 788591
5424 788591 772339 691692 686436 500694 533103 753918 653237 701119 629427 676406 587230
5413 587230 553263 672723 672432 637964 704376 659087 649153 645318 580612 600810 623861 607118
5401 607118 536705 498979 512402 604539 539477 574877 480286 612458 620591 443400 410629
5390 410629 517818 594985 565492 606311 548014 601565 528644 534698 635216 608531 667428
5379 667428 720120 673925 647834 776597 839402 803872 744850 712431 647694 640244 565220 492201
5367 492201 562668 662475 691600 548332 411851 377211 422875 419866 541778 549122 570376
5356 570376 614133 594465 653654 722352 830776 895668 1010907 977434 786078 748617 766782
5345 766782 705200 926819 918383 963894 938296 762261 884730 748752 640613 679885 574939
5334 574939 589867 732950 540059 519599 410760 572657 520449 463814 640947 538571
5324 538571 665525 580278 651862 750315 743628 833644 766425 721950 713898 746460 766778 486967
5312 486967 544791 698837 673329 682767 494761 470020 547561 527090 550469 562567 603186
5301 603186 670705 586920 567880 548682 625329 620388 653844 603069 511932 605330 488898 555302
5289 555302 530033 615956 583518 661565 536227 634363 582306 590079 511988 478745 492779 568929
5277 568929 512183 362973 602012 551199 544854 277980 423968 402437 429557 373069 303289
5266 303289 326241 408591 484975 440511 390028 325647 390971 314345 441225 422840 507686
5255 507686 438208 464935 505570 515373 497554 339944 413990 354792 455638 373485 413277
5244 413277 281226 355125 282299 439238 335300 252687 302574 323702 379799 374396 349952
5233 349952 350033 506265 390119 440876 382424 504941 583535 507960 463952 527005 481248 384638
5221 384638 328843 253462 386867 319500 314062 289115 276965 231766 287368 150020 17292
5210 17292 368097 371302 446230 281632 310739 412754 265150 186062 230939 164046 249850
5199 249850 267172 363083 298276 154029 373815 365325 318898 153522 224578 347354 291661
5188 291661 133480 245894 367331 350884 141219 201561 325102 362644 410272 360316 369802
5177 369802 255334 378024 387081 366737 267761 466770 396147 281471 240285 293415 355774
5166 355774 256587 241548 163323 282267 262215 404438 345721 343069 366143 434066 415992
5155 415992 383831 347009 429330 505178 378591 390221 309744 344207 340483 352652 412898 530069
5143 530069 405069 365647 376960 453092 446400 370124 425286 376336 450716 524657 517109 490781
5131 490781 515557 608965 539173 594965 568152 508392 535360 559323 576255 604528 637821 811897
5119 811897 733425 600768 588778 583456 718304 557831 544143 809342 732473 642149 687266
5108 687266 787490 935635 845953 870842 1012967 943873 1039894 966255 979332 980253 964319
5097 964319 936062 708785 748690 760689 816121 826698 757670 851001 972373 848289 890715
5086 890715 899230 1047278 1097200 1161247 1175297 988017 1059244 1093336 973633 951890 1026222
5075 1026222 1034555 976588 811826 867829 896330 864173 878793 861295 944989 864794 977235
5064 977235 1009094 947937 1064320 1086908 1011153 1034242 913822 1136284 1079678 957633 1002558
5053 1002558 987380 1083047 1056899 1071709 1074129 1094410 1094547 1245861 1180596 1182628 1091963 1139029
5041 1139029 1259095 1232624 1219155 1168860 1145659 1036281 1074516 1070124 1113144 973671 1001351
5030 1001351 1052456 958720 1012290 991907 933456 987214 1094033 991087 1055563 1091231 1080695
5019 1080695 1033944 1177256 1157523 1234186 1246021 1178533 1238906 1178117 1288741 1299068 1326812
5008 1326812 1257809 1386197 1308519 1443863 1458305 1579529 1579963 1574572 1668631 1723059 1857718
4997 1857718 1919143 2043130 2014023 2202897 2159031 2302175 2340424 2462654 2534630 2612932 2808698
4986 2808698 2977645 3162941 3206400 3313594 3457663 3648850 3704657 3872586 4039462 4358200
4976 4358200 4477378 4592537 4863674 5002643 5298637 5367743 5622140 5790771 5764760 5793823
4966 5793823 5879107 5931051 6068181 6058644 6055840 6091601 6041750 6160875 6067198 5971153 5956923
4955 5956923 6008206 6049583 6104904 6276520 6492420 6617408 6697752 6823447 6872692 6973763
4945 6973763 7019815 7071925 7165373 7169937 7294419 7415088 7495904 7588796 7515430 7655325 7673530
4934 7673530 7698369 7808385 7790123 7879104 7897799 7976353 8278214 8383007 8642740 8828914
4924 8828914 8938225 9030496 9109435 9300319 9193930 9232345 9373351 9379551 9331807 9439115 9411929
4913 9411929 9506026 9414506 9487366 9626406 9744881 9815838 9826241 9988439 9939310 10065306 9988230
4902 9988230 9950050 9760201 9914328 10093292 10268412 10355500 10457036 10543758 10444157 10495465
4892 10495465 10493605 10370934 10297738 10298402 10171242 10094259 9846102 9922789 9827550 9782865 9605067
4881 9605067 9664184 9651011 9651130 9570461 9609468 9544377 9224594 9221371 8965751 9024727 8895934
4870 8895934 8722087 8421907 8281172 7995740 7948528 7843600 7740237 7571714 7448247 7437444
4860 7437444 7170306 7146497 7006729 7038508 7006008 7117119 7243735 7502108 7561681 7875464
4850 7875464 7990787 8303070 8428308 8522318 8803880 8825507 8986376 9069540 9086334 8979903
4840 8979903 8912814 8869308 8980014 8922352 8957574 8769128 8539964 8327694 7931327 7582783
4830 7582783 7330631 6977438 6685341 6310051 6079397 5835558 5603605 5312309 4770388 4593865
4820 4593865 4471619 4161476 3920589 3786389 3743189 3585010 3377372 3261158 3085941 3120014
4810 3120014 2992883 3047141 2934151 2818218 2710850 2669637 2582199 2427045 2548795 2402016
4800 2402016 2382125 2264424 2327216 2302926 2174147 2033637 2116914 2013990 2017368 2087072 1929600
4789 1929600 1965250 1921591 2009838 2003668 2014297 1920233 2009668 1917101 2060738 2211742 2347947
4778 2347947 2516486 2573212 2544993 2304281 2148286 2066501 2105025 1898609 2018766 2008322
4768 2008322 2061913 2124181 1889306 1987106 2040229 2069001 2027145 2059422 2115314 2123517 2260157
4757 2260157 2317997 2362053 2460141 2553163 2785318 2835344 3109454 3376980 3582186 4055759
4747 4055759 4469810 5094017 5756285 6471846 7312718 8277608 9309187 10863614 12044261
4738 12044261 12350391 11830985 10388518 8864554 7346927 6175285 5332711 4723255 4129256
4729 4129256 3672080 3493703 3295731 3057675 2905095 2759037 2693189 2608580 2521547 2508779
4719 2508779 2475191 2389586 2414931 2440517 2316973 2393069 2333458 2424578 2332306 2386888 2401314
4708 2401314 2468306 2623694 2597987 2547961 2653597 2728401 2873232 3021061 3228175 3487208
4698 3487208 3599689 3822111 4123293 4497761 4843158 5300033 5632273 6151470 6331793 6269379
4688 6269379 6123137 5808510 5495696 5131491 5147121 5136602 5313315 5604649 6116907 6736695
4678 6736695 7441415 8366489 9450627 10768010 12011576 12612396 12900318 12850384 12075067
4669 12075067 10787014 9639572 8850060 8232629 7889326 7725235 7486127 6792976 6089086
4660 6089086 5316291 4664955 4115887 3690192 3415821 3151545 2728475 2687245 2569844 2380219
4650 2380219 2216822 2134606 2200971 1994768 1873410 1741939 1805409 1705775 1678146 1665754 1651672
4639 1651672 1563379 1408831 1434540 1479477 1417111 1311271 1270354 1190332 1256870 1312348 1254920
4628 1254920 1179243 1030986 1148186 1141821 988751 1080833 1119331 1155110 900459 895074 1003332
4617 1003332 1003803 830615 773321 837910 857195 808922 955745 971239 877920 799829 925316
4606 925316 953528 874333 934373 1066788 1035930 963642 1006205 917992 975767 951398 890847
4595 890847 919230 826777 812078 785504 715730 824383 775322 819399 854827 756153 904087
4584 904087 874203 731174 772772 774742 873869 880961 814509 828917 757184 789584 815064 770396
4572 770396 859493 878237 894256 732178 724440 731552 745228 761375 666964 779899 775833 700137
4560 700137 735912 802101 718752 562213 635700 809071 745165 714115 757677 807948 801721
4549 801721 726817 726154 693658 729249 641903 773798 771607 686408 703868 684963 674436 733933
4537 733933 743321 790689 762350 772754 878521 743421 737809 731723 717579 680376 706121 793557
4525 793557 835457 844506 818522 860737 841164 739143 746841 789803 699041 867914 753720
4514 753720 776837 766676 764638 883905 830483 884899 947749 887329 854736 916560 923366 1026457
4502 1026457 958054 1038624 987537 856624 905410 975053 957752 1022791 1051894 1235554 1182350
4491 1182350 1058673 1065473 1048216 1160418 1093133 1154585 1141181 1174927 1211836 1215153 1178049
4480 1178049 1271186 1310953 1343908 1367828 1295737 1236505 1250565 1317259 1503761 1568408 1630530
4469 1630530 1633584 1770238 1675756 1688849 1806464 1781004 1841161 1850915 1984398 1938918 1988413
4458 1988413 1985187 2043999 2060498 2100126 2073790 2168099 2247903 2207129 2223710 2370446 2453263
4447 2453263 2442630 2536562 2563436 2568604 2648706 2724621 2775058 2793998 2898766 3004506 3065983
4436 3065983 3080156 3158203 3307950 3462200 3507898 3595428 3750615 3938042 4043368 4163800
4426 4163800 4309047 4550142 4723421 5016426 5290165 5454826 5758397 5933726 6186562 6424991
4416 6424991 6513229 6647092 6814430 6877905 6889976 6994614 7113767 7218346 7205371 7389146
4406 7389146 7443618 7487040 7513352 7674444 7787083 7736806 7856332 8010674 8092426 8104176 8180548
4395 8180548 8115513 8270995 8326577 8424915 8547999 8571130 8619354 8738868 8761426 8805330 8808948
4384 8808948 8870374 8933829 9012008 9136112 9300234 9607258 9966060 10200284 10342866 10581867
4374 10581867 10684607 10768599 10776994 10882932 10920427 10746455 10750067 10718526 10650304 10509937 10338138
4363 10338138 10337423 10110391 9898571 9668300 9460480 9142339 8887717 8642565 8503604 8120365
4353 8120365 7700271 7491091 7227410 7070859 6886513 6759797 6627058 6495438 6455544 6527821
4343 6527821 6300165 6410621 6518231 6533965 6474134 6582964 6942077 7023036 6957319 6845033
4333 6845033 6685132 6599505 6493370 6433243 6378911 6193579 6197450 6155663 6213117 6136898 6223357
4322 6223357 6301337 6075909 6077253 6180062 6229474 6074668 6193208 6247918 6326111 6348740 6316448
4311 6316448 6448964 6638401 6738864 6994921 7230961 7471845 7609393 7902902 8288800 8456832
4301 8456832 8798314 9119100 9442818 9661537 9872559 10007315 10136173 10221503 10427996 10482251
4291 10482251 10622802 10714155 10732630 10764384 10761258 10745698 10636901 10509762 10446140 10272696 10165259
4280 10165259 10215349 10177170 10287014 10146206 10235178 10179545 10019939 10012473 10246220 10372084
4270 10372084 10523921 10480435 10553677 10609076 10534885 10713258 10674486 10669421 10615766 10566656 10544540
4259 10544540 10526590 10395703 10538449 10499224 10569978 10592376 10608484 10724773 10681216 10639288 10684634
4248 10684634 10697337 10607275 10524318 10387924 10378164 10342847 10298493 10199431 10085232 10009664 9920079
4237 9920079 9888530 9773546 9790067 9578855 9524176 9575305 9516035 9374610 9317588 9179712 9221354
4226 9221354 9309119 9400425 9449286 9384492 9356291 9377413 9452045 9293021 9436088 9456211 9572259
4215 9572259 9655062 9782739 9829039 9848137 10015463 10261835 10558704 10779629 11055451 11375804
4205 11375804 11719490 11999275 12577796 13026854 13312208 13617486 14008186 14308337 14483719
4196 14483719 14607431 14709129 14748809 14691754 14744215 14816352 15092504 15196295 15515906 15929713
4186 15929713 16334420 16731734 17227532 17847494 18394755 18722617 18938444 19113730 19220299
4177 19220299 19220492 19302716 19399007 19511729 19636093 19780931 19866025 19733477 19613423 19459315
4167 19459315 19497822 19416472 19628466 19860772 20327927 20882829 21531975 22245443 23187752 24348836
4157 24348836 25369788 26240409 26849612 27249041 27386486 27477099 27443228 27849635 28360716 29058555
4147 29058555 29711343 30369598 31198779 32064042 33011579 34161769 35216481 36203526 37271919
4138 37271919 37918405 38687117 39143336 39301823 39041137 38248985 37022474 35500004 34097381
4129 34097381 32907258 31955364 31335978 30954242 30809858 31059297 31358243 32219510 33197513
4120 33197513 34067610 35014539 35854797 36404561 36320704 35771579 34996269 33941187 32759159
4111 32759159 31626290 30702217 30226763 29537972 29230359 29121736 29162547 29413246 29572523
4102 29572523 29998347 30538598 31163102 32070703 33160020 34359418 35547006 36770340 38023001
4093 38023001 39010176 39630178 40268049 40677939 41035521 41414614 41755463 42146003 42524557
4084 42524557 42724733 42843866 43103902 43369186 43643248 44050907 44761431 45356125 46191986
4075 46191986 47011760 47980014 49020308 50194102 51625621 53079288 54887454 56725738
4067 56725738 58615753 60489235 62599200 64635505 66614055 68753622 71056604 73217250
4059 73217250 75820676 79144982 83342695 88757252 95368269 102952729 111499975 121778348
4051 121778348 133500966 147743892 164972686 185515819 207000655 230087017 256844490
4044 256844490 279822869 279534873 256044895 225190136 194805329 169402264 149689637
4037 149689637 134368503 122076705 112448789 104830563 98753491 93728152 89838696 86963376
4029 86963376 84582120 82493459 80563332 78871727 77130375 75003559 73106173 71248099
4021 71248099 69930303 68813673 68233266 68130767 68321478 68925651 70127196 71696016 73569293
4012 73569293 75387241 77036063 78689838 78889828 76445700 71994029 67420968 63132898
4004 63132898 59687253 56964998 54665316 52735258 51055212 49671433 48448309 47259475
3996 47259475 46116560 45088794 43986818 43016237 41879217 40982767 40106098 39074316 38139252
3987 38139252 37381809 36522802 35611057 34798433 33992426 33310184 32725244 32197768 31623086
3978 31623086 31352990 30979135 30824931 30428235 30024882 29740632 29406252 28889752 28394804
3969 28394804 27924376 27314787 26900116 26334559 25982895 25412362 25019278 24481805 24063240
3960 24063240 23523111 23180112 22935396 22491570 22192239 22148825 22068994 22000643 21880594 21740328
3950 21740328 21692736 21472790 21559733 21417525 21539886 21711548 22031484 22443511 22947366 23853356
3940 23853356 25096361 26529627 28055892 29820868 31728804 33516670 33749541 32806452
3932 32806452 31308627 29664122 27915739 26038641 24360036 22765321 21280956 20237436
3924 20237436 19051923 18165630 17473657 16647428 16011241 15431929 15143729 14818373 14229767
3915 14229767 13837273 13479909 13368416 13258497 13028104 13084340 12949308 12926327 12827397 12611254
3905 12611254 12501497 12346081 12356644 12252556 11877921 11838076 11615239 11414936 11214796 10888054
3895 10888054 10650344 10384222 10324851 10337801 10164002 10123127 9899026 9716329 9680466 9451762
3885 9451762 9410042 9301540 9268374 9393495 9343098 9314878 9209865 9340099 9188568 8963543
3875 8963543 9017655 8973346 8974138 8969831 8960566 9089920 8952815 8973514 9074062 9064542 9132733 9016357
3863 9016357 9005020 9168254 9176349 9339332 9308068 9573121 9614435 9764413 9977353 9936722 10048728
3852 10048728 10332794 10359518 10395926 10503387 10701443 10811199 10752550 10905037 10947253 11282750
3842 11282750 11254856 11351599 11458467 11685175 11834186 11798386 11848205 11831385 11691076 11620384
3832 11620384 11559823 11447707 11403388 11158913 11316916 11273518 11288927 11382263 11518286 11705984
3822 11705984 11880412 12207513 12558326 12991573 13290855 13811325 14201063 14675015 15057587
3813 15057587 15581446 15921573 15943018 15996133 16006835 15810602 15778086 15750572 15809477 15916771
3803 15916771 16094321 16466728 16714695 16938735 17250065 17620552 18017046 18142450 18299074
3794 18299074 18499824 18576197 18782776 19032176 19239889 19642431 19868208 20437358 20758955 20921695
3784 20921695 21435933 21701228 22015365 22157194 22447868 22892208 23160786 23623398 24412671
3775 24412671 24894828 25717596 26577586 27630864 28633184 29322386 30333702 31012138 31446516
3766 31446516 31843936 32214704 32728946 33298195 33928466 34853953 35746992 36856430 37837698
3757 37837698 38734207 39572972 40458053 41729843 42997097 44698081 46701095 48898012 51377212
3748 51377212 53897020 56455658 59076880 61478437 63794809 66333413 68706945 71052939
3740 71052939 73275937 75342160 77106718 78548276 79526475 80062081 80329828 80374236 80449738
3731 80449738 80412741 80167574 79819175 79590853 79206391 78725504 78233963 77812279 77265610 76415635
3721 76415635 75386197 74054426 72377382 70304468 68097523 65849321 63539363 61394041
3713 61394041 59386928 57258621 55222536 53442609 51768008 50336875 48950906 47821051
3705 47821051 46810233 45805347 44571625 43374576 41993027 40579084 39251479 37993189
3697 37993189 36957915 35996288 35084639 34442256 33978983 33648277 33703576 33706755 33874714 33977152
3687 33977152 34088366 34309707 34020730 33582245 33214674 32825999 32631295 32445766 32263322
3678 32263322 32471751 32667725 32996823 33393792 33724215 34002271 34157348 34004542 33898392
3669 33898392 33759793 33764190 33977753 34289971 34739604 35159476 35550799 35854790 36215069 36444984
3659 36444984 36556884 36481185 36341905 36115795 35794802 35668692 35690678 35578784 35723069 35934655
3649 35934655 36098535 36093134 35778475 35522490 35048211 34273402 33399019 32516452 31470641 30393333
3639 30393333 29389780 28314293 27363479 26539202 25862159 25325727 24684609 24100365 23917790
3630 23917790 23585363 23433467 23198263 23076524 23006470 22885830 22857643 23048126 23033139 23127593
3620 23127593 23217237 23233605 23342385 23493055 23716144 23884695 24120527 24216459 24503659 24718248
3610 24718248 24944785 25287933 25629713 25787425 26128685 26377628 26801263 27190522 27570722
3601 27570722 28121400 28519427 29165997 29942835 30626669 31353923 32202366 33000343 33918425
3592 33918425 34694976 35887793 37098796 38214235 39565949 40974855 42663967 44465360
3584 44465360 46458286 48818113 51379406 54073584 57504075 61251664 65564367 70178086
3576 70178086 75640995 81828983 88363880 95415326 102948121 111211518 119549289 127836288
3568 127836288 136073732 143830143 150828806 157062079 161940260 165657885 167652101 168161657
3560 168161657 167240489 164634558 160739665 155760294 150022253 143552813 136720880 129753851
3552 129753851 123102603 116423620 110176138 104278482 98789900 93856906 89346882 85186083
3544 85186083 81369005 77861590 74635466 71561742 68514779 66066119 63733794 61585843
3536 61585843 59633541 57977587 56428997 55012154 53684485 52510419 51348539 50238258
3528 50238258 49173431 48095671 47137275 46249320 45465086 44669903 43817828 42919881 42188734
3519 42188734 41651541 40955980 40185226 39666451 39173377 38646013 38137690 37648794 37196172
3510 37196172 36900396 36504989 36148396 35863427 35622215 35385671 35254419 35169172 35015150 34945591
3500 34945591 35132824 35247631 35600374 36110183 36875460 37800028 38820443 40148373 41546534
3491 41546534 43291872 44988769 46990190 49021119 50987583 53049155 54877678 56428848
3483 56428848 57662077 58404455 58533255 58288708 57339013 55827541 53808171 51476691 48997115
3474 48997115 46462392 43749931 41200550 38833998 36576401 34518780 32661299 31176110
3466 31176110 29611303 28254113 27040529 26023574 24920586 23937105 23111978 22490902 21690470
3457 21690470 21050527 20541978 20009034 19370981 18606355 18228577 17775282 17326526 16780556
3448 16780556 16511817 16088700 15677183 15414249 15138485 14835730 14492406 14460775 14221915 13969364
3438 13969364 13618902 13589810 13549822 13345746 13193353 13029229 12989684 13006860 12946010 12810200
3428 12810200 12727063 12623626 12630913 12488684 12355167 12229639 12161301 12122996 11988915 11835495
3418 11835495 11804448 11649298 11618038 11512131 11365581 11266644 11338805 11386570 11254803 11185809
3408 11185809 11265427 11458421 11398827 11382785 11481396 11705409 11773288 11890883 12169008 12485052
3398 12485052 12552397 12946162 13422182 13668027 13863244 14090908 14325706 14685502 15160464 15399217
3388 15399217 15314841 15124571 15036577 15085875 15253033 15422857 15812784 16133463 16760595 17315625
3378 17315625 17906085 18572995 19368473 20143367 20934340 21732182 22649320 23312088 23840516
3369 23840516 24304711 24777650 25129313 25316849 25475590 25719222 25961608 26076673 26292608
3360 26292608 26524332 26838965 27034410 27365862 27412255 27766505 27751749 27690977 27626902 27422638
3350 27422638 27210774 27029552 26777050 26674273 26482147 26432350 26641801 26689144 26974136 27115194
3340 27115194 27632682 28168609 28678177 29192656 29862672 30598083 31332043 32033819 32943008
3331 32943008 33834364 34871851 36235948 37379459 38897578 40569246 42561582 44868593
3323 44868593 47260070 49926558 52912425 55931077 59118436 62316905 65412952 68489884
3315 68489884 71205447 73653493 75697935 77581044 79172600 80394251 81398807 82299744
3307 82299744 82958290 83845530 84765082 85640058 86586314 87560476 88487667 89264983 89835237
3298 89835237 90377227 90733517 90945755 90962549 90920683 90872837 90804598 90955704 91391094 92272336
3288 92272336 93562680 95070460 96746197 98551645 100256847 102087825 103603425 104956373
3280 104956373 105928584 106717805 107141365 107420766 107540137 107520314 107470303 107319081 107042132 106466062
3270 106466062 105981485 105206164 104155319 102879533 101107366 98937888 96708971 94100926
3262 94100926 91320155 88557245 85743870 83134585 80471687 78081805 75811551 73939258
3254 73939258 72148954 70382507 69002089 67612140 66148133 64785563 63378917 62152500
3246 62152500 60868692 59431576 58071981 56864704 55919763 54719796 53752649 52897153 51988135
3237 51988135 51137007 50173158 49141366 48041673 47072816 46376645 45526332 44547233 43587767
3228 43587767 42830683 42098438 41339842 40823676 40161385 39543067 38902126 38150965 37606896
3219 37606896 37067137 36478478 36142564 35680726 35225355 34808141 34427787 34086622 33535877
3210 33535877 33154928 32619040 31960631 31237038 30567188 30000687 29467080 29060644 28614172
3201 28614172 28305437 28255712 28047762 27605238 27216643 26687923 26391951 25999394 25545511 25252910
3191 25252910 24924941 24659627 24369776 23910408 23676069 23321178 23047186 22829781 22487454
3182 22487454 22296992 22135390 22052730 21829610 21584482 21404155 21374745 21180352 21142468 21047250
3172 21047250 21171234 21349118 21525237 21649515 22009900 22432145 22603739 22789437 23108811
3163 23108811 23448625 23497910 23818151 24062282 24442889 25011542 25552380 26262958 26841577 27520061
3153 27520061 28385747 29400618 30470000 31842079 33237484 34964428 36728958 38843552
3145 38843552 41355127 44065165 47392341 50852672 54661095 58805986 63142831 67718907
3137 67718907 72371333 77022283 81641155 86178553 90645069 94555473 97805462 100256491
3129 100256491 101783122 102186069 101688478 100311128 97899472 94748441 90928501 86656832
3121 86656832 82237206 77838231 73720455 69824347 66203020 63143624 60480665 58002634
3113 58002634 55945676 54325017 52739443 51190590 49824466 48710183 47746089 46956164
3105 46956164 46456796 46139178 45791379 45531640 45506541 45541056 45404964 45106085 44945954 44526446
3095 44526446 43794569 42935470 42006611 40609919 38964053 37236466 35511431 33814983 31905753
3086 31905753 30331951 28723406 27008670 25724916 24517112 23535159 22502217 21700349
3078 21700349 21084842 20386435 19814944 19387745 18884386 18380218 17901669 17485257 17073885
3069 17073885 16532334 16014264 15666851 15199461 14626505 14213629 13710673 13181280 12789134
3060 12789134 12525244 12147017 11801534 11533782 11337055 11110396 10867630 10653498 10575052 10279854
3050 10279854 10059716 9894782 9720447 9575237 9418427 9479319 9420000 9180145 9078950 8968223
3040 8968223 8788081 8789493 8670160 8576140 8206121 8062745 8107478 7832179 7693579 7560808
3030 7560808 7470157 7374610 7322620 7229728 7147118 7042201 7083617 6981839 6946421 6717042 6783190
3019 6783190 6720973 6644654 6657030 6439785 6510032 6369188 6383295 6423958 6444681 6375028 6435003
3008 6435003 6325340 6398464 6379679 6271363 6254297 6208696 6275436 6245536 6375838 6266539 6349232
2997 6349232 6390727 6473798 6502277 6584199 6585002 6682337 6634242 6771130 7000670 6898436 7043767
2986 7043767 6946545 7078609 7048748 7029239 7108262 7145730 7125597 7136026 7147323 7343268 7411387
2975 7411387 7403462 7651001 7634342 7735200 7730999 7908948 7982519 7959797 8018936 8048177 8114361
2964 8114361 8151372 8229107 8444712 8637866 8667487 8899511 8893287 9028731 9098806 9259221 9448070
2953 9448070 9489999 9666211 9882852 10118246 10307295 10480383 10779359 11054076 11233538 11542292
2943 11542292 11964252 12107311 12445081 12932837 13402351 13673503 13993834 14380875 14799922
2934 14799922 15124650 15521615 16091083 16511271 16919064 17341896 17862253 18285517 18710577
2925 18710577 19171862 19485281 19795996 20206508 20782213 21256378 21618043 22139535 22647718
2916 22647718 23192318 23598383 24147219 24696876 25284489 25843244 26671944 27482727 28281137
2907 28281137 29270644 30279842 31246971 32193564 33459333 34884261 36211654 37745036 39384374
2898 39384374 40732982 41728878 42463240 43267866 44282463 45382043 46646759 47871622 49123954
2889 49123954 50624724 52148748 53857176 55578253 57496539 59665026 62064688 64732931
2881 64732931 67544538 70766044 74230253 78008231 82292977 86938476 92120328 98223272
2873 98223272 105386140 113638227 123248269 134544188 147646400 163001588 180655192 201524867
2865 201524867 226247129 255339165 288212944 323835901 359847084 391624606 412043646
2858 412043646 413015385 392785493 357895277 318220318 281166896 249942719 225423353
2851 225423353 207060818 193421344 183732099 176726881 171733836 168085073 164841905 161709652
2843 161709652 158281151 154929494 151564097 147947007 144367359 140957489 138015099 135974524
2835 135974524 135053282 135294756 136985268 140049585 144286460 149236616 153697821 156432373
2827 156432373 155281312 148971071 138551137 126031810 113870702 102886745 93304672
2820 93304672 85553227 78980211 73410555 68622322 64390570 60763929 57415922 54461116
2812 54461116 51965565 49729641 47734597 45896262 44101384 42585514 40941699 39535427
2804 39535427 38091218 36912099 36060191 35139451 34470140 33846429 33101769 32354609 31442780
2795 31442780 30563424 29489948 28487991 27727989 26753197 25933711 24963316 24034727 23144402
2786 23144402 22191439 21265827 20523787 19700172 18997080 18352352 17558942 17150205 16548268
2777 16548268 16072010 15490133 15064983 14579187 14137427 13815205 13464650 12940112 12538542
2768 12538542 12281097 11852600 11549507 11178172 10874776 10508572 10326572 10027817 9928104 9843889
2758 9843889 9510358 9329003 9067110 8883506 8751585 8559420 8336393 8174494 7892300 7801662
2748 7801662 7533623 7298969 7196327 7100267 6978070 6918257 6883448 6618936 6524796 6315658
2738 6315658 6202154 6018690 5972192 5869234 5693977 5562951 5602296 5453240 5258333 5214355
2728 5214355 5122891 5032443 4869900 4897456 4905966 4856460 4717900 4697575 4554017 4446835 4482632
2717 4482632 4441205 4501167 4345088 4315432 4211863 4215392 4106025 4108844 4088760 3993285 3869328
2706 3869328 3869461 3949875 3938759 3835956 3784574 3804485 3629165 3618537 3517056 3634418 3542850
2695 3542850 3392612 3443404 3368909 3411362 3474267 3408525 3433529 3493297 3280406 3189915 3097735
2684 3097735 3061897 2922761 2871175 2907978 2796377 2692535 2569108 2591898 2517870 2462175 2454310
2673 2454310 2372927 2412972 2406947 2280259 2365280 2329928 2293282 2221039 2168827 2194441 2111651
2662 2111651 2169168 2184321 2143865 2112713 2071759 2011449 2074004 2011125 1968999 2070164 1984709
2651 1984709 1927942 1825707 1765315 1819313 1791008 1707020 1746681 1757902 1635916 1729986 1675878
2640 1675878 1659972 1715610 1592976 1531931 1669629 1658178 1677390 1571400 1531164 1637384 1598376
2629 1598376 1629802 1579444 1614953 1553238 1416821 1295425 1372752 1412822 1485077 1396733 1492045
2618 1492045 1453515 1387057 1499932 1431383 1539791 1433010 1363049 1413843 1358122 1452273 1412626
2607 1412626 1363400 1451419 1242787 1364678 1360528 1244776 1432314 1290990 1290191 1384419 1273404
2596 1273404 1414449 1355405 1338967 1437111 1346600 1574204 1373960 1494243 1523141 1456861 1574477
2585 1574477 1601549 1747590 1787369 1778629 2083820 2202437 2279679 2504827 2575035 2883447 2703207
2574 2703207 2801996 2713074 2398343 2170322 2064237 1994062 2048541 1809376 1773078 1775857 1562496
2563 1562496 1578056 1371893 1531873 1552978 1565367 1549555 1452306 1400699 1533090 1331145 1341134
2552 1341134 1338192 1367640 1409524 1261451 1254150 1268017 1287816 1331431 1405542 1286665 1190101
2541 1190101 1099574 1190694 1105919 1086526 997059 822050 841614 710817 756484 853220 769168
2530 769168 733007 745264 628787 715490 528091 595351 657014 572668 565069 487836 610080
2519 610080 724892 690045 600962 699965 595718 483015 473584 619009 608978 529607 585775
2508 585775 640607 597764 459121 468154 512785 409996 444564 550331 397460 445649 473788
2497 473788 636613 504918 543122 491208 360140 389829 358817 507785 402435 308187 323322
2486 323322 416728 240787 375389 400312 481126 399067 442194 365123 333351 296951 287004
2475 287004 449525 354285 301162 442325 382579 241019 190085 277348 410139 262943 349849
2464 349849 326625 310303 267863 90410 235898 277235 227922 292620 367669 377760 369179
2453 369179 321831 353870 245851 239354 297672 341410 297771 223486 239102 304735 298758 288269
2441 288269 299917 261477 251374 213021 267324 188938 150118 245902 77173 87118 173275 212730
2429 212730 350792 201878 208168 359124 329007 283646 144706 215892 236215 163666 338383
2418 338383 367935 314313 157203 161554 262248 390028 348745 350700 306495 293365 289976 227158
2406 227158 251541 162957 167675 250031 308664 172451 93921 203032 327524 226728 255776
2395 255776 299111 287631 241584 174783 280765 301245 333116 301890 202173 94783 206451
2384 206451 245622 336870 230851 252449 362741 233936 165804 269020 297942 260189 94865
2373 94865 173125 276669 175914 235947 323330 298908 279453 412596 493961 401242 276075
2362 276075 198502 212207 230051 235007 221305 227664 182634 231492 166619 164977 198368 136096
2350 136096 178703 49481 -13625 65290 116398 275542 117956 80991 176771 135844 88737
2339 88737 67820 215338 227958 204319 235822 195327 246248 224745 230643 247549 107490 84186
2327 84186 133472 101551 280998 134224 205566 181649 103138 193784 141709 161257 210091
2316 210091 207849 228981 275452 205720 297986 130374 272016 80019 234570 302669 139620
2305 139620 118663 56312 160406 255736 286794 127426 158762 39394 27237 32325 57924
2294 57924 77573 51474 30441 48013 129258 88344 85653 -18755 29516 -27555 39806 40172
2282 40172 166364 163387 143880 249755 183649 52073 40504 13010 69472 135624 64001
2271 64001 163226 87969 -17360 75478 73809 -8202 71407 98818 213624 55804 65383 146598
2259 146598 120200 85758 6947 167964 213906 107510 144548 217502 31860 50984 107347
2248 107347 197177 99284 246791 234491 304142 189876 245804 289261 321929 185177 193707
2237 193707 250878 53439 118195 226224 253897 291606 186247 244358 214487 12107 243003
2226 243003 281589 204524 213152 113900 239529 132869 146978 288974 63403 51084 46709
2215 46709 177458 220318 141572 187434 286766 239527 197599 152043 336542 116828 109010
2204 109010 338073 393024 329039 329615 416508 426157 267584 342484 382738 320139 192270 160393
2192 160393 248254 278025 183719 293202 325693 252100 161122 274517 284998 350347 375322
2181 375322 417143 421927 392353 405703 359641 302667 392946 410910 410496 453608 484997 570054
2169 570054 503495 502138 575227 592927 589743 610299 673402 761919 678548 730952 711853 704357
2157 704357 737536 889420 940694 812273 748582 859004 881197 809254 837107 830485 895457
2146 895457 966539 1062466 1086317 1119218 1017181 1006392 1229842 1235200 1284488 1374447 1526279
2135 1526279 1540930 1465941 1676899 1824221 1772400 1793360 1883567 1864256 2061513 2158324 2334565
2124 2334565 2284520 2307457 2472713 2677236 2819816 2810402 3031900 3283130 3574121 3904858
2114 3904858 4180756 4416508 4632099 4731312 4992378 5340186 5929785 6777194 7667521 8879000
2104 8879000 10256810 12323473 15180464 19303118 25076360 31489045 36971901 35143188
2096 35143188 27526602 20150658 15233933 12078954 9836239 8240135 7085746 6142449
2088 6142449 5490644 4964557 4594582 4503481 4231026 4098409 3737653 3351057 3073672 2616609
2078 2616609 2444155 2200664 2070545 2064578 1771821 1826236 1750957 1593279 1532259 1432624 1422843
2067 1422843 1441433 1225313 1234415 1246928 1238631 1050664 986466 1060085 955526 890268 801757
2056 801757 821487 831107 723110 760738 869035 766851 694944 616758 743155 597286 495254
2045 495254 581286 637275 592448 542248 452244 515483 417962 405471 532035 383990 505915
2034 505915 368970 388799 439427 299397 342169 401446 322138 332925 225010 282949 254874
2023 254874 258073 376191 279719 379472 344561 296163 383726 207840 277203 424305 221557
2012 221557 336384 327222 338529 413497 228549 355902 267882 267837 301218 160360 223915 143776
2000 143776 9098 167644 96509 135423 190622 24599 214183 130928 177852 99260 -90004
1989 -90004 57650 81341 172023 159566 -6889 180268 100480 158025 273849 -18622 147844
1978 147844 162838 132205 123065 113440 203338 145882 30769 139885 115381 133953 109585 24188
1966 24188 209290 123378 97135 129430 123771 22338 108556 117363 98072 23613 29093 189446
1954 189446 43958 105050 41637 131638 89760 46577 51900 141356 123862 89157 83655 184018
1942 184018 165643 183635 158942 64456 62025 47451 150341 -640 -49235 -24407 49019
1931 49019 -33135 -23909 135073 97314 60144 31154 28129 9582 -15906 -33233 91526 79512
1919 79512 36379 -75775 -15991 54971 -46754 45107 104931 68155 9103 74374 -43892
1908 -43892 -49801 1963 119388 -11929 5305 26457 -19680 25623 -52516 64451 45182
1897 45182 41031 -34497 -63691 -88608 -109297 -62828 20036 104142 62995 80492 141761 143745
1885 143745 79280 185350 121275 41048 -9201 64908 -8611 5644 71471 68300 -8142 -25131
1873 -25131 -32306 8117 96533 14949 20912 96513 123577 -9502 -39592 -35482 -45597 130604
1861 130604 39309 -7374 10324 -47681 75426 -31100 -9677 126147 22460 127046 163212
1850 163212 93847 48241 37804 30424 -24828 -78037 -56226 -41558 32558 -53285 -22719 76415
1838 76415 141047 83077 120073 151179 140527 153813 120879 142067 96417 211518 150527 93834
1826 93834 68524 85971 127056 130683 -33147 18696 54625 -16689 21483 -16057 41738 -38385
1814 -38385 -73339 16090 -76076 1005 -19963 -52001 7530 -60767 13051 28334 -119927 3060
1802 3060 56546 102882 3416 -63590 -17978 -7161 13174 -18569 -81882 17947 64956 -282
1790 -282 -52575 -126197 93561 31015 -162420 -48470 135558 76497 -119026 -202477 60044
1779 60044 51570 -3120 58416 -71084 47169 4343 73260 59745 -13791 69234 167737 76267
1767 76267 -4115 -50239 153427 132319 -32862 36915 120162 173394 21992 48533 138875
1756 138875 24029 114677 82645 106086 -24942 -151738 -86006 -106101 -116484 -16817 48504
1745 48504 11953 -113767 -74347 31160 -21926 35695 -41702 -102595 -46193 -896 -4466 -16737
1733 -16737 -59637 118243 102925 20538 -116454 -50504 72293 -40461 -22937 31163 -9695
1722 -9695 42714 -59340 -67019 -134715 -113578 34256 44327 -8559 3052 -9573 41156 -14194
1710 -14194 34224 165461 67135 -3317 58186 224305 121060 10433 -448 -11893 88782
1699 88782 2047 888 53727 -23408 -53561 -17688 -78566 -29853 68089 3626 -43802 -100346
1687 -100346 -18359 -43192 -114004 -90237 -68526 12098 -188738 -104001 -16728 83424 19850
1676 19850 -79087 10961 -40335 10982 35081 37137 -75640 -71874 66446 83443 -114145 -51525
1664 -51525 14951 69830 -130495 -47133 -3267 -40581 100940 81931 68348 27549 20282 96885
1652 96885 -45098 -148517 4761 -99027 27177 -178255 -106800 -13788 -36622 -31663 -132904
1641 -132904 93529 25583 -3055 64628 104691 18548 16993 -16028 -2277 -175345 -140979
1630 -140979 -67473 40570 -75324 78110 120784 41677 -34361 -41373 -10911 26497 -5416
1619 -5416 -120885 -34794 -103791 -93370 -37800 112789 -24053 105271 34143 24556 -27960
1608 -27960 49886 97652 -18985 -74844 7162 -31644 -143430 -192399 -119251 32888 -65310
1597 -65310 21623 13504 73591 39819 51762 -20953 -123715 -61494 116105 156914 -20593
1586 -20593 30204 117872 66433 -92217 -64407 -30643 70278 -21608 11386 -72506 -103113
1575 -103113 -25279 119413 -83670 -299797 -96608 -64400 -43365 -185181 32901 135743
1565 135743 -402 -128089 -22113 -101515 -89046 -112642 -22158 -12774 -80615 70223 87274
1554 87274 -16587 -136700 82612 119301 -18585 -143034 -382 42932 811 -119832
1544 -119832 108449 -16874 -81641 32005 -77673 24504 -50338 -83209 -66677 -149379 -107469
1533 -107469 -31871 -111497 -17307 -1028 -1132 -44965 -96025 21639 -74629 -157233 -112502 -12496
1521 -12496 -54541 -72913 84027 96799 36257 9717 203009 236161 19810 34928 133985
1510 133985 34726 17076 42425 15596 -96635 -105312 76057 76758 -9759 -91386 62956 -47037
1498 -47037 -136774 -47655 -8391 17726 -32775 29000 64097 -3495 -61621 84903 69358 108847
1486 108847 966 72703 44990 14883 11637 11930 99448 13451 38553 43 36990 40967
1474 40967 -21027 -39400 7424 2270 -120292 -95970 51658 89 -72928 -35135 -84672 -16754
1462 -16754 -62029 -56339 -77811 -43866 -6011 -29345 -52673 -141469 -52414 101579 -95590 -34956
1450 -34956 102929 19737 -6660 -70088 22530 13576 -126291 21978 10484 -100612 61229
1439 61229 51015 74845 -26442 42003 109868 -86520 -67736 113747 57997 112075 -13921
1428 -13921 -11423 110437 56889 110592 20354 53643 -103578 -150190 -156410 -58822 -41906 -53387
1416 -53387 -31266 -1012 -32210 33434 61424 -45566 -2638 -119505 -42096 -585 32174
1405 32174 -39221 -64665 41778 -98550 -218055 -47914 -14202 77859 76133 11563 -12246
1394 -12246 -99275 -127425 -70717 -28689 25727 -62893 -33880 -136109 -127566 28531 -14630 -27565
1382 -27565 -98705 42308 128306 -29153 -51796 -39488 5799 19704 -88052 10862 64795
1371 64795 -9048 12543 -64543 -31935 -110556 -62825 -5960 -58580 -112578 -8419 119250
1360 119250 75184 110424 76160 -2119 -34020 -109535 -143835 9895 17067 112406 -60381
1349 -60381 -54797 -52576 -86250 -29039 -75987 6350 19313 -53176 -86938 -59234 -77300 -75737
1337 -75737 -82816 2168 -28196 -18678 132400 97652 70905 -75117 -88303 37816 -41861 -21715
1325 -21715 25116 63475 37384 -35106 70990 103160 -53114 -28062 -18907 998 11865 -31490
1313 -31490 53773 -40108 24425 98359 110558 -22363 4501 118293 219250 166429 -16075
1302 -16075 -9517 -3128 60539 -186687 -59210 -7509 -54827 18090 47394 -149038 -165456 -169053
1290 -169053 -47882 -28633 -20721 72359 47551 184538 36118 127455 72014 53844 -40064
1279 -40064 -13702 12376 22029 -51372 39143 77862 -82200 -97398 -102270 7405 -154803 -218295
1267 -218295 39431 -20556 -6027 20955 -10081 6127 -76220 21172 -51015 -119097 -71706
1256 -71706 -9974 33638 54292 -52114 -40653 11050 -49018 -17447 -100131 -38706 -34060 72160
1244 72160 67356 55939 45123 38424 -89346 -98724 -32552 -138451 -167852 -124544 -20161 -36556
1232 -36556 -55269 -99602 -78583 -54578 -82807 -658 48569 26143 40161 48275 -305 -64184
1220 -64184 6753 41845 -4344 7276 9040 48099 -85662 -125925 62261 347 5732 -97378
1208 -97378 -93536 -73402 -142923 -88418 68078 -41624 -46958 -116039 -99701 -1995 -93345 -6562
1196 -6562 -17539 1918 38761 29212 47109 63137 -3263 -4977 54709 -10369 -2481 -12099 20814
1183 20814 -125582 -2935 61245 8326 66576 -29864 -62715 -26320 20249 -63620 39325
1172 39325 76123 16078 -25925 83274 47966 -3023 36749 123037 62352 -30183 -75194 -95912
1160 -95912 -19935 -164226 -4332 -71725 -104452 -88983 -14890 51028 -8424 -27108 52556
1149 52556 -11825 -54716 83212 6075 -45887 -53986 101185 94729 -85003 -71180 71327
1138 71327 -10541 -113179 -65017 -19239 -82767 -10734 68536 9150 -33686 -172569 -256
1127 -256 73277 -52266 -88096 -62790 -30633 -63192 -113309 -31064 78599 1117 -16814 -32036
1115 -32036 69857 -63913 -39743 -111955 -94298 -84364 -88172 -64410 91359 -10982 -113727
1104 -113727 25738 74737 10926 -73676 40126 -2663 -94540 2324 75397 43255 112604
1093 112604 61419 99581 10006 -25540 26832 38238 13641 -28759 -105021 -78903 -194429
1082 -194429 -164184 -24207 -149711 -106807 -1995 70247 11973 -114575 27849 22546 5346
1071 5346 24816 94952 63973 -52206 -57892 -13375 -13681 18727 4877 8077 -73605 -7668 62485
1058 62485 854 -46017 41902 125335 48735 24924 116505 164467 -31967 7550 31417 117707
1046 117707 65884 95713 102808 81187 18211 -91305 22654 -58008 -30986 25364 -10155
1035 -10155 -25349 -34115 4382 44544 -98428 -96123 -39171 -14916 44240 -137778 62026 -65712
1023 -65712 -32072 7004 9322 99306 90076 12104 107272 -14232 -5042 65869 -24110 58979
1011 58979 -184584 -108168 -73444 -108425 -33698 -69706 -2170 49671 -64995 95583 39254
1000 39254 -53450 -48405 -88122 96157 -32758 -577 87973 40057 -17442 -61278 -941 75705
988 75705 -58869 -20927 -28104 4221 -24807 -128763 -38773 -96405 9731 -47296 -24310 280
976 280 53422 -55573 10546 -55537 70317 -1191 73928 72172 -29639 21744 -30121 -15086
964 -15086 12948 58605 19365 -22761 -96362 93308 115274 55799 -138182 -84054 -63317 -111353
952 -111353 -19480 91811 42275 -65975 37271 32069 -30344 -78747 -289 20590 165081
941 165081 121897 5820 43517 -46250 -51768 -37068 -4667 -92496 -73444 11743 -13461 25339
929 25339 70515 42030 -24581 -60911 -49477 -20228 -93777 -133136 -23360 -109006 -47719 -68049
917 -68049 41382 38533 -71097 27938 -47138 -68455 40639 -7071 26995 36476 -36854 73035
905 73035 -94244 -39285 -48928 122611 104852 -16956 116148 155773 -1979 14205 30173
894 30173 84406 -2737 -37294 74710 -29659 -41895 -100896 -18366 76350 -50282 -20383
883 -20383 28792 132775 23933 -26951 37041 33978 43162 70107 91939 69706 51475 52397
871 52397 87942 85542 51957 32225 -63443 -65132 148814 86234 151372 -39166 3688 49519
859 49519 -29684 59378 37663 -11431 2149 -28179 98850 17508 39223 127698 69773 141189
847 141189 56605 23346 -26222 -159034 -47966 -88145 -94183 -90800 -120298 -17268 -85922 -89471
835 -89471 49093 -54749 -103095 -116279 66216 17778 101584 61764 65811 63044 -57317 -37455
823 -37455 37142 89914 45942 22849 -92506 -12009 -46424 -2442 9714 -3898 -39375 2013
811 2013 43101 29398 3033 -78480 26230 -55955 -134932 -119048 -59068 94645 -42281 -156512
799 -156512 36729 28030 -55619 -38053 66148 97320 -56494 -46272 4404 -8689 -72727
788 -72727 -100638 21010 -82367 -52500 -68582 -96840 -19459 -102240 95583 40938 -14569
777 -14569 21574 81430 14716 22567 -60850 -7901 33409 75913 29332 21979 -27018 -65354
765 -65354 -4423 -14038 59985 66729 63749 -35180 -34306 -22929 -69946 -77870 -66037 100543 -7996
752 -7996 -62903 -89049 -27279 24588 35235 12729 113826 -13558 6839 84765 71884 41814
740 41814 -14408 195522 131039 68491 123359 38753 49254 -2733 31623 89087 -24393 6918
728 6918 85799 10884 59595 61560 118080 56780 -40844 -103685 -66787 7032 -134465 2134
716 2134 -7372 41429 -91134 -101805 -38047 -65301 -50365 32169 57374 159091 127490 124294
704 124294 83333 -75967 49411 -5128 -5457 -115196 -111413 9302 -47853 -56309 -51112 28729
692 28729 84659 -19633 -110681 38580 -43400 65846 60197 14357 5487 -7586 -40539 45319
680 45319 -56415 -26901 -109 -45514 12612 -59806 17799 47559 12306 74559 30637 -32705
668 -32705 -58326 19314 46182 -37862 59009 102877 156529 130775 78941 -9776 -41560 -73755
656 -73755 70371 27546 -72130 -49749 19985 68223 -61684 -51027 -59708 72542 -39179
645 -39179 38810 67145 -23432 -54678 -96868 -34213 -38442 -15992 39501 -71982 -16357 -22216
633 -22216 38306 145193 -89568 -39365 -58698 31298 197434 55873 14729 -24482 125175
622 125175 197530 83331 215992 79836 72312 104498 35665 -1039 49462 60680 -122076
611 -122076 -113486 40283 15203 163108 67411 -26098 -12807 -82475 21156 2717 19550
600 19550 -74326 -8562 50058 -11104 -38296 33528 227691 -7713 -194947 -3383 36307
589 36307 -37361 -43440 -3820 225392 83895 -51051 8641 43722 99426 -16958 -137943
578 -137943 -36104 4774 -29490 -48651 31546 -13508 69858 80557 -49633 6448 52193
567 52193 54139 45577 -80761 85409 117084 54111 38306 -93994 14314 39386 54893 -41591
555 -41591 -19631 84691 31962 67190 61049 13202 50585 45323 -78609 -70813 -157358 -90085
543 -90085 -5033 -39547 29186 -9866 84980 -50997 -38069 48766 -52901 -48455 10497 -38336
531 -38336 47817 -27967 -93834 -136392 -108150 -27702 -62243 -24668 -100953 -148684 -99483 -38956
519 -38956 -35154 15389 -61035 -42611 22938 -38431 55706 25687 103270 39934 50277 7888
507 7888 -118344 -99777 -118377 -27723 29045 -16741 71080 92493 27204 135698 27087 20583
495 20583 -98448 -21060 119527 -23659 -92600 40860 24582 -31038 52547 74490 114968
484 114968 44780 29797 -133930 -74500 -133126 -142685 -85333 -80379 -48928 -110055 15635 70188
472 70188 -16232 1191 39427 86964 77529 -90333 -63611 877 93141 36962 48349 12968
460 12968 -92205 5896 81351 91090 68139 -29990 -79598 -76003 -45125 60297 19711 22236
448 22236 -26917 21577 111678 55452 -27746 -15827 -6570 56833 -2667 -37093 -59047 79712
436 79712 88089 -17383 -6316 60627 -3391 -119509 4005 18006 28974 -59763 -38171 -84931
424 -84931 58304 -55701 -57810 3114 -29349 -3339 42665 64363 -26206 -16930 25711 35633
412 35633 -138657 -97571 -151992 -125359 -86071 -21704 2894 -13532 -39144 2839 -28066 -27037
400 -27037 46785 71508 -38099 -128194 146496 -9819 -65419 -42253 86917 117045 -32344
389 -32344 -33222 72679 -14622 -24979 27274 62725 -102705 -134807 17268 -17055 -137871 -90850
377 -90850 11825 -21557 26600 -25675 66344 112290 64148 -86630 70692 -52534 15531
366 15531 15724 -74885 13367 -74683 60490 19467 39933 75083 76592 4578 82509 -1650
354 -1650 48965 -8719 50466 111213 44303 10993 -123478 -73466 -113838 76296 -35141 57897
342 57897 23593 50701 13886 -16544 -18669 60713 61610 -37225 24835 23531 17712 -25589 48009
329 48009 -120794 -150056 -96885 105283 99602 -86496 -73571 43863 -110572 -115582 -62809
318 -62809 30931 51470 -46785 7689 -29637 -126771 -97477 76626 -12116 -149714 -132687 -3621
306 -3621 -51543 -53385 16755 92151 -84933 -103821 13632 71047 -15437 -109950 -52040 -93333
294 -93333 -107737 -16585 -44141 -196368 40607 10743 100076 -25543 -78530 90091 31999
283 31999 -61790 -138353 -76138 -66629 235 13786 112416 60716 58093 98203 82147 -30809
271 -30809 8412 9734 -55319 -85249 45800 157216 22219 -128764 -104346 22999 -51077
260 -51077 -37264 -89620 -39465 65185 34775 38172 -54120 -114980 92395 42194 -67180 -45872
248 -45872 -160215 -69427 12363 88 113812 89931 6988 -45711 -31409 16099 -26499 -46007
236 -46007 -2711 -126295 -77562 -36698 148778 -36116 -98920 70050 3240 7343 -63852
225 -63852 21683 134770 -3710 -189504 -25219 52325 69173 -27174 -35861 66605 -79450
214 -79450 -10585 -16150 -70543 -19429 -35920 28306 -39519 -167272 -27885 98413 60734 58013
202 58013 -19225 100801 15074 66720 135251 105383 69681 71922 33981 19341 -94495 -50718
190 -50718 -40088 -92657 -48871 -68411 -4253 9383 -8165 9819 52409 61869 45820 -19135
178 -19135 -13444 50392 -36508 68201 70393 16919 69022 -88699 26160 14703 25010 -65806
166 -65806 -106229 -43692 -42357 -91938 -56586 -62307 -3602 1585 40187 -39511 -81105 94366
154 94366 38830 53692 53323 79653 -48041 -93291 -99986 -30123 -15285 -85528 -31431 -18895
142 -18895 -52002 -48640 37260 45727 3527 -78657 -49019 -115248 -184421 -117978 52526 81909
130 81909 -19333 -32570 2179 -61419 -19315 -14469 -25942 -88676 -140553 6739 -45078 -53938
118 -53938 -2612 43273 -34395 13867 62270 44620 -26072 -66071 -38859 -96360 -144704 -75708
106 -75708 28373 -26275 8840 73333 34730 9913 66940 66801 87364 -16112 10844 55322
94 55322 -84135 -46629 19929 -5396 -54532 -35760 19012 -14586 -90851 -72412 -49280 -63696
82 -63696 -134321 -81752 -17672 10380 11935 -21184 59033 12886 -48099 -13346 -51546 914
70 914 -30904 1298 102265 53363 -5431 -12304 -2180 53715 -55523 -30335 16667 -64926
58 -64926 -18899 -100192 9164 26217 76047 -4557 15887 17250 -53056 -36269 -40521 -54614
46 -54614 35357 -8002 -47412 -54192 -41106 85281 11124 60122 9828 58852 10959 -69821
34 -69821 -70214 13786 -19412 8310 8367 -653 -24441 -45658 -7378 -17667 82211 -27404 -64757
21 -64757 -42394 -86939 -47520 -10888 -33283 -60045 -8452 52038 51167 -9477 -3008 -22870 18765
8 18765 33569 11202 -64742 -155861 -118026 40765 29769 -16576
0 -16576
$$ Imaginary data points
##PAGE= N=2
##DATA TABLE= (X++(I..I)), XYDATA
16383 -2225699 -2096431 -2155182 -2124802 -2027491 -2005316 -1986494 -1986262 -1938473 -1861861 -1840976 -1815420
16372 -1815420 -1695901 -1691907 -1769368 -1826565 -1647502 -1712257 -1716647 -1616025 -1632376 -1577201 -1560525
16361 -1560525 -1444158 -1375477 -1470088 -1454512 -1364160 -1383534 -1235460 -1247135 -1224440 -1128839 -1163512
16350 -1163512 -1146480 -1095320 -1059474 -1124840 -1112990 -1036341 -997518 -996765 -918361 -897490 -863557 -926548
16338 -926548 -850215 -764260 -755932 -703321 -686539 -683342 -695601 -708942 -617927 -543332 -547990 -444248
16326 -444248 -466606 -469983 -455250 -449809 -336247 -333475 -327138 -232599 -247975 -243739 -248648 -234912
16314 -234912 -165564 -242346 -120223 -104810 -64259 -7648 -41738 59906 62388 68406 91013
16303 91013 85971 97793 212441 160111 262804 169992 193338 298672 340233 406447 293035
16292 293035 369597 427871 357082 327575 479470 501259 511453 479446 615223 597174 541200
16281 541200 625904 639172 702171 666639 771799 828596 824392 773467 846504 972001 877944
16270 877944 800213 961719 971939 975373 939353 1010942 1004138 977514 1183127 1192062 1187883 1079762
16258 1079762 1051963 1183356 1182799 1062381 1170821 1158860 1172019 1228664 1267607 1268845 1225759
16247 1225759 1371127 1254137 1298819 1421664 1389221 1445886 1372218 1338996 1454911 1372634
16237 1372634 1492591 1454132 1438463 1451460 1379536 1471883 1495200 1450882 1441703 1608039 1644057
16226 1644057 1668632 1625538 1667518 1635004 1687869 1698453 1688962 1663810 1779104 1782406 1724837
16215 1724837 1809777 1839448 1799632 1700372 1753514 1808833 1771725 1778871 1760110 1835158 1912476
16204 1912476 1774739 1802955 1863306 1962716 2015216 2089414 2175749 2043550 2079353 2125897 1981192
16193 1981192 2006976 2046901 2132209 2068637 2041183 2074542 2201486 2178914 2201023 2317157 2179374
16182 2179374 2154631 2265372 2259939 2301677 2143347 2139827 2354594 2200925 2262461 2257958 2301159
16171 2301159 2209277 2077437 2322541 2409442 2336541 2378359 2352125 2423650 2303085 2223138 2361494
16160 2361494 2325998 2320211 2298998 2364411 2387243 2232385 2374177 2368661 2352284 2399172 2198326
16149 2198326 2392414 2333022 2316775 2441217 2460658 2558616 2549846 2387021 2380115 2464140 2455924
16138 2455924 2456717 2376968 2469672 2371947 2354736 2467960 2424167 2406459 2367599 2392600 2433860
16127 2433860 2403494 2419292 2468743 2513150 2422537 2389077 2601958 2586073 2535262 2494618 2500249
16116 2500249 2646180 2408171 2394041 2477651 2443896 2445269 2440775 2521718 2511092 2450211 2555175
16105 2555175 2532353 2476786 2412908 2453828 2625003 2501923 2647324 2598099 2488463 2527959
16095 2527959 2546463 2587255 2518148 2496520 2473221 2594867 2642442 2535317 2569873 2610665 2575295
16084 2575295 2646432 2650773 2708629 2587505 2515308 2610591 2611188 2503085 2606051 2743454 2555347
16073 2555347 2579062 2549235 2679367 2699951 2628926 2778594 2703998 2481795 2625643 2663203
16063 2663203 2654949 2540456 2488436 2686050 2549156 2627927 2689992 2713188 2650136 2629041 2723612
16052 2723612 2665983 2617673 2694559 2639215 2616434 2655290 2663343 2757256 2700970 2736793 2599565
16041 2599565 2686721 2762010 2716665 2655691 2618283 2582570 2687909 2815844 2644531 2606437 2598949
16030 2598949 2623449 2538138 2593303 2684475 2653267 2586464 2735446 2699108 2593300 2686241 2600976
16019 2600976 2556711 2554902 2578976 2598924 2645488 2624008 2617506 2684480 2689757 2572531 2512697 2592023
16007 2592023 2588726 2534807 2581728 2609566 2638003 2663807 2712546 2625175 2521328 2557895 2595866
15996 2595866 2492215 2540000 2633481 2713368 2659626 2663265 2652648 2619498 2546644 2674508 2789884
15985 2789884 2669487 2617911 2657226 2770143 2513058 2551958 2612368 2671994 2584295 2571254 2694873
15974 2694873 2681349 2623867 2695544 2708062 2560103 2521661 2551020 2717932 2685118 2594075 2628570
15963 2628570 2689301 2584856 2577294 2705933 2653384 2592958 2638103 2731303 2676595 2538563 2680691
15952 2680691 2806622 2690725 2718712 2579742 2706691 2691378 2617108 2779149 2764409 2668623
15942 2668623 2525229 2514799 2718758 2642175 2603303 2649319 2607255 2689900 2766436 2814514 2723753
15931 2723753 2624247 2680217 2699364 2677920 2536249 2511659 2683181 2652562 2581263 2675323 2740692
15920 2740692 2712637 2636435 2562726 2722858 2554619 2572012 2703339 2726457 2785057 2705092 2737426
15909 2737426 2704202 2614380 2699264 2730791 2729946 2686776 2582431 2686145 2590252 2617588 2722402
15898 2722402 2710535 2768694 2706193 2791864 2826345 2727785 2777518 2782063 2760043 2679979 2616690
15887 2616690 2831674 2829180 2732499 2746456 2715340 2705285 2733560 2730714 2695093 2622519 2668336
15876 2668336 2816670 2622765 2723308 2660801 2579079 2686810 2646828 2684360 2760649 2848908
15866 2848908 2708322 2657181 2716734 2861028 2729139 2758623 2812227 2859973 2898856 2779250
15856 2779250 2703043 2631860 2727168 2757592 2645487 2705912 2713628 2806215 2892144 2736255 2713530
15845 2713530 2565257 2590781 2715579 2630101 2704498 2639345 2669459 2755466 2764165 2655334 2667762
15834 2667762 2699250 2671846 2593479 2707212 2701938 2715628 2677248 2596356 2693536 2700944 2730693
15823 2730693 2740206 2759188 2723998 2774559 2791077 2652910 2716012 2813317 2738797 2704063 2706420
15812 2706420 2602729 2710872 2688623 2638999 2762793 2651569 2653869 2587825 2740530 2713289
15802 2713289 2760489 2727905 2830592 2736327 2725184 2771138 2746456 2862465 2841823 2890722 2789623
15791 2789623 2756002 2730610 2842190 2740487 2685559 2683625 2670599 2547769 2671027 2719953 2647206
15780 2647206 2799429 2781230 2812073 2695523 2688873 2661273 2748255 2653093 2797815 2750393 2778230
15769 2778230 2761283 2679092 2755854 2642171 2633527 2726031 2737869 2763396 2729110 2777025 2834460
15758 2834460 2678132 2736379 2740155 2802615 2814454 2797439 2856719 2715672 2644402 2617190 2649905
15747 2649905 2683285 2605959 2698568 2716690 2637119 2716806 2748594 2741659 2676536 2677627 2705833 2700018
15735 2700018 2725053 2679213 2716174 2710102 2660075 2726903 2767731 2635740 2795729 2774801 2868306
15724 2868306 2817424 2747214 2841119 2745971 2852480 2888296 2810600 2725820 2686452 2821917 2772612
15713 2772612 2682848 2701579 2603754 2689408 2738329 2708172 2748186 2676611 2746235 2683895 2575821
15702 2575821 2708836 2671990 2845744 2892383 2638153 2782933 2643302 2780529 2697083 2651171
15692 2651171 2801981 2695517 2665348 2740157 2825024 2848727 2738101 2659860 2791802 2629353
15682 2629353 2656717 2552718 2577471 2641961 2655835 2650969 2608544 2790206 2677890 2682142 2712897
15671 2712897 2601299 2623311 2816458 2694583 2724670 2603620 2667756 2745114 2587553 2639064
15661 2639064 2677125 2815884 2733118 2833550 2812731 2789020 2709564 2880943 2736054 2686634
15651 2686634 2698088 2848558 2839912 2815304 2836068 2787387 2713423 2559265 2703635 2775615 2785641
15640 2785641 2676179 2818330 2816174 2767868 2737183 2901774 2955850 2796678 2829527 2832913 2797611
15629 2797611 2669685 2733477 2828329 2727990 2747080 2838808 2739252 2747111 2736148 2754231 2751673
15618 2751673 2722878 2769000 2880398 2815363 2762902 2761637 2778344 2782296 2653958 2906576 2884716
15607 2884716 2912579 2855172 2925156 2918004 2800177 2755958 2681024 2705724 2749954 2772716 2814166
15596 2814166 2818868 2709660 2889979 2862420 2812555 2787227 2721983 2806263 2847268 2805430 2877944
15585 2877944 2807952 2754270 2753244 2785109 2873545 2679032 2746374 2698918 2730483 2707542 2787407
15574 2787407 2797227 2743253 2826737 2899296 2812671 2718560 2672912 2727036 2830140 2763470 2866650
15563 2866650 2854246 2817592 2833120 2780195 2749643 2719176 2775455 2815047 2774284 2797541 2737849
15552 2737849 2721969 2697528 2562209 2723578 2837703 2607202 2630114 2751696 2727470 2634805
15542 2634805 2713827 2766309 2779634 2686069 2661146 2833306 2797332 2794663 2847820 2919962 2842064
15531 2842064 2760822 2767630 2791675 2900201 2714927 2769329 2719837 2765010 2715928 2721811 2689464
15520 2689464 2764570 2682403 2775079 2666036 2724592 2983800 2826496 2907212 2802224 2760327
15510 2760327 2728305 2871225 2823376 2750805 2669858 2817322 2730231 2697624 2765252 2855831 2825887
15499 2825887 2660920 2824199 2755136 2782746 2724771 2752053 2870775 2796880 2739460 2840263
15489 2840263 2746282 2765502 2825914 2780392 2845567 2790779 2788697 2914552 2824989 2788298 2901858
15478 2901858 2868929 2852171 2755957 2810405 2876061 2871283 2746453 2770919 2860857 2856580 2783671
15467 2783671 2883411 2866492 2874981 2915148 2799977 2796875 2729493 2855641 2853062 2859682 2827961 2886338
15455 2886338 2880440 2770205 2728526 2850314 2817908 2810405 2807084 2804617 2895114 2800322 2821628 2815224
15443 2815224 2845596 2810342 2802901 2788053 2808057 2674675 2766213 2791452 2859951 2789077 2772715
15432 2772715 2900522 2831775 2814658 2691872 2695492 2908126 2845943 2795886 2810727 2758253 2783529
15421 2783529 2692336 2651292 2795039 2821949 2948212 2820123 2729208 2863627 2790951 2819613
15411 2819613 2750540 2779830 3002477 2927047 2860803 2921721 2779942 2827106 2773062 2818756 2940635
15400 2940635 2784998 2892813 2849546 2890010 2803352 2803402 2897956 2769123 2821850 2800105 2832790
15389 2832790 2875257 2937086 2876316 2923190 2872316 2896050 2783564 2800791 2884595 2832969 2920216
15378 2920216 2911186 2921923 2845852 2781785 2790891 2816196 2823447 2876825 2836382 2738531 2760125 2769251
15366 2769251 2780265 2720547 2648951 2723059 2840063 2860331 2907758 2785501 2869622 2839699 2789804
15355 2789804 2852534 2854717 2909349 2822944 2807633 2841353 2780338 2808670 2758139 2736421 2860336
15344 2860336 2781361 2779114 2860851 2817688 2870062 2814622 2854941 2871596 2817799 2840058 2864290
15333 2864290 2903296 2913125 2838958 2942325 2813813 2771633 2858930 2900453 2936791 2799973 2914012
15322 2914012 2808984 2912328 2747103 2836715 2965884 2794210 2785441 2950879 2904828 2840954
15312 2840954 2864013 2812890 2794977 2692581 2798283 2892176 2969658 2851646 2946843 2974477 2884687
15301 2884687 2842509 2856327 2933284 2896916 2921401 2952770 2937150 2866050 2964122 3055878 2932841
15290 2932841 2928229 2950213 2926285 2900488 2911533 2904199 2800956 2758036 2911766 2853964 2848472
15279 2848472 2805300 2765873 2901972 2849355 2873386 2920889 2939182 2811398 2905756 2939769 2923501
15268 2923501 2870536 2900895 3010772 2965022 2781400 2823783 2899652 2877405 2876295 2878533 2910871
15257 2910871 2753651 2776609 2824593 2913237 2889599 2790633 2882196 2761983 2750349 2776803 2783316
15246 2783316 2892244 2861575 2939480 2974955 2852745 2853797 2815958 2844120 2879843 2841771 2942670
15235 2942670 2864130 2867316 2946632 2838331 2800080 2731573 2790017 2838423 2776002 2855854 2894513
15224 2894513 2991601 2939881 2904361 2918743 2832270 2851297 2968024 2975324 2908788 2883739 2857563
15213 2857563 2880944 2804301 2852180 2897256 2923022 2906836 2863210 2904299 2878639 2858415 2969209
15202 2969209 3080999 2950002 2892678 2843851 2812246 2865290 2802300 2993234 3063318 2924811
15192 2924811 2882132 2815732 2891329 2938766 2947803 2958140 2916474 2803003 2881062 2940347 2894367
15181 2894367 2889363 2904596 2892090 2824310 2996885 3044632 2858504 2825066 2927294 2980792 2946093
15170 2946093 2895298 2968987 2886618 2770105 2936427 2891920 2916680 2874411 2896331 2964815 2967399
15159 2967399 2976056 3008974 2917387 2854707 2819324 2924837 2930742 2846653 2939355 2908363 2856899
15148 2856899 2803542 2863367 2886453 2880598 2916066 3019260 2913933 2844652 2957387 3030907 2928569
15137 2928569 2857829 2813379 2950505 2919185 2803148 2756416 2743851 2984880 2950638 2938987 2905024
15126 2905024 2947366 3028250 2939026 3006348 2958176 2941072 3015281 2989682 2815378 2889343 2860281
15115 2860281 3045644 2954638 2902676 2960164 2932542 2943872 2907093 2923794 2908663 2920072 2907312
15104 2907312 3074517 2928417 3030136 2996326 2934079 2928155 2844141 2951541 2907919 2923759 2965389
15093 2965389 2910851 2773179 2832071 2857902 2920563 2807149 2855528 2894371 2909227 2932796 2901375
15082 2901375 2981556 2837118 2877160 2874371 2934533 2745225 2738855 2751039 2918683 3019441 2967458
15071 2967458 2960620 2992818 2950498 2934851 2980752 2890449 2964448 2933082 2980152 3022132 2853796
15060 2853796 2923173 2817365 2776922 2886404 2981736 3054862 2866160 2805718 2907581 2960094
15050 2960094 2975890 2975422 2956363 2944814 2954630 2993362 3020683 3094002 2999421 3051615 3099935 3024005
15038 3024005 3031676 2992350 2868566 2863567 2972152 3005974 3126026 3042913 2971927 2939096 3024757
15027 3024757 3035926 2941558 2911503 2982846 2936722 2942436 2954889 2846229 2932083 2846385 2916118
15016 2916118 2918118 2927940 2916234 2916666 2934455 2926589 2877770 3023506 3050739 2959765 2962760 2939103
15004 2939103 2917175 2921115 2877352 2901133 2829058 2883368 2790167 2801742 2938983 2897247 2859332
14993 2859332 2805388 2934993 3039349 2951555 2926848 3002566 3009228 3057624 2938886 3028116 2956842
14982 2956842 2871894 2933794 2934570 2924384 2997277 2997808 3047768 2975014 2961916 2977184 2963501 2864373
14970 2864373 2841014 2955846 2884918 2960602 2933750 2916531 2909764 2954609 3009173 3116077 2945622
14959 2945622 3030761 3042005 2925495 2954925 2815075 2956280 2934776 2868208 2829440 2911125 2955283
14948 2955283 2978114 3033490 3001958 2929330 2936441 2980141 2901526 2941556 2917815 3040353 2999544
14937 2999544 2959773 2960255 2992717 2992689 2955552 2934640 2977105 2963001 3020890 2939759 2867697 3000308
14925 3000308 2907202 2937305 2927794 2933500 3006911 2991722 2956453 3127583 2968783 2931551 2948413
14914 2948413 2907813 2932747 2980765 3029639 3042590 2976930 2940747 2984171 2998593 3026290 3034134
14903 3034134 3123465 3090373 3030077 3016577 2966557 2998158 2984786 2979275 3022558 3025794 3047045 3066678
14891 3066678 3008668 3079425 2964531 3029344 3004239 2932613 3129006 3036201 2847270 2853375 2895290
14880 2895290 2984703 2868817 2750611 3030908 2884494 2876164 2926578 2874823 2931045 2893556 2917498
14869 2917498 3067874 2963048 2982421 2899726 3052480 3066816 2928752 3111902 3072039 3006337
14859 3006337 2903061 2930339 2992647 2997852 3074262 2957099 2785705 2983205 3043499 3050352 2994792
14848 2994792 2932555 3002866 2971202 2920079 2957730 2916213 2960528 3051770 2942392 3089023 3062266
14837 3062266 3048973 3061816 2942746 3070643 3121981 2993593 2969857 2941083 2977274 3031233 3001572
14826 3001572 2979692 2802678 2958593 3027416 3021288 2992304 2932448 2950349 3019418 2946158 3064771
14815 3064771 2938519 2886585 2986656 3011850 3121530 3111194 3238783 3124762 3057068 2960697
14805 2960697 2981403 2914223 2982417 2866680 2970516 3039101 2927455 3035534 3011448 2973400
14795 2973400 2932284 3007851 2981431 3043972 2904209 2995131 3054176 2997792 3072317 3096620 3071612
14784 3071612 3028447 3063535 3041007 2996295 2867947 3042540 3154155 3011540 2941332 2996266
14774 2996266 3023822 3039879 3061923 3003563 3029798 3010677 3052883 3042950 3125832 3097056 3143096
14763 3143096 3060192 2945470 3093882 3063209 3025790 2932176 2983267 2981897 3014769 2965758 3116701
14752 3116701 3071143 2990306 3122821 3169045 3142855 2989857 3205038 3202312 3153007 2953221 2968289
14741 2968289 2969966 2990352 2928282 3020604 3123544 2978500 3002215 2948123 3052939 3026168 3089872
14730 3089872 3079389 3100855 2983695 3009922 3010204 3122551 3010729 3032828 3099502 3042326 2985356
14719 2985356 2942370 2938604 2990669 3005747 2951073 2981729 3033345 3016947 2942924 3005219 3096071
14708 3096071 3064531 2998268 3080633 3032175 3145259 3045375 3074976 3052299 3066937 3105620 3094444
14697 3094444 2967536 2893102 2940552 3042346 3076056 3043843 3037686 2959004 3074286 3052844 3086267
14686 3086267 3005573 2993447 3131272 3073675 3054165 3069867 3025963 3077518 3015807 3147049 3281419
14675 3281419 3042504 2967735 2840683 3067963 3061719 2871952 3006451 2986219 2982950 3029746 3040759
14664 3040759 3183420 3078526 3025959 3143827 3118985 3135524 3006913 3107875 3067838 3018020
14654 3018020 3127590 3092137 3162138 3119852 3045000 3128021 3009770 3032540 3044537 3108524 3193136
14643 3193136 3002873 3038116 2984797 2955586 3014113 3101070 3122662 3086113 3078808 3119844 3165405
14632 3165405 3073984 3007257 3072261 3048677 2941687 3091390 2998652 3086237 3138997 3143222 3171243
14621 3171243 3069169 3098556 3059358 3038027 2918574 2993472 3018829 3064196 3026897 3060277 3200094
14610 3200094 3092306 3091528 2981341 2964110 3009142 3166499 3127674 3103686 3015967 3098586 3039075
14599 3039075 2983571 3105303 3126797 3266952 3097909 3115339 2986503 3027498 3003168 3019680
14589 3019680 3026429 3052550 3030121 3143445 3026417 3053488 3117214 3147879 3183622 3013951 3126926
14578 3126926 3140909 3092961 3062434 3164125 3156094 3266851 3190761 3200931 3102328 3110084 3114232
14567 3114232 3088914 3063353 2974095 3230578 3183953 2964712 2954694 3079804 3125904 3019331
14557 3019331 2904615 3072562 3068257 3093414 3126811 3206911 3204152 2949188 3042377 3116753 3088232
14546 3088232 3055762 3128058 3156925 3149458 3129991 3124138 3069804 3029129 3009347 3022210 3094267 3024392
14534 3024392 3034223 3107065 3191578 3125342 3161388 3197427 3094270 3130716 3088692 3056450 3049276
14523 3049276 3202465 3273073 3258265 3203627 3268747 3162294 3078299 3011977 3133910 3134248 3037604
14512 3037604 3099701 3090010 3164835 3111372 3166440 3168219 3180469 3121293 3128384 3143060 3154906 3057419
14500 3057419 3211830 3257232 3118826 3030612 2937651 3068129 3068109 3118202 3203059 3236349 3163795
14489 3163795 3207289 3179903 3164816 3067633 3154620 3170563 2995763 3053018 3053426 3100577 3168491
14478 3168491 3094691 3117307 3119890 3105017 3129396 3017066 3073785 3109034 3174964 3135905 3044749
14467 3044749 3165701 3159013 3211748 3249852 3167989 3271627 3120127 3186689 3174270 3149146 3128883
14456 3128883 3082347 3259445 3282334 3146285 3142550 3135845 3197754 3223192 3210621 3392652 3160891
14445 3160891 3111148 3188894 3144908 3086944 3098594 3169397 3171329 3058052 3029322 3174021 3172804
14434 3172804 3157745 3091705 3069133 3073796 3144043 3157340 3290594 3204235 3132343 3212290 3197118
14423 3197118 3055736 2945176 3125171 3167280 3112405 3048738 3215525 3155856 3107004 3072903
14413 3072903 3129292 3138439 3111859 3193868 3268534 3112789 3091805 3189106 3122730 3127248 3113126
14402 3113126 3220964 3146072 3098212 3049584 3152452 3061670 3081210 3111446 3113177 3092067 3180653
14391 3180653 3259965 3276118 3191244 3105196 3273550 3235077 3102528 3055494 3127962 3012270 3102747
14380 3102747 3062517 3149748 3058912 3137764 3171430 3217583 3207405 3256628 3215035 3009066 3103517
14369 3103517 3201519 3189872 2952994 3148053 3225311 3260186 3041228 3046208 3065977 3079772 3100264
14358 3100264 3107146 3139448 3196733 3265924 3255773 3214709 3119339 3094003 3023472 3074199 3066971 3132939
14346 3132939 3210647 3248264 3267785 3280993 3238295 3111212 3071214 3202876 3293169 3229702 3299665
14335 3299665 3242613 3224653 3231648 3126857 3091870 3072968 3150352 3194149 3215360 3135225 3230866
14324 3230866 3141056 3084491 3156467 3168198 3221347 3087562 3120960 3108263 3110841 3148340 3214248
14313 3214248 3225882 3164943 3093303 3174375 3195907 3168945 3168955 3189281 3183661 3171706 3115296 3068055
14301 3068055 3197779 3051502 3157895 3146716 3295315 3278796 3304303 3339190 3216803 3241163
14291 3241163 3236242 3239330 3287851 3100615 3142368 3271199 3149618 3210622 3054845 3204920 3245968
14280 3245968 3189940 3249200 3313084 3322916 3325647 3209083 3253212 3111555 3174729 3285389 3115660
14269 3115660 3206839 3149581 3293360 3262219 3151390 3316014 3346316 3083933 3181768 3301047
14259 3301047 3477320 3307050 3090412 3178899 3092563 3190348 3266987 3329293 3155768 3100230
14249 3100230 3227612 3380313 3122440 3161912 3190892 3243593 3185830 3178673 3406162 3304427
14239 3304427 3314559 3192908 3188071 3224786 3344015 3274997 3263209 3043292 3230107 3217439 3184829
14228 3184829 3107151 3247753 3331504 3223797 3281185 3262717 3346460 3206251 3286776 3207009 3283531
14217 3283531 3293335 3367412 3449357 3352367 3289783 3377937 3285832 3356723 3278031 3294073 3399780
14206 3399780 3133583 3213454 3202731 3235571 3263192 3194201 3227537 3190063 3164855 3208238 3166556
14195 3166556 3284087 3377541 3248766 3254790 3250812 3240673 3199902 3253054 3271810 3420724 3299315
14184 3299315 3254856 3348385 3275991 3185202 3182099 3196272 3135580 3149858 3276962 3262613 3179157
14173 3179157 3196048 3236249 3256200 3200673 3198734 3142119 3230901 3256461 3274160 3264771 3126286
14162 3126286 3237211 3380737 3253528 3192181 3274233 3292675 3308445 3294134 3353490 3171219
14152 3171219 3259559 3376072 3401377 3356409 3216742 3378159 3385931 3351714 3333065 3342990 3464067
14141 3464067 3376964 3305048 3384836 3344599 3310596 3216384 3373311 3337244 3188315 3263019 3178638
14130 3178638 3273450 3282677 3311887 3299637 3191328 3265608 3277995 3296735 3300897 3321390 3441385
14119 3441385 3307978 3330754 3448248 3256046 3345728 3275619 3320296 3307710 3260072 3325874 3186244
14108 3186244 3141389 3220734 3158451 3295323 3320689 3358181 3303380 3149987 3196024 3179119 3289263
14097 3289263 3195134 3183309 3309302 3250315 3239019 3212511 3234645 3272255 3301460 3293095 3268473
14086 3268473 3319078 3421678 3362109 3409017 3396055 3383783 3381065 3339502 3336960 3368340 3368333 3215322
14074 3215322 3266499 3214407 3232001 3263886 3326953 3397462 3381149 3444111 3387523 3238183 3356290
14063 3356290 3412401 3225334 3228505 3312905 3470644 3438210 3343401 3290800 3338801 3338803 3349368 3325945
14051 3325945 3219335 3254813 3220072 3328226 3341703 3457619 3368351 3349111 3197659 3142447
14041 3142447 3378075 3335108 3204475 3304474 3352294 3230165 3236119 3289919 3445878 3281966
14031 3281966 3349887 3521269 3290711 3288453 3268666 3215170 3235389 3123685 3348459 3507536
14021 3507536 3335987 3354057 3410769 3457910 3360814 3225882 3326796 3183892 3275520 3271072 3284196
14010 3284196 3199770 3179626 3318519 3321410 3313911 3333646 3419726 3333492 3404976 3300370 3420260
13999 3420260 3436706 3434191 3348858 3364556 3238971 3317962 3267124 3224739 3269502 3268491 3364192
13988 3364192 3242232 3300037 3240915 3361470 3324276 3370894 3399354 3426325 3308223 3260065 3348806
13977 3348806 3317670 3271746 3124890 3264293 3353876 3362348 3217041 3325684 3328995 3236788 3236722
13966 3236722 3253603 3394847 3315708 3302159 3339575 3353471 3364386 3380224 3311903 3421556 3229703
13955 3229703 3358979 3320491 3249632 3380150 3281413 3457759 3396326 3389243 3412394 3290410 3349320
13944 3349320 3418502 3278331 3480301 3285261 3384400 3441949 3248421 3352461 3210405 3353640
13934 3353640 3256369 3263974 3374016 3270530 3247840 3495096 3426442 3350019 3288105 3347794 3402345
13923 3402345 3351269 3459336 3419030 3378537 3419715 3392272 3449546 3314148 3209206 3419288
13913 3419288 3311578 3281936 3325157 3309164 3353582 3302754 3287914 3438609 3427788 3347325 3253652
13902 3253652 3300176 3375889 3369323 3444718 3387316 3337312 3507928 3422496 3351517 3288231 3271011
13891 3271011 3328594 3280268 3266505 3376480 3373474 3397268 3409174 3373355 3461339 3404221 3447371
13880 3447371 3406207 3326324 3324412 3447426 3444681 3374613 3359654 3450435 3469733 3400568 3482925
13869 3482925 3391105 3359491 3402820 3475646 3408487 3492197 3382748 3395692 3380788 3316856 3408300
13858 3408300 3420327 3426516 3426994 3424794 3262013 3432569 3439967 3492034 3479264 3443774 3468481 3427280
13846 3427280 3350416 3469149 3514118 3426304 3404961 3342269 3357284 3461197 3484268 3392956 3437287
13835 3437287 3347382 3382121 3416752 3425889 3340124 3309977 3339926 3323258 3328746 3344210 3488095
13824 3488095 3359596 3464581 3341479 3436289 3396036 3374845 3366756 3314072 3344824 3346939 3374948
13813 3374948 3387638 3472178 3455817 3477331 3274227 3475098 3477045 3454104 3488592 3494701 3465195
13802 3465195 3331171 3426949 3423648 3384356 3353895 3371656 3454743 3311073 3189966 3469663 3501847
13791 3501847 3388248 3328224 3436698 3459176 3348718 3479287 3527875 3669244 3471044 3496076
13781 3496076 3588903 3525510 3633606 3541913 3337344 3340729 3359261 3499259 3440397 3465266 3572037
13770 3572037 3562637 3615906 3494951 3486267 3386821 3283998 3399633 3351281 3370761 3424823 3442320
13759 3442320 3489046 3382321 3444773 3412221 3332865 3471711 3405796 3431272 3396285 3318497 3391533
13748 3391533 3424859 3468424 3465181 3430876 3407185 3413340 3541093 3573725 3501981 3555576 3525099
13737 3525099 3555456 3495695 3414288 3462955 3350174 3400484 3498551 3417725 3430020 3417691 3485687
13726 3485687 3512165 3445849 3543953 3470742 3349789 3512038 3443454 3505671 3520655 3394848 3441911
$$ [...]
##END NTUPLES=NMR SPECTRUM
##END=
