##TITLE=1H_CG-1177
 CDCl3
 8 sc, 
 27.10.2023
##JCAMPDX= 6.0         $$ Bruker NMR JCAMP-DX V2.0
##DATA TYPE= NMR SPECTRUM
##DATA CLASS= NTUPLES
##ORIGIN= UXNMR, Bruker Analytische Messtechnik GmbH
##OWNER= root
$$ XWIN-NMR		Version 3.5
$$ Fri Oct 27 16:04:20 2023 Russian Standard Time (UT+4h)  she@DPX200
##.OBSERVE FREQUENCY= 200.13135
##.OBSERVE NUCLEUS= ^1H
##.ACQUISITION MODE= SIMULTANEOUS
##.ACQUISITION SCHEME= undefined
##.AVERAGES= 8
##.DIGITISER RES= 18
##SPECTROMETER/DATA SYSTEM= spect
##.PULSE SEQUENCE= zg30
##.SOLVENT NAME= CDCl3
##.SHIFT REFERENCE= (INTERNAL, CDCl3, 0, 15.7315)
##AUDIT TRAIL= $$ (NUMBER, WHEN, WHO, WHERE, WHAT)
$$ ##TITLE= Audit trail, XWIN-NMR		Version 3.5
$$ ##JCAMPDX= 5.01
$$ ##ORIGIN= Bruker BioSpin GmbH
$$ ##OWNER= she
$$ F:/spectra/data/she/nmr/H-F/1/pdata/1/auditp.txt
$$ ##AUDIT TRAIL=  $$ (NUMBER, WHEN, WHO, WHERE, WHAT)
(   1,<2023-10-27 16:03:14.12 +0400>,<she>,<DPX200>,
      <created by zg, POWCHK disabled, PULCHK disabled
       configuration hash MD5:
       00 E9 B6 7A A2 85 ED C7 34 08 36 98 17 FE 4E 26
       data hash MD5: 16K
       D8 6B 2D E7 B5 56 9A 1F E0 39 D5 D7 92 03 31 76>)
(   2,<2023-10-27 16:03:16.70 +0400>,<she>,<DPX200>,
      <Start of raw data processing
       efp BC_mod = 2 LB = 0.24 FT_mod = 6 PKNL = 1 PHC0 = -23870.55 PHC1 = 10.65273 SI = 16K 
       data hash MD5: 16K
       66 1F 72 92 8C D6 34 5E AF F5 0E 66 87 4F 15 05>)
(   3,<2023-10-27 16:03:38.39 +0400>,<she>,<DPX200>,
      <pk PHC0 = -6.437616 PHC1 = 7.200001 
       data hash MD5: 16K
       1E 3F 71 1C 1C 12 62 AB B6 EE 5B D9 FC 2B C4 54>)
(   4,<2023-10-27 16:03:42.45 +0400>,<she>,<DPX200>,
      <abs ABSG = 5 
       data hash MD5: 16K
       33 B8 2F 95 D6 A9 45 E3 F0 ED D9 AB A0 F4 98 1E>)
$$ ##END=
$$ 
$$ hash MD5
$$ 8F 8F 4E C2 18 C5 1B 36 D5 3C DA 1F 81 B5 44 98
##$RELAX= 
##$RELAX= 
##$RELAX= 
##$RELAX= 
##$RELAX= 
##$RELAX= 
$$ Bruker specific parameters
$$ --------------------------
##$DU= <F:/spectra>
##$EXPNO= 1
##$NAME= <H-F>
##$PROCNO= 1
##$TYPE= <nmr>
##$USER= <she>
##$AMP= (0..31)
100 100 100 100 100 100 100 100 100 100 100 100 100 100 100 100 100 100 
100 100 100 100 100 100 100 100 100 100 100 100 100 100 
##$AQSEQ= 0
##$AQ_mod= 1
##$AUNM= <au_zg>
##$AUTOPOS= <>
##$BF1= 200.13
##$BF2= 200.13
##$BF3= 200.13
##$BF4= 200.13
##$BF5= 200.13
##$BF6= 200.13
##$BF7= 200.13
##$BF8= 200.13
##$BYTORDA= 1
##$CFDGTYP= 0
##$CFRGTYP= 5
##$CHEMSTR= <none>
##$CNST= (0..31)
1 1 145 1 1 1 1 1 1 1 1 1 1 1 1 1 1 1 1 1 1 1 1 1 1 1 1 1 1 1 1 1 
##$CPDPRG= <>
##$CPDPRG1= <>
##$CPDPRG2= <>
##$CPDPRG3= <>
##$CPDPRG4= <mlev>
##$CPDPRG5= <mlev>
##$CPDPRG6= <mlev>
##$CPDPRG7= <mlev>
##$CPDPRG8= <mlev>
##$CPDPRGB= <>
##$CPDPRGT= <>
##$D= (0..31)
0 1.2 0 0 0 0 0 0 0 0.06 0 0.03 0 0 0 0 0.0002 0 0 0 0 0 0 0 0 0 0 0 0 
0 0 0 
##$DATE= 1698408193
##$DBL= (0..7)
120 120 120 120 120 120 120 120 
##$DBP= (0..7)
150 150 150 150 150 150 150 150 
##$DBP07= 0
##$DBPNAM0= <>
##$DBPNAM1= <>
##$DBPNAM2= <>
##$DBPNAM3= <>
##$DBPNAM4= <>
$$ [...]
##$SUBNAM3= <"">
##$SUBNAM4= <"">
##$SUBNAM5= <"">
##$SUBNAM6= <"">
##$SUBNAM7= <"">
##$SUBNAM8= <"">
##$SUBNAM9= <"">
##$SW= 18.05172834244
##$SWIBOX= (0..15)
0 0 2 0 0 0 0 0 0 0 0 0 0 0 0 0 
##$SW_h= 3612.71676300578
##$TD= 16384
##$TD0= 1
##$TE= 0
##$TE2= 300
##$TE3= 300
##$TEG= 300
##$TL= (0..7)
0 120 120 120 120 120 120 120 
##$TP= (0..7)
150 150 150 150 150 150 150 150 
##$TP07= 0
##$TPNAME0= <>
##$TPNAME1= <>
##$TPNAME2= <>
##$TPNAME3= <>
##$TPNAME4= <>
##$TPNAME5= <>
##$TPNAME6= <>
##$TPNAME7= <>
##$TPOAL= (0..7)
0.5 0.5 0.5 0.5 0.5 0.5 0.5 0.5 
##$TPOFFS= (0..7)
0 0 0 0 0 0 0 0 
##$TUNHIN= 0
##$TUNHOUT= 0
##$TUNXOUT= 0
##$USERA1= <user>
##$USERA2= <user>
##$USERA3= <user>
##$USERA4= <user>
##$USERA5= <user>
##$V9= 5
##$VALIST= <valist>
##$VCLIST= <CCCCCCCCCCCCCCC>
##$VD= 0
##$VDLIST= <DDDDDDDDDDDDDDD>
##$VPLIST= <PPPPPPPPPPPPPPP>
##$VTLIST= <TTTTTTTTTTTTTTT>
##$WBST= 1024
##$WBSW= 4
##$XGAIN= (0..3)
0 0 0 0 
##$XL= 0
##$YL= 0
##$YMAX_a= 101740
##$YMIN_a= -147253
##$ZGOPTNS= <>
##$ZL1= 120
##$ZL2= 120
##$ZL3= 120
##$ZL4= 120
##$ABSF1= 15.74138
##$ABSF2= -2.31047
##$ABSG= 5
##$ABSL= 3
##$ALPHA= 0
##$AQORDER= 0
##$ASSFAC= 0
##$ASSFACI= 0
##$ASSFACX= 0
##$ASSWID= 0
##$AUNMP= <proc_1d>
##$AZFE= 0.1
##$AZFW= 0.1
##$BCFW= 0
##$BC_mod= 2
##$BYTORDP= 0
##$COROFFS= 0
##$CY= -3
##$DATMOD= 1
##$DC= 0
##$DFILT= <>
##$DTYPP= 0
##$F1P= 0
##$F2P= 0
##$FCOR= 1
##$FTSIZE= 16384
##$FT_mod= 6
##$GAMMA= 0
##$GB= 0
##$INTBC= 1
##$INTSCL= 3.70164e-10
##$ISEN= 128
##$LB= 0.24
##$LEV0= 0
##$LPBIN= 0
##$MAXI= 10000
##$MC2= 0
##$MEAN= 0
##$ME_mod= 0
##$MI= 1.114404
##$NCOEF= 0
##$NC_proc= -8
##$NLEV= 6
##$NOISF1= 3.799351
##$NOISF2= 2.8
##$NSP= 0
##$NTH_PI= 0
##$NZP= 0
##$OFFSET= 15.73146
##$PC= 1
##$PHC0= -23876.99
##$PHC1= 17.85273
##$PH_mod= 1
##$PKNL= yes
##$PPARMOD= 0
##$PSCAL= 0
##$PSIGN= 0
##$REVERSE= no
##$SF= 200.130008019479
##$SI= 16384
##$SIGF1= 3
##$SIGF2= 2
##$SINO= 5.538805
##$SIOLD= 16384
##$SREGLST= <1H.CDCl3>
##$SSB= 0
##$STSI= 16384
##$STSR= 0
##$SW_p= 3612.71676300578
##$SYMM= 0
##$S_DEV= 0
##$TDeff= 16384
##$TDoff= 0
##$TI= <>
##$TILT= no
##$TM1= 0
##$TM2= 0
##$TOPLEV= 0
##$USERP1= <user>
##$USERP2= <user>
##$USERP3= <user>
##$USERP4= <user>
##$USERP5= <user>
##$WDW= 1
##$XDIM= 16384
##$YMAX_p= 411228178
##$YMIN_p= -8020929
$$ End of Bruker specific parameters
$$ ---------------------------------
##NTUPLES= NMR SPECTRUM
##VAR_NAME=  FREQUENCY,     SPECTRUM/REAL,   SPECTRUM/IMAG
##SYMBOL=    X,             R,               I
##VAR_TYPE=  INDEPENDENT,   DEPENDENT,       DEPENDENT
##VAR_FORM=  AFFN,          ASDF,            ASDF
##VAR_DIM=   16384,         16384,           16384
##UNITS=     HZ,            ARBITRARY UNITS, ARBITRARY UNITS
##FACTOR=    0.220516191357247, 1,           1
##FIRST=     3148.33713943135, 0,            0
##LAST=      -464.379623574431, 0,           0
##MIN=       -464.379623574431, -8020929,    0
##MAX=       3148.33713943135, 411228178,    0
$$ Real data points
##PAGE= N=1
##DATA TABLE= (X++(R..R)), XYDATA
$$ [...]
5606C2930N96324P35298L05846k56300j32521j21667k10376k4469k79714j01277
5596E44074k23726k67527M18642M55824Q9595J64083l43148k96063l8524k92746
5586B10484l3729K64210q4103K85861j119741l25486O92359j30083M10880N40519
5576G11171O3640r53181K95660L13885q16553j23359l14712j85201j85475o6157
5566a260282K16860L10633Q48074M72424J90900L68795q22678L17971Q7778l3028
5556F97447N05906p7656j35720k27632q5355l06013k85553J11556o94966M15999
5546h1987j29505o20903J023241J12559p74489O08463K74667k08541L19246L16869
5536H39620J49624k78248l10389O68024l08645n82505Q42638O09069l87636l82873
$$ y = [32930, 629254, 1364552, 1670398, 1414098, 1281577, 1159910, 949534, 925065, 645351, 544074, 320348, 52821, 471463, 927287, 1016882, 1180965, 837817, 541754, 503230, 210484, 176755, 440965, 356862, 642723, -477018, -802504, -110145, -240228, 170652, 711171, 774811, -178370, 117290, 431175, -385378, -508737, -823449, -1008650, -1194125, -1260282, -1043422, -732789, 115285, 587709, 778609, 1147404, 324726, 642697, 730475, 697447, 1203353, 1125697, 989977, 762345, 676990, 370977, 85424, 196980, -497986, -81987, -211492, -832395, 190846, 303405, -471084, 137379, 412046, 203505, 522751, 839620, 989244, 710996, 400607, 1068631, 759986, 177481, 1020119, 1629188, 1241552, 858679]
5526H58679q59541K98047M27687k41707j16976k42357j24242k296p00618j5746
5516g19070p6768L7194J098897K7876L50799M75099l78868j85405J56192L24896
5506A110842j25522K31293L93517o65561N45710L86634l62258N5860o77022J70268
5496A063761j22150l47225n09537Q7173O84615K23713j082970M14315M14866l25469
5486E01092J05762K9244m1417k22647K11595P61719J43957Q1976n67496k95634
5476G08151J826676o44553O3670J002246r64088n42897J3582n10125N77474M75973
5466B006109K83404k90436k16242R7542M09047o4628l62700l76705p92666k85925
5456D06800O06835k59215O40097M24236J5415J059294k19786m03087k6717j77351
$$ y = [858679, -862, 297185, 724872, 483165, 366189, 123832, -410, -2706, -703324, -719070, -795838, -758644, 340253, 368129, 718928, 1194027, 815159, 629754, 785946, 1110842, 985320, 1216613, 1610130, 944569, 1490279, 1876913, 1514655, 1570515, 893493, 1063761, 941611, 594386, 84849, 172022, 856637, 1080350, -2620, 411695, 826561, 501092, 606854, 636098, 594681, 372034, 583629, 1345348, 1489305, 1571281, 1003785, 708151, 2534827, 1890274, 1953944, 2956190, 1992102, 1449205, 1462787, 952662, 1530136, 2006109, 2289513, 1999077, 1782835, 1880377, 2289424, 2224796, 1862096, 1485391, 692725, 406800, 1013635, 754420, 1394517, 1818753, 1834168, 2893462, 2673676, 2270589, 2243872, 2066521]
5446B066521M13254n07015j15130k06566j79599N3414O27403M56044o52885n60272
5436A395169q0414N56559J14708n7795N29751m7282n60120m77420k41559m80676
5426F50921k38732O93489k23448l16707j5775m11266j48472N80158N03154j14706
5416I58616l40036j02259m16872p8160K06553L63989N86440K31352J16384m23252
5406A102755M63040O73052o04620K6502O533m75341k36518M83358m1589o57174
5396G39998j71882O2497q44015K51014O78856m3018Q1868J78326q50269N62309
5386F45684O31267n78995M23167K4181p45914p51922k02879P65546M15784j52899
5376D73020J1882Q72661K42103J99451L50891j59299l9138r41316J3487M96713
$$ y = [2066521, 2479775, 1972760, 1857630, 1651064, 1471465, 1524879, 2152282, 2608326, 1955441, 1395169, 1314755, 1871314, 1986022, 1928227, 2457978, 2410696, 1850576, 1373156, 1131597, 650921, 412189, 1105678, 882230, 565523, 549748, 138482, -9990, 570168, 1073322, 958616, 618580, 516321, 99449, 21289, 227842, 591831, 1178271, 1409623, 1526007, 1102755, 1565795, 2238847, 1634227, 1660729, 1667262, 1191921, 955403, 1438761, 1397172, 739998, 568116, 630613, -213402, 37612, 716468, 673450, 755318, 933644, 83375, 645684, 1276951, 697956, 1121123, 1145304, 399390, -352532, -555411, 210135, 625919, 473020, 484902, 1357563, 1599666, 1799117, 2150008, 1990709, 1951571, 1010255, 1023742, 1520455]
5366A520455J9404O57067M40493q92710K28442K12556j469852l6633M29236q64527
5356B43931Q0887Q0535k01562k9933O36532N29523j20179j42260M0521m69235
5346F48760R46575K96979j210908l8560P49103J62706r977R21275k04765n38979
5336A722209Q52108j29045r12834l32588J1997p78966m54968J152683k70449p16644
5326A43503Q14318o37300r62864Q20963o29151m72075N46458M27657K44051J86505
5316D82065K71161O8498m75177k09678j93595q4585J233832K65975k21416K40477
5306A377557j53515n80964Q25499L63445p27258L13853L47087j50825r66421o4809
5296E83649m64327l73127L28309j52177Q7205j01533j18444N46747K93474m27279
$$ y = [1520455, 1539859, 2196926, 2637419, 1744709, 1973151, 2185707, 715855, 679222, 1108458, 243931, 324818, 405353, 203791, 173858, 810390, 1339913, 1219734, 1077474, 1117995, 648760, 1595335, 1892314, 681406, 642846, 1391949, 1554655, 1544678, 2465953, 2261188, 1722209, 2574317, 2445272, 1532438, 1199850, 1211847, 432881, -22087, 1130596, 860147, 143503, 957821, 320521, -642343, 178620, -450531, -922606, -376148, 51509, 295560, 482065, 753226, 821724, 346547, 136869, -56726, -141311, 1092521, 1358496, 1137080, 1377557, 1224042, 643078, 1468577, 1832022, 1104764, 1418617, 1765704, 1614879, 648458, 583649, 119322, -253805, 74504, -77673, 9532, -92001, -210445, 336302, 629776, 202497]
5286B02497p49827r0174P80613o75219P67943M76437j301949R77371N49811l28967
5276F08536K5833N83727n3898j226097R10779n24609o68410K91940j34948K33033
5266D5886l91006k59665m85595k45432N30093k30651K8787L79542l58846L57726
5256f29161Q14549L46996j54625O5940L80159p46026k51098J128104r19316l77874
5246c42352N03600l42439N27851N77387n68091j461906J93914K53908j073927
5237a732055O65877J243054p44761l88083J152763O57679n98545N9332l71048
5228e5787r76987M52423m7075q63949l41958N16718m63370l04170M15317P49325
5218i19513J06925O77189N70052r38077J73285L3928o13929M52012k52878k37159
$$ y = [202497, -547330, -637504, 143109, -532110, 235833, 712270, -589679, 387692, 937503, 608536, 634369, 1218096, 1164198, -61899, 848880, 324271, -344139, -52199, -187147, 45886, -345120, -604785, -1090380, -1335812, -805719, -1036370, -1007583, -628041, -986887, -629161, 185388, 532384, 377759, 443699, 823858, 77832, -173266, 954838, 35522, -342352, 161248, -181191, 346660, 924047, 355956, -1105950, -912036, -658128, -1732055, -1066178, 176876, -567885, -955968, 196795, 854474, 255929, 315261, -55787, -1032774, -580351, -627426, -1491375, -1833333, -1316615, -1779985, -2084155, -1668838, -919513, -812588, -135399, 434653, -503424, -330139, -296211, -910140, -458128, -711006, -948165]
5208i48165R3366M51490m10510p59874J418516M68169p94953J000926N01165n78865
5198D41265m11073O54160m9792q19696K72397L73138p89978o71868L80686N60349
5188f0412J20086n4350J47279L08326j28747l78622k73293K2908p03225N8848
5178i41202K40258L16386J2135n14198L80697L14408J87657J245074j58899k91314
5168G91002K31510p81949K65789Q30926N22809m36778N1252K230M36110M18591
5158B331492l45012k42852p68269l51371P39471J46016o1335p20960m45139m276
5148B77765m21389R27128O60928o84956P78349l11739p24391J173896Q24465J27714
5138B627770J91770M15276j15138r46534q0579l33835M3325J070306r2650q67244
$$ y = [-948165, -854799, -403309, -813819, -1573693, -155177, 312992, -481961, 518965, 1020130, 441265, 30192, 684352, 634560, -185136, 87261, 460399, -329579, -1001447, -620761, -60412, 59674, 5324, 152603, 460929, 332182, -46440, -319733, -296825, -1000050, -941202, -700944, -384558, -372423, -886621, -505924, -191516, -3859, 1241215, 1082316, 791002, 1022512, 240563, 506352, 1337278, 1860087, 1423309, 1474561, 1476791, 1912901, 2331492, 1986480, 1743628, 975359, 623988, 1363459, 1509475, 1448140, 727180, 282041, 277765, -143624, 783504, 1444432, 759476, 1537825, 1226086, 501695, 1675591, 2500056, 2627770, 2819540, 3234816, 3119678, 2173144, 2092565, 1758730, 1802055, 2872361, 2779711, 1912467]
5128A912467J72536M24330M87390k7798J06516J46223p9177o63541j8768l61711
5118B098467k14972J16385J13819K66146m84720o38774O83763q28814k70224Q44193
5108A685269r23046k46677K44210L7512J217104K3323P8174J277742j74541L37789
5098C556859l65384n60598m18965j169284J247317J38449K1079N51999o83374
5089B318098j09426J111549l0374L9891j027426r5145P12411k13089K28618M37147
5079C372254O1419j25870Q2292P85618K92618j054476N8207m76133n99261O65386
5069C062054M81932p35277k77212P46315J3270n90236J593635p264n71082M70473
5059D186608m70889m84536P54364K57679j90367o86673L28926J13396j017837
$$ y = [1912467, 2085003, 2509333, 2996723, 2968925, 3075441, 3221664, 3142487, 2478946, 2460178, 2098467, 1883495, 1999880, 2113699, 2379845, 1895125, 1256351, 1940114, 1111300, 841076, 1685269, 762223, 515546, 759756, 797268, 2014372, 2037695, 2115869, 3393611, 3219070, 3556859, 3191475, 2630877, 2211912, 1042628, 2289945, 2428394, 2449473, 3001472, 2318098, 2208672, 3320221, 3289847, 3329738, 2302312, 2207167, 2919578, 2706489, 2935107, 3372254, 3433673, 3307803, 3390095, 4175713, 4468331, 3413855, 3472062, 2995929, 2396668, 3062054, 3543986, 2808709, 2531497, 3277812, 3291082, 2700846, 4294481, 4287217, 3716135, 4186608, 3715719, 3231183, 3985547, 4243226, 4052859, 3366186, 3695112, 3808508, 2790671]
5050B790671L55833m59726m36699J235267k31402j04891j57755l33565P8816K55252
5040B991801k05580m56598j011072L49670j67040L07578N14466K34148m41321
5031B116052M4690K59128n8232l43439N74573L14799j65021K02840n07334o351
5021B431705K66610K79285J19028j045100L93661M90625o0473O23382j29295K19319
5011C588747o0462m37789n6560q01822q22179O65569J01576M73635O71619k4817
5001C297517l28117m12629j94785n4805M24966n61786j147298k51101j0831R9925
4991H61056R1166n65237n5699N30390j83703M51012l04727k77055q5528j088580
4981f26905K45393O95728l67841K5843L47494K54352M0662m24923M63003M73484
$$ y = [2790671, 3146504, 2686778, 2250079, 3485346, 3253944, 3149053, 2991298, 2657733, 2736549, 2991801, 2786221, 2329623, 1318551, 1668221, 1501181, 1808759, 2323225, 2557373, 2116052, 2160742, 2419870, 2361638, 2018199, 2592772, 2907571, 2742550, 2945390, 2438056, 2431705, 2698315, 2977600, 3096628, 2051528, 2445189, 2935814, 2875341, 3498723, 3369428, 3588747, 3528285, 3090496, 3033936, 2232114, 1409935, 2075504, 2177080, 2650715, 3322334, 3297517, 2969400, 2556771, 2361986, 2307181, 2732147, 2170361, 1023063, 771962, 761131, 861056, 952222, 386985, 331286, 861676, 677973, 1128985, 824258, 547203, 461675, -626905, -381512, 314216, -53625, -27782, 319712, 574064, 614726, 189803, 652806, 1126290]
4971A126290l84483k26058P0532k18244l85050K89719Q42867P79539j44537j135170
4961F15405R7539m1107j090483O68539J059611r43005l42374K86562l4337M07662
4951F84012P8564J84435L86548l662o13701N16779q18321m29320Q67260J35775
4941I88369k09143K28788j09348J015718n98463K67018R84094j040036O3140O13684
4931B203821k78832M08619K03113m60583m75605P51611M02077j13864n53728M61248
4921B547877K91766K4181J468500L4987o07537Q27329m15294J82591K60348m90776
4911D123972l06661m99907R65388Q82571o6633K09869j101486m16767R96747j76438
4901D610655m79330M11513p86478q83882Q84877Q96048M12404n34837r10019k46100
$$ y = [1126290, 741807, 515749, 586281, 368037, -17013, 272706, 1115573, 1895112, 1750575, 615405, 712944, 671837, -418646, 249893, 1309504, 366499, 24125, 310687, 276350, 684012, 762576, 947011, 1333559, 1329897, 716196, 1232975, 414654, -14666, 852594, 988369, 779226, 1008014, 898666, 1914384, 1315921, 1582939, 2567033, 1526997, 1590137, 2203821, 1924989, 2333608, 2536721, 2076138, 1600533, 2352144, 2754221, 2640357, 2086629, 2547877, 2839643, 2863824, 4332324, 4367311, 3759774, 4587103, 4171809, 4354400, 4614748, 4123972, 3817311, 3317404, 4282792, 5165363, 5098730, 5308599, 4207113, 3790346, 4787093, 4610655, 4131325, 4542838, 3756360, 2872478, 3757355, 4653403, 5065807, 4530970, 3620951, 3374851]
4891C374851J57652N24685n07578J75412J432938k94425j26765J191057J178767
4882G106594k64933m41461P17106j23416o62374O26095n23695k79018L39083j08578
4872F385403n39490K89819K05536l40720N82802J169268q19883p56815N96965
4863F772885Q18716L96832L19220J81273n77922j33315N34924j07851k79916O61087
4853H585933L63864P24951j47770O5397J03628o26799k86236J55158n07202j8719
4843H412205N21640n48795O36665L75192P01885J96412m84720Q9076j5458q79722
4833I004380M00758l21942l88506l23796M79052K1672k66379O33046M6229q18167
4823H466347r2481J06923l20551m46731L37061o43710k71181M65161j859k12024
$$ y = [3374851, 3532503, 4057188, 3549610, 3725022, 5157960, 4863535, 4736770, 5927827, 7106594, 6841661, 6400200, 7117306, 6993890, 6331516, 6957611, 6433916, 6154898, 6493981, 6385403, 5845913, 6135732, 6341268, 6000548, 6583350, 7752618, 6932735, 6175920, 6772885, 7591601, 7988433, 8307653, 8488926, 7911004, 7777689, 8312613, 8204762, 7924846, 8585933, 8949797, 9674748, 9526978, 9592375, 9696003, 9069204, 8782968, 8938126, 8430924, 8412205, 8933845, 8385050, 9021715, 9396907, 10098792, 10295204, 9810484, 9899560, 9884102, 9004380, 9405138, 9083196, 8694690, 8370894, 8849946, 8871618, 8605239, 9238285, 9284514, 8466347, 8373866, 8480789, 8160238, 7713507, 8050568, 7406858, 7135677, 7600838, 7598979, 7386955]
4813G386955N67142j534249j707213q0757l74246L88834P53764M31010N28028
4804F359268n49519J12559R36784q90389N28148R57139l4596p1780J42738L64779
4794G855131m17470P6799Q28387q44695j450928M28511P56901n28034p14787p9106
4784E910709j78653N33261K67237j255902k31631k18004o17278o5955R12240j31232
4774D924792k87869M66342L67532J074227Q9408o43456j88596q37056N27966p14645
4764D778645n42536M81820p64874l92346L73365o425K77559o91340p67881O9881
4754B815868l03284o68316r27216J13003R18374l12542M65528j52576j065007
4745H83832K6162J188898L16018J0922L43327J08139o02651o3521K33878J06615
$$ y = [7386955, 7954097, 6419848, 4712635, 4631878, 4257632, 4646466, 5400230, 5831240, 6359268, 5809749, 5922308, 6859092, 5968703, 6496851, 7453990, 7419394, 7347614, 7490352, 7855131, 7437661, 7514460, 8342847, 7498152, 6047224, 6475735, 7232636, 6704602, 5989815, 5910709, 5732056, 6265317, 6532554, 5276652, 5045021, 4827017, 4209739, 4143784, 5056024, 4924792, 4636923, 5103265, 5470797, 6545024, 6634432, 5990976, 5802380, 4965324, 5493290, 4778645, 4236109, 4717929, 3953055, 3560709, 3934074, 3927649, 4205208, 3513868, 2745987, 2815868, 2512584, 1844268, 917052, 1030055, 1948429, 1635887, 2101415, 1948839, 883832, 909994, 2098892, 2414910, 2425832, 2769159, 2877298, 2274647, 2211126, 2445004, 2551619]
4735B551619l00517J29498K85081m95589n43508j70087m8786L73397N39641J2354
4725B333103r35700Q1698L79842M53612P0165O3001K01428m12150L95725K45196
4715B875920r1744N36399k32759N24835J44618j294928o91605N44101N85144r1864
4705B808117j15431R7317j187847j74855N50324P28443N44326k32326K22865P40680
4695C981613K16476k58422J261898J81111N62125N14921j045258p45745n52312
4686D116407m97649M85337l70207M92441J24094L30471O53581q53590j800368
4677B680517L16478J37295k23114K03345N30501k10428N59758J7288K7420m65493
4667C573567m91910k31571n56996N26049N97293j72775K95351L90428l54568j12222
$$ y = [2551619, 2251102, 2380600, 2665681, 2170092, 1626584, 1456497, 1407711, 1781108, 2320749, 2333103, 1397403, 1479101, 1858943, 2312555, 2382720, 2445721, 2647149, 2234999, 2630724, 2875920, 2784176, 3320575, 3087816, 3612651, 3757269, 2462341, 1770736, 2314837, 2899981, 2808117, 2692686, 2790003, 1602156, 1427301, 1977625, 2706068, 3250394, 3018068, 3240933, 3981613, 4198089, 3939667, 5201565, 5382676, 5944801, 6459722, 5414464, 4668719, 4116407, 3618758, 4104095, 3733888, 4226329, 4350423, 4680894, 5334475, 4480885, 2680517, 2996995, 3134290, 2911176, 3114521, 3645022, 3434594, 3994352, 4011640, 4039060, 3573567, 3081657, 2850086, 2293090, 2819139, 3416432, 3243657, 3539008, 3929436, 3574868, 3462646]
4657C462646j05782K75847m58865j48213l9424m59744M1300L85860k79661M17293
4647C091257p88662l23014M82523j78857N73046M73949q96808j62681K10564r9786
4637B381531L59758k49607m8674K48113l36466K41835J36536p9825o6658L8747
4627B625290P40559L0422l64504q8139k99362m71599Q186J81594J53025l6343
4617B479129l89970M35098J02684m33574p69058n45793K93781R0125o3703J133174
4607B331893O42969O7702R33988J83580N22777m79317j86111j97080k32986O2247
4597C649662q55257k82630R54303m69336L23109O35731k87733q61038j23381n57312
4587B126118o18931M66011j75981o78944L20408K89398k20893j4038N29241l22393
$$ y = [3462646, 3356864, 3632711, 3173846, 3025633, 2986209, 2526465, 2567765, 2953625, 2673964, 3091257, 2302595, 1979581, 2462104, 2283247, 2856293, 3330242, 2433434, 2270753, 2481317, 2381531, 2741289, 2491682, 2443008, 2691121, 2354655, 2596490, 2733026, 2653201, 2586543, 2625290, 3365849, 3396271, 3031767, 2943628, 2644266, 2172667, 2180853, 2362447, 2515472, 2479129, 2089159, 2524257, 2626941, 2193367, 1424309, 878516, 1172297, 1262422, 1198719, 2331893, 2974862, 3042564, 3976552, 4160132, 4682909, 4203592, 4017481, 3820401, 3587415, 3649662, 2794405, 2511775, 3466078, 2996742, 3319851, 3955582, 3667849, 2806811, 2683430, 2126118, 1507187, 1973198, 1797217, 1118273, 1438681, 1728079, 1507186, 1493148, 2022389, 1699996]
4577A699996p91729L69390j18624o84098M84319J53985k06358R22190P12034j47758
4567B393347n24713k75952k41555p4473r63143q363L54871M22853R82716j88633
4557A876955l05194N87263L11103k96601p64882K98717m53695j305003O35065
4548E83728J447271K46311o05257l35013P44776q0322m4736J68094n1536o5870
4538B007446l76353p29568K49787p36734p28915J098600P12157l80771j16718
4529I98931k65626n7790L50081m64215K96508Q20127O01376O4728l09472m8802
4519A985846j185209l91160M02597j33431N61793M37225J51128n73193k09109
4510A046487O85716q8449M44721n72444q99103l43638k81494P10415j51626J97366
$$ y = [1699996, 908267, 1277657, 1159033, 474935, 959254, 1113239, 906881, 1829071, 2541105, 2393347, 1868634, 1592682, 1351127, 1276654, 313511, 305148, 660019, 1082872, 2065588, 1876955, 1571761, 2159024, 2470127, 2173526, 1408644, 1707361, 1253666, -51337, 583728, 2030999, 2277310, 1672053, 1337040, 2081816, 2001494, 1956758, 2124852, 2073316, 2007446, 1631093, 901525, 1151312, 414578, -314337, 784263, 1496420, 1115649, 998931, 733305, 675515, 1025596, 561381, 857889, 1678016, 2279392, 2344120, 2034648, 1985846, 800637, 409477, 812074, 678643, 1240436, 1677661, 1828789, 1255596, 1046487, 1732203, 1643754, 2088475, 1516031, 616928, 273290, -8204, 702211, 550585, 747951]
4500G47951J138432k90766J45842P19961L91210k5801q95901m81212J64940O453
4490A621109J113476P0896n89333j8405K0549Q7122M48727o67305L5035Q17658
4480B939529m51053l07489J15966J94659n0021K78870o1080k29380j3651N61389
4470B977739j36858r39019m45649N90792L30531m01527l85437L61531m56868M84388
4460A979623M13165n29047R2682L74573N09004n16895j86695J016055j90173r04864
4450B057428n11221N94549J182001O18198M82136M20712L06669Q42440p7162m53774
4440E461976k85194r68707r35396K6438j47414k77722M71096n9966p42312J94641
4430B737440r729j264000K12805Q33602l00106j23654k55171J032007M73805k40217
$$ y = [747951, 1886383, 1595617, 1741459, 2461420, 2852630, 2826829, 1930928, 1449716, 1614656, 1621109, 2734585, 2805481, 2216148, 2197743, 2218292, 2305414, 2754141, 2086836, 2121871, 2939529, 2488476, 2180987, 2296953, 2491612, 2441591, 2720461, 2659381, 2430001, 2416350, 2977739, 2840881, 1901862, 1456213, 2047005, 2377536, 1976009, 1590572, 1952103, 1495235, 1979623, 2392788, 1863741, 1956423, 2330996, 2840000, 2323105, 2136410, 3152465, 2962292, 2057428, 1546207, 2140756, 3322757, 3940955, 4423091, 4843803, 5150472, 5992912, 5915750, 5461976, 5176782, 4208075, 3272679, 3299117, 3151703, 2873981, 3345077, 3285111, 2542799, 2737440, 2727711, 1463711, 1676516, 2510118, 2210012, 2086358, 1831187, 2863194, 3336999, 3096782]
4420C096782J119167n98412n62027R17336j71783o54010J13710K02018R38307
4411D401088k61393J57528j92146j091953p1833N02826m3554k00810K30395P5508
4401C505656j49720j79042K87139j37372K00835J131255j35362k4640J660621
4392F159370N11090K47053K77638j22835m99219L21263J082993q42045n37572
4383F597736J115602j83277m92570O57934K02588o51241J69644M12441P63811
4374H592668P20602N65460M03990L40269j13612l84428j91177N87651l88393o53102
4364I479928J83477p5280o52993m7678o51480J08567O87708K92745J262612P07567
4354A1295173r24061o12074J076528L00506O60347J55518m01777m53068Q47678
$$ y = [3096782, 4215949, 3617537, 3055510, 3972846, 3801063, 3147053, 3260763, 3462781, 4401088, 4139695, 4297223, 4105077, 3013124, 2941291, 3444117, 3400563, 3199753, 3430148, 3505656, 3355936, 3176894, 3464033, 3326661, 3527496, 4658751, 4523389, 4498749, 6159370, 6670460, 6917513, 7195151, 7072316, 6573097, 6894360, 7977353, 7135308, 6597736, 7713338, 7530061, 7037491, 7695425, 7898013, 7246772, 7416416, 7828857, 8592668, 9313270, 9878730, 10282720, 10622989, 10509377, 10124949, 9933772, 10521423, 10133030, 9479928, 9663405, 9588125, 8935132, 8887454, 8235974, 8344541, 9032249, 9324994, 10587606, 11295173, 10371112, 9759038, 10835566, 11136072, 11796419, 11951937, 11550160, 11097092, 11944770]
4345A1944770J001885k21904k76288n52255q4038k97127K21750n72588q18112
4336A0346093P51683J17300p64595O0865m15987N90210J256521L40776O51204
4327A2934070O06146j64591M68851P60673M05757K15115j50304p00520l45241
4318A4029956k76475j74748P05199o60250K90277P12427N09639J390901N99299
4309A7126225j221347o88286k08287j80158M19262r52577n65503J552754J124448
4300A6406531R24654J99292m40480K15126l92038M9307R09492m011M30854N65208
4290A8863935R2588J047514J178171O33763K274799K453882J681177N52787j510976
4281B7267640k331484j930134k177075j822689q33827o13470n47227N79383j322480
$$ y = [11944770, 12946655, 12724751, 12448463, 11896208, 11812170, 11515043, 11736793, 11164205, 10346093, 11097776, 11215076, 10450481, 10511346, 10095359, 10685569, 11942090, 12282866, 12934070, 13540216, 13375625, 13844476, 14605149, 15010906, 15226021, 15075717, 14375197, 14029956, 13753481, 13578733, 14283932, 13623682, 13913959, 14626386, 15136025, 16526926, 17126225, 15904878, 15216592, 15008305, 14828147, 15247409, 14294832, 13729329, 15282083, 16406531, 17331185, 17530477, 17089997, 17305123, 16913085, 16962392, 17871884, 17867873, 18298727, 18863935, 18956523, 20004037, 21182208, 21815971, 24090770, 26544652, 28225829, 28778616, 27267640, 24936156, 23006022, 20828947, 19006258, 18172431, 17558961, 17011734, 17591117, 16268637]
4272A6268637j705229r06988p41776K76348j69866q87024J158733k27844p21103
4263A2343888O87947o5062l0183J781555M33905j00374n45122q58901J11898J77111
4253A3936662m34504L90252o84233n42634N16692l82009k12584L93006M8467l0483
4243A2998632N21536M11392k88600k74149L42702J54230O65045j84748q44303
4234A3501737o02736L29112l72384m74663m41998p80912r20116j6699o3288O527
4224A0164580O39965J15127o79396L2553j03107j5500l73457j94573L19236Q13407
4214A0718835j79810K41714L28531k77380P0140M91929l76105J50416J79203K34564
4204A1582037K82481l9552j07373P76181L57168m04175j06989J139158K91877
$$ y = [16268637, 14563408, 13656420, 12914644, 13190992, 13021126, 12134102, 13292835, 13064991, 12343888, 13031835, 12966773, 12936590, 14718145, 15152050, 15051676, 14506554, 13647653, 13759551, 13936662, 13502158, 13892410, 13208177, 12665543, 13182235, 12800226, 12587642, 12980648, 13029115, 12998632, 13520168, 13931560, 13642960, 13368811, 13711513, 13865743, 14530788, 14346040, 13501737, 12899001, 13228113, 12855729, 12381066, 11939068, 11158156, 10238040, 10221341, 10158053, 10164580, 10804545, 10919672, 10240276, 10272829, 10169722, 10154222, 9780765, 9586192, 9905428, 10718835, 10539025, 10780739, 11109270, 10831890, 10902030, 11393959, 11017854, 11168270, 11347473, 11582037, 11864518, 11824966, 11717593, 12493774, 12850942, 12446767, 12339778, 13478936, 13770813]
4195A3770813M85990K1202J61750p3125j92234J361234K82268r66215O14024J067533
4185A6533240J98391n9146O38000L47083k32017N76632O09739M75453N44211J058854
4175B0690440J700404R21418J279496K070994J9296L76157J31911j099649o50938
4166B5439529j063297p44743Q3785K51114M7587l02027k98826p47414j540211
4157B1125497P45592J032834j068092j41047P89791Q72137K84821k76802p11571
4148B2653160M41865K15119P6474R32404L53079L75984J600088J110666J439606
4139B9198445J165407J454858J960152K293823L044327K783116L650677N906849
4131E1457654N099202N250024L500542o94807m659803o042627n345949n104561
$$ y = [13770813, 14256803, 14278005, 14439755, 14366630, 14174396, 15535630, 15817898, 14851683, 15465707, 16533240, 16731631, 16672485, 17310485, 17657568, 17425551, 18002183, 18611922, 19087375, 19631586, 20690440, 22390844, 23312262, 24591758, 26662752, 26682048, 27058205, 27190116, 26090467, 25439529, 24376232, 23631489, 23715274, 23966388, 24013975, 23711948, 23413122, 22665708, 21125497, 21871089, 22903923, 21835831, 21694784, 22484575, 23356712, 23641533, 23364731, 22653160, 23095025, 23310144, 23386618, 24319022, 24672101, 25048085, 26648173, 27758839, 29198445, 30363852, 31818710, 33778862, 36072685, 39117012, 41900128, 45550805, 51457654, 56556856, 61806880, 65307422, 64612615, 59952812, 53910185, 48564236, 43459675]
4123D3459675m104336k934613k533187j285309j284364j227907j90982o89821
4115B9209156j827214m57477O70817o84556n22810M20896n54430m08860Q3071
4106B5928593l46220K25562Q1055M00892Q74413k23931R8561R78993R9601J089074
4096B9206593J437930P10830L83999J5691J112783J663511J164919J318511K250328
4087C9265095K998178L113421M540014N905336O661496R352712J2161837J0765563
4079I4763652M363049m258312j1270692j2591609r984197p057990m370772l749310
4071D5843819l186823k370877k586529n86753j89439r53984m37274k4628r27917
4062C4579595l46748l34877l10953p67987j286313m47458r46772p50916O27968
$$ y = [43459675, 39355339, 36420726, 33887539, 32602230, 31317866, 30089959, 29898977, 29209156, 27381942, 26924465, 27595282, 26910726, 26387916, 26808812, 26254382, 25845522, 25928593, 25582373, 25807935, 25888990, 26289882, 27164295, 26940364, 27038925, 28017918, 28117519, 29206593, 30644523, 31355353, 31739352, 31755043, 32867826, 34531337, 35696256, 37014767, 39265095, 42263273, 45376694, 49916708, 55822044, 62483540, 71836252, 83998089, 94763652, 99126701, 94868389, 83597697, 71006088, 61021891, 53963901, 49593129, 45843819, 42656996, 40286119, 37699590, 37112837, 36923398, 35969414, 35532140, 35507512, 34579595, 34232847, 33897970, 33587017, 32819030, 31532717, 31085259, 30138487, 29387571, 30015539]
4053C0015539L12456R07911R59386r10535k2534Q50716M33646R21907R58656R1366
4043C4518514j222107o54089Q27512j54560k10472Q64679P03822k22712N29153
4034C4979740Q70216l29720m6293N70557J065932J440323k15677l89514Q85440
4025C8831004M21291j66562J90694K57448q35601k10835Q36960M93292L08191
4016D0125882Q45161J249217k23550m80569p0058q83908j189835k77859j642156
4007C7452325o62035j6418p02645k74054P2170L01597k66629m1433M69842r92907
3997C5339813m60867r60813j149927j011557k96392n50747j021855J40916m12018
3988B9616553j657002p71171m22814m00673q49996K8643l50062r62762m12834
$$ y = [30015539, 30327995, 31235906, 32195292, 31284757, 31262223, 32112939, 32546585, 33468492, 34427148, 34518514, 33296407, 32642318, 33469830, 33315270, 33104798, 33969477, 34673299, 34450587, 34979740, 35849956, 35520236, 35473943, 36044500, 37110432, 38550755, 38335078, 37945564, 38831004, 39252295, 39085733, 39276427, 39533875, 38698274, 38487439, 39324399, 39817691, 40125882, 40971043, 42220260, 41996710, 41516141, 41446083, 40562175, 39372340, 39094481, 37452325, 36790290, 36773872, 36071227, 35797173, 35869343, 36170940, 35904311, 35862878, 36332720, 35339813, 34878946, 33918133, 32768206, 31756649, 31460257, 30909510, 29887655, 30028571, 29616553, 27959551, 27188380, 26765566, 26364893, 25514897, 25543540, 25193478, 24230716, 23817882]
3979B3817882j020020o0858P18983m7820k22222k75184P9722J32286L35100Q17483
3969B4275352L94029K81793k79847J13338K48899l08458j3591K29521J97333O90790
3959B5829159N15756J161997P73990O90290R28203N07990J556146J819839O69264
3950C4452634p78872p01318n1598K2320n32644P16155J061217K01892Q44170J736154
3940C6970110J574947K469637K390972K709339L664753L136575M062051M965892
3932F1944276O164268P085061R278246J0799760J2196313J3391405J2928115Q090107
3924A41877551Q62734p276820j3288788j4442087j2995828j1494978r878868q919362
3916F4443554o700775n690371n559625m310287l297623l505858k160770j547543
$$ y = [23817882, 22797862, 22737004, 23455987, 23408167, 23185945, 22910761, 22990483, 23122769, 23457869, 24275352, 24669381, 24951174, 24671327, 24784665, 25033564, 24725106, 24711515, 24941036, 25138369, 25829159, 26344915, 27506912, 28280902, 28971192, 29899395, 30407385, 31963531, 33783370, 34452634, 33673762, 32972444, 32920846, 32943166, 32410522, 33126677, 34187894, 34389786, 35233956, 36970110, 38545057, 41014694, 43405666, 46115005, 49779758, 52916333, 56978384, 61944276, 68108544, 75193605, 84471851, 95271611, 107467924, 120859329, 133787444, 141877551, 142740285, 135463465, 122174677, 107732590, 94736762, 83241784, 73362916, 64443554, 57742779, 52052408, 46492783, 42182496, 38884873, 35379015, 33218245, 31670702]
3908C1670702j507081j241446j092412n81055q45321r03272l36829n05435q32167
3899B3825684j097670n73613j552538q08514j550870j472272M48299K00322j97858
3890A7220970M78277o31962q50963n2388J71183q91187l95874K12353m64986q5125
3880A4710298l57685q6297J94529L45l40288Q47926M80651m82941l20092o47871
3870A3998575j314K19433M51389l39113j264843j1449N88378M35885P55948J97697
3860A5030586n82308m65654K26317J179119j00213l39441q94209l73453P8911
3851A3759655L23129L91110J07573o74292m96079N90767K31796P618R65020M1753
3841A5248050J27320J21682j14456R08228P05075K69806J006921J09689M61474
$$ y = [31670702, 30163621, 28922175, 27829763, 27248708, 26403387, 25500115, 25163286, 24657851, 23825684, 22728014, 22154401, 20601863, 19793349, 18242479, 16770207, 17218506, 17418828, 17220970, 17699247, 17067285, 16216322, 16163934, 16335117, 15443930, 15048056, 15260409, 14795423, 14710298, 14352613, 14266316, 14460845, 14461190, 14120902, 14968828, 15449479, 14966538, 14646446, 13998575, 13997261, 14216694, 14668083, 14328970, 13064127, 13052678, 13641056, 14076941, 14832889, 15030586, 14448278, 13982624, 14208941, 15388060, 15287847, 14948406, 14054197, 13680744, 13759655, 14082784, 14473894, 14581467, 13907175, 13411096, 14001863, 14233659, 14241277, 15206297, 15248050, 15375370, 15497052, 15382596, 16290824, 16995899, 17265705, 18272626, 18382315, 18843789]
3832A8843789j32183j0949k5179j51139m20745j11366J98357M5374J063126K2407
3822A9321492n22278J067632O26385m67884P8905M31580M15417N16481K55927
3813B1723657P4714k60457L71935J014870O04270n00440K19247m00021L3383K41400
3803B3122558r14814K34229O71632k35768n3366L47289K76203R18329J69114j64743
3793B4370663K50517N33309J888010J598357Q21698Q81058J547741P84635J39519
3784C2815507Q44493J086247J025760O39392J191920O81113O81944J349553R85834
3775D1301763M14620K60102O79144M01494l82795N08430N48797O15145K36666
3766D4583366J21618M24902l02929q32319m89099n95640p28358j479395r53368
$$ y = [18843789, 18711606, 18700657, 18675478, 18524339, 18103594, 17992228, 18190585, 18235959, 19299085, 19321492, 18799214, 19866846, 20493231, 20025347, 20104252, 20535832, 20951249, 21467730, 21723657, 21798371, 21537914, 21909849, 22924719, 23528989, 23028549, 23247796, 22847775, 22881158, 23122558, 22207744, 22441973, 23113605, 22877837, 22824471, 23171760, 23447963, 24366292, 24535406, 24370663, 24621180, 25154489, 27042499, 28640856, 29462554, 30343612, 31891353, 32675988, 32815507, 33660000, 34746247, 35772007, 36411399, 37603319, 38284432, 38966376, 40315929, 41301763, 41716383, 41976485, 42655629, 43057123, 42674328, 43182758, 43731555, 44346700, 44583366, 44704984, 45129886, 44826957, 43994638, 43505539, 42909899, 42181541, 40702146, 39748778]
3757C9748778p39513j106426q95092n75102l32589k21308j73851j03864n68733
3748C5032300k22741R59333N72371m9056R51877k85874j9373o36541m67220j15749
3738C5719327J64117n44960j97770L8403O6549o94272m13483j79874R51026M35364
3728C5344427O01219O32259K41494J239675n38562M42074J312514L55721J407772
3719D1038593J505163P06208N03166O88625O47217k42468O03436O42023P92440
3710D6884403R80252J78073Q90012l92238j9147P69975K76482K306078K170059
3701E4043949R21272J187008K164527L081522L654111K945726L157813K661298
3693G3817226K836582K471987L603479K359196K188225K732784R17619J219312
$$ y = [39748778, 39009265, 37902839, 37007747, 36432645, 36100056, 35878748, 35704897, 35601033, 35032300, 34809559, 35768892, 36341263, 36292207, 37244084, 36958210, 36938837, 36302296, 35835076, 35719327, 35883444, 35338484, 35140714, 35179117, 35245666, 34551394, 34137911, 33958037, 34909063, 35344427, 35945646, 36577905, 36819399, 38059074, 37520512, 37962586, 39275100, 39630821, 41038593, 42543756, 43249964, 43753130, 44441755, 45088972, 44846504, 45449940, 46091963, 46884403, 47864655, 48042728, 48932740, 48540502, 48521355, 49291330, 49567812, 51873890, 54043949, 54965221, 56152229, 58316756, 61398278, 65052389, 67998115, 71155928, 73817226, 76653808, 79125795, 82729274, 85088470, 87276695, 90009479, 90927098, 92146410]
3685I2146410P69720j77317L50837O2780L0188p99473M08545J632485R24042P05609
3675I6053826P85179k82422q0508M0843m02359q22248j092513j625966j606781
3666I0967051j472572j646449j830948k159587k361635k120825l491432k072276
3658G3811327j480158k506709j419822r53448k039965j422526j714798j942153
3650F0331748k276929k382370j209738j301362j112290o67703j841500j352475
3642D8187381N12931k835p20865j232835j634514j626336j625356l42400p08812
3633D0806359n34880n11837p48910m49722K02822Q62487j53929J95848N35010
3624D0203248j41565L72334J484807R71082J198748R34528R56175R02272J995709
$$ y = [92146410, 92916130, 92738813, 93089650, 93152430, 93182618, 92383145, 92791690, 94424175, 95348217, 96053826, 96839005, 96556583, 96476075, 96516918, 96114559, 95292311, 94199798, 92573832, 90967051, 89494479, 87848030, 86017082, 83857495, 81495860, 79375035, 75883603, 73811327, 72331169, 69824460, 68404638, 67451190, 65411225, 63988699, 62273901, 60331748, 58054819, 55672449, 54462711, 53161349, 52049059, 51381356, 49539856, 48187381, 48700312, 48697477, 47976612, 46743777, 45109263, 43482927, 41857571, 41515171, 40806359, 40271479, 39759642, 39010732, 38561010, 38763832, 39626319, 39472390, 39668238, 40203248, 40061683, 40434017, 41918824, 42889906, 44088654, 45023182, 45979357, 46881629, 48877338]
3615D8877338J719149O67404J046018K183876K703200K362269K170578J873386
3607F3603218J664828K703028J728532J220518J228849Q27325j302218j118634
3599G0555446o45507j997365j286214j086031j620293k363776l262703j827026
3591E6466531j873280k703573k096976k010655k553428j468563r57775j595887
3583D1206394j333218J37598l97479r42866j6773Q25277n78690r144j68039j042846
3573C7680214n46748M31526p18600n29J084004k69998n9094M00890l50388n58965
3563C7092312R62933Q25057R2477L69100M29701K98039K57501J017991J244314
3554D2589425O93349Q02141L28438J51905N90546Q29470Q53467J075117O98104
$$ y = [48877338, 50596487, 51263891, 52309909, 54493785, 57196985, 59559254, 61729832, 63603218, 65268046, 67971074, 69699606, 70920124, 72148973, 72976298, 71674080, 70555446, 69909939, 67912574, 66626360, 65540329, 63920036, 61556260, 58293557, 56466531, 54593251, 51889678, 49792702, 47782047, 45228619, 43760056, 42802281, 41206394, 39873176, 40010774, 39613295, 38670429, 38653656, 39478933, 38900243, 38891099, 38723060, 37680214, 37133466, 37564992, 36846392, 36845863, 37929867, 37659869, 37600775, 38001665, 37651277, 37092312, 38055245, 38880302, 38972779, 39341879, 39771580, 40069619, 40327120, 41345111, 42589425, 43282774, 44084915, 44413353, 44565258, 45155804, 45985274, 46838741, 47913858, 48611962]
3545D8611962L91801J130287J287849J579586K156123J762655K419376K085846
3537F1425485P29774K138247K346620J794066L038023K270349K111909J373793
3529G7228266K524913K833276K087407L163725M152598K880867L440908M976317
3521A03288277N437702O438804Q345966Q177012Q290463Q472700Q418914Q828936
3513A65698774Q258207P177121N150422J992560K38188k335292n239081p684499
3505A73256400q937321q855793j0317750j1060106r763388j0611445j0447569
3498A03263028q438562p899630p443204o530343n158318n090208l754141k646344
3490E6302278l158345l206701k142794k801329k035384q02845j924696k643230
$$ y = [48611962, 49003763, 50134050, 51421899, 53001485, 55157608, 56920263, 59339639, 61425485, 62155259, 64293506, 66640126, 68434192, 71472215, 73742564, 75854473, 77228266, 79753179, 82586455, 84673862, 87837587, 91990185, 94871052, 98311960, 103288277, 108725979, 115164783, 123510749, 131687761, 139978224, 148450924, 156869838, 165698774, 173956981, 181134102, 186284524, 188277084, 188515272, 186179980, 180940899, 173256400, 164319079, 155463286, 145145536, 134085430, 124322042, 113710597, 103263028, 94824466, 86924836, 79481632, 72951289, 67792971, 62702763, 58948622, 56302278, 53143933, 49937232, 47794438, 44993109, 42957725, 42154880, 40230184, 37586954]
3482C7586954j482916r40026j750980j169046J04769l59088j794361n12387n01854
3473B9181065r86745o18390K08672n94739o17264J67731M0598p1156N24155J30420
3463B7364347o33327L85692l30590o24184M31505K79974l25416m19966O5674l59362
3453B5834347m45301o7083l31650q63073m84911j97290m27164k24029l19411n76896
3443B1897539p64386k10730K51503m55966j240896n17397p02612j340274K59519
3434A7176300R88997j16504Q86662l21541j127999R2630M05307L00574K69062
3425A8553488n13601K24486k632j063769J94432Q4163J66626P52400k06256k37941
3415A7951396N85988K16745R56401N72408k04634M50747q1847M48846J064777
$$ y = [37586954, 36104038, 35164012, 33413032, 32243986, 32348755, 31989667, 30195306, 29682919, 29181065, 28194320, 27575930, 27784602, 27189863, 26572599, 26740330, 26780928, 26709772, 27233927, 27364347, 26731020, 27116712, 26786122, 26161938, 26593443, 26873417, 26548001, 26128035, 26193709, 25834347, 25389046, 25321963, 24990313, 24127240, 23642329, 23445039, 23017875, 22793846, 22474435, 21897539, 21133153, 20922423, 21173926, 20717960, 19477064, 18959667, 18257055, 16916781, 17176300, 18165297, 18048793, 18935455, 18613914, 17485915, 17578545, 17983852, 18284426, 18553488, 18039887, 18264373, 18261741, 17197972, 17392404, 17476567, 17643193, 18395593, 18189337, 17951396, 18537384, 18754129, 19710530, 20282938, 20078304, 20529051, 20447204, 20896050, 21960827]
3406B1960827k39723P40102P37074k37170L42139J335796O54872n01437p27081
3397B4065399m26061n25107M87088K88473n04443J42040M52113j3110P22856O57203
3387B5346451L39206j83572r72612k97387j26539J55013M03849M05762l28282
3378B4741889L65219O14860J43839J88014J096310P74521J080260J025355J184923
3369C1215190K66592M24928L59081P83042L62948N85147R86303J031538J564349
3360C7579118J705017J448394J355734J267431J093154P33377O24302J228077
3352D7034604O68649P34228J326410R3995P96731P24742M98441M57956J35052
3343E2470808l09393n25493o9654L01017j45514O52005k28317O72162Q2054n36521
$$ y = [21960827, 21721104, 22461206, 23198280, 22961110, 23303249, 24639045, 25293917, 24792480, 24065399, 23639338, 23114231, 23601319, 23889792, 23385349, 23527389, 23979502, 23966392, 24689248, 25346451, 25685657, 25502085, 24529473, 24232086, 24105547, 24260560, 24664409, 25070171, 24741889, 25107108, 25721968, 25865807, 26053821, 27150131, 27924652, 29004912, 30030267, 31215190, 31481782, 31906710, 32265791, 33048833, 33411781, 33996928, 34983231, 36014769, 37579118, 39284135, 40732529, 42088263, 43355694, 44448848, 45182225, 45806527, 47034604, 47703253, 48437481, 49763891, 49857886, 50654617, 51379359, 51877800, 52335756, 52470808, 52161415, 51635922, 51566268, 51867285, 51721771, 52373776, 52145459, 52817621, 52899675, 52363154]
3333E2363154P20147P02237P37131N01702M63998M15289k99174Q45716J049674
3324E7499874J091056Q67152J287820K887327J477970L107320K303711J484650
3316G2006880L190110K148718K256986K928693J986859L036709J801476K438811
3308I1795242K780985L323823K702288J938386K505513K313051K061681J085702
3300A10506671J419396J071572m22756N71172l5659p43851m91970J61979o05002
3291A11431552K19590O8200q18264r57806L91788n64769j249132j658627j258168
3282A05604364o93470l49439R92148O72720p02272N88393J060586J923347J911107
3273A11007484K319555J487954L15926L58391J501931J053802J145943J163593
$$ y = [52363154, 53083301, 53785538, 54522669, 55024371, 55488369, 55903658, 55604484, 56450200, 57499874, 58590930, 59458082, 60745902, 63633229, 65111199, 68218519, 70522230, 72006880, 75196990, 77345708, 79602694, 82531387, 84518246, 87554955, 89356431, 91795242, 94576227, 97900050, 100602338, 102540724, 105046237, 107359288, 109420969, 110506671, 111926067, 112997639, 112574883, 113146055, 113110396, 112366545, 111874575, 112036554, 111431552, 111651142, 111719342, 110901078, 109943272, 110335060, 109770291, 108521159, 106862532, 105604364, 104910894, 104561455, 105553603, 106226323, 105524051, 106112444, 107173030, 109096377, 111007484, 113327039, 114814993, 115130919, 115489310, 116991241, 118045043, 119190986, 120354579]
3265A20354579M12371N89189J72964l49581K99848M94850N33184R65039J60362
3256A23632805M70584J019650K89580l42884j47810j281027l15631k38360o24359
3247A22462548p69531j245470j842769l574647l752876m534641n280376m110314
3239I7351924m435955m235175l859372l594108l606450k996334j896156k320903
3231G0407471k776842k771485l018629j509159l09118m1280j682684j258113m44900
3222E6595261l02225P8603K1842o02915m78329p24642J9622j54317o59149m69527
3212E3324224l55760j087436j039936m09977n28249j081391m560m32099k64933
3203D8119883r73839L15306P7289r00801j213365j389023j207872k31034p55494
$$ y = [120354579, 120766950, 121356139, 121529103, 121179522, 121479370, 121974220, 122507404, 123472443, 123632805, 124103389, 125123039, 125412619, 125069735, 124921925, 123640898, 123325267, 123086907, 122462548, 121693017, 120447547, 118604778, 115030131, 111277255, 106742614, 101462238, 97351924, 92915969, 88680794, 84821422, 81227314, 77620864, 74624530, 72728374, 70407471, 67630629, 64859144, 61840515, 60331356, 60022238, 59980958, 58298274, 57040161, 56595261, 56293036, 56371639, 56393481, 55790566, 55312237, 54587595, 54607217, 54452900, 53793751, 53324224, 52968464, 51881028, 50841092, 50431115, 49902866, 48821475, 48816915, 48384816, 48119883, 47146044, 47461350, 47538639, 46637838, 45424473, 44035450, 42827578, 42596544, 41841050]
3194D1841050o53415M0547n81025q86418L77579K50559p75418q84386n46559m6621
3184C8135893k67102p30657l44388N0430N52596O85410r39K18848N57092N07375
3174C9364558J571504R86313R36206J932554O14764K49020P46742Q19995J158371
3165D8380027R06013o1569J174201J437656R20615N07681J49032M67530J62720
3156E4043906p97356o43006j703666j459237j035376j327019j088214l91360r75329
3147D4623343K76290N7967n01373J02204P83302j25617K41352J767407J592521
3138D8817396L57564J556566J280859K436721L495621K435839K540364L104468
3130F6025398L037557K636597K969593M311887L808661L190806M223024K528715
$$ y = [41841050, 41187635, 41228182, 40647157, 39760739, 40138318, 40388877, 39613459, 38729073, 38182514, 38135893, 37868791, 37138134, 36793746, 36844176, 37396772, 38082182, 38081243, 38300091, 38857183, 39364558, 40936062, 41922375, 42858581, 44791135, 45405899, 45654919, 46401661, 47221656, 48380027, 49286040, 49224471, 50398672, 51836328, 52756943, 53264624, 53413656, 53881186, 54043906, 53246550, 52603544, 50899878, 49440641, 48405265, 47078246, 45990032, 45598672, 44623343, 44899633, 44957600, 44456227, 44558431, 45341733, 45216116, 45457468, 47224875, 48817396, 49174960, 50731526, 52012385, 54449106, 57944727, 60380566, 62920930, 66025398, 69062955, 71699552, 74669145, 78981032, 82789693, 85980499, 90203523, 92732238]
3122I2732238K441497L332990J578340J032445Q70310l23558j210701k396071
3114I8057490k798051l195430l942947l979324n168161m811644m658804n521884
3106F3981245n227789m155636m779719l034548j565984k527898j935557j711085
3098C9043029j485959j885543j586900o59755r26658j612099r29402o10506j342739
3089B8003468o38562j105075j211192q99272p24798k15630j164058p63446k11854
3080B1069581n84454o4768n00871M16968J052723o5691l76062K20884L80448n47040
3070B1001718r3718m98613o63020K88855k46378m88725p71569p08332M79743k93732
3060A8006229m15500K50844q74291n93774J246086n79885p68374j026411q75021
$$ y = [92732238, 95173735, 98506725, 100085065, 101117510, 101987820, 101664262, 100453561, 98057490, 95259439, 92064009, 88121062, 84141738, 78973577, 74161933, 69503129, 63981245, 58753456, 54597820, 49818101, 46783553, 45217569, 42689671, 40754114, 39043029, 37557070, 35671527, 34084627, 33424872, 32498214, 30886115, 29956713, 29346207, 28003468, 27364906, 26259831, 25048639, 24149367, 23424569, 23208939, 22044881, 21281435, 21069581, 20485127, 20420359, 19919488, 20336456, 21389179, 21323488, 20947426, 21168310, 21548758, 21001718, 20908000, 20409387, 19746367, 20035222, 19788844, 19300119, 18528550, 17820218, 18299961, 18006229, 17590729, 17841573, 16967282, 16373508, 17619594, 17039709, 16271335, 15244924, 14369903]
3051A4369903j38729o37029n58420J06680P469J30661k5777j64460n02864k47778
3041A2339656j32460R69160j22567m1454L07432m79723p96439R09097r927r0961
3031A2851814J35719q04211j91687J94146J6945m61629l97121J0741J81433j88320
3021A1347830R87806n63334j243830M8876M94333m55457n10046k66469Q64153
3012A0703862O62604M67688M24343k85928p24482M51067K9103l46546O51152Q04202
3002A2837065k66538K51621R30773j66038Q8448Q70497k83576O9620O50234j22777
2992A4859329n62218m73786L17125M25498L95079N89364j27609M89226L10663
2983A6222671M14111m43058j13936J95926k78072J26877k41731k07286J057633
$$ y = [14369903, 14231174, 13594145, 13035725, 13142405, 13149874, 13280535, 13254758, 13090298, 12587434, 12339656, 12207196, 13176356, 13053789, 13012335, 13319767, 12840044, 12043605, 12952702, 12942775, 12851814, 12987533, 12183322, 11991635, 12185781, 12202726, 11741097, 11343976, 11354717, 11536150, 11347830, 12335636, 11772302, 10528472, 10577348, 11071681, 10616224, 10106178, 9839709, 10703862, 11366466, 11834154, 12258497, 11972569, 11248087, 11699154, 11728257, 11381711, 12032863, 12837065, 12570527, 12822148, 13752921, 13586883, 13675331, 14545828, 14262252, 14331872, 14982106, 14859329, 14297111, 13823325, 14140450, 14565948, 14961027, 15550391, 15422782, 15912008, 16222671, 16636782, 16193724, 16079788, 16275714, 15997642, 16124519, 15882788, 15675502, 16733135]
2974A6733135K92569l59826L20165l20627L36986L27922j27289J51434O56451
2965A8010920m08682N049Q04221K06411j17986K40277K22439K52770M9323R74409
2955B0239151Q78610r183K47525r7109R44167O50198j19406P63031L40295K88305
2945B4125584N92308P53137K27335M18692P06342P69180Q45241J337943J826243
2936C1602005J103773J01893L14832l70777M28227P33489L35138J057641J129046
2927C6435267P70204K23275J23326J251423R47580J069183Q64225k41992J345773
2918D2788264J467005P37455J222761J515933J430822J406658K578383K450637
2910E5597918K669209K617089K820735K432630J628165K662982K564921J503469
$$ y = [16733135, 17025704, 16665878, 16986043, 16665416, 17002402, 17330324, 17203035, 17354469, 18010920, 17602238, 17607287, 18411508, 18617919, 18499933, 18740210, 18962649, 19215419, 19264742, 20239151, 21117761, 21108578, 21356103, 21258994, 22203161, 22853359, 22733953, 23496984, 23837279, 24125584, 24717892, 25471029, 25698364, 26117056, 26823398, 27592578, 28437819, 29775762, 31602005, 32705778, 32807671, 33122503, 32751726, 33179953, 33913442, 34248580, 35306221, 36435267, 37205471, 37428746, 37552072, 38803495, 39751075, 40820258, 41684483, 41442491, 42788264, 44255269, 44992724, 46215485, 47731418, 49162240, 50568898, 53147281, 55597918, 58267127, 60884216, 63704951, 66137581, 67765746, 70428728, 72993649, 74497118]
2902G4497118J437470J114143J652569J525171K298941M339490M005129M695679
2894I5565710N471327Q115768J0179312J1467069J3091955J2219378Q134528J246161
2886A65491208n599071r414449j0558950q418692o482656n479173l311527k960744
2878A13265946k765842m87344m60509o18697M09507J8627O44839J597004J478787
2869A13082318K239834L419435M420256M843685N070607P292869R065601J0411030
2861A59845635J1412891J1952521J3478464J5048885J7752316K0573782K3502648
2854B73567142K5470455K6602774K4636952K2261450J9855435J4693130M140840
2847D11228178j1184635k6612482l7898503m1423742l7707121l2762532k6683482
$$ y = [74497118, 75934588, 77048731, 78701300, 80226471, 82525412, 86864902, 90870031, 95565710, 101037037, 109152805, 119332117, 130799186, 143891141, 156110519, 164245047, 165491208, 159892137, 150477688, 139918738, 131500046, 125017390, 119538217, 116226690, 113265946, 110500104, 110012760, 109552251, 108933554, 109343061, 109361688, 110006527, 111603531, 113082318, 115322152, 118741587, 123161843, 128005528, 133076135, 140369004, 149434605, 159845635, 171258526, 183211047, 196689511, 211738396, 229490712, 250064494, 273567142, 299037597, 325640371, 350277323, 372538773, 392394208, 407087338, 411228178, 400043543, 373431061, 335532558, 294108816, 256401695, 223639163, 196955681]
2840A96955681k1248564j7522626j4691004j2683537j0578769r370685p957742
2833A02902754o088518n661089m775810n267033n069427l546023l547613l247525
2825F5699716l073387l088607k739281k364925k502742k333746k331594j903979
2817D5361455j767709j689898q26457p60279j717676j331920r48100j065367j092341
2808C4161708j305696n75323k65119r82110l84508r81816q80846o76811p92503
2799B7316976R1291j233761o64683M04816j037047j668488J97168q80660j536859
2790B0988753k00784k56083n81323j041480K48358L8938n19333k33574r04156
2781A7539316r09115j83982j239597l15801j071747n57553J01379j015686m5465
$$ y = [196955681, 175707117, 158184491, 143493487, 130809950, 120231181, 110860496, 102902754, 96814236, 91153147, 86377337, 81110304, 76040877, 72494854, 68947241, 65699716, 62626329, 59537722, 56798441, 54433516, 51930774, 49597028, 47265434, 45361455, 43593746, 41903848, 41077391, 40317112, 38599436, 37267516, 36319416, 35254049, 34161708, 32856012, 32280689, 32015570, 31033460, 30648952, 29667136, 28786290, 28109479, 27316976, 27408267, 26174506, 25509823, 25914639, 24877592, 23209104, 23406272, 22525612, 20988753, 20787969, 20531886, 19950563, 18909083, 19157441, 19196379, 18677046, 18443472, 17539316, 16630201, 16446219, 15206622, 14890821, 13819074, 13261521, 13362900, 12347214, 12301749]
2772A2301749j07889l40171L27019L84272J07185J30462O18679p46399r82450
2763A1692457n57143n34693l66634m81108J56737N60097p86313L73289P16840
2754A0773529o77005o4144o64655m50528j9260r06028l5093K56022r53541p80805
2744F478492L11766j25730M3007P55796q9346r69290j72189N96482j18284J50042
2734F860746L23597o17305K7242L40250l5690o1700L29584K6302l22847j9048
2724F851131M1356k84566K06100P1898J61429J09852p0408K77265m75512K6564
2714F915109o50123k85237L58417n78538q66085J92848o24315l02783r280q0592
2704D069421m69886m81163o12980k74334N64239M64068k57872L00032k40113l63170
$$ y = [12301749, 12193860, 11853689, 12180708, 12564980, 12672165, 12802627, 13421306, 12674907, 11692457, 11135314, 10600621, 10233987, 9752879, 9909616, 10469713, 9683400, 10056689, 10773529, 10096524, 10032380, 9367725, 8917197, 8897937, 7991909, 7956816, 8212838, 7259297, 6478492, 6790258, 6664528, 6707535, 7463331, 7373985, 6404695, 6232506, 6828988, 6710704, 6860746, 7184343, 6567038, 6594280, 6934530, 6898840, 6837140, 7166724, 7193026, 6870179, 6851131, 6892487, 6607921, 6814021, 6885919, 7047348, 7157200, 7086792, 7364057, 6888545, 6915109, 6264986, 5979749, 6338166, 5759628, 4893543, 5086391, 4462076, 4159293, 4150013, 4069421, 3599535, 3118372, 2505392, 2231058, 2795297, 3259365, 3001493, 3301525, 3061412, 2698242]
2694B698242M38452K87520p28318K94217N66962m27186L15746N38839N1653P63279
2684D799406Q8379M92900n32712k95754K45445r77406n44332J82605m41482K1202
2674C038251l39964m91692P2494P6796J62449j62943r7533o50312l65843j55063
2664A086640J641O44878M28456o53953l03909j34413J046968k0892m14715n3117
2654A627584K92747k19294N2655J50525l2312l58007r6876n92114L66356n41782
2644F49482J66683M25165m15526M40535R62810j40824l47550K20041K75337n16942
2634A719211q21742r1028J33786j056766k18519J86023N89079N31105k54220J71605
2624H88534n16951K87522P20743k64198m6446J5890k32181m16874r22890N91756
$$ y = [2698242, 3136694, 3424214, 2695896, 2990113, 3557075, 3129889, 3445635, 3984474, 4036127, 4799406, 4887785, 5380685, 4847973, 4552219, 4797664, 3820258, 3275926, 3458531, 3017049, 3038251, 2698287, 2206595, 2279089, 2355885, 2518334, 2355391, 2257858, 1607546, 1241703, 1086640, 1088281, 1733159, 2161615, 1507662, 1203753, 1069340, 2116308, 2095416, 1680701, 1627584, 1920331, 1701037, 1753692, 1904217, 1871905, 1513898, 1417022, 824908, 1191264, 649482, 816165, 1241330, 825804, 1266339, 2229149, 2088325, 1740775, 1960816, 2236153, 1719211, 897469, 806441, 940227, -116539, -335058, -149035, 440044, 971149, 716929, 888534, 371583, 659105, 1379848, 1115650, 1069204, 1085094, 852913, 436039, -486851, 104905]
2614A04905M27637O12315j39188r54048K64522R46556J54780l26508N14236L45483
2604A950690r8009P2150j07241o20443j96889M48255K3144p1414L86529J17537
2594A904309q80389L49624R08687n51610j116459K41862l0191r2983K2391K45436
2584A000677l4627K88042M57963K69970J76475O36939r55916n62025l3166O63252
2574A907584N53551k10581K48428o2487n3992J36020R8613J50790l48738k48766
2564B170422l28392K0751m2184r40246K69640Q123q32923J68557j91626L71791
2554F73913O456O38669O96896n31183j57707k98774n05028M32443N46803n15843
2544I86645n20378m79488m76069L37347K94053p96306l3936N67225M18223Q15214
$$ y = [104905, 532542, 1144857, 1005669, 51621, 316143, 1262699, 1417479, 1090971, 1605207, 1950690, 1852681, 1924831, 1817590, 1197147, 1000258, 1448513, 1471657, 1400243, 1786772, 1904309, 1023920, 1373544, 2282231, 1730621, 614162, 856024, 825833, 732850, 755241, 1000677, 966050, 1254092, 1712055, 1982025, 2158500, 2795439, 1839523, 1277498, 1244332, 1907584, 2461135, 2250554, 2498982, 2436495, 2382503, 2518523, 2617136, 2767926, 2419188, 2170422, 1842030, 1862781, 1820597, 880351, 1149991, 1158114, 325191, 493748, 302122, 673913, 680369, 1319038, 2015934, 1484751, 1327044, 1028270, 523242, 955685, 1502488, 986645, 466267, -13221, -489290, -151943, 142110, -654196, -688132, -120907, 297316, 1112530]
2534A112530N9550n76561k5930N47702j74923r93299L93740j43896K7354J60825
2524C87092m17498j41767L07127N48697O02495o50472K63322n7061o37108M77797
2514F82624Q6873m6640l24901l16645J85951n27610L60482L65205m83251j09119
2504a27031J79261j5732j44135l14562N86869J46851q6027M2847J56164M11040
2494H35545k87181k16822P64708l39029k06319l77313m01243M32726l6608o81295
2484e12831k22317k10254N05774M67753l10643J02087l2356k80225J25383L66301
2474a328J23244p34271j89995J63400j35830J46403J52679J66389m19910l156
2464g32375j02230j73728Q13526N04343n04445L65231L0103K2517L03301k44653
$$ y = [1112530, 1172080, 595519, 569589, 1117291, 942368, -50931, 342809, 198913, 226267, 387092, -30406, -172173, 134954, 683651, 1286146, 635674, 898996, 841935, 204827, 682624, 769497, 722857, 397956, 81311, 267262, -260348, 100134, 465339, -17912, -127031, 52230, 36498, -107637, -422199, 164670, 311521, 225494, 268341, 424505, 835545, 548364, 331542, 1096250, 757221, 550902, 173589, -227654, 205072, 168464, -512831, -735148, -945402, -439628, 28125, -282518, -180431, -212787, -493012, -367629, -1328, 121916, -612355, -802350, -638950, -774780, -628377, -475698, -309309, -729219, -732375, -834605, -1008333, -194807, 309536, -194909, 170322, 200425, 222942, 526243, 281590]
2454B81590l68047o3481m00049J49316K33883m36772K44124N91826k83771J71604
2444A20223R78102m65037j92094o44455m44018K50038k87630J90328k56198J01208
2434f49533Q67411p54204J15319P18116k19216P69975j93453k13309n10413n54138
2424f23445M84456j34412J195875n00715j191759P25577o8807J20984L78482O06478
2414I92714m31400l61191q0470l27111n72431l20136J584811P7759j450476J327556
2404D39625k84041j28387J148114J7890J44106q95739k49642r2930j058946Q90752
2394f9198K13690o53593M24318P831r7735P18022p16294J46080J63869q7546j32120
2383h2676k34255j07984L44527m19366K06531P08257m59870M91535j18286m00932
$$ y = [281590, -86457, -149938, -549987, -400671, -166788, -603560, -359436, 232390, -51381, 120223, 1098325, 633288, 441194, -203261, -647279, -397241, -684871, -494543, -750741, -649533, 217878, -536326, -421007, 297109, 77893, 847868, 654415, 441106, -69307, -623445, -138989, -273401, 922474, 421759, -770000, -44423, -113230, 7754, 386236, 992714, 561314, 200123, 119653, -207458, -779889, -1100025, 484786, 562545, -887931, 439625, 155584, 27197, 1175311, 1193201, 1337307, 441568, 191926, 98996, -959950, -69198, 144492, -509101, -84783, -76952, -174687, 543335, -172959, -26879, 136990, 49444, -82676, -316931, -424915, -80388, -499754, -293223, 415034, -44836, 446699, 328413, -72519]
2373g2519R12187l18128r55575M89989m5118N4501M97767n25004p30031m74498
2363a166429K0072O99573N01090L8728k81716J01201K4575K60125n15106k99305
2353f17192N05263j282607J87415J145922l27118K58370Q50931P82562L76912
2344A880458l04574o39387o69377n85685J07468p96301l93830J48644K06008J75616
2334h70960l915J00114o95186J22366L41146p57323O05088Q4531k5743J192466
2324I2584L76125J87522N0987p22448l08387L63586L8782n70557P6911L17380
2314i7515n38390N43153J228705k65538K12987L90415o28282j9694l60207m89563
2304b3929m12242j04847M70947j39640n33312L88594o72092N46934L25916m78582
$$ y = [-72519, 839668, 521540, -434035, 55954, 10836, 65337, 563104, 38100, -691931, -1166429, -1146357, -446784, 54306, 93034, -188682, -87481, -62906, 197219, -317887, -617192, -111929, -1394536, -1207121, -61199, -388317, -129947, 720984, 1503546, 1880458, 1575884, 936497, 267120, -318565, -211097, -1007398, -1401228, -1252584, -1046576, -870960, -874875, -774761, -1469947, -1347581, -1006435, -1763758, -1158670, -1074139, -1099882, 92584, 468709, 656231, 707218, -15230, -323617, 39969, 78751, -491806, -414895, -97515, -635905, -92752, 1135953, 870415, 1083402, 1473817, 845535, 825841, 465634, -23929, -436171, -541018, -70071, -209711, -743023, -354429, -1026521, -479587, -153671, -632253]
2294f32253J1891o41802J56533k04904J163370Q94822J36010l89057J85763P03213
2284A383586p34720j069270M59515n14037m8355j94941O7328L27880M7094m15006
2274f90926N72766l01972k03218K32992q05946P4803Q58187J49234N57702q1628
2264C61994j32067O82232m01666J6540j87647j267253l09496J79394O48727N65848
2254A56606j08142L38844P10379L15259o94271m80787j16246j12129O5473J75392
2244B50378P4633m91364j54131k99298N08675M08358k6929J29139R40250O51730
2234A991441r53296m84326N48272p61417l83907R86606N9113K85454l44435m05398
2224E38107n79275K47336Q67996j48691j115755R19669K36316l69618J024533
$$ y = [-632253, -620362, -1262164, -1105631, -1310535, -147165, 747657, 883667, 494610, 680373, 1383586, 648866, -420404, 39111, -474926, -523281, -718222, -650894, -323014, -275920, -690926, -118160, -420132, -623350, -390358, -1196304, -1121501, -263314, -114080, 443622, 361994, 229927, 912159, 510493, 527033, 339386, -927867, -1237363, -1057969, -409242, 156606, 48464, 387308, 1097687, 1412946, 718675, 237888, 121642, 9513, 74986, 250378, 325011, -166353, -320484, -619782, -111107, 297251, 270322, 399461, 1339711, 1991441, 1038145, 553819, 1102091, 340674, -43233, 943373, 1002486, 1287940, 943505, 538107, -41168, 206168, 1074164, 925473, -190282, 729387, 965703, 596085, 1620618]
2215A620618M5860q62695K76416L36675q6161n06063K00177r9655L16085R4978
2205A336235m69954m44411k17517l85535O84703J35395M83304P8275k77744l45698
2195E77053N18465Q00027L5807n40686q53232n03094J35659P57021j14986n35571
2185B76463M17271N68768O51114N78683k01672l08968j5047L6913l61501j000962
2175F41062N8414m6264J21061N1731O80531Q09203k84734K20977k43378J70728
2165B179331J207457o42450m6928m22557k98410R05211l48574J23855L97065j17522
2155B936478O31849J009415P21183L70407J21180J82078o7406p9203q0820O78560
2145F423721J50841n5790M12960K1731N11381M27078J019289J253331M75546Q61764
$$ y = [1620618, 1666478, 803783, 1080199, 1416874, 1330713, 824650, 1024827, 925172, 1241257, 1336235, 866281, 421870, 204353, -181182, 503521, 638916, 1122220, 1200495, 922751, 577053, 1095518, 1895545, 1931352, 1390666, 537434, 34340, 169999, 927020, 812034, 276463, 693734, 1262502, 1913616, 2492299, 2290627, 1981659, 1966612, 2003525, 1642024, 641062, 699476, 653212, 774273, 826004, 1506535, 2315738, 2031004, 2251981, 2008603, 2179331, 3386788, 2744338, 2697410, 2274853, 1976443, 2881654, 2533080, 2656935, 3054000, 2936478, 3568327, 4577742, 5298925, 5669332, 5790512, 5972590, 5905184, 5825981, 5745161, 6423721, 6574562, 6518772, 6931732, 6953463, 7464844, 7891922, 8911211, 10164542, 10640088, 11501852]
2135A1501852m61586q13259M23636Q32732J3967N34956P47866J255773L98951
2126A4434888L32220J087830K101263J281901J630313J674753J423894J501382
2118B5468444J639849K093147L194158L175508L795959M732813O665691R695415
2110F0460984J4285042K0609921K8416599L6097586J8131819j5479201l1483598
2103A31039152l3859790k2480349j4567623j0566348p741243o701270m968009
2096C0154520l831694k031924r01036j544203r36574n79341k316421k419498q65953
2087A4727876j129030j203608l45239r43234n12797J12101r08879n91610L07444
2078I513024k21410m53226j177806n11595p01944K09334q4059m38185j84325m32795
$$ y = [11501852, 11040266, 10227007, 10650643, 11483375, 11497342, 12032298, 12780164, 14035937, 14434888, 14767108, 15854938, 17956201, 19238102, 20868415, 22543168, 23967062, 25468444, 27108293, 29201440, 32395598, 35571106, 39367065, 44099878, 50765569, 60460984, 74746026, 95355947, 123772546, 159870132, 178001951, 162522750, 131039152, 97179362, 74699013, 60131390, 49565042, 41823799, 35122529, 30154520, 26322826, 24290902, 23389866, 21845663, 20909089, 20329748, 18013327, 15593829, 14727876, 13598846, 12395238, 12049999, 11106765, 10593968, 10706069, 9797190, 9205580, 9513024, 9291614, 8838388, 7660582, 7148987, 6447043, 6656377, 6572318, 6134133, 5949808, 5517013]
2068E517013k47235L04016K27972r22722k84714L13311m27164l47582l87916j24308
2058C620671l88587P05240J229570p86872n89050O40069j096712P1898k38872
2049C167355n62783l64126j41897Q64797m8968j80820L37118k89747l31502J38503
2039B587930k88658O24876P38508q02492o84083j157140p07961P35059N91317
2030A637356l93262j45259p71541l33372P20016O51824K06891O523l72185j02299
2020A104692n47964o26325m37398P8523M82688K5454m20536j00816K00346J03575
2010a37761M28507L85468M22554q86894l25217M39410k22507K02733k16740k77080
2000a87527R89299p15633m35940K03657q79377M49415J299473M54806j54163k30093
$$ y = [5517013, 5269778, 5573794, 5801766, 4879044, 4594330, 4907641, 4480477, 4132895, 3744979, 3620671, 3232084, 3937324, 5166894, 4380022, 3790972, 4431041, 3334329, 3406227, 3167355, 2604572, 2240446, 2098549, 2963346, 2914378, 2733558, 3070676, 2780929, 2449427, 2587930, 2299272, 2924148, 3662656, 2860164, 2176081, 1018941, 310980, 1046039, 1637356, 1244094, 1098835, 327294, -6078, 713938, 1365762, 1572653, 1579176, 1206991, 1104692, 556728, -69597, -506995, -428472, 54216, 79670, -340866, -441682, -241336, -137761, 290746, 676214, 1098768, 211874, -113343, 326067, 103560, 306293, 89553, -187527, 801772, 86139, -349801, -146144, -1025521, -576106, 723367, 1178173, 1024010, 793917]
1990G93917k87257M22414j69636q46079p53126J71017K91711l6004O3767l82021
1980g31297J10045Q34881O4140K24936J12456J71350J00052K79794J28975p51008
1970E44324k26677j7420K77895j13841l49595m48168k39754O07342j58557J90893
1960F6442R44111r94012k35828J41971j29654L03862L8887J06337n60255q89077
1950a207216P4794J49640L22288L34944J99786k32224L37138K52072J19078N5672
1940D05972l33955L2584M88665M37850n58108p8018O8472l48723m9124n6228j08274
1929i8887Q46550m95351k76045m88786J84583l02286p42194O82031j67403M68708
1919c89080J113266q63339j20543P42159o64911M91697L98962J86698j75661j495216
$$ y = [793917, 506660, 929074, 759438, -86641, -839767, -668750, -377039, -413043, -349276, -731297, -621252, 213629, 277769, 502705, 615161, 786511, 886563, 1166357, 1295332, 544324, 317647, 300227, 578122, 464281, 114686, -333482, -573236, 34106, -124451, 66442, 1010553, 16541, -219287, -77316, -206970, 96892, 135779, 242116, -318139, -1207216, -1132422, -982782, -660494, -325550, -125764, -357988, -20850, 231222, 350300, 405972, 72017, 104601, 593266, 1031116, 473008, 394990, 463462, 114739, 65615, 9387, -98887, 747663, 252312, -23733, -512519, -327936, -630222, -1372416, -690385, -857788, -389080, 724186, -139153, -259696, 482463, -182448, 309249, 708211, 894909, 719248, -775968]
1909g75968M15871Q72913r45088N26533j61309o38779R76386o39576n86859M57636
1899d98240o29263P8333J17696M28945k03048K33560P94854j023612m7838Q24400
1889G5787j46340L90336L01465l63543j202159Q0843P64456r31346M19151R60277
1879C48927l97591M18405r0696j010509P51722l24378j535382O84422L70165J88871
1869e96044P99254j86980N11406j32219p33544K37275p79728J00998L28406r10870
1859a362046l30232J178426j0019O4284L22247k09961k25066j49070L33326K61566
1849a26545l65118j91212L31497J8391K80378J152072l26062j77777O90021K10393
1839A496038O98962n03340p52581M75140o98934M13688N21593j304768M76486
$$ y = [-775968, -360097, 512816, -432272, 94261, -67048, -705827, 270559, -369017, -955876, -498240, -1127503, -1049170, -931474, -502529, -705577, -472017, 322837, -700775, -748613, 75787, -70553, 319783, 621248, 257705, -944454, -863611, -99155, -1030501, -611350, 348927, -48664, 369741, 279045, -731464, 20258, -304120, -1839502, -1155080, -784915, -596044, 203210, 16230, 527636, 395417, -338127, -100852, -880580, -779582, -451176, -1362046, -1692278, -513852, -523871, -459587, -137340, -347301, -572367, -721437, -388111, -126545, -491663, -682875, -351378, -332987, -52609, 1099463, 773401, 595624, 1285645, 1496038, 2195000, 1691660, 939079, 1414219, 715285, 1128973, 1650566, 345798, 822284]
1830H22284j49759n67477Q57634n71582m11357k28748j54373R42628m95595o67102
1820f23447N62716M27216M27296j75467p06177r012L59456K02243k6123l41331
1810I7370r03204J84500Q03131N43023m0378n94235k90974L25073l28966p5752
1800b80412j22442m56027m86266Q29392M80800k57370J55093L19604j291213n18226
1790a627067L46943J45306J32536N70754N18277n53536J62273O24474j116972
1781g97012k63773J14915p56765O8597J045852Q4475q3527r51911m59909R57343
1771a041715j1717n42739p81672j62471O30886J27574O5376L41559L52611L50542
1761f71766k19201K39031J51285n5023N75316J83262k64972J45380N9035p97644
$$ y = [822284, 672525, 105048, 962682, 391100, -20257, -249005, -403378, 539250, 43655, -623447, -60731, 366485, 793781, 618314, -87863, -96875, 262581, 464824, 438701, 97370, -805834, -621334, 181797, 724820, 684442, 90207, -200767, 124306, -204660, -280412, -402854, -858881, -1345147, -515755, -34955, -292325, -137232, 182372, -1108841, -1627067, -1280124, -1134818, -1002282, -431528, 86749, -466787, -304514, 319960, -797012, -1060785, -945870, -1702635, -1634038, -588186, -503711, -587238, -1539149, -1999058, -1041715, -1053432, -1596171, -2377843, -2540314, -1909428, -1781854, -1716478, -1374919, -1022308, -671766, -890967, -651936, -500651, -555674, 19642, 202904, -62068, 83312, 142347, -655297]
1751f55297j07854J37446k08176O02999n7611K45997J1472p07765Q58381L75174
1741D94766m57945J018050k69211n62786q67774r2547N18513l63614q05846R34254
1731d54140k38006o64046R61044R57490O25760o16670p95250l31232m90180O43228
1721d02002L23172m70618N08289o49536q26159J024456P98550o06693l98691N44630
1711a54602m61850k57699J287466L5333m78926r7321J5314o97030L39275P16225
1701B46185l29560k07280J10259r67267k58559K50935j83517l7466j57386L21579
1691a212077L63456O26589Q17568J67419o70924o54124L49461K86375j77683j48856
1681b52796J74672J13046o01097l15356O3192l77043n2996R95232J19533k34636
$$ y = [-655297, -763151, -625705, -833881, -230882, -288493, -42496, -31024, -738789, 119592, 494766, 36821, 1054871, 785660, 222874, -644900, -737447, -218934, -582548, -1388394, -454140, -692146, -1356192, -395148, 562342, 1188102, 571432, -223818, -555050, -1045230, -402002, -78830, -549448, -41159, -690695, -1516854, -492398, 306152, -300541, -699232, -154602, -616452, -874151, 413315, 448648, -30278, -127599, -112285, -809315, -470040, 246185, -83375, -290655, -180396, -1147663, -1406222, -1155287, -1338804, -1376270, -1533656, -1212077, -848621, -222032, 595536, 762955, 92031, -562093, -212632, 73743, -103940, -252796, -78124, 34922, -566175, -881531, -818339, -1195382, -1248378, -253146, -133613, -368249]
1671c68249P39782j81755J40858J651343J98325j528760m91651j0123l10492J41693
1661a9029O491m41890j57535L77100J63644J7725K32495Q37071j001498R78734
1651I93308O64530j250130j28523j16982r65403L87265Q57685r34267p15573o3666
1641a271756m39020K52366L65221K70481l41247k96083R57729L0579k90955P35302
1631b7383r58854q43292O62817O85867K10014M30487j73551l40845N68950j54382
1621E9828l18636l01653m99198m2684L65898R08716K87502j82644l4231m15723
1611a72825P60908J60420k51188L6150p68949l07903O41619O79350K09249m8141
1601I38690o383q58984m9103j64700j64027r4965l85940Q2702k28333k13397M95074
$$ y = [-368249, 371533, 189778, 330636, 1981979, 2180304, 651544, 159893, 149770, -160722, -19029, -12538, -454428, -611963, -234863, -71219, -53494, 179001, 1016072, 14574, 993308, 1657838, 407708, 279185, 162203, -803200, -415935, 441750, -492517, -1208090, -1271756, -1710776, -1458410, -1093189, -822708, -1163955, -1460038, -502309, -471730, -762685, -27383, -986237, -1829529, -1166712, -480845, -270831, 159656, -13895, -354740, 214210, 59828, -258808, -560461, -1059659, -1102343, -736445, 172271, 459773, 277129, 242898, -172825, 588083, 748503, 497315, 533465, -235484, -543387, 98232, 777582, 986831, 938690, 932307, 73323, 24220, -140480, -304507, -399472, -785412, -702710, -931043, -1144440, -649366]
1590f49366j08963j19849P67305J89901l20941O80817j01308p71008K14211K47349
1580B8148n03088j49685m74406j29351M47192M53110L81307M77266j31859N2056
1570D50690n43789K07679M96848q15737l74517l97073k1665j4352k97737J6453
1560a293200J35824P76389M76755J00418K98574p73591n85882J45333J07172N22714
1550h9494J55689J05521J33362J30944K23933m01482m9812O73745j98301j031864
1540c47759k91450K84313o37239L03708R83338p2793l65380J07484L33551k91628
1530F145m15237J04744O01296l0534p46813J70884J049679N40837m53223j96575
1520F31203J12673J45087J66709J75927R58l08521r60601n68691l7016l2660k708
$$ y = [-649366, -758329, -878178, -110873, 79028, -241913, 438904, 337596, -433412, -219201, 28148, -474940, -624625, -1099031, -1228382, -781190, -328080, 53227, 530493, 398634, 450690, -93099, 114580, 611428, -204309, -578826, -975899, -997564, -1011916, -1309653, -1293200, -1157376, -380987, 95768, 196186, 494760, -278831, -864713, -719380, -612208, -89494, 66195, 171716, 305078, 436022, 659955, 258473, 208661, 882406, 684105, -347759, -639209, -354896, -992135, -688427, 294911, 222118, -143262, -35778, 297773, 6145, -409092, -304348, 296948, 266414, -480399, -309515, 740164, 1281001, 827778, 631203, 743876, 888963, 1055672, 1231599, 1232557, 924036, -36565, -605256, -642272, -674932, -677640]
1509f77640O34046q2827J73821k8264n01290L86530r8084K72675q755l21538o6268
1498c17594o39121l09587J146806j79390j21342L56900N8328J27691l70941o40597
1488h88847K48305J15689J225863q27815r817O10201j198045K30022Q33133j225888
1478h87199j11327q7341o62095N33788N07511N10816m23959l60685L56929j117065
1468a740627L55179P58165p14341j99681P7257K46847N68571L25302L57246K49245
1458B83163M30305J087045j41072l58139K24191q54282j210051J81006l7627l79694
1448g75155O98670J54219J72298m06902k03394R13202j75094L03987K49377p89890
1438A41318m97931P4107j10464K36815Q18541l41668j18512O80959q53417n51845
$$ y = [-677640, -43594, -126421, 47400, 19136, -482154, -95624, -193708, 78967, 70212, -251326, -317594, -956715, -1266302, -119496, -298886, -420228, -63328, -5000, 122691, -248250, -888847, -640542, -524853, 701010, -126805, -136622, 473579, -724466, -494444, 338689, -887199, -998526, -1085867, -1747962, -1214174, -706663, -195847, -619806, -980491, -623562, -1740627, -1385448, -627283, -1341624, -1541305, -1464048, -1217201, -648630, -323328, 33918, 283163, 713468, 1800513, 1659441, 1301302, 1525493, 671211, -538840, -357834, -395461, -775155, -76485, 77734, 250032, -156870, -360264, 552938, 377844, 681831, 931208, 141318, -356613, -282506, -392970, -156155, 662386, 320718, 202206, 883165, 29748, -522097]
1428e22097m93261M25654K04372j66377M82110O8164o92653m091m22626L86054
1418g34751P04888l59739l61051j0957K4640M56592M34732J04036M56729J90619
1408I05738j288435l53104R6156M97824l20274k8400j99q87289M48588j92327
1398a121722n67066O75430m00497N60386O40465J23347J44413j414716p5967N91694
1388h44233J80680O75041l83459n1796J78621m51572Q02631M40524r2651P1843
1378E25629O26858k11787o66905p0765J0356m23201k40075l6531m51453J91398
1368g46476R7848K39905Q84370l49464n02776n6905n8991K44491J06467j10077
1358b51608J03575j432628L31157J402569j53790k40122k82852P00061J107239
$$ y = [-522097, -1015358, -589704, -385332, -551709, -69599, -1435, -694088, -698179, -1120805, -734751, -29863, -389602, -750653, -761610, -736970, -280378, 154354, 258390, 715119, 905738, -382697, -735801, -639645, -141821, -462095, -490495, -490694, -1377983, -929395, -1121722, -1688788, -1013358, -1413855, -853469, -213004, -89657, 54756, -1359960, -1435927, -844233, -663553, 11488, -371971, -423767, -245146, -696718, 105913, 546437, 453786, 525629, 1152487, 940700, 273795, 203030, 213386, -209815, -449890, -486421, -937874, -746476, -648628, -408723, 475647, 126183, -376593, -433498, -492489, -247998, -141531, -251608, -148033, -1580661, -1249504, 153065, -725, -240847, -523699, 176362, 1283601]
1349A283601j03543K44439j741k80822l22764K59026k19546m82309k96644N01081
1339E80778J67607o73543l68667L32331j00432m92399J95966N91069K89663J1061
1329E33434j12245P1687J06384p79256l83165Q32693j97176q2905l86945J23639
1319b73855L72224K26083M80860n20222J51437l10100k22247o1254k57868n96298
1309a011240L64366N10222O14729m76161o56996j36112n04304Q12866N08137l77004
1299c51497l8724J86094j46624J352210O00026n80138j6892m03557m57277n89055
1289d45434L80716J56903q93080M07040R75600o41656j66682O90274r33995p65190
1279a235504L3292L00174P4292m19999Q27151Q70843n09463j25571J219065q44127
$$ y = [1283601, 1180058, 1424497, 1422756, 1141934, 819170, 1078196, 858650, 376341, 79697, 580778, 748385, 74842, -293825, 38506, -61926, -554325, -358359, 232710, 522373, 533434, 421189, 492876, 599260, -179996, -563161, 269532, 72356, -10549, -397494, -273855, 98369, 324452, 805312, 285090, 436527, 126427, -95820, -157074, -414942, -1011240, -646874, -136652, 478077, 1916, -655080, -791192, -1295496, -482630, 25507, -351497, -390221, -204127, -350751, 1001459, 1601485, 1021347, 1004455, 600898, 143621, -445434, -64718, 92185, -800895, -393855, 581745, -59911, -226593, 463681, -470314, -1235504, -1202212, -902038, -827746, -1247745, -420594, 450249, -59214, -184785, 1034280, 190153]
1269A90153n96360M44599n49972k31946K24539l4916N72585o25750k63886Q09907
1259f1047L12186M51911j68271j209668m20888O6583R52649N47762l86061j015260
1249i30104R32196P92455j35574J2941n84954o59738k65521n66661M29243j48136
1239a123853p4040L69405o9295N44575L91509L4202j0421l00162l11958m84320
1229a034358j94182P51730o25884l46419P48293O5876k15318Q16744R63388l46128
1219E83742k01141O09691k2093R8336o01003m55214n87078P02754l86372l77100
1209f35478Q07434K7790j51607M59618j6769j82228k1968o8682n13012o92042
1199i86944N98504N70333j94696P00246j96427n93705l73863p53269p51335J108407
$$ y = [190153, -406207, 38392, -511580, -743526, -518987, -553903, 18682, -607068, -870954, -61047, 251139, 703050, 534779, -674889, -1095777, -1029194, -76545, 471217, 85156, -930104, 2092, 794547, 658973, 671914, 86960, -572778, -838299, -1404960, -975717, -1123853, -1197893, -828488, -897783, -353208, 38301, 72503, 62082, -238080, -550038, -1034358, -1228540, -476810, -1102694, -1449113, -700820, -634944, -850262, -33518, 929870, 583742, 382601, 992292, 970199, 1068535, 467532, 12318, -574760, 127994, -258378, -635478, 171956, 199746, 48139, 507757, 490988, 308760, 286792, 218110, -294902, -986944, -388440, 181893, -12803, 687443, 491016, -102689, -476552, -1229821, -1981156, -872749]
1189h72749L53414q64535M39845M48776k15420L15873j93758J9037r1899L16971
1179c44445J44337j66779L63916r4582m53662m0989K61423j97565o76453l49942
1169a554741R81620M29018N12971O1942m22979N01123m81670k08548j55731o02931
1159i39926J162613M64823J31391N09605o617Q5625r94919l44127J54339l88213
1149a65406n74531J74017N9550J38840K68029k56032N57015J263506j83980o06951
1139F74057k72304J99428j48646o66707O03965K0925q23369l20622L28880Q23726
1129D19333k22370n01886K81906k7577M37855M05142o00481J90979K35880q17831
1119a99050P59295k74781k34103P4285K74529M29861j262407j289623N61904J29906
$$ y = [-872749, -519335, -1383870, -944025, -495249, -710669, -394796, -588554, -569517, -661416, -344445, -200108, -366887, -2971, -97553, -551215, -592204, -330781, -528346, -1204799, -1554741, -573121, -144103, 368868, 430810, 7831, 508954, 27284, -181264, -336995, -939926, 222687, 687510, 818901, 1328506, 1321889, 1407514, 412595, 68468, 222807, -165406, -739937, -565920, -506370, -367530, -99501, -355533, 201482, 1464988, 1281008, 674057, 401753, 601181, 452535, -214172, 389793, 410718, -412651, -733273, -404393, 419333, 196963, -304923, -23017, -50594, 387261, 792403, 191922, 382901, 618781, -199050, 560245, 285464, 51361, 125646, 400175, 830036, -432371, -1721994, -1160090, -1030184]
1109a030184o512M08624J28679k64179M58994O17503K47196Q4321J74124l71262
1099D47304n07891L19658K2736k0083J541630Q42615k5331m03240k09578o00269
1089A407551m79697P33906l83162p06619N60451l95513l36099J90896o7634K8571
1079E52651j11002j160083k78156J58197m17200p32082K17361O35899P74617M05586
1069D5788n71916p95813O03069Q39674M80398K33054k13886O804r57131n00560
1059h30519K53938l71406O62860L92001o93072O37493L48302m58200K02691O46551
1049G90639K38259J69409k55628l69241l10107j80932K98412J61197k60784O06991
1039H88215m64162j67078P49870q1981m85276P34249m11956p05199L23355L2847
$$ y = [-1030184, -1036696, -628072, -499393, -763572, -304578, 312925, 560121, 644442, 818566, 447304, -60587, 259071, 281807, 261724, 1803354, 2645969, 2620638, 2217398, 2007820, 1407551, 927854, 1661760, 1278598, 571979, 1132430, 736917, 400818, 591714, 524080, 552651, 441649, -718434, -996590, -838393, -1255593, -1987675, -1770314, -1134415, -359798, 45788, -526128, -1321941, -718872, 120802, 601200, 834254, 620368, 627172, -329959, -830519, -576581, -947987, -285127, 106874, -586198, 51295, 399597, -58603, 144088, 790639, 1028898, 1198307, 942679, 573438, 263331, 82399, 380811, 542008, 281224, 888215, 424053, 256975, 1006845, 924864, 439588, 1173837, 761881, 56682, 380037, 412884]
1029D12884j85031Q90671J60866n71164n37084l97832j69628p98000N48524k66065
1019i11859k10786J105047n02270k0155K51953L54214P87158m71040l14809J95643
1009B63096m71854N60394k86781l88304M0158m95214K10297J60528Q4142P05011
999C81473K98168L89956k44194L24547k91189n37669P88278N385j61511l96345
989E56899p83745l94309j3468J107437J162504l2442m75533o65901n87789N7491
979f8856m36904q93770L44461P98153L59455J27281r32468R8680P03436n7424
969D2044N31563q3572q66669p89790l89601K75388K44856j1884M25633j56348
959g78380Q1362M72187J83571l86001M55760j63232M40906O33387m59857J022941
$$ y = [412884, 227853, 1118524, 1279390, 708226, 171142, -226690, -396318, -1194318, -645794, -911859, -1122645, -17598, -519868, -540023, -288070, 66144, 853302, 382262, 67453, 263096, -208758, 351636, 64855, -323449, -283291, -778505, -568208, -407680, -323538, 381473, 679641, 1069597, 825403, 1149950, 858761, 321092, 1109370, 1114755, 953244, 556899, -226846, -621155, -634623, 472814, 1635318, 1602876, 1127343, 461442, -126347, -68856, -505760, -1399530, -1055069, -256916, 102539, 229820, -702648, -603968, 99468, 42044, 573607, 490035, -376634, -1166424, -1556025, -1280637, -1035781, -1047665, -622032, -778380, -697018, -224831, -41260, -427261, 28499, -134733, 306173, 939560, 479703, 1502644]
949A502644j06322n73523j15569l57025N44088n0688j28760j72318p58649N51882
939C35760P75025k78263m0468L78588j99141K46484L56716q65075k74084J032695
929A468237m09516p76066j97117L99969p67274q22205J337215P04935q1149L68778
919A225807l31715m77155r5446n98448j26864N40616K23547m44665m51716K87467
909b48572M20992p1176R84790k42399j186528O98294J17446r16867l12125l60250
899a116395O00440K33798J58215M26839p31998j98508P03160k78647k44117J00215
889c46998n27294K29984K07909M10533N8826r21712k85657L70307K45440Q2963
879d75699J038310J10786q8071J27960K47718q91261m96146J279112q2488j351402
$$ y = [1502644, 1396322, 822799, 707230, 350205, 894293, 843605, 714845, 542527, -216122, 335760, 1110785, 832522, 792054, 1170642, 971501, 1217985, 1574701, 709626, 435542, 1468237, 1058721, 282655, 85538, 485507, -281767, -1103972, 233243, 938178, 857029, 1225807, 894092, 416937, 321491, -276957, -403821, 136795, 360342, -84323, -536039, -248572, 172420, 101244, 1086034, 843635, -342893, 355401, 472847, -444020, -756145, -1116395, -515955, -282157, -123942, 302897, -429101, -627609, 75551, -203096, -447213, -346998, -874292, -644308, -436399, -25866, 32960, -888752, -1174409, -804102, -558662, -475699, 562611, 673397, 585326, 713286, 961004, 69743, -426403, 852709, 770221, -581181]
869e81181O88002N79624n25530M84694l3693j448558M56677J048214J47874m75203
859C40920Q22187j04721j265289O23994L73112o10646J2295K42485j039669o89986
849a295318M11467l12078R4447P11211K56892O11833m02908k53367k63767p18086
839a159674J01452o44858k89480K43001p8679P19614M23028K95694P7110K61500
829e1292J91685o33520l46763l71942j85290R4855K90999K55463L5925L03497
819d16383L92870L6807o00758j71681N32991J76667l07700p31000J70285M99841
809d18061N97432N81390r57809m05056N4355j9334O90681k56606j113750m2411
799a289169m00044P80741M85713J21286Q7576n38350M85733O80297o28640j11670
$$ y = [-581181, 106821, 686445, 160915, 645609, 611916, -836642, -379965, 668249, 816123, 340920, 1163107, 1058386, -206903, 417091, 790203, 179557, 191852, 434337, -605332, -1295318, -883851, -1195929, -1101482, -390271, -133379, 478454, 75546, -177821, -441588, -1159674, -1058222, -1703080, -1992560, -1749559, -1828238, -1108624, -685596, -389902, -312792, -51292, 140393, -493127, -839890, -1211832, -1397122, -1302267, -1011268, -755805, -719880, -416383, -23513, 13294, -587464, -759145, -226154, -49487, -357187, -1088187, -917902, -418061, 179371, 760761, -197048, -602104, -547749, -567083, 123598, -133008, -1246758, -1289169, -1689213, -908472, -422759, -301473, -213897, -752247, -266514, 413783, -214857, -326527]
789c26527n1067l72866Q97839J034900j14324K04942M49755l10846m34517l98780
779E78509j71562M0518l36441Q39465L71671o31271k51256l01278J39430K41271
769E19056k94894l64738l11993k87943M69902m1352l9189j61670r05142k70054
759a688017R50023L97306j87738N87359l42585o65066k56435Q92743K90727K11260
749A89577K07878l74530o85897M73491P7402k95122P46387K28170j060737j16764
739f10145J25402l14273K925P28683L71799m02268p0566M72829K05179n9438J046298
728A496425o4137m006l61727p87726M43944j4490l76954r7433O27108Q2150K70723
717A213877p8034p91086K03991k12346K35752K90000k05899p17290n26947M23947
$$ y = [-326527, -377594, -750460, 147379, 1182279, 1067955, 1272897, 1722652, 1411806, 977289, 578509, 406947, 447465, 111024, 950489, 1322160, 690889, 439633, 138355, 277785, 519056, 224162, -140576, -452569, -740512, -270610, -311962, -351151, -512821, -1417963, -1688017, -737994, -340688, -528426, 58933, -283652, -948718, -1205153, -312410, -21683, 189577, 397455, 22925, -662972, -189481, -112079, -407201, 339186, 567356, -493381, -610145, -484743, -799016, -796091, -67408, 304391, -97877, -168443, 304386, 509565, 450127, 1496425, 1432288, 1428282, 1066555, 278829, 722773, 708283, 331329, 233896, 861004, 943154, 1213877, 1135843, 344757, 548748, 336402, 572154, 862154, 656255, -61035, -587982, -164035]
707a64035R16316k44453k01354L67870k13279J34094l96339o60902k19998j8691
697g00771N21353O31016n70286k06447K70484o44179O26057N1026p71398n5976
687h49121L48238O15892N17300o03966o39537k91999O0865M79770K76293q2456
677a68721J90638J50339J11001O87549J81765l52236j67278J01677l15927l90985
667B7822J100205n59014l36252N02475N69578k75992n6334L09985j7049J27622
657A393046M07356j050790o01420o14107R5506l86401O0196P64933n69856j2603
647e14140N48433J36386K53486l73957L35218L69459k59956j89548K32953j67319
637C71015k42930R36933m59525M06820L69478o43282K66455p66179r30083O88984
$$ y = [-164035, 752281, 507828, 306474, 674344, 461065, 595159, 198820, -462082, -682080, -700771, -179418, 451598, -118688, -325135, -54651, -698830, -72773, -21747, -793145, -849121, -500883, 115009, 632309, 28343, -611194, -903193, -842328, -362558, -86265, -168721, 21917, 172256, 283257, 970806, 1152571, 800335, 633057, 734734, 418807, 27822, 1128027, 569013, 232761, 735236, 1304814, 1028822, 972488, 1282473, 1265424, 1393046, 1800402, 749612, 148192, -465915, -370409, -756810, -696614, 68319, -501537, -514140, 34293, 170679, 424165, 50208, 385426, 754885, 494929, 305381, 538334, 371015, 128085, 1065018, 605493, 1012313, 1381791, 738509, 1004964, 238785, -691298, -2314]
627b314m98851J46436K36961m78994l59340N88269R48752R6850l32257k6194N66053
616H85371P7846m78075L62154K94768j36857K93012m96618j14358O32736k14486
606A105493o6109L9283l83201k26862K30130j216695n94146P23498n02425j48138
596a039172P15905K05527j50252k706L1859j24275p8050q7635O2720J36446Q76873
585E47240K54701o3654N25108M97193l62998j54894r63949L37353p51126r42558
575a077584Q18469m150R2433K81540p16614j48207L82726K96117K75980K01404
565D02114O50945o18480l33621N23693n19883p8243P95312k8091j10578p2055
555F11113M41513l59254j080748R81657j83344j123316Q94841M70117l12115J05425
$$ y = [-2314, -501165, -354729, -117768, -596762, -956102, -367833, 580919, 677769, 345512, 319318, 885371, 963217, 485142, 847296, 1142064, 1005207, 1298219, 801601, 687243, 1319979, 1105493, 1039384, 1078667, 695466, 468604, 698734, -517961, -1112107, -388609, -891034, -1039172, -323267, -117740, -267992, -270698, -238839, -363114, -441164, -528799, -466079, -329633, 547240, 801941, 738287, 1263395, 1760588, 1397590, 1242696, 278747, 616100, -135026, -1077584, -259115, -263265, -170832, 110708, -605906, -754113, -371387, -75270, 200710, 402114, 1053059, 434579, 100958, 624651, 104768, 26525, 821837, 793746, 683168, 611113, 1052626, 693372, -387376, 594281, 410937, -712379, 182462, 652579, 340464, 445889]
545D45889k63434M92408p23173o77267J294548j9443m76459j775P2634k39717
535i5789j15918l62497J7107P06028l65781p3846m88300k4698J182769J63037
525E42112j26002j11689j083212J037929M92817j145002j9651L80252j05569o14382
515g52397O09382Q1844j189093M31758K00525J42221J27587l6341j04893n2652
505e42059L80151M41189k61117l45729L5167k38651m28967j45811m32030O95906
495h41951Q76725M54739l8528m02803J36535O2475Q3743M05714j74285n3080q95534
484c86250n84639J081789l96170J35531J54553k29582l06281L70370O6178l60426
474d54927M8640M65602l42813K05286P44001q97797l32419J080719j194019O22221
$$ y = [445889, 182455, 674863, -48310, -725577, 568971, 549528, 73069, 71294, 143928, -95789, -211707, -574204, -557097, 148931, -216850, -290696, -778996, -803694, 379075, 542112, 416110, 304421, -778791, 259138, 751955, -393047, -412698, -32446, -138015, -752397, -143015, -61171, -1250264, -818506, -617981, -475760, -348173, -384514, -489407, -542059, -161908, 279281, 18164, -327565, -292398, -531049, -960016, -1105827, -1537857, -841951, 34774, 489513, 450985, 48182, 184717, 247192, 330935, 736649, 562364, 509284, -386250, -970889, 110900, -285270, -149739, 4814, -224768, -531049, -160679, -94501, -454927, -406287, 59315, -283498, -78212, 665789, -232008, -564427, 516292, -677727, -55506]
464e5506J159980K96293l63935k63822K998Q39945N44154m51093k52218l13383
454A143413l46542J77052o14852R29675K53744o17670N81139m63540j463250k30185
444f51016L92045J47115m84634k46857O34745N9663J98305J47544l63253K74756
434A08413l9804j63105n50892P9550N82659o07366J45686j17106l84834R04400
424d2399l11871l09043J14251j85496K87708N26678N36787j0561n52783k76519
414b23248J165986J54821l19622j18969m49593N57280K33341J29463P85262m85813
404A428908j60484R27438p28240k46172J71437J28306j34645j044800J7801O50038
394A009587k76173K07240j53458q35339p29346j31965L52264M64989L12850N37710
$$ y = [-55506, 1104474, 1400767, 1036832, 773010, 776008, 1615953, 2160107, 1709014, 1456796, 1143413, 796871, 973923, 359071, 1288746, 1542490, 924820, 1505959, 1042419, -420831, -651016, -258971, -111856, -596490, -843347, -208602, -148939, 49366, 196910, -166343, 108413, 68609, -94496, -645388, -565838, 16821, -590545, -444859, -561965, -946799, -42399, -354270, -663313, -549062, -734558, -446850, 79828, 616615, 606054, 53271, -223248, 942738, 1097559, 777937, 658968, 209375, 766655, 999996, 1129459, 1914721, 1428908, 1268424, 2195862, 1467622, 1221450, 1392887, 1521193, 1386548, 341748, 359549, 1009587, 733414, 940654, 787196, -48143, -777489, -909454, -557190, -92201, 220649, 758359]
384G58359N48176p987m81466o71846K34446j13390n92143m55527K73341m93481
374a001518M70315K11246P06104R91063r5741K2273P6250p45833m33452k11357
364a0650j68112L40886L76752n78150R86718L81333k78096K45958J62527n07456
354I51710l73561o58231M71523K04670K7213O02783O46654m14536N81477N26182
344B565884j198522m51107O80822m41209O6175O38181L98964n98834m7938M11478
334B023894r61399m62231R37049j315333p63797Q1183p86357q0993J589449P91883
324A053348k4426o36006n77397J99653k396J19999l56095o66994J82408M79645
314b28261Q41120k54312j50474Q72234j16568J21093l17739m54531K25881K4158
$$ y = [758359, 1306535, 1298548, 817082, 145236, 379682, 266292, -325851, -781378, -508037, -1001518, -531203, -319957, 386147, 1377210, 1281469, 1303742, 1379992, 634159, 200707, -10650, -178762, 162124, 538876, -39274, 947444, 1328777, 1050681, 1296639, 1459166, 951710, 578149, -80082, 391441, 596111, 623324, 1226107, 1872761, 1458225, 2039702, 2565884, 1367362, 916255, 1597077, 1155868, 1222043, 1860224, 2259188, 1660354, 1612416, 2023894, 1062495, 600264, 1537313, 221980, -541817, -460634, -1246991, -1327984, 261465, 1053348, 1028922, 392916, -184481, 15172, 12776, 132775, -223320, -890314, -707906, -228261, 612859, 358547, 208073, 1080307, 963739, 1084832, 767093, 312562, 538443, 562601]
304E62601O62857O17036J71179M10801p26320m52256l53595J0224r1767K05489
294A016249J103494k25917m74461J048224o42426o12825O5569k61636j407711
285c91440l80045P69986J023547j85498O884m52266M25178K59072k31296n93377
275B50745P44261K76145l95137n6944l05647k20911J177524l82187p9726J74770
265A182893K75906j3119J0573J57175J24924J20931k31646o20490l94370M13169
255A025946P5666l58805P17400O80279j69282q78406K37743J01122q6037k50542
245A095084m30007j0996q93406j114462O67673P20824q36639O9575l6252l09328
235a077934n77551P34577J75994L35268O17671n02558o46674L88989N15232K23700
$$ y = [562601, 1225458, 1842494, 2013673, 2424474, 1698154, 1245898, 892303, 902527, 810760, 1016249, 2119743, 1893826, 1419365, 2467589, 1825163, 1212338, 1277907, 1016271, -391440, -771485, -1499, 1022048, 836550, 843434, 391168, 816346, 1075418, 844122, 250745, 995006, 1271151, 876014, 819070, 513423, 292512, 1470036, 1087849, 1008123, 1182893, 1458799, 1445680, 1456253, 1613428, 1738352, 1859283, 1627637, 1007147, 612777, 1025946, 1101612, 742807, 1460207, 2140486, 1971204, 1092798, 1330541, 1431663, 1345626, 1095084, 665077, 654081, -239325, -1353787, -686114, 34710, -801929, -732354, -768606, -1077934, -1655485, -920908, -744914, -409646, 208025, -294533, -941207, -552218, -36986, 186714]
225A86714L73092k85179M71609l46800l74082N8553O5171O87944K67615l63776
215G40861J83753n82690o07720L45088J02695L85242k7840j62816k66782K41142
205C50933K18900L73772L15212j5600N56243l29323j316374l41444M69641R67387
195A249347m37590L626J126340P6274k56689P96548q8010J39287l23318q49823
185A435992L07012M42287l51178o31778l19661j67073L92439P61400K06233m88841
175A586832n76840K7552R237o5586K31108J82089q71538O2484L48751l36921K10740
164H07908M83271o6529j27263o43803P57161m9841j014202Q18335K71120j408531
154a72374M72644m54332l83480J031522k02025q27523J55896K70541N14196r3581
$$ y = [186714, 559806, 274627, 746236, 399436, 25354, 83907, 149078, 837022, 1104637, 740861, 924614, 341924, -265796, 79292, 181987, 567229, 539389, 376573, 109791, 350933, 569833, 943605, 1258817, 1243217, 1799460, 1470137, 153763, -187681, 281960, 1249347, 811757, 815383, 1941723, 2017997, 1761308, 2557856, 2469846, 2609133, 2285815, 1435992, 1743004, 2185291, 1834113, 1202335, 882674, 715601, 1108040, 1869440, 2075673, 1586832, 1009992, 1037544, 1046781, 981195, 1212303, 1394392, 522854, 585338, 934089, 597168, 807908, 1291179, 1224650, 1097387, 453584, 1210745, 1160904, 146702, 965037, 1236157, -172374, 300270, -154062, -537542, 493980, 291955, -535568, -379672, -109131, 405065, 311484]
144C11484P29614Q11455j117819l99678Q48538m30012K58169L07095r1218j70339
134A057289Q7224l6778m89423P80277J2285r94859l49106L16134p98358l83385
124g98700L93462L95322j24670K58088J42803k95090O33936J54540q82370N3464
114f9215O58490K35976L20189l02282k37760P9008n2430j69075j04860k09246
104A48795J50680m90319r34M22488o56035L70617J068211J38088j44852R8675
94A105414k20873L4495l15341L91705K50150n03091J63059J001381M6594J29755
84B083248p0118l26440r81857k05868L66485l15229m3865M69575K26741J11460
74A314132r5523l54220n79870J5386m0858N33739M69520N68326j57355r31388
$$ y = [311484, 1041098, 1852553, 734734, 335056, 1183594, 753582, 1011751, 1318846, 1227628, 1057289, 1144513, 1107735, 618312, 1398589, 1410874, 416015, 66909, 383043, -415315, -798700, -405238, -9916, -134586, 123502, 266305, -28785, 605151, 759691, -122679, -69215, 589275, 825251, 1145440, 843158, 605398, 684406, 631976, 462901, 358041, 148795, 299475, -190844, -191778, 230710, -425325, -54708, 1013503, 1151591, 1006739, 1105414, 884541, 919036, 603695, 995400, 1245550, 742459, 905518, 1906899, 1953493, 2083248, 2013130, 1686690, 704833, 498965, 865450, 550221, 506356, 975931, 1202672, 1314132, 1218609, 864389, 284519, 299905, 259047, 792786, 1262306, 1830632, 1673277, 741889]
64G41889K73137N87943j69862K1021j18977m61897k10805j05998M30165J48342
54A134958n76966N47130q4789k84976N84079j99285l46241L90650l91992k97184
44D75384l57255K49988O28254m48183p7913J34554k14853m7549l47293j57925
34a62791K11899L47144k10100L06604K06274M9021j05109k75641J24721K42958
24G34980p7517M75223j64480k28876J07382j2689L93155N81986j02717o13106
14A093341j94705r77L8982k47337l32064L52128K50552o4529j06031j93762m45951
3A49647l1943M76454J14762
0G08920
$$ y = [741889, 1015026, 1602969, 1433107, 1454128, 1335151, 873254, 662449, 556451, 986616, 1134958, 557992, 1105122, 1020333, 735357, 1319436, 1120151, 773910, 1164560, 772568, 475384, 118129, 368117, 996371, 548188, 470275, 604829, 389976, 342427, -4866, -162791, 49108, 396252, 186152, 492756, 699030, 748051, 642942, 367301, 492022, 734980, 657463, 1132686, 968206, 739330, 846712, 834023, 1227178, 1809164, 1706447, 1093341, 898636, 897659, 936641, 689304, 357240, 709368, 959920, 895391, 789360, 595598, 149647, 117704, 594158, 708920]
$$ Imaginary data points
##PAGE= N=2
##DATA TABLE= (X++(I..I)), XYDATA
16383c848684n0961J91828N12254L62891m22603j18536N27871l02145J043146
16374b104939L52565n76330J94164L03875R0269M13355j17746K34192n68959l08505
16364b088059K37874k84300j53394l06640m54856L16353M38500K17317k5300k36720
16354b339225J7589J74668P54372k90391Q5681J66871m64685j36464o23881K914
$$ y = [-3848684, -3899645, -3707817, -3195563, -2832672, -3255275, -3373811, -2845940, -3148085, -2104939, -1752374, -2328704, -2134540, -1830665, -1740396, -1327041, -1444787, -1210595, -1779554, -2088059, -1850185, -2134485, -2287879, -2594519, -3049375, -2733022, -2294522, -2077205, -2102505, -2339225, -2321636, -2146968, -1392596, -1682987, -1597306, -1430435, -1895120, -2031584, -2655465, -2652551]
$$ [...]
##END NTUPLES=NMR SPECTRUM
##END=
