##TITLE=1H_CG-1175
 CDCl3
 8 sc, 
 29.8.2023
##JCAMPDX= 6.0         $$ Bruker NMR JCAMP-DX V2.0
##DATA TYPE= NMR SPECTRUM
##DATA CLASS= NTUPLES
##ORIGIN= UXNMR, Bruker Analytische Messtechnik GmbH
##OWNER= root
$$ XWIN-NMR		Version 3.5
$$ Tue Aug 29 14:57:11 2023 Russian Standard Time (UT+4h)  she@DPX200
##.OBSERVE FREQUENCY= 200.13135
##.OBSERVE NUCLEUS= ^1H
##.ACQUISITION MODE= SIMULTANEOUS
##.ACQUISITION SCHEME= undefined
##.AVERAGES= 8
##.DIGITISER RES= 18
##SPECTROMETER/DATA SYSTEM= spect
##.PULSE SEQUENCE= zg30
##.SOLVENT NAME= CDCl3
##.SHIFT REFERENCE= (INTERNAL, CDCl3, 0, 15.759)
##AUDIT TRAIL= $$ (NUMBER, WHEN, WHO, WHERE, WHAT)
$$ ##TITLE= Audit trail, XWIN-NMR		Version 3.5
$$ ##JCAMPDX= 5.01
$$ ##ORIGIN= Bruker BioSpin GmbH
$$ ##OWNER= she
$$ F:/spectra/data/she/nmr/H-F/1/pdata/1/auditp.txt
$$ ##AUDIT TRAIL=  $$ (NUMBER, WHEN, WHO, WHERE, WHAT)
(   1,<2023-08-29 14:56:01.00 +0400>,<she>,<DPX200>,
      <created by zg, POWCHK disabled, PULCHK disabled
       configuration hash MD5:
       00 E9 B6 7A A2 85 ED C7 34 08 36 98 17 FE 4E 26
       data hash MD5: 16K
       46 BB 0A 7A 23 CF B9 82 81 A3 71 3D 7A AC 68 D0>)
(   2,<2023-08-29 14:56:03.57 +0400>,<she>,<DPX200>,
      <Start of raw data processing
       efp BC_mod = 2 LB = 0.24 FT_mod = 6 PKNL = 1 PHC0 = -21045.58 PHC1 = 10.65272 SI = 16K 
       data hash MD5: 16K
       4F C6 D8 D7 54 F3 EE 98 85 F4 26 6F C0 7F 82 1F>)
(   3,<2023-08-29 14:56:17.82 +0400>,<she>,<DPX200>,
      <pk PHC0 = 0.29501 PHC1 = 2.980232e-08 
       data hash MD5: 16K
       55 53 A7 4D 5A 71 E1 61 05 BF C3 D8 91 A6 C9 BA>)
(   4,<2023-08-29 14:56:22.10 +0400>,<she>,<DPX200>,
      <abs ABSG = 5 
       data hash MD5: 16K
       EB B6 1A 86 64 8F B7 3D B8 AF B0 6B 31 89 C8 66>)
$$ ##END=
$$ 
$$ hash MD5
$$ F7 A6 3A 88 74 93 11 B6 00 2F 1F 93 7E 66 20 A4
##$RELAX= 
##$RELAX= 
##$RELAX= 
##$RELAX= 
##$RELAX= 
##$RELAX= 
$$ Bruker specific parameters
$$ --------------------------
##$DU= <F:/spectra>
##$EXPNO= 1
##$NAME= <H-F>
##$PROCNO= 1
##$TYPE= <nmr>
##$USER= <she>
##$AMP= (0..31)
100 100 100 100 100 100 100 100 100 100 100 100 100 100 100 100 100 100 
100 100 100 100 100 100 100 100 100 100 100 100 100 100 
##$AQSEQ= 0
##$AQ_mod= 1
##$AUNM= <au_zg>
##$AUTOPOS= <>
##$BF1= 200.13
##$BF2= 200.13
##$BF3= 200.13
##$BF4= 200.13
##$BF5= 200.13
##$BF6= 200.13
##$BF7= 200.13
##$BF8= 200.13
##$BYTORDA= 1
##$CFDGTYP= 0
##$CFRGTYP= 5
##$CHEMSTR= <none>
##$CNST= (0..31)
1 1 145 1 1 1 1 1 1 1 1 1 1 1 1 1 1 1 1 1 1 1 1 1 1 1 1 1 1 1 1 1 
##$CPDPRG= <>
##$CPDPRG1= <>
##$CPDPRG2= <>
##$CPDPRG3= <>
##$CPDPRG4= <mlev>
##$CPDPRG5= <mlev>
##$CPDPRG6= <mlev>
##$CPDPRG7= <mlev>
##$CPDPRG8= <mlev>
##$CPDPRGB= <>
##$CPDPRGT= <>
##$D= (0..31)
0 1.2 0 0 0 0 0 0 0 0.06 0 0.03 0 0 0 0 0.0002 0 0 0 0 0 0 0 0 0 0 0 0 
0 0 0 
##$DATE= 1693306560
##$DBL= (0..7)
120 120 120 120 120 120 120 120 
##$DBP= (0..7)
150 150 150 150 150 150 150 150 
##$DBP07= 0
##$DBPNAM0= <>
##$DBPNAM1= <>
##$DBPNAM2= <>
##$DBPNAM3= <>
##$DBPNAM4= <>
$$ [...]
##$SUBNAM3= <"">
##$SUBNAM4= <"">
##$SUBNAM5= <"">
##$SUBNAM6= <"">
##$SUBNAM7= <"">
##$SUBNAM8= <"">
##$SUBNAM9= <"">
##$SW= 18.05172834244
##$SWIBOX= (0..15)
0 0 2 0 0 0 0 0 0 0 0 0 0 0 0 0 
##$SW_h= 3612.71676300578
##$TD= 16384
##$TD0= 1
##$TE= 0
##$TE2= 300
##$TE3= 300
##$TEG= 300
##$TL= (0..7)
0 120 120 120 120 120 120 120 
##$TP= (0..7)
150 150 150 150 150 150 150 150 
##$TP07= 0
##$TPNAME0= <>
##$TPNAME1= <>
##$TPNAME2= <>
##$TPNAME3= <>
##$TPNAME4= <>
##$TPNAME5= <>
##$TPNAME6= <>
##$TPNAME7= <>
##$TPOAL= (0..7)
0.5 0.5 0.5 0.5 0.5 0.5 0.5 0.5 
##$TPOFFS= (0..7)
0 0 0 0 0 0 0 0 
##$TUNHIN= 0
##$TUNHOUT= 0
##$TUNXOUT= 0
##$USERA1= <user>
##$USERA2= <user>
##$USERA3= <user>
##$USERA4= <user>
##$USERA5= <user>
##$V9= 5
##$VALIST= <valist>
##$VCLIST= <CCCCCCCCCCCCCCC>
##$VD= 0
##$VDLIST= <DDDDDDDDDDDDDDD>
##$VPLIST= <PPPPPPPPPPPPPPP>
##$VTLIST= <TTTTTTTTTTTTTTT>
##$WBST= 1024
##$WBSW= 4
##$XGAIN= (0..3)
0 0 0 0 
##$XL= 0
##$YL= 0
##$YMAX_a= 382641
##$YMIN_a= -489061
##$ZGOPTNS= <>
##$ZL1= 120
##$ZL2= 120
##$ZL3= 120
##$ZL4= 120
##$ABSF1= 15.79427
##$ABSF2= -2.257582
##$ABSG= 5
##$ABSL= 3
##$ALPHA= 0
##$AQORDER= 0
##$ASSFAC= 0
##$ASSFACI= 0
##$ASSFACX= 0
##$ASSWID= 0
##$AUNMP= <proc_1d>
##$AZFE= 0.1
##$AZFW= 0.1
##$BCFW= 0
##$BC_mod= 2
##$BYTORDP= 0
##$COROFFS= 0
##$CY= -3
##$DATMOD= 1
##$DC= 0
##$DFILT= <>
##$DTYPP= 0
##$F1P= 0
##$F2P= 0
##$FCOR= 1
##$FTSIZE= 16384
##$FT_mod= 6
##$GAMMA= 0
##$GB= 0
##$INTBC= 1
##$INTSCL= 3.70164e-10
##$ISEN= 128
##$LB= 0.24
##$LEV0= 0
##$LPBIN= 0
##$MAXI= 10000
##$MC2= 0
##$MEAN= 0
##$ME_mod= 0
##$MI= 1.114404
##$NCOEF= 0
##$NC_proc= -5
##$NLEV= 6
##$NOISF1= 3.799351
##$NOISF2= 2.8
##$NSP= 0
##$NTH_PI= 0
##$NZP= 0
##$OFFSET= 15.75901
##$PC= 1
##$PHC0= -21045.29
##$PHC1= 10.65272
##$PH_mod= 1
##$PKNL= yes
##$PPARMOD= 0
##$PSCAL= 0
##$PSIGN= 0
##$REVERSE= no
##$SF= 200.130002508336
##$SI= 16384
##$SIGF1= 3
##$SIGF2= 2
##$SINO= 5.538805
##$SIOLD= 16384
##$SREGLST= <1H.CDCl3>
##$SSB= 0
##$STSI= 16384
##$STSR= 0
##$SW_p= 3612.71676300578
##$SYMM= 0
##$S_DEV= 0
##$TDeff= 16384
##$TDoff= 0
##$TI= <>
##$TILT= no
##$TM1= 0
##$TM2= 0
##$TOPLEV= 0
##$USERP1= <user>
##$USERP2= <user>
##$USERP3= <user>
##$USERP4= <user>
##$USERP5= <user>
##$WDW= 1
##$XDIM= 16384
##$YMAX_p= 533999353
##$YMIN_p= -136105
$$ End of Bruker specific parameters
$$ ---------------------------------
##NTUPLES= NMR SPECTRUM
##VAR_NAME=  FREQUENCY,     SPECTRUM/REAL,   SPECTRUM/IMAG
##SYMBOL=    X,             R,               I
##VAR_TYPE=  INDEPENDENT,   DEPENDENT,       DEPENDENT
##VAR_FORM=  AFFN,          ASDF,            ASDF
##VAR_DIM=   16384,         16384,           16384
##UNITS=     HZ,            ARBITRARY UNITS, ARBITRARY UNITS
##FACTOR=    0.220516191357247, 1,           1
##FIRST=     3153.85077385812, 0,            0
##LAST=      -458.865989147664, 0,           0
##MIN=       -458.865989147664, -136105,     0
##MAX=       3153.85077385812, 533999353,    0
$$ Real data points
##PAGE= N=1
##DATA TABLE= (X++(R..R)), XYDATA
$$ [...]
8472E361976K33324K98670K18350K56868K16440K50993J21195M925j73860k33957
$$ 5361976 5595300 5893970 6112320 6369188 6585628 6836621 6957816 6962741 6788881 6554924
8462F554924l58430l56380l47503k23256k69724j95068j81398k01778k24349j63501
$$ 6554924 6196494 5840114 5492611 5269355 4999631 4804563 4623165 4421387 4197038 4033537
8452D033537j18306r5948n1326l7080n7069k4494m512M2926l0665O3572J27672
$$ 4033537 3915231 3819283 3767957 3730877 3673808 3649314 3644802 3687728 3657063 3720635 3848307
8441C848307K03895J13469J49220O1329R7361J17563J16444J13104J22965P0032
$$ 3848307 4052202 4165671 4314891 4376220 4473581 4591144 4707588 4820692 4943657 5013689
8431E013689K2207q9102p1867q8785k9444o2506j05044j95136j76384j52639j50902
$$ 5013689 5035896 4946794 4874927 4786142 4756698 4694192 4589148 4394012 4217628 4064989 3914087
8420C914087j36078j82820j01660j55229j45207q6422j51945j88030p7944j11339
$$ 3914087 3778009 3595189 3493529 3338300 3193093 3106671 2954726 2766696 2688752 2577413
8410B577413k5720r3474l1684j8541l6938k1392l9499K3576L546K725m0305M6392
$$ 2577413 2551693 2458219 2426535 2407994 2371056 2349664 2310165 2333741 2337287 2340012 2299707 2346099
8398B346099K7478q58l852J2135K1521n109K6243K7264J9082l5896n0465o2261
$$ 2346099 2373577 2372719 2368867 2381002 2402523 2397414 2423657 2450921 2470003 2434107 2383642 2321381
8386B321381n9800p3884j24283j02263q8824o2865n3019m4403j28965p8552l0795
$$ 2321381 2261581 2187697 2063414 1961151 1872327 1809462 1756443 1712040 1583075 1504523 1473728
8375A473728j7778n2398j08126q4585l8185k4565l3509m7560q0655n25m6089k2603
$$ 1473728 1455950 1403552 1295426 1210841 1172656 1148091 1114582 1067022 986367 985842 939753 917150
8363I17150n6243M256l08M3999p2795l6938k1712M6123k3402j0608m5086n2926
$$ 917150 860907 865163 864855 908854 836059 799121 777409 823532 800130 789522 744436 691510
8351F91510o565j0123j3943n2553l0724Q2699l4816m3004J5176p168k4088M7946
$$ 691510 684945 674822 660879 608326 577602 660301 625485 582481 597657 590489 566401 614347
8339F14347m2960l4549k2856J1543L981Q3641l0032m064j1118j9372l117K2881
$$ 614347 571387 536838 513982 525525 529506 613147 583115 579051 567933 548561 545444 568325
8327E68325J7005K8265J7711k9735l4416k3488k0816j1512k0241k722O5317k0014
$$ 568325 585330 613595 631306 601571 567155 543667 522851 511339 491098 488376 553693 533679
8315E33679l0350L278K6654J0151J1554m8041K6892K5072m3680n2731K2986q300
$$ 533679 503329 506607 533261 543412 554966 506925 533817 558889 515209 462478 485464 477164
8303D77164l5693J887O0643K2754m0843L4801K4741k3938K6821J5673m0512L2758
$$ 477164 441471 443358 504001 526755 485912 520713 545454 521516 548337 564010 523498 556256
8291E56256k0757J4014n996M0553J3732k6952j6665L1853O7377J5090l3254j2045
$$ 556256 535499 549513 543517 584070 597802 570850 554185 586038 653415 668505 635251 623206
8279F23206K9016J8283K8533O534L2761L2818n3725L4773L50l7488K9033j4816
$$ 623206 652222 670505 699038 705572 738333 771151 717426 752199 752549 715061 744094 729278
8267G29278o547l2439L679J8229L3643l3381K5753k406J4029M4092J8328p689
$$ 729278 722731 690292 693971 712200 745843 712462 738215 735809 749838 793930 812258 804569
8255H04569R069J0089N3292O658m9932Q1105R1585N8026l5619L7170N1443k5932
$$ 804569 813638 823727 877019 883677 833745 914850 1006435 1064461 1028842 1066012 1117455 1091523
8243A091523L1915L4297n3876k2028J0879q749N4084n253K210O6371r347J5176
$$ 1091523 1123438 1157735 1103859 1081831 1092710 1083961 1138045 1132792 1135002 1201373 1192026 1207202
8231A207202P9316R8873J48277Q1142J00788J19649K12477L68821M63998L10325
$$ 1207202 1286518 1385391 1533668 1614810 1715598 1835247 2047724 2416545 2880543 3190868
8221C190868j91093m31671l94643k63816j52211j36706j13184n7220N525j04721
$$ 3190868 2999775 2568104 2173461 1909645 1757434 1620728 1507544 1450324 1455849 1351128
8211A351128n0707p0089m7106l3268n0815j3156m1597m9272L039q983k6793K9063
$$ 1351128 1300421 1230332 1183226 1149958 1099143 1085987 1044390 995118 998157 989174 962381 991444
8199I91444k6679K9873M5986J1629M031l1891j44925K54M32954O4741M7512k2566
$$ 991444 964765 994638 1040624 1052253 1056284 1024393 879468 879722 1312676 1377417 1424929 1402363
8187A402363j4426n698o3908o809p0571p3628m2809j01287n82p0831j9629l8308
$$ 1402363 1387937 1382239 1318331 1311522 1240951 1167323 1124514 1023227 1022645 951814 932185 893877
8175H93877m7120n8188n5870j9454j6261n579L8791o1457n1355L1577k7924l3558
$$ 893877 846757 788569 732699 713245 696984 691405 730196 668739 617384 648961 621037 587479
8163E87479J857K9258M5195J0613o7211L7224L4961q350m5786J8756k8514j6266
$$ 587479 589336 618594 663789 674402 607191 644415 679376 671026 625240 643996 615482 599216
8151E99216k5548J7701o4926l6120m7122Q160n125m8354L798k6620k8505J2873
$$ 599216 573668 591369 526443 490323 443201 451361 446236 397882 401680 375060 346555 359428
8139C59428k4123l7773K0354l9080K7861L3421o0657j0919l6454m4382k015L2986
$$ 359428 335305 297532 317886 278806 306667 340088 279431 268512 232058 187676 185661 218647
8127B18647l629J2364j0279k4739J7290k8917m0742r144l229J4583k9465k3765
$$ 218647 215018 227382 217103 192364 209654 180737 139995 130851 127622 142205 112740 88975
8115H8975J9093J0237r349L316k4890N6145J6067l362m0043o122k097k679m9545
$$ 88975 108068 118305 108956 112272 87382 143527 159594 156232 116189 110067 107970 105291 55746
8102E5746K8375K0211k4245M348J8741q347M8047m9451k3161N9216j3081K1400
$$ 55746 84121 104332 80087 84435 103176 94829 142876 93425 70264 129480 116399 137799
8090A37799l7969o8274J6554J045P7381Q30l5064q922j1379l0268m3389j7956
$$ 137799 99830 31556 48110 49155 126536 127366 92302 83380 72001 41733 -1656 -19612
8078a9612L527P8146L8434l8829j8488p835J2152K8228m679M521j107k8893N26
$$ -19612 -16085 62061 100495 61666 43178 35343 47495 75723 71044 75565 74458 45565 46091
8065D6091J5938p180J4821J4232k5556p9223N122N0315M5794n4162j396R828J032
$$ 46091 62029 54849 69670 83902 58346 -20877 -15755 34560 80354 26192 24796 34624 35656
8052C5656K0245l5456M2246p412n9617m6317J0918O0392K0786k6340m4467M0475
$$ 35656 55901 20445 62691 55279 -4338 -50655 -39737 20655 41441 15101 -29366 11109
8040A1109O3238o269j6441m3374M955j3006j979L8574m6772j2975M0244q400m156
$$ 11109 74347 68078 51637 8263 13218 212 -1767 36807 -9965 -22940 17304 8904 4748
8027D748J3018j2418K5126k4922k9921K1109K2940R017P107J645J3387k7594L9372
$$ 4748 17766 5348 30474 5552 -24369 -3260 19680 28697 35804 37449 50836 23242 62614
8014F2614J186r5546n4084M819K2552M1997j7649K7356M1557l4428k5000r664
$$ 62614 63800 -31746 -85830 -81011 -58459 -16462 -34111 -6755 34802 374 -24626 -34290
8002c4290J1221K8013l9469p5879L2000J9645N811l034k9542J0843R808k8681
$$ -34290 -23069 4944 -34525 -110404 -78404 -58759 -52948 -55982 -85524 -74681 -64873 -93554
7990i3554j7265M4642K6085j914N0950m1364n0408J5327L123L3045J8381n0693
$$ -93554 -110819 -66177 -40092 -42006 8944 -32420 -82828 -67501 -64378 -31333 -12952 -63645
7978f3645J6865M2174J321j0996M732K174n0422n994m566k550P3263O18o7913
$$ -63645 -46780 -4606 -3285 -14281 -9549 -7375 -57797 -63791 -68357 -70907 2356 2974 -64939
7965f4939J6308l298J552k7940j1961k6510M1111m936J1701L713K2917K2331l7974
$$ -64939 -48631 -51929 -50377 -78317 -90278 -116788 -75677 -80613 -68912 -65199 -42282 -19951 -57925
7952e7925L2343M5446o0284p191k0889q447J827R175J0150o78M704K504N738K3364
$$ -57925 -25582 19864 -40420 -47611 -68500 -76947 -75120 -65945 -55795 -56473 -51769 -49265 -43527 -20163
7938b0163p987r089k4396j17M3997k6282p0476N437K1040J9755J1280l6536M6573
$$ -20163 -28150 -37239 -61635 -61752 -17755 -44037 -114513 -109076 -88036 -68281 -57001 -93537 -46964
7925d6964L3065l1596O50J2325R216k6913j2248L4189k7682j6028J6077o7205
$$ -46964 -13899 -45495 -44845 -32520 -23304 -50217 -62465 -28276 -55958 -71986 -55909 -123114
7913a23114J1542O5285J7183l243l0124l9844L857L4137r911M4756k3656n592
$$ -123114 -111572 -46287 -29104 -32347 -62471 -102315 -98458 -64321 -74232 -29476 -53132 -58724
7901e8724L734j9789j1220K3044N1865l7877o2674l054N0276L0294k2806R636
$$ -58724 -54990 -74779 -85999 -62955 -11090 -48967 -111641 -114695 -64419 -34125 -56931 -47295
7889d7295M6525J9305l7568K463q424l8470n22M6807M8852n009m8801l6515J3555
$$ -47295 -770 18535 -19033 -16570 -24994 -63464 -63986 -17179 31673 26664 -22137 -58652 -45097
7876d5097M6219n4537K1553N30m4502K0885K6414L6315l2768k1724K3730L8202
$$ -45097 1122 -53415 -31862 -31332 -75834 -54949 -28535 7780 -24988 -46712 -22982 15220
7864A5220j5707N017L3524q6908L4112j6567n188L938j2468L0771j5292l1644
$$ 15220 -487 4530 38054 -48854 -14742 -31309 -36497 -32559 -45027 -14256 -29548 -61192
7852f1192L935L9148k3772K9628l918q53n396k3230o875P064K3613p4640O1266
$$ -61192 -57257 -18109 -41881 -12253 -16171 -17024 -22420 -45650 -52525 -45461 -21848 -96488 -35222
7839c5222q199m0042O73N2406M5056o7542O399L1439k5648K4931k7745K8468j7900
$$ -35222 -43421 -83463 -82790 -30384 14672 -52870 -46471 -15032 -40680 -15749 -43494 -15026 -32926
7826c2926m2652q044K7829L6921k0807L0724l0282K5865l9054J66M0120Q78k2192
$$ -32926 -75578 -83622 -55793 -18872 -39679 -8955 -39237 -13372 -52426 -52260 -12140 -11262 -33454
7813c3454M2868l3606k13O267m1314K3403R101M733l38K4574o0100O6030k183
$$ -33454 9414 -24192 -24405 -18138 -59452 -36049 -26948 -22215 -22553 2021 -58079 7951 5768
7800E768J0914R466r929o0634k1242j253k4965L4057L2099j9567J9507J2982r168
$$ 5768 16682 26148 16219 -44415 -65657 -66910 -91875 -57818 -25719 -45286 -25779 -12797 -21965
7787b1965N6433K2565m1257m748M049p897j4385k1318L7504P925K3185o378l0004
$$ -21965 34468 57033 15776 11028 15077 7180 -7205 -28523 8981 16906 40091 33713 3709
7774C709k6309J9062N385q45J3572L8393q099l4869M6625O4007m0042J2619O1589
$$ 3709 -22600 -3538 1847 1002 14574 52967 44868 9999 56624 120631 80589 93208 154797
7761A54797K4933J5760O8822N2348K0288k5583K0024k8187m5484K952n173J2417
$$ 154797 179730 195490 264312 316660 336948 311365 331389 303202 257718 260670 255497 267914
7749B67914P8094L3916j3519n9315q2494m2150m4978n0146J0798k1700o201K4709
$$ 267914 346008 379924 366405 307090 224596 182446 137468 87322 98120 76420 70219 94928
7737I4928J3301l7455k4481J1541o93j1317l334J6480j0167p225J1082j4779o465
$$ 94928 108229 70774 46293 57834 57141 45824 42490 58970 48803 41578 52660 37881 31416
7724C1416n6784L8323L4922m2786K4676N7903K5927k9280J4437K4153j5628k9937
$$ 31416 -25368 12955 47877 5091 29767 87670 113597 84317 98754 122907 107279 77342
7712G7342J4773Q09K3864k7712N4623J7653m1152L5217q4206p279L6437N2695
$$ 77342 92115 92924 116788 89076 143699 161352 120200 155417 71211 63932 100369 153064
7700A53064k1198k8796m3212M7654J7836L7335O2804l0475L5652k283j9711O5252
$$ 153064 131866 103070 59858 107512 125348 162683 225487 195012 230664 228381 208670 273922
7688B73922L7486j7617M4955J4318J13477P3150J70366K26449Q0556p8493j01041
$$ 273922 311408 293791 338746 353064 466541 539691 710057 936506 1017062 938569 837528
7677H37528j24114j5309M7609K4042R9706M9438K3374j40832j35520j32492r4132
$$ 837528 713414 698105 745714 769756 869462 918900 942274 801442 665922 533430 439298
7666D39298o1182n7624n4470j9030o4164n331Q307j6162n4545L2477m160n5298
$$ 439298 378116 320492 266022 246992 182828 177497 185804 169642 115097 147574 143414 88116
7654H8116l903K6748K5773l1940J4848l0034J2373K135j5725j0037k596r224q885
$$ 88116 84213 110961 136734 104794 119642 89608 101981 104116 88391 78354 75758 66534 57649
7641E7649j7769O1405K753k3340k270K766l21J0034l2814k9774J0179q057M4594
$$ 57649 39880 101285 104038 80698 78428 81194 80873 90907 58093 28319 38498 30441 75035
7628G5035j1132j9740L6730l4305N81N3532Q487o824K2596L329o653j2209K3384
$$ 75035 63903 44163 80893 46588 47169 100701 109188 102364 124960 128289 121636 109427 132811
7615A32811q4074K1447N4717J4767l282J3900j2306K7430M2007N3053Q0942O6024
$$ 132811 48737 70184 124901 139668 136386 150286 137980 165410 207417 260470 341412 407436
7603D07436O8885M9210J28466J02086p5786j16274j51404n6403l3556q3386k9181
$$ 407436 476321 525531 653997 756083 680297 564023 412619 356216 322660 239274 210093
7592B10093n2007r059J3334q416K0308p5155j3794L9621j3809p822j6667J2623
$$ 210093 158086 149027 162361 153945 174253 99098 85304 124925 111116 103294 86627 99250
7580I9250L1114N986l0202K340l886K993J8580N3761O049Q567j910n6127O3978
$$ 99250 130364 136350 106148 108488 104602 107595 126175 179936 185985 194552 192642 136515 200493
7567B00493J2636j4368J5234j99O456L8362K5337M5306J14981J24361J66256J21302
$$ 200493 213129 198761 213995 213796 220252 258614 283951 329257 444238 568599 734855 856157
7555H56157L1122q6040k30963j11318j05335p1320r1312j2047N0343o6906l209
$$ 856157 887279 801239 570276 458958 353623 282303 190991 178944 229287 162381 159172
7544A59172j7426n1795j9920P256j4598J1285J3985M883r983L0942k3429p1891
$$ 159172 141746 89951 70031 77287 62689 73974 87959 92842 82859 113801 90372 18481
7532A8481l1605P2119R1519j6338J0564O224N4961J5859K8613O886p3795j2851
$$ 18481 -13124 58995 150514 134176 144740 150964 205925 221784 250397 257283 183488 170637
7520A70637l6026j859p7604K5080l9990l0515j6681M2966M5641k1422k1425N8075
$$ 170637 134611 132752 55148 80228 40238 9723 -6958 36008 81649 60227 38802 96877
7508I6877j8160k0573n7191M1821J6689l5255K331o61l0119M0688M237l3084L8731
$$ 96877 78717 58144 953 42774 59463 24208 26539 25878 -4241 36447 40684 7600 46331
7495D6331J4085L3318k2657k5813M0551K0885L9267N727q0343n167L2145M509
$$ 46331 60416 93734 71077 45264 85815 106700 145967 151694 71351 66184 98329 102838
7483A02838l358O1811Q1569Q0401L0737k5980n7827j00037j8687L949l8405K2234
$$ 102838 99480 161291 242860 323261 353998 328018 270191 170154 151467 155416 117011 139245
7471A39245K6002r7190K4163j7279j5109M2590k574j402M883M158j00156L0084
$$ 139245 165247 68057 92220 74941 59832 102422 99848 98446 103329 107487 7331 37415
7459C7415l1714P3239j5412l3957o890j4397O9777j3911k3978o4798N0459K7877
$$ 37415 5701 78940 63528 29571 22681 8284 78061 64150 40172 -24626 25833 53710
7447E3710R1k3194j1360M518k5331J1739m073M922L4637J5064M0946l6432p6422
$$ 53710 53801 30607 19247 23765 -1566 10173 6100 11022 45659 60723 101669 65237 -11185
7434a1185N0483J9799P240L7601K1330J1230J1464N747L3337J5322n9893m9639
$$ -11185 39298 59097 66337 103938 125268 136498 147962 153709 187046 202368 142475 92836
7422I2836o220j613j5526j9343l4165m7574L8401O481k707j948n2279K1728M9637
$$ 92836 86616 85003 69477 50134 15969 -31605 6796 13277 10570 8622 -43657 -21929 27708
7409B7708m5830k3080P628m36K7677K4007K0945j7772l1279k6831P626L1297j5699
$$ 27708 -18122 -41202 -33574 -34010 -6333 17674 38619 20847 -10432 -37263 -29637 1660 -14039
7396a4039l3241K4269P3099M6986m7411o4619K3794k6010K1275K3706o910j7141
$$ -14039 -47280 -23011 50088 97074 49663 -14956 8838 -17172 4103 27809 20899 3758
7384C758n840J6733J8819o1279J0632O550r824r514j2107J7807M5363k7421m2796
$$ 3758 -2082 14651 33470 -27809 -17177 -10627 -20451 -29965 -42072 -24265 21098 -6323 -49119
7371d9119j6388L7496K5875K1827l2475J8708J6131n0196J7401O5368j1263k0014
$$ -49119 -65507 -28011 -2136 19691 -12784 5924 22055 -28141 -10740 54628 43365 23351
7359B3351J5281r987P883k7942j8408m579k2018K9734p696J2728L005J0729K8227
$$ 23351 38632 28645 36528 8586 -9822 -14401 -36419 -6685 -14381 -1653 1352 12081 40308
7346D0308k7512j7309P172P154Q525Q019k5835K597R257k1540P4513N1557l7901
$$ 40308 12796 -4513 2659 9813 18338 26357 522 3119 12376 -9164 65349 116906 79005
7333G9005j519j0101Q11L805K1241o7651n286L7248J4990j5525K7233K885K776
$$ 79005 77486 67385 68196 72001 93242 25591 20305 57553 72543 57018 84251 87136 89912
7320H9912m4529j3416M3921J8410M5202K864j2933L2469k1281j5326j208K7548
$$ 89912 45383 31967 75888 94298 139500 142364 129431 161900 140619 125293 124085 151633
7308A51633K581J3543O6585j0462n1300J4084L9006O000j1050p7407J151O6526
$$ 151633 154214 167757 234342 223880 172580 186664 225670 231670 220620 143213 144364 210890
7296B10890K7176M6268K548m5666m3484o095l5089j2749r526O13M0547O0541n768
$$ 210890 238066 284334 286882 241216 197732 191637 156548 143799 134273 134886 175433 235974 230206
7283B30206q8985J0065j4746k2910J2381J5916P7323l7048k1493P3291k2230m8195
$$ 230206 141221 151286 136540 113630 126011 141927 219250 182202 160709 234000 211770 163575
7271A63575k0637o1095J411N4659N0917K7430j3286l9466k6200l6925M5271O3548
$$ 163575 142938 81843 83254 137913 188830 216260 202974 163508 137308 100383 145654 209202
7259B09202j5184k3077l2295J9585N8541k3045j4035K1070M7891N0718K5304l4855
$$ 209202 194018 170941 138646 158231 216772 193727 179692 200762 248653 299371 324675 289820
7247B89820J5213j7155K996l723P8293Q945M8847M0236K077O0170Q626M8550Q0934
$$ 289820 305033 287878 290874 287151 365444 374389 423236 463472 465549 525719 534345 582895 663829
7234F63829P319j8115K4141n195o78j2212K0709M4274l8451q1010j673k4529M647
$$ 663829 671148 653033 677174 671979 671301 659089 679798 724072 685621 604611 602938 578409 583056
7221E83056n4822m5125m8633k4363n6836l3819l452N703n062J6337N333o8106
$$ 583056 528234 483109 434476 410113 353277 319458 316006 321709 316647 332984 338317 270211
7209B70211l4448K5616K2561J2852Q63k6298k7141l4346J4989J6611k4076m2045
$$ 270211 235763 261379 283940 296792 297655 271357 244216 209870 224859 241470 217394 175349
7197A75349j5907k2815j1859L5012K2588l3150j5814O1173j6579j7522K990k3397
$$ 175349 159442 136627 124768 159780 182368 149218 133404 194577 177998 160476 163466 140069
7185A40069N2632K3895j5697n922k5193j7479L0887k580k986N0954J793j00310
$$ 140069 192701 216596 200899 194977 169784 152305 183192 180612 177626 228580 230373 130063
7173A30063j1006R529K2720J0563j792N124M9326J2510o727N5508n0695Q655l0602
$$ 130063 119057 128586 151306 161869 160077 165201 214527 227037 220310 275818 225123 233778 203176
7160B03176J426K2496j103M546M5526n115M0345M1160N1120Q0411P0341J8991
$$ 203176 204602 227098 225995 230541 276067 270952 311297 352457 403577 483988 554329 573320
7148E73320M0556J39649J77282M8284n6836j02066m5268n4041n903k4863R9170
$$ 573320 613876 753525 930807 979091 922255 820189 774921 720880 714977 690114 789284
7137G89284J17884M139j08867j31968j14431m2731p7225l2677j6941L787m7121
$$ 789284 907168 911307 802440 670472 556041 513310 436085 403408 386467 390254 343133
7126C43133o0223q676J6724M6060k4080o2523L3192O8044o8851k8487R28K9464
$$ 343133 282910 274234 290958 337018 312938 250415 283607 351651 282800 254313 255241 284705
7114B84705j5311P47p1366N7273K8490l2281L4114R1169J0713K3681Q1886J15677
$$ 284705 269394 270141 198775 256048 284538 252257 286371 377540 388253 411934 493820 609497
7102F09497R1591J1909m7296m7433l6732m4280m0422N2106L9046R2461Q3422n4642
$$ 609497 701088 712997 665701 618268 581536 537256 496834 548940 587986 680447 763869 709227
7090G09227j09598p9971r3481j6508l6134p3065m368l0627m0433m6255k2965K361
$$ 709227 599629 519658 426177 409669 373535 300470 296102 265475 225042 178787 155822 158183
7078A58183J847k0641J6760R853m2706N179N9334j7740j8482j3891j9956J7389
$$ 158183 160030 139389 156149 166002 123296 128475 187809 170069 151587 137696 117740 135129
7066A35129J4227J7858J6427o6352k6650J03426K964l0527J6129N092l3363K4879
$$ 135129 149356 167214 183641 117289 90639 194065 197029 166502 182631 187723 154360 179239
7054A79239j4582L034O3608R162n4018m4493K2584O9533l6428N241M8685j1864
$$ 179239 164657 167691 231299 240461 186443 141950 164534 234067 197639 202880 251565 239701
7042B39701k708L963L667k9423L719l9361j0915P03o096j6031k260L5449L005
$$ 239701 236993 240956 244623 215200 218919 179558 168643 169346 163250 147219 144959 180408 183413
7029A83413r032M2500J5869l3876k4448K8312n9106n2070J6753p086l4756l85
$$ 183413 174381 216881 232750 198874 174426 202738 143632 91562 108315 101229 66473 66088
7017F6088J6746K4439l79k8697J4696k3827L967L8208K9041k1500K3954q01m6372
$$ 66088 82834 107273 106894 78197 92893 69066 73033 111241 140282 118782 142736 141935 95563
7004I5563o2657L8017M2456K9114K6433K3432k2045n5118j5530O2377K0159p2877
$$ 95563 32906 70923 113379 142493 168926 192358 170313 115195 99665 162042 182201 109324
6992A09324J86J1748j1682K4509k5919l993L1783L7320K2010P250j8855n542J5456
$$ 109324 109510 121258 109576 134085 108166 104173 135956 173276 195286 202536 183681 178139 193595
6979A93595l2059M0319O2160J5757M0630m7444L2651O0868o008l3280l7550L2002
$$ 193595 161536 201855 264015 279772 320402 272958 305609 366477 360469 327189 289639 321641
6967C21641O7561P2598L9484r877j5507M4694K4481R8283N7527J2595L2922p539
$$ 321641 389202 461800 501284 491407 475900 520594 545075 643358 700885 713480 746402 738863
6955G38863j09389k1707M5136J3219p2977q6751k9440n748p3788l4033k7178k1343
$$ 738863 629474 607767 652903 666122 593145 506394 476954 471206 397418 363385 336207 314864
6943C14864j0675j5568P936q472r996q814j2196M345l7853m9873L5057M460J6714
$$ 314864 304189 288621 296557 288085 278089 269275 257079 261424 223571 173698 208755 213215 229929
6930B29929k0673j9370R8550J526l9662O3119k5041l7278M3924j9004j5114J3236
$$ 229929 209256 189886 288436 289962 250300 313419 288378 251100 295024 276020 260906 274142
6918B74142J3100o6254L5442q475O321o5644m0212P509j1971k8771L7619p290
$$ 274142 287242 220988 256430 247955 254276 188632 148420 155929 143958 115187 152806 145516
6906A45516k1581k7431k9369K3840j1580K4621K6560q293O262j4995K3947r981
$$ 145516 123935 96504 67135 90975 79395 104016 130576 122283 128545 113550 137497 127516
6894A27516l2109j0308J3949k170k9476K9130M0736m4864l829r253k6762N5858
$$ 127516 95407 85099 99048 96878 67402 96532 137268 92404 88575 79322 52560 108418
6882A08418J5090l9662j4788O2755j5489M3743k9975l1973n407K6938J6917J1045
$$ 108418 123508 83846 69058 131813 116324 160067 130092 98119 92712 119650 136567 147612
6870A47612J9158k4259k5473n2036J5924J1616l5358O7801L4726l122l1580K6817
$$ 147612 166770 142511 117038 65002 80926 92542 57184 124985 159711 156589 125009 151826
6858A51826p931M5581K4241j9089o2964k8042K5418k249p774k05M4299N5233n2532
$$ 151826 143895 189476 213717 194628 131664 103622 129040 126791 119017 118812 163111 218344 165812
6845A65812l681L4089k0021Q638J9562j5735J7114j3801j2146l2476M0144k2823
$$ 165812 162131 196220 176199 184837 204399 188664 205778 191977 179831 147355 187499 164676
6833A64676K90p329k53K238n593M2202p161N9985k1663K1825J2402k5819L5072
$$ 164676 164966 157637 157384 159622 154029 196231 189070 249055 227392 249217 261619 235800 270872
6820B70872K803m3184L6388L6879j1156k2258N572j9748Q187J2152K4734k9101
$$ 270872 273675 230491 266879 303758 292602 270344 275916 256168 264355 276507 301241 272140
6808B72140k4889j5650j4103M907l0913l8605l9414O4157m6290J365K2010j4028
$$ 272140 247251 231601 217498 222405 191492 152887 113473 177630 131340 132705 154715 140687
6796A40687m2976M033K9183n2091k9061J9510M2763j5631K837N3317j519o6905
$$ 140687 97711 101744 130927 78836 49775 69285 112048 96417 99254 152571 151052 84147
6784H4147q418p606r348K927L4534O601j8232M065J267r122j9813K2913J8783
$$ 84147 75729 68123 58775 61702 96236 102837 84605 88670 89937 80815 61002 83915 102698
6771A02698L979k6145j2048K2524l5085N228q811O3809j3988m3442R440O192k637
$$ 102698 106677 80532 68484 91008 55923 61151 52340 116149 102161 58719 68159 74351 71714
6758G1714K4462p958o66J7312j2984l2492k8089M3513J949j5341p411j0952m857
$$ 71714 96176 88218 87552 104864 91880 59388 31299 74812 76761 61420 54009 43057 38200
6745C8200R800k6828l8622M1133P0111O3761j8534p2648M653L023l2957k1171
$$ 38200 48000 21172 -17450 23683 93794 157555 139021 66373 71026 74049 41092 19921
6733A9921O8764l8436l8544M699o682L2772N6230J8336l5816j2569J5937k8952
$$ 19921 88685 50249 11705 16404 9722 42494 98724 117060 81244 68675 84612 55660
6721E5660k5026j6605j9037O021j2642M1855K0459j2302m0495N3592K2603k0536
$$ 55660 30634 14029 -5008 1013 -11629 30226 50685 38383 -2112 51480 74083 53547
6709E3547k8319P728L8237P283o181r876K429n723m7381L5137M8500j0029m2404
$$ 53547 25228 32956 71193 78476 72295 62419 64848 59125 11744 46881 95381 85352 42948
6696D2948j4889k6094n1183k9455N7615L5718J6249j7627k4337P184M8179K7819
$$ 42948 28059 1965 -49218 -78673 -21058 14660 30909 13282 -11055 -3871 44308 72127
6684G2127o9465K8472J743j1750k7113M1311M949k360m7892m6210O8842o411P296
$$ 72127 2662 31134 32877 21127 -5986 35325 40274 37914 -9978 -56188 12654 6243 13539
6671A3539N0807n267o4211k3814L6125O0544j2356o1572J2384L4800j7466k331
$$ 13539 64346 59079 -5132 -28946 7179 67723 55367 -6205 6179 40979 23513 21182
6659B1182Q318M7964M7482l8176p4814k2189K0739n7956m4790N7469J8475K9640
$$ 21182 29500 77464 124946 86770 11956 -10233 10506 -47450 -92240 -34771 -16296 13344
6647A3344l1793j6395q383M3115L3100l961o966K062L6415j2200j7372K0157k68
$$ 13344 -18449 -34844 -43227 -112 32988 29027 22061 24123 60538 48338 30966 51123 50855
6634E0855o5273M7453K237j0748N791J821k8165j882N0162J1737k3859N291j6687
$$ 50855 -14418 33035 35272 24524 30315 32136 3971 2089 52251 63988 40129 45420 28733
6621B8733m677K914M579R010J805J5155k2816k62l2047M6265K1683j6484j0921
$$ 28733 24056 26970 31549 40559 42364 57519 34703 34441 2394 48659 70342 53858 42937
6608D2937k3543M0069n962j3677l6433J765l963K7365K8028j0550n5474K215L6226
$$ 42937 19394 59463 53501 39824 3391 5156 1193 28558 56586 46036 -9438 -7223 29003
6595B9003K3740m8830q051P376J6927J5181k4464j9498N6857K68k8881j2634N2451
$$ 29003 52743 3913 -4138 3238 20165 35346 10882 -8616 48241 48509 19628 6994 59445
6582E9445j0790n1079L7764J3246k8986K2485L3984L0036k8432n1300J7776M478
$$ 59445 48655 -2424 35340 48586 19600 42085 76069 106105 77673 26373 44149 48627
6570D8627m449l420K5126m033J3783k613k3718J0603L4357J720l1033k1635n085
$$ 48627 44178 40758 65884 61851 75634 73021 49303 59906 94263 95983 64950 43315 38230
6557C8230J5380j5111M0200M5375n3205n2933J7672M2299N5466K608j1580q061
$$ 38230 53610 38499 78699 124074 70869 17936 35608 77907 133373 135981 124401 116340
6545A16340o7625K6847P109O5964n4620o7499k9595M7390K3904J2851J101l5369
$$ 116340 48715 75562 82671 148635 94015 26516 -3079 44311 68215 81066 82167 46798
6533D6798j7261K1318j2544K0962M724k0543l3561k035J9476o4189J7624L5434
$$ 46798 29537 50855 38311 59273 63997 43454 9893 7858 27334 -36855 -19231 16203
6521A6203k446N1406j0109J5324j2245r70J5481k6436K3132K2973M82J8464n9675
$$ 16203 13757 65163 55054 70378 58133 57163 72644 46208 69340 92313 92795 111259 51584
6508E1584M598L4415j7588n0913J8813M0955r875m7052N467L1032j2173m0134
$$ 51584 56182 90597 73009 22096 40909 81864 71989 24937 30404 61436 49263 9129
6496I129l5126O0070M809K4712k1121L3311p321K387l5840k4294r312Q101j1005
$$ 9129 -25997 34073 38882 63594 42473 75784 68463 70850 35010 10716 1404 9505 -1500
6483a500L1437J119K1049L4172Q103j5599k872k0134j3240J2758l2114n242L3855
$$ -1500 29937 31056 52105 86277 94380 78781 75909 55775 42535 55293 23179 17937 51792
6470E1792m1899K6544J5854K8983J1919m2067M5892K323L1725m3838l8009K499
$$ 51792 9893 36437 52291 81274 93193 51126 97018 99341 131066 87228 49219 51718
6458E1718l4623L8381n4341N081Q618J4472K7239J4816L3121q5243m4163O5035
$$ 51718 17095 55476 1135 6216 14834 29306 56545 71361 104482 19239 -24924 40111
6446D0111n341m8961j0325L5691N6153k4398q638j7626k0785n2108K6223K2010
$$ 40111 34770 -14191 -24516 11175 67328 42930 34292 16666 -4119 -56227 -30004 -7994
6434g994N7240M9909j3865k7784K5178K9235l4986o0055K4294K0957L7814l9549
$$ -7994 49246 99155 85290 57506 82684 111919 76933 16878 41172 62129 99943 60394
6422F0394K4276k0350j9797L0990j9380l251K1530k9748K2871j1744j8676L4453
$$ 60394 84670 64320 44523 75513 56133 52882 74412 44664 67535 55791 37115 71568
6410G1568K053P794j2835K3713K04J2532q469Q364j8350J9408n4071L4562J1882
$$ 71568 73621 81415 68580 92293 92497 105029 96560 104924 86574 105982 51911 86473 98355
6397I8355k9329M3808M8045o7443N682k5537K987N5807K7705L8939j3947k9620
$$ 98355 69026 112834 160879 93436 99118 73581 76568 132375 160080 199019 185072 155452
6385A55452k6987K39L3409R588o1790m568K7810n358p741L0168n6382o2M1746
$$ 155452 128465 128704 162113 171701 109911 105343 133153 127795 120054 150222 93840 93778 135524
6372A35524K3807n9634K5482J4466k3563l8492m5477L8311L967l0989k4793L9223
$$ 135524 159331 99697 125179 139645 116082 77590 32113 70424 74391 43402 18609 57832
6360E7832J041m104N2368k8775J1348m3799k3492M5337K4050n3979L6716J1550
$$ 57832 58873 54769 107137 78362 89710 45911 22419 67756 91806 37827 74543 86093
6348H6093k643J9563m0074K775J0447L7890l0219p618L6851O985m8142N3380q398
$$ 86093 83450 103013 62939 65714 76161 114051 83832 76214 113065 120050 71908 125288 116890
6335A16890k9303j9385K9883L7869j1554l5949k480j5131L2705k1545k6606J7185
$$ 116890 87587 68202 98085 135954 124400 88451 85971 70840 103545 82000 55394 72579
6323G2579K2962K0095r059J3529j4693Q11M523l2303k2791K9721Q384J6375J3688
$$ 72579 95541 115636 106577 120106 105413 106224 110747 78444 55653 85374 93758 110133 123821
6310A23821m5876j2346m2985K045k397K1315M6883k2398O162J7607j4996M233
$$ 123821 77945 65599 22614 24659 22262 43577 90460 68062 74224 91831 76835 81068
6298H1068R092M573N557l7772k0133K9735J3872q507P098r429P527J5036J3245
$$ 81068 90160 94733 100290 62518 42385 72120 85992 77485 84583 75154 82681 97717 110962
6285A10962l6495r573J560K1013l6185N5166L1414l5072M5159J4328M112m1764
$$ 110962 74467 64894 66454 87467 51282 106448 137862 102790 147949 162277 166389 124625
6273A24625J3493p899J767O226J2059j1621l3046K8235O6920o7337n5458P7826
$$ 124625 138118 130219 131986 138212 150271 138650 105604 133839 200759 133422 77964 155790
6261A55790K7123m0983n0993n6063j6382O1198K0087L4427o0065J0446J6417K2100
$$ 155790 182913 141930 90937 34874 18492 79690 99777 134204 74139 84585 101002 123102
6249A23102n729j4269j5700K7299L9614q45n5212n866L0067j4737O749J7510J0394
$$ 123102 117373 103104 87404 114703 154317 153472 98260 92394 122461 107724 114473 131983 142377
6236A42377J0334N450p3989n9021O5633l589k2509n987j5784O7996k6846O0617
$$ 142377 152711 158161 84172 25151 90784 87195 64686 58699 42915 110911 84065 144682
6224A44682J2722j4626n521j4782j7523j3184O038k2845K4391k7183J3678N9432
$$ 144682 157404 142778 137257 122475 104952 91768 97806 74961 99352 72169 85847 145279
6212A45279j3262k4447N579M8408l3798q400P9445m3466l5627O0138k482Q805
$$ 145279 132017 107570 113149 161557 127759 119359 198804 155338 119711 179849 177367 186172
6200A86172J3714j8849n1746L4131l1191K9122m3437n1302M7235j5008n103K2815
$$ 186172 199886 181037 129291 163422 132231 161353 117916 66614 113849 98841 93738 116553
6188A16553L4367m9178K9233L0980k128L1310n2743J1389k7071k9586N0848K0554
$$ 116553 150920 101742 130975 161955 159827 191137 138394 149783 122712 93126 143974 164528
6176A64528q859n8536O0557j2637Q961j8177J8034j2873J6472M1777m2888q1995
$$ 164528 155669 97133 157690 145053 154014 135837 153871 140998 157470 199247 156359 74364
6164G4364j0303M4470N2405K1894q4594K4412K1601o518J2507k1739N1241k4565
$$ 74364 64061 108531 160936 182830 98236 122648 144249 137731 150238 128499 179740 155175
6152A55175L2833M2452m4957j7791k1939j5541P507O687J000r576k310P172J1623
$$ 155175 188008 230460 185503 167712 145773 130232 137739 144426 145426 135850 133540 140712 152335
6139A52335J7598p070l2833l3797M3620K1277k9062N2399k243l2310n518q035
$$ 152335 169933 162863 130030 96233 139853 161130 132068 184467 182224 149914 144396 136361
6127A36361P4915n834k5692n793J9825L1854j2351J0038J2230n5187N977k1794
$$ 136361 211276 205442 179750 173957 193782 225636 213285 223323 235553 180366 186343 164549
6115A64549K1971O002k4229J626k0805m559M5568m4394J4942K5828r884M6720
$$ 164549 186520 192522 168293 169919 149114 144555 190123 145729 160671 186499 176615 223335
6103B23335k3582m2524p569J5786M7166r53K308k7823N97K5076n0983n652M0980
$$ 223335 199753 157229 149660 165446 212612 211659 213967 186144 186741 211817 160834 155182 196162
6090A96162M6555K9240N745j4685M464l9434L2443J545j7557l93l5442j3062M6085
$$ 196162 242717 271957 277702 263017 267481 228047 260490 262035 244478 244085 208643 195581 241666
6077B41666j522j9807J2644k7682M5378m7805J6686M4983J747L0397K5850m903
$$ 241666 240144 220337 232981 205299 250677 202872 219558 264541 266288 296685 322535 317632
6065C17632L1524m0279k6612K1180p477l076k1300J1456k4198K577L2030J6885
$$ 317632 349156 308877 282265 303445 295968 292892 271592 283048 258850 261427 293457 310342
6053C10342N950k0397L9055J3939l5407K5129n5218K7671J3826l0876r77L1670
$$ 310342 316292 295895 334950 348889 313482 338611 283393 311064 324890 294014 293037 324707
6041C24707M0K6592l9899J8294L710m0565P718O5159j7207k6519k2352k2519j3922
$$ 324707 324747 351339 311440 329734 333444 292879 300597 365756 348549 322030 299678 277159 263237
6028B63237N0758O0586m31R068p415k2552N769K297j1859K104k0279j9630M1823
$$ 263237 313995 374581 374150 383218 375803 353251 359020 361317 349458 351562 331283 311653 353476
6015C53476K9538j9513Q2231O761j1905J7407K7858j9307k080J4029k3435m7341
$$ 353476 383014 363501 445732 452493 440588 457995 485853 466546 464466 478495 455060 407719
6003D07719L1729N4588m291l2028M471L7225M1436J6369m1763k5833K1783K1271
$$ 407719 439448 494036 489745 457717 462188 499413 540849 557218 515455 489622 511405 532676
5991E32676o4103j3857k928K3279J4749j7614K2820n0074K3705j628k5320j865
$$ 532676 468573 454716 451788 475067 489816 472202 495022 444948 468653 467025 441705 439840
5979D39840O6669j303l497L3713M6972p856k60L945K8953q374M9673J3592r243
$$ 439840 506509 505206 501709 535422 582394 574538 574278 578223 607176 598802 648475 662067 652824
5966F52824P5745K5247q8918m9125N161n0684j4435K73n4916O677k7079n409J6760
$$ 652824 728569 753816 664898 615773 620934 570250 555815 556088 501172 507849 480770 475361 492121
5953D92121l2722L1471k6211K9929r732M6485o8177j5651K9555Q868K1517M8644
$$ 492121 459399 490870 464659 494588 484856 531341 463164 447513 477068 485936 507453 556097
5941E56097J8623N724N5076k1831n1973o6459L8503M1010n370m8996KJ5289k7570
$$ 556097 574720 580444 635520 613689 561716 495257 533760 574770 569400 520404 520406 535695 508125
5928E08125J7839k1430r269j513l5073J6977L4399j0833j411l7960K5619o4137
$$ 508125 525964 504534 495265 493752 458679 475656 510055 499222 497811 459851 485470 421333
5916D21333M5797k5168k2341J08183K0672k5610m5356N3959L7062m0309l0189
$$ 421333 467130 441962 419621 527804 548476 522866 477510 531469 568531 528222 498033
5905D98033m644k072L742K3246j8438O505k0693L497L3579j331j0711P084R086
$$ 498033 493389 491317 495059 518305 499867 506372 485679 489176 522755 521424 510713 517797 526883
5892E26883l8610K0827J013K271K5862J7229m0144K796K564K4580m8564J9442
$$ 526883 488273 509100 510113 512384 538246 555475 515331 518127 520691 545271 496707 516149
5880E16149K9174o144j4896n5192L2384K7018J7681q230j8788L0174N5315o0372
$$ 516149 545323 539179 524283 469091 501475 528493 546174 537944 519156 549330 604645 544273
5868E44273j0128K3647K0632M9004l4478l8385K5470o888R216m2100M2522O5139
$$ 544273 534145 557792 578424 627428 592950 554565 580035 573147 582363 540263 582785 647924
5856F47924m8672l2057M935j1441j0891J4430J7929K3383l4015o901J7900l3138
$$ 647924 599252 567195 572130 560689 549798 564228 582157 605540 571525 564624 582524 549386
5844E49386J8198P1888K0775l0948k1811m019L2151M7030o977J8880m2157k6678
$$ 549386 567584 639472 660247 629299 607488 603469 635620 682650 675673 694553 652396 625718
5832F25718O3584L3634j5998j8941N559k5577k287N731K9104k9021k2416q785
$$ 625718 689302 722936 706938 687997 693556 667979 665692 671423 700527 671506 649090 640305
5820F40305K3946K5791j4271M2545o865N4355J7634p334m6623L5820M4668l1261
$$ 640305 664251 690042 675771 718316 711451 765806 783440 776106 729483 765303 809971 778710
5808G78710J0180k6458l9781M7946K846M9021M5778k6659n426J8186Q91M1980
$$ 778710 788890 762432 722651 770597 773443 822464 868242 841583 836157 854343 855234 897214
5796H97214J8O613j0584j0029K4565n9112J1124M7560N502M1988J3741j8140J2540
$$ 897214 897232 903845 893261 883232 907797 848685 859809 907369 912871 954859 968600 950460 963000
5783I63000j2035R369j7977J776J9148J4997K3373L1076M3808k4029k8011N7734
$$ 963000 950965 960334 942357 944133 963281 978278 1001651 1032727 1076535 1052506 1024495 1082229
5771A082229M0774J2583J0049m9767J4788R622M3208K5944j4946r805L8539M3983
$$ 1082229 1123003 1135586 1145635 1095868 1110656 1120278 1163486 1189430 1174484 1164679 1203218 1247201
5759A247201K9477j798L7513l4986K8589K5610l5222K7533K3783J8189N343J7913
$$ 1247201 1276678 1274880 1312393 1277407 1305996 1331606 1296384 1323917 1347700 1365889 1371232 1389145
5747A389145O8014K8427l4560m536j8430M7381J9151M403L0032k3125j5702O2181
$$ 1389145 1457159 1485586 1451026 1446490 1428060 1475441 1494592 1498995 1529027 1505902 1490200 1552381
5735A552381L1008n6347K2078K6745K0324O7949j8637K8568N1960L7765J6314
$$ 1552381 1583389 1527042 1549120 1575865 1596189 1664138 1645501 1674069 1726029 1763794 1780108
5724A780108L1629n3171l2051L4115K262L8134L3166L5009L2383m0286l995M8644
$$ 1780108 1811737 1758566 1726515 1760630 1762892 1801026 1834192 1869201 1901584 1861298 1857303 1905947
5712A905947P6741M058M2019N117k4612k2374L9590Q1562K0870K2910N1809J9332
$$ 1905947 1982688 1986746 2028765 2033882 2009270 1986896 2026486 2108048 2128918 2151828 2203637 2222969
5700B222969j3796K4637P8725l5005k0594L4746J06922K2891J2195P0703K8964
$$ 2222969 2209173 2233810 2312535 2277530 2256936 2291682 2398604 2421495 2433690 2504393 2533357
5689B533357K995L4802M3656M8683K0196J5474K0347K6298K15N3564M9414L9049
$$ 2533357 2536352 2571154 2614810 2663493 2683689 2699163 2719510 2745808 2746023 2799587 2849001 2888050
5677B888050K2156Q495K6873R56L1345K7248K5526N0634N3328O3407r241K7201
$$ 2888050 2910206 2918701 2945574 2946530 2977875 3005123 3030649 3081283 3134611 3198018 3188777 3215978
5665C215978N0416P6747N3825M0622M2906p954J1528N2421N3025K0104k5034j4484
$$ 3215978 3266394 3343141 3396966 3437588 3480494 3472540 3484068 3536489 3589514 3609618 3584584 3570100
5653C570100P4991j0481l574K9347P2400O4921k3068m1211O5776O9626L083O036
$$ 3570100 3645091 3634610 3631036 3660383 3732783 3797704 3774636 3733425 3799201 3868827 3871910 3877946
5641C877946J099L0485k099n0691j1771N8906K3002p533J5633r563n3051N3606
$$ 3877946 3879045 3909530 3907431 3856740 3844969 3903875 3926877 3919344 3934977 3925414 3872363 3925969
5629C925969J7391p0970L3079K3955l253m3066L8926k9453J0596n5856j667p017
$$ 3925969 3943360 3872390 3905469 3929424 3926171 3883105 3922031 3892578 3903174 3847318 3845651 3838634
5617C838634l8866l8551K7410k1894j8488k9990k2619n2933k6707L607j8902j6217
$$ 3838634 3799768 3761217 3788627 3766733 3748245 3718255 3695636 3642703 3615996 3619603 3600701 3584484
5605C584484l763l6309j6853o1115l5942n7295n8933J562j9006m2814Q847m9329
$$ 3584484 3580721 3544412 3527559 3466444 3430502 3373207 3314274 3315836 3296830 3254016 3262863 3213534
5593C213534J1693L9658l2632m1951m9045l3100o2171k4666m1441n4216M9607
$$ 3213534 3225227 3264885 3232253 3190302 3141257 3108157 3045986 3021320 2979879 2925663 2975270
5582B975270l3370n6124m5600o6865k3634k6647k974n1860k7333M377n738k0617
$$ 2975270 2941900 2885776 2840176 2773311 2749677 2723030 2720056 2668196 2640863 2645240 2639502 2618885
5570B618885m5092q287n277l1756j4891n2867j932k5790n4428j7792Q2233k6955
$$ 2618885 2573793 2565506 2560229 2528473 2513582 2460715 2458783 2432993 2378565 2360773 2443006 2416051
5558B416051r9819k5162k5335J8961q336m5669K6400P416k1724l2861n3302n1965
$$ 2416051 2316232 2291070 2265735 2284696 2276360 2230691 2257091 2264507 2242783 2209922 2156620 2104655
5546B104655J8945J2392N385l5013j6326J781j9440o1502J3283l0705J3015R652
$$ 2104655 2123600 2135992 2141377 2106364 2090038 2091819 2072379 2010877 2024160 1993455 2006470 2016122
5534B016122R185q148n2262J0630l6896n3934j867j3448j5319j0148J5436J6782
$$ 2016122 2025307 2017159 1964897 1975527 1938631 1884697 1882830 1869382 1854063 1843915 1859351 1876133
5522A876133K3190k5217N6173M8689Q7708k7950r1727m1671n2535n3554k0644
$$ 1876133 1899323 1874106 1930279 1978968 2066676 2038726 1946999 1905328 1852793 1799239 1778595
5511A778595m9798J0032K5938R08p0044o5230O153n3533N0335l2660m590j5184
$$ 1778595 1728797 1738829 1764767 1765675 1695631 1630401 1636554 1583021 1633356 1600696 1596106 1580922
5499A580922O378n272L7029J4987J3589K4311l5727Q106m1295o6253R2360k0800
$$ 1580922 1587300 1582028 1619057 1634044 1647633 1671944 1636217 1644323 1603028 1536775 1629135 1608335
5487A608335l6652P215K0262M5990J8155l8249k9919J3398J560j5800J6768M1964
$$ 1608335 1571683 1578898 1599160 1645150 1663305 1625056 1595137 1608535 1610095 1594295 1611063 1653027
5475A653027L8702J3785p0503L5173J4161o540n2860K9796k0353j1081J1577M6313
$$ 1653027 1691729 1705514 1635011 1670184 1684345 1677805 1624945 1654741 1634388 1623307 1634884 1681197
5463A681197j312N505m290M987J5371N1129J1006J6271m3203N3192L8508j7187
$$ 1681197 1679885 1685390 1681100 1686087 1701458 1752587 1763593 1779864 1736661 1789853 1828361 1811174
5451A811174K1960Q125K9969N2787R7087K0337l436M2114Q8304P3479J5776O7192
$$ 1811174 1833134 1841259 1871228 1924015 2021102 2041439 2038003 2080117 2168421 2241900 2257676 2324868
5439B324868J75339J10841J17740P5860J81620K23052K51320K72863K52689J77110
$$ 2324868 2500207 2611048 2728788 2804648 2986268 3209320 3460640 3733503 3986192 4163302
5429D163302J07893o7800k15483j83486k71891k97649j94659k17659j45820j59238
$$ 4163302 4271195 4203395 3987912 3804426 3532535 3234886 3040227 2822568 2676748 2517510
5419B517510n7979p0897m7612k5417o0444n3902k4925r5885k9436L0634l4003
$$ 2517510 2459531 2388634 2341022 2315605 2255161 2201259 2176334 2080449 2051013 2081647 2047644
5408B047644k6961O0132n7942p688J8127l9198L289l524j7390m4830l585n780
$$ 2047644 2020683 2080815 2022873 2015185 2033312 1994114 1997403 1993879 1976489 1931659 1928074 1922294
5396A922294N871m008n3392j7139J6435L041K3281j5051J2873R307J1299r700
$$ 1922294 1928165 1924157 1870765 1853626 1870061 1873102 1896383 1881332 1894205 1903512 1914811 1905111
5384A905111n9372J9112j6625O9441L3083m9522R5132q552o1647K6036n7508j6373
$$ 1905111 1845739 1864851 1848226 1917667 1950750 1901228 1996360 1987808 1926161 1952197 1894689 1878316
5372A878316L5658O788M2924L4083r52j1365L9221M6037l9220j239j9655M6253
$$ 1878316 1913974 1920762 1963686 1997769 1996817 1985452 2024673 2070710 2031490 2030251 2010596 2056849
5360B056849L4262J277R022j1843P894o5818K0400J2093K4617N2653L8208l1020
$$ 2056849 2091111 2092388 2101410 2089567 2097461 2031643 2052043 2064136 2088753 2141406 2179614 2148594
5348B148594M4030J5637K888j2672Q900L5320J7753M9743P9936L3566N4350R4085
$$ 2148594 2192624 2208261 2211149 2198477 2207377 2242697 2260450 2310193 2390129 2423695 2478045 2572130
5336B572130R981O4085P0412O1777J0484J9514J3479k8263l221K0259M4578K1832
$$ 2572130 2582111 2646196 2716608 2778385 2788869 2808383 2821862 2793599 2790378 2810637 2855215 2877047
5324B877047L748L9388N2187j440M8562r726j1060K3049k587N6604N0681K6646
$$ 2877047 2880795 2920183 2972370 2970930 3019492 3009766 2998706 3021755 3019168 3075772 3126453 3153099
5312C153099N5206j4357J3069K1822k2811p39l2362P9349K6852p2236K4912J4
$$ 3153099 3208305 3193948 3207017 3228839 3206028 3205289 3172927 3252276 3279128 3206892 3231804 3231818
5300C231818n9747m0321J0497Q084o14m7172M053K7185j2790K3472L3291L2650
$$ 3231818 3172071 3131750 3142247 3150331 3149717 3102545 3106598 3133783 3120993 3144465 3177756 3210406
5288C210406J12530J41618O6830N6517L8785P3036O7682J1173L2165M988J01444
$$ 3210406 3322936 3464554 3531384 3587901 3626686 3699722 3767404 3778577 3810742 3815730 3917174
5277C917174Q3798L0190N2772O0399M9305K4447M1532K8447K7745M9274Q1558
$$ 3917174 4000972 4031162 4083934 4144333 4193638 4218085 4259617 4288064 4315809 4365083 4446641
5266D446641J38075J22331R1112Q3319N3773Q1573R9817N1264K6584L2067P5333
$$ 4446641 4584716 4707047 4798159 4881478 4935251 5016824 5116641 5167905 5194489 5226556 5301889
5255E301889J32263Q9996J03258R0719Q7244Q6378R3041O8431J2984N7596R2065
$$ 5301889 5434152 5524148 5627406 5718125 5805369 5891747 5984788 6053219 6066203 6123799 6215864
5244F215864J15901P2694R6294P5807R0840Q6029L4993J01258O8500N4109P9016
$$ 6215864 6331765 6404459 6500753 6576560 6667400 6753429 6788422 6889680 6958180 7012289 7091305
5233G091305N5952N3033M1674J06815R0823J48257J13656J58803J74706J36243
$$ 7091305 7147257 7200290 7241964 7348779 7439602 7587859 7701515 7860318 8035024 8171267
5223H171267J19096J63191J27849J21655J90272J61884J75786J44298J94633J96406
$$ 8171267 8290363 8453554 8581403 8703058 8893330 9055214 9231000 9375298 9569931 9766337
5213I766337J96140K05672J87346R5179J70224J71496J87678K00775K60990K50129
$$ 9766337 9962477 10168149 10355495 10450674 10620898 10792394 10980072 11180847 11441837 11691966
5203A1691966K87105L29127L60456K58087L28949L69965K51055K71240K23563
$$ 11691966 11979071 12308198 12668654 12926741 13255690 13625655 13876710 14147950 14371513
5194A4371513K47109K30075L13383L58089L68208L77614L94297M27950M76436
$$ 14371513 14618622 14848697 15162080 15520169 15888377 16265991 16660288 17088238 17564674
5185A7564674M49674M73956N39122N21258N13885N85068N54934M45752M64718
$$ 17564674 18014348 18488304 19027426 19548684 20062569 20647637 21202571 21648323 22113041
5176B2113041M81863M42731M52042M62763N20893N74108N96456O23298O90710
$$ 22113041 22594904 23037635 23489677 23952440 24473333 25047441 25643897 26267195 26957905
5167B6957905O96656P29695Q33794R05518R20640R49186J100115J106355J251477
$$ 26957905 27654561 28384256 29218050 30123568 31044208 31993394 33093509 34199864 35451341
5158C5451341J241074J206084J299638J281534J359286J402867J426759J463074
$$ 35451341 36692415 37898499 39198137 40479671 41838957 43241824 44668583 46131657
5150D6131657J490959J512385J605566J723095J846206K035903K079711K155451
$$ 46131657 47622616 49135001 50740567 52463662 54309868 56345771 58425482 60580933
5142F0580933K182351K305890K406732K613618K835926L007356L181471L435657
$$ 60580933 62763284 65069174 67475906 70089524 72925450 75932806 79114277 82549934
5134H2549934L698696M048941M546342N178241N760101O442407P319716Q280284
$$ 82549934 86248630 90297571 94843913 100022154 105782255 112224662 119544378 127824662
5126A27824662R473537J0837567J2502838J4462527J6741715J9513952K2830994
$$ 127824662 137298199 148135766 160638604 175101131 191842846 211356798 234187792
5119B34187792K6790079L1382301L6664403M2302335M7284317M9049586M2735314
$$ 234187792 260977871 292360172 329024575 371326910 418611227 467660813 510396127
5112E10396127K3603226o257414l4302572n0298322n4277607n0630062m4094303
$$ 510396127 533999353 527741939 493439367 443141045 388863438 338233376 294139073
5105B94139073l7224745l0957866k5701954k1408339j7990968j5218958j3066360
$$ 294139073 256914328 225956462 200254508 178846169 160855201 145636243 132569883
5098A32569883j1281592r807075q484507p470503o609092n807068n172941m664990
$$ 132569883 121288291 111481216 102996709 95526206 88917114 83110046 77937105 73272115
5090G3272115m235513l859394l543498l182795k847883k640577k349047k142058
$$ 73272115 69036602 65177208 61633710 58450915 55603032 52962455 50613408 48471350
5082D8471350k006902j882117j820697j763752j730625j605696j532006j477039
$$ 48471350 46464448 44582331 42761634 40997882 39267257 37661561 36129555 34652516
5074C4652516j471804j404807j332726j150185j054278r86060q80583p97833p16582
$$ 34652516 33180712 31775905 30443179 29292994 28238716 27252656 26372073 25574240 24857658
5065B4857658p07644o38484o75191o41394o70924o06511o13478o18571o28740
$$ 24857658 24150014 23511530 22836339 22194945 21524021 20917510 20304032 19685461 19056721
5056A9056721n48131n57707n35202n00018n21882n19083n08661n46500n00282
$$ 19056721 18508590 17950883 17415681 16915663 16393781 15874698 15366037 14819537 14319255
5047A4319255m15246l90449l31699k69350k18619k01636j71825j68641j44001
$$ 14319255 13904009 13513560 13181861 12912511 12693892 12492256 12320431 12151790 12007789
5038A2007789j67966j72675k03020j45508j74296j78806j91846j72707j65831
$$ 12007789 11839823 11667148 11464128 11318620 11144324 10965518 10773672 10600965 10435134
5029A0435134k36166k34470k22918j93420j43270j21610j07647j45175j09354
$$ 10435134 10198968 9964498 9741580 9548160 9404890 9283280 9175633 9030458 8921104
5020H921104j29144o2863r7398j71737j08571j45552j32988j29062j59115j70067
$$ 8921104 8791960 8729097 8631699 8459962 8351391 8205839 8072851 7943789 7784674 7614607
5010G614607o0555m6504q2329o7675o299m5068M947n4071j6444l2234m0884N2739
$$ 7614607 7554052 7507548 7425219 7357544 7351245 7306177 7311124 7257053 7240609 7208375 7167491 7220230
4998G220230N8799M1466Q1244J21014Q2343K9152L3508N5464O5045N1291k0648
$$ 7220230 7279029 7320495 7401739 7522753 7605096 7634248 7667756 7723220 7788265 7839556 7818908
4987G818908p0131r0024p8270j06383j47164j65593j42685n2224j00195j38716
$$ 7818908 7748777 7658753 7580483 7474100 7326936 7161343 7018658 6966434 6866239 6727523
4977F727523r8124q8342m3083l1329r0986k5855j0318m655J9282j4605P3565k121
$$ 6727523 6629399 6541057 6497974 6466645 6375659 6349804 6339486 6334831 6354113 6339508 6413073 6410952
4965F410952P1099J02190O1684j6602K1084Q1489N1873M0504Q0169N9979K5952
$$ 6410952 6482051 6584241 6645925 6629323 6650407 6731896 6783769 6824273 6904442 6964421 6990373
4954F990373M3275l9069m4227j6630l4579o1895n4623K0277L8676o3884L2047
$$ 6990373 7033648 6994579 6950352 6933722 6899143 6837248 6782625 6802902 6841578 6777694 6809741
4943F809741J8549r6017n3852p5809K5197L3784R8070P9053P9045O4302R5820
$$ 6809741 6828290 6732273 6678421 6602612 6627809 6661593 6759663 6838716 6917761 6982063 7077883
4932G077883Q1076N7884P8468M3326R6082j7877J5395L681J4834r777l8859r8962
$$ 7077883 7158959 7216843 7295311 7338637 7434719 7416842 7432237 7435918 7450752 7440975 7402116 7303154
4920G303154j56546j68166k43942j61229j91384k19909k74744k06246j54060j94165
$$ 7303154 7146608 6978442 6734500 6573271 6381887 6161978 5887234 5680988 5526928 5332763
4910E332763j26258j52367j46992j00263j27704j12537j27228p6401j37829j11475
$$ 5332763 5206505 5054138 4907146 4806883 4679179 4566642 4439414 4363013 4225184 4113709
4900D113709j08074q1429q9987r6760j08452j04217r7368m2091n2522n5882j2366
$$ 4113709 4005635 3924206 3834219 3737459 3629007 3524790 3427422 3385331 3332809 3276927 3264561
4889C264561j41099l4147o92m9599l4903K0421l8168k4326k1654j5205K0556p5325
$$ 3264561 3123462 3089315 3088623 3039024 3004121 3024542 2986374 2962048 2940394 2925189 2945745 2870420
4877B870420m8775j3196o5877o8071m7865O296K0429l2877K3517n6701q1652j3073
$$ 2870420 2821645 2808449 2742572 2674501 2626636 2632932 2653361 2620484 2644001 2587300 2505648 2492575
4865B492575l0539k3810n2648J4283K5018k8429m3020m4827K1522p0970R054N419
$$ 2492575 2462036 2438226 2385578 2399861 2424879 2396450 2353430 2308603 2330125 2259155 2268209 2273628
4853B273628l2359n7526k1175J8923L4398k8060M6669p2675n3263N5066J1019
$$ 2273628 2241269 2183743 2162568 2181491 2215889 2187829 2234498 2161823 2108560 2163626 2174645
4842B174645J5187J110M8250j1397Q338k600K7379k094L5931L9579J559Q096O8254
$$ 2174645 2189832 2190942 2239192 2227795 2236133 2233533 2260912 2258818 2294749 2334328 2335887 2343983 2412237
4829B412237L1325P5052J04791R0783m0335n586j16149j07297o6099L2142L4897
$$ 2412237 2443562 2518614 2623405 2714188 2673853 2668267 2552118 2444821 2378722 2410864 2445761
4818B445761j9909L4315O6825n6759o353R1879J8927L0153L5056j2204M3994O6748
$$ 2445761 2425852 2460167 2526992 2470233 2463880 2555759 2574686 2604839 2639895 2627691 2671685 2738433
4806B738433O2428N3991J12629P9479L6231P1496L6227O5692J49555J97773J61723
$$ 2738433 2800861 2854852 2967481 3046960 3083191 3154687 3190914 3256606 3406161 3603934 3765657
4795C765657J58406K22671K85164K40311J75014P5921j29186k19665k56878k32716
$$ 3765657 3924063 4146734 4431898 4672209 4847223 4923144 4793958 4574293 4317415 4084699
4785D084699k10594k60659j45376j44869n3592k9387j00087k3151m7940j4571
$$ 4084699 3874105 3613446 3468070 3323201 3269609 3240222 3140135 3116984 3069044 3054473
4775C054473k0637j2372k0820K6267J5935j2644J2856k7784M1892O8483L7537
$$ 3054473 3033836 3021464 3000644 3026911 3042846 3030202 3043058 3015274 3057166 3125649 3163186
4764C163186P2571P1936P7344Q5906M1510L5900J15299J54205J32400J07493J84347
$$ 3163186 3235757 3307693 3385037 3470943 3512453 3548353 3663652 3817857 3950257 4057750 4242097
4753D242097J41070J92489K50221K70123K70020L03603L68072L87513N06677P71432
$$ 4242097 4383167 4575656 4825877 5096000 5366020 5669623 6037695 6425208 6931885 7703317
4743G703317R62214J170041J529054J634253J035703J28976q48096j644179j702849
$$ 7703317 8665531 9835572 11364626 12998879 14034582 14163558 13315462 11671283 9968434
4734I968434j547549j155676q79239o56851n25633m18236l00316k85388k56271
$$ 9968434 8420885 7265209 6385970 5729119 5203486 4785250 4484934 4199546 3943275
4725C943275j94561j74715k01753j90123o0343j15428r1407j52328j36720r4719
$$ 3943275 3748714 3573999 3372246 3182123 3121780 3006352 2914945 2762617 2625897 2531178
4715B531178k8353N282n0482m0388j1447l6690k3006j1892k5035p105q447k1921
$$ 2531178 2502825 2508107 2457625 2417237 2405790 2369100 2346094 2334202 2309167 2302062 2293615 2271694
4703B271694k6318j9993j5181K1292o660N086J5446n2877L0196J4747Q9444M8602
$$ 2271694 2245376 2225383 2210202 2231494 2224834 2229920 2245366 2192489 2222685 2237432 2326876 2375478
4691B375478K1470M514J12227N9099P99L7024P0422K5116j107N9253P5129R4125
$$ 2375478 2396948 2401462 2513689 2572788 2573587 2610611 2681033 2706149 2705042 2764295 2839424 2933549
4679B933549J09841R6000J73406K33365K50856K69218K92717L89195O02965P39012
$$ 2933549 3043390 3139390 3312796 3546161 3797017 4066235 4358952 4748147 5351112 6090124
4669F090124R35958J283828J417235R75021K73869j83422p66125j343768j484516
$$ 6090124 7026082 8309910 9727145 10702166 10976035 10792613 10026488 8682720 7198204
4660G198204j261016q91828o75321n31125k73045l27343k40394k68153q5795j09392
$$ 7198204 5937188 5045360 4370039 3838914 3565869 3238526 2998132 2729979 2644184 2534792
4650B534792j67480j20693j23556p8803r7038j6624n9056l7183m3882K297j9110
$$ 2534792 2367312 2246619 2123063 2044260 1947222 1930598 1871542 1834359 1790477 1792774 1773664
4639A773664n6225l2778K0829J6322n6575m8826m1160L5064O2229m5208j1250
$$ 1773664 1717439 1684661 1705490 1721812 1665237 1616411 1575251 1610315 1672544 1627336 1616086
4628A616086j706K320J1116m0141j569r5650k1759n7354M858K5164j4672j4223
$$ 1616086 1614380 1616700 1627816 1587675 1586106 1490456 1468697 1411343 1416201 1441365 1426693 1412470
4616A412470R814N870J5790m560Q448k2794L4910l2974m3505P939L8310r1893
$$ 1412470 1422284 1428154 1443944 1439384 1447832 1425038 1459948 1426974 1383469 1391408 1429718 1337825
4604A337825l2690L4783j6201L26J6499M0447j8654K7797K233p9446l0933K4541
$$ 1337825 1305135 1339918 1323717 1324043 1340542 1380989 1362335 1390132 1392365 1312919 1281986 1306527
4592A306527K6485l8212l8985k771L1841K7183K6584m3286L6002J3447j2938n591
$$ 1306527 1333012 1294800 1255815 1253044 1284885 1312068 1338652 1295366 1331368 1344815 1331877 1326286
4580A326286K899K8936k1036N363O515L2437j1863p197J1619N20k6295L5811k1321
$$ 1326286 1329185 1358121 1337085 1342448 1348963 1381400 1369537 1362340 1373959 1374479 1348184 1383995 1362674
4567A362674k6817o8783j4043K0367k361k8057n589N097L3850L3718l8153m1087
$$ 1362674 1335857 1267074 1253031 1273398 1271037 1242980 1237391 1242488 1276338 1310056 1271903 1230816
4555A230816k798M619j1850O09N267r325l7777p523P558k8913j0602L667o554
$$ 1230816 1228018 1232637 1220787 1221396 1226663 1217338 1179561 1172038 1179596 1150683 1140081 1143748 1137194
4542A137194J8309L951n7774L8714J9084n595l0215l4520l758k1249j8638J0003
$$ 1137194 1155503 1159454 1101680 1140394 1159478 1153883 1123668 1089148 1085390 1064141 1045503 1055506
4530A055506j3279m553J8841k3303o0816j2087k3674j5427M2201K4627o3162J247
$$ 1055506 1042227 1037674 1056515 1033212 972396 960309 936635 921208 963409 988036 924874 926121
4518I26121l445r923L7377J7208r212l3649o5824N2881K9511m6201K5479j1667
$$ 926121 922676 912753 950130 967338 958126 924477 858653 911534 941045 894844 920323 908656
4506I08656M2420M8612j7445J3449K3740L438m953o0355r773q248M9650o00j9946
$$ 908656 951076 999688 982243 995692 1019432 1022870 1017917 957562 947789 939541 989191 988591 968645
4493I68645m17M7294n228j2366j640J780K6658K0148k6817k9913N5506J178r775
$$ 968645 968228 1015522 1010294 997928 996288 998068 1024726 1044874 1018057 988144 1043650 1044828 1035053
4480A035053j3568J9520J3756J5589Q2817j6061o453J1902n7480M9349O3762l5180
$$ 1035053 1021485 1041005 1054761 1070350 1153167 1137106 1130653 1142555 1085075 1134424 1198186 1163006
4468A163006J0784J2517Q921L5721K0806n0372o408J9033J9658N0411K7516M960
$$ 1163006 1173790 1186307 1195228 1230949 1251755 1201383 1194975 1214008 1233666 1284077 1311593 1316553
4456A316553N065K9447r19J0912O4495j221k2614N4321j1999J8248r038M9380
$$ 1316553 1321618 1351065 1350146 1361058 1425553 1424332 1401718 1456039 1444040 1462288 1453250 1502630
4444A502630l1898K8885m573L0966J0562J3210L0453M5064k9077L4263M8418N4005
$$ 1502630 1470732 1499617 1495044 1526010 1536572 1549782 1580235 1625299 1596222 1630485 1678903 1732908
4432A732908L3195M9481N5145K5205K6420N1077R6052Q7961J10826M6586K3054
$$ 1732908 1766103 1815584 1870729 1895934 1922354 1973431 2069483 2157444 2268270 2314856 2337910
4421B337910m1013m0642l7928m3649M91k1826l0163J3078n219J13958l7988R09
$$ 2337910 2296897 2256255 2218327 2174678 2175169 2153343 2123180 2136258 2131039 2244997 2207009 2207918
4409B207918K3221k4380q175N1437R0870M2400N4816J0211K104J06184P9549L7189
$$ 2207918 2231139 2206759 2198584 2250021 2340891 2383291 2438107 2448318 2450422 2556606 2636155 2673344
4397B673344J9998L2642J09627K4881P2120P0013N4391K7608L6532R3699R2406
$$ 2673344 2693342 2725984 2835611 2860492 2932612 3002625 3057016 3084624 3121156 3214855 3307261
4386C307261l32N9397J15854N4862J07756J3785N6925Q0963J22924P280J15812
$$ 3307261 3306929 3366326 3482180 3537042 3644798 3658583 3715508 3796471 3919395 3926675 4042487
4375D042487R2604R0043J15711J16180O3112M8265J61219J41140P7875L4330M4289
$$ 4042487 4135091 4225134 4340845 4457025 4520137 4568402 4729621 4870761 4948636 4982966 5027255
4364E027255L9416m739N5809P8327M3803P3345l721P662Q5159P9089K0906M2129
$$ 5027255 5066671 5061932 5117741 5196068 5239871 5313216 5309495 5317157 5402316 5481405 5502311 5544440
4352E544440J09433P2992J14459N4163R3555J38912J04344J27958J84856J38717
$$ 5544440 5653873 5726865 5841324 5895487 5989042 6127954 6232298 6360256 6545112 6683829
4342F683829J35838J30838J48321J62901J16936J18991J49670J03536J9326O2103
$$ 6683829 6819667 6950505 7098826 7261727 7378663 7497654 7647324 7750860 7770186 7832289
4332G832289N2935m9314N4688k5415q0139q2270l2847j22965j22634p2361j43687
$$ 7832289 7885224 7835910 7890598 7865183 7785044 7702774 7669927 7546962 7424328 7351967 7208280
4321G208280j23753p2491j00005q1783r479n3112o2748p6402l1833l2653P319
$$ 7208280 7084527 7012036 6912031 6830248 6820769 6767657 6704909 6628507 6596674 6564021 6571340
4310F571340l4995Q6248j6011K3711J1342K1391P5736r047m9276K7063K4433j5905
$$ 6571340 6536345 6622593 6606582 6630293 6641635 6663026 6738762 6729715 6680439 6707502 6731935 6716030
4298F716030o7647q8704j17877p9993m2589j01749p4437q2676p8095j02084p9996
$$ 6716030 6648383 6559679 6441802 6361809 6319220 6217471 6143034 6060358 5982263 5880179 5800183
4287E800183K488j8770o920r1462j34120j53733j81026j76448j71700j66110j42837
$$ 5800183 5802671 5783901 5776981 5685519 5551399 5397666 5216640 5040192 4868492 4702382 4559545
4276D559545k6211r6565j18293l0698p3749p7473l1681o1377m0913J274k4841
$$ 4559545 4533334 4436769 4318476 4287778 4214029 4136556 4104875 4043498 4002585 4003859 3979018
4265C979018j7540m1896k5773o8522k8823O2642m1220l8788o9627n8167L2888
$$ 3979018 3961478 3919582 3893809 3825287 3796464 3859106 3817886 3779098 3709471 3651304 3684192
4254C684192o4901n3235l7763O0499N734l0185k2835J9623l7459R069o6015o5994
$$ 3684192 3619291 3566056 3528293 3588792 3594526 3564341 3541506 3561129 3523670 3532739 3466724 3400730
4242C400730m9717J224k3294k112L6996n684j4210J8290M7317N2623j2958K4972
$$ 3400730 3351013 3352237 3328943 3326831 3363827 3358143 3343933 3362223 3409540 3462163 3449205 3474177
4230C474177K9515j9734L4918M7520Q6182J8539P2460Q0127k7561J045L5091L98
$$ 3474177 3503692 3483958 3518876 3566396 3652578 3671117 3743577 3823704 3796143 3797188 3832279 3832677
4218C832677K4363M574l886L91K2755r456K5912M3694O4270j0924N3762J9017
$$ 3832677 3857040 3861614 3857728 3858119 3880874 3871418 3897330 3941024 4005294 3994370 4048132 4067149
4206D067149L1964j7144J4625K7657M2209Q7867R6630Q4366J13913O7753J86631
$$ 4067149 4099113 4081969 4096594 4124251 4166460 4254327 4350957 4435323 4549236 4616989 4803620
4195D803620J69492J74684J93149J73296K78012J54936J04141m9184r1706j50885
$$ 4803620 4973112 5147796 5340945 5514241 5792253 5947189 6051330 6002146 5910440 5759555
4185E759555j92710j68116j33789k9209q7857l7101m3732p1385q7019l7379P6915
$$ 5759555 5566845 5398729 5264940 5235731 5147874 5110773 5067041 4995656 4908637 4871258 4948173
4174D948173j5135l2873n0678o5063l1108m2733j3702K080JK4422K6493J5132
$$ 4948173 4933038 4900165 4849487 4784424 4753316 4710583 4696881 4698961 4698962 4723384 4749877 4765009
4162D765009p859J03811J5601p162K3785P493N1816k7120M3741O4659O6557N0315
$$ 4765009 4757150 4860961 4876562 4869400 4893185 4900678 4952494 4925374 4969115 5033774 5100331 5150646
4150E150646P1232J8175o105J6976P4611O8278P1227J4371N1154O6630J289N030
$$ 5150646 5221878 5240053 5233948 5250924 5325535 5393813 5465040 5479411 5530565 5597195 5598484 5603514
4138E603514J4834L7784K2809J2260P0413O0418O2396Q8788R2889J2140O6799
$$ 5603514 5618348 5656132 5678941 5691201 5761614 5822032 5884428 5973216 6066105 6078245 6145044
4127F145044J15200J69332J19400J27530J44228J62197J36998J29212J82754J75719
$$ 6145044 6260244 6429576 6548976 6676506 6820734 6982931 7119929 7249141 7431895 7607614
4117G607614J72601J90021J96015J64390K78221L08656L27392L39193M39188L01774
$$ 7607614 7780215 7970236 8166251 8330641 8608862 8917518 9244910 9584103 10023291 10325065
4107A0325065J70734r302j83992k11355j34093j07225k0623m765k8044O4692N2270
$$ 10325065 10495799 10486497 10302505 10091150 9957057 9849832 9829209 9824444 9796400 9861092 9913362
4096I913362N3672J19141P4677Q3922Q7300O2622J05005J25012J33460J50452
$$ 9913362 9967034 10086175 10160852 10244774 10332074 10394696 10499701 10624713 10758173 10908625
4086A0908625J31743J98545J75047J70679J12887J16529R8287L8248r759O66M538
$$ 10908625 11040368 11238913 11413960 11584639 11697526 11814055 11912342 11950590 11940831 11941497 11946035
4075A1946035P258n6331K7272J23516P3944J52458J28265J13225J69621K00010
$$ 11946035 11953293 11896962 11924234 12047750 12121694 12274152 12402417 12515642 12685263 12885273
4065A2885273K18382K25914K41620K47269K70628K70505K15416L00104K56883
$$ 12885273 13103655 13329569 13571189 13818458 14089086 14359591 14575007 14875111 15131994
4056A5131994K60697K82908J98840K08698K45020K66232K57051J97998J28397
$$ 15131994 15392691 15675599 15874439 16083137 16328157 16594389 16851440 17049438 17177835
4047A7177835R0459J8376k3626j6573L5134L5590K6134J08114J04652J48182J86696
$$ 17177835 17268294 17286670 17263044 17246471 17281605 17317195 17343329 17451443 17556095 17704277 17890973
4036A7890973K29713K95238L78135M14210M62217N24220N75753O10483O94255
$$ 17890973 18120686 18415924 18794059 19208269 19670486 20194706 20770459 21380942 22075197
4027B2075197Q42488Q90284J071288J235476J402126J641647J756707J999329
$$ 22075197 22917685 23807969 24879257 26114733 27516859 29158506 30915213 32914542
4019C2914542K139456K239547K194395J645200L27634j143016k074494k307965
$$ 32914542 35053998 37293545 39487940 41133140 41460774 40317758 38243264 35935299
4011C5935299k095736j917244j654566j559648j420404j353350j191592j004125
$$ 35935299 33839563 31922319 30267753 28708105 27287701 25934351 24742759 23738634
4003B3738634q69161o89232n50721m76416m63594l46188k33389j82126j14333
$$ 23738634 22869473 22180241 21629520 21153104 20689510 20343322 20109933 19927807 19813474
3994A9813474j0054N2096R6292J35416K40362K92040L38970L93977L55625L86791
$$ 19813474 19803420 19855516 19951808 20087224 20327586 20619626 20958596 21352573 21708198 22094989
3984B2094989L38096J86193n1983l29507n90711o73317o07278o54806n72929m74327
$$ 22094989 22433085 22619278 22567295 22237788 21647077 20973760 20366482 19711676 19138747 18664420
3974A8664420m19676l65938l26116k82618k43635k46727j64064k34030j38116
$$ 18664420 18244744 17878806 17552690 17270072 17026437 16779710 16615646 16381616 16243500
3965A6243500j19020j10796j04810j20746j27538n6760J9695l872j601n6083j6466
$$ 16243500 16124480 16013684 15908874 15788128 15660590 15603830 15623525 15619653 15618052 15561969 15545503
3954A5545503l459J3500o8820o7093p4137l4505p7728q500L1602P478L2826M2525
$$ 15545503 15542044 15555544 15486724 15419631 15345494 15310989 15233261 15224761 15256363 15263841 15296667 15339192
3942A5339192O5585O8722k1670k4173n1986l6994m5672o1389n5583l9394n8113
$$ 15339192 15404777 15473499 15451829 15427656 15375670 15338676 15293004 15231615 15176032 15136638 15078525
3931A5078525m4173j791M8357M4605O2145j1655J5968q127K9210N562l5355q1807
$$ 15078525 15034352 15032561 15080918 15125523 15187668 15176013 15191981 15183854 15213064 15218626 15183271 15101464
3919A5101464j32000k20959l10893k80203k50994k20120j93570j52210j28903
$$ 15101464 14969464 14748505 14437612 14157409 13906415 13686295 13492725 13340515 13211612
3910A3211612j42485q9019J1520j1119k4650K7889M6435Q2198J39399J75177K43142
$$ 13211612 13069127 12980108 12991628 12980509 12955859 12983748 13030183 13112381 13251780 13426957 13670099
3899A3670099K59140L21956L53612L42071L55949N46749M34100L97940J01663
$$ 13670099 13929239 14251195 14604807 14946878 15302827 15849576 16283676 16681616 16783279
3890A6783279k21483n65414q14923q00084p36872o92551n35112m45766l96803
$$ 16783279 16561796 15996382 15181459 14381375 13644503 12951952 12416840 11971074 11574271
3881A1574271l94046k27200k19172k11133j94458j40919j41896m9187j13459k5880
$$ 11574271 11180225 10953025 10733853 10522720 10328262 10187343 10045447 9996260 9882801 9856921
3871I856921l0253j23213q8114o9097j40709j64806j45857j56450j36197q7342
$$ 9856921 9826668 9703455 9615341 9546244 9405535 9240729 9094872 8938422 8802225 8714883
3861H714883j08709j81184j45409j74329j44114j80825j77311j40484j45220j32957
$$ 8714883 8606174 8424990 8279581 8105252 7961138 7780313 7603002 7462518 7317298 7184341
3851G184341j34665j63129j9387r2587r6672p6166p3570k1768m8990n8428o9967
$$ 7184341 7049676 6886547 6867160 6774573 6677901 6601735 6528165 6506397 6457407 6398979 6329012
3840F329012j27227k5683n2098m1619j4321m8431o9212n9728l1263n0746q2101
$$ 6329012 6201785 6176102 6124004 6082385 6068064 6019633 5950421 5890693 5859430 5808684 5726583
3829E726583m2207M3110o803n4978k9659q028l4094q755lj1705L9999L9565O9235
$$ 5726583 5684376 5727486 5720683 5665705 5636046 5628018 5593924 5585169 5585166 5573461 5613460 5653025 5722260
3816E722260l1267l8740j3144j0190J3627J6598m27M578l4975N851n6359l1879
$$ 5722260 5690993 5652253 5639109 5628919 5642546 5659144 5658717 5663295 5628320 5634171 5577812 5545933
3804E545933M381O2060J8768k2491n373P0703k7103N7022P649P990M6232K0394
$$ 5545933 5550314 5612374 5631142 5608651 5603278 5673981 5646878 5703900 5711549 5719539 5765771 5786165
3792E786165L6873L8257O4861L0756J18189R4542N6870J29465J48727J09732J18817
$$ 5786165 5823038 5861295 5926156 5956912 6075101 6169643 6226513 6355978 6504705 6614437 6733254
3781F733254P5919Q4029L9229N5051Q8025n0882m1112l0129o2031q4323l1594
$$ 6733254 6809173 6893202 6932431 6987482 7075507 7024625 6983513 6953384 6891353 6807030 6775436
3770F775436N4259K6574K0287j3962J22k6222k6073n9109p3663m8156j48017q3930
$$ 6775436 6829695 6856269 6876556 6862594 6862716 6836494 6810421 6751312 6677649 6629493 6481476 6397546
3758F397546l7545p8939q8239p0971n0733m7499k4640n1216J0491m1465j9982
$$ 6397546 6360001 6281062 6192823 6121852 6071119 6023620 5998980 5947764 5958255 5916790 5896808
3747E896808l9253k4440N201R7088M1632K5149J00944L4571J0075J2397P7843
$$ 5896808 5857555 5833115 5838316 5935404 5977036 6002185 6103129 6137700 6147775 6160172 6238015
3736F238015O3017O5494j3509L5882M6465O8803K9157R0021N8248l2155L6075
$$ 6238015 6301032 6366526 6353017 6388899 6435364 6504167 6533324 6623345 6681593 6649438 6685513
3725F685513M0825J1196k2051M0704O6055O0663N4343Q2224P2684R6420O8763
$$ 6685513 6726338 6737534 6715483 6756187 6822242 6882905 6937248 7019472 7092156 7188576 7257339
3714G257339R8488N5613J24829J8890R622O4625O1523J03538O2061R4654L4341
$$ 7257339 7355827 7411440 7536269 7555159 7564781 7629406 7690929 7794467 7856528 7951182 7985523
3703G985523j0321m229L3495Q0017K7786P9865M2536M1110N1111O1222N1595Q3952
$$ 7985523 7975202 7970973 8004468 8084485 8112271 8192136 8234672 8275782 8326893 8388115 8439710 8523662
3691H523662N8526J11673J39053J51206R8658P7543J40947J50961Q3677J06818
$$ 8523662 8582188 8693861 8832914 8984120 9082778 9160321 9301268 9452229 9535906 9642724
3681I642724J39713J22724J33593J28259K01415K22776K46117K82127K85444K99615
$$ 9642724 9782437 9905161 10038754 10167013 10368428 10591204 10837321 11119448 11404892 11704507
3671A1704507L86502M39901M00288M62861M10126L81112M46275L65025M04822
$$ 11704507 12091009 12530910 12931198 13394059 13804185 14185297 14631572 14996597 15401419
3662A5401419L77991L85831L44148L14527L90156M27066M46574M64993M63728
$$ 15401419 15779410 16165241 16509389 16823916 17214072 17641138 18087712 18552705 19016433
3653A9016433M09679M23851L50721L04366K51613J99023L6328k1653j24596k15319
$$ 19016433 19426112 19849963 20200684 20505050 20756663 20955686 20992014 20970361 20845765 20630446
3643B0630446j88928k36373k65806k36366k79623l72262k71774k74565l11533
$$ 20630446 20441518 20205145 19939339 19702973 19423350 19051088 18779314 18504749 18193216
3634A8193216l35778m12031m11235l45604m54960n47392m99941m57251m38173
$$ 18193216 17857438 17445407 17034172 16688568 16233608 15686216 15186275 14729024 14290851
3625A4290851m14141m13172m12331l58644l21054l43581k53917j48022r2373o3171
$$ 14290851 13876710 13463538 13051207 12692563 12371509 12027928 11774011 11625989 11533616 11470445
3615A1470445j4955q920K8808N9833J27703K31941K61289L04582L49041L24837
$$ 11470445 11455490 11446570 11475378 11535211 11662914 11894855 12156144 12460726 12809767 13134604
3605A3134604K89700K84898K40658J71100J00459J1583l6360j02796k08405k66231
$$ 13134604 13424304 13709202 13949860 14120960 14221419 14233002 14196642 14093846 13885441 13619210
3595A3619210k11783k53163k37462k97096k13373k55890k66578k22695j66673
$$ 13619210 13407427 13154264 12916802 12619706 12406333 12150443 11883865 11661170 11494497
3586A1494497j93058j60997j89617j72296j27807j91912j06480j66978j47644
$$ 11494497 11301439 11140442 10950825 10778529 10650722 10458810 10352330 10185352 10037708
3577A0037708k03605j28818j27832j48012j37022j78971j84189j74548o9195j17851
$$ 10037708 9834103 9705285 9577453 9429441 9292419 9113448 8929259 8754711 8685516 8567665
3567H567665m8445l5001j9989l6844j5103l3729m5308j1887L4141J3773k0362
$$ 8567665 8519220 8484219 8464230 8427386 8412283 8378554 8333246 8321359 8355500 8369273 8348911
3556H348911K5381K577K5009J04916J16046O0743J4331N0143J34644P1045K2049
$$ 8348911 8374292 8376869 8401878 8506794 8622840 8683583 8697914 8748057 8882701 8953746 8975795
3545H975795L6988J14946P6296J21533J22782R3592J52765J23221J52414K37380
$$ 8975795 9012783 9127729 9204025 9325558 9448340 9541932 9694697 9817918 9970332 10207712
3535A0207712K34011K05346K56723K89910K50318L06316L09579K97707L39684
$$ 10207712 10441723 10647069 10903792 11193702 11444020 11750336 12059915 12357622 12697306
3526A2697306L33485K59371J34942J92543J22237K1446j1762l7528r2738q6423
$$ 12697306 13030791 13290162 13425104 13617647 13739884 13761330 13749568 13712040 13619302 13532879
3516A3532879l3017j23119j20394r4169m0901q6742o8647j9167P5228P6360J06315
$$ 13532879 13499862 13376743 13256349 13162180 13121279 13034537 12965890 12946723 13021951 13098311 13204626
3505A3204626J35502K03306J42453K23196L35912L85732L75938L92218N15560
$$ 13204626 13340128 13543434 13685887 13909083 14244995 14630727 15006665 15398883 15914443
3496A5914443N09774N37170O24492O44049O72665P13691P16861P11835O84741
$$ 15914443 16424217 16961387 17585879 18229928 18902593 19616284 20333145 21044980 21729721
3487B1729721P10037O45311O17662N31537N54835M54210L02754L61602L83787
$$ 21729721 22439758 23085069 23702731 24234268 24789103 25243313 25546067 25907669 26291456
3478B6291456L26225K71728K81357K53360K53377K09024R0657n073j13266j37210
$$ 26291456 26617681 26889409 27170766 27424126 27677503 27886527 27977184 27972111 27858845 27721635
3468B7721635k24752l25178n03324m81530m89873n57741n51331m99608m17073
$$ 27721635 27496883 27171705 26668381 26186851 25696978 25139237 24587906 24088298 23671225
3459B3671225m14812l58836l64522k78568k59983j63902j71954q2139q5137j18031
$$ 23671225 23256413 22897577 22533055 22254487 21994504 21830602 21658648 21576509 21491372 21373341
3449B1373341P618N1409L9342O5905Q3233L6821l7847m2837p8488j21037k09471
$$ 21373341 21380959 21432368 21471710 21537615 21620848 21657669 21619822 21576985 21498497 21377460 21167989
3438B1167989k45175l32500m06035m44378n01427n64714n61371n21419n41990
$$ 21167989 20922814 20590314 20184279 19739901 19238474 18673760 18112389 17590970 17048980
3429A7048980n08049m83835m83055m76512m35043m24823l54142k58292k51279
$$ 17048980 16540931 16057096 15574041 15097529 14662486 14237663 13883521 13625229 13373950
3420A3373950k59919k08834j45061j35375o2014k9641n5646R1965Q8227Q9947
$$ 13373950 13114031 12905197 12760136 12624761 12562747 12533106 12477460 12569425 12657652 12747599
3410A2747599J28565J32576K10636K33999K06489K10010K61544K46940K31064
$$ 12747599 12876164 13008740 13219376 13453375 13659864 13869874 14131418 14378358 14609422
3401A4609422J61888J58183J73610J80459J01528P6879P3892r31j862j1694K3440
$$ 14609422 14771310 14929493 15103103 15283562 15385090 15461969 15535861 15534930 15533068 15521374 15544814
3390A5544814n4462o7488p3950j66421j46017j63330k13747k72687l44217l18200
$$ 15544814 15490352 15422864 15348914 15182493 15036476 14873146 14659399 14386712 14042495 13724295
3380A3724295k93132k99707m25970l50234l56753l00638l19659l06316k69077
$$ 13724295 13431163 13131456 12705486 12355252 11998499 11697861 11378202 11071886 10802809
3371A0802809k31677k54608k07085j95797k08061j35878j30905j63976j40081
$$ 10802809 10571132 10316524 10109439 9913642 9705581 9569703 9438798 9274822 9134741
3362I134741o4121k4490j20563q5425k6920l6432m1202q941m3216m7481O225J8762
$$ 9134741 9070620 9046130 8925567 8840142 8813222 8776790 8735588 8726647 8683431 8635950 8642175 8660937
3350H660937J1378n9372r95K8242J5429M3650K9402P5960J09862N2735R0918R8392
$$ 8660937 8672315 8612943 8611948 8640190 8655619 8699269 8728671 8804631 8914493 8967228 9058146 9156538
3338I156538J55340P2531O4794J26552R3258P4902R7812J38577J35679P5260P2214
$$ 9156538 9311878 9384409 9449203 9575755 9669013 9743915 9841727 9980304 10115983 10191243 10263457
3327A0263457j7154O2441R3928L9054O7445J10638R5177J1683O8410O4888P6105
$$ 10263457 10246303 10308744 10402672 10441726 10509171 10619809 10714986 10726669 10795079 10859967 10936072
3316A0936072K8523R583P4070Q1247O1602J15458Q9383O2848Q9394L9439P8539
$$ 10936072 10964595 10974178 11048248 11129495 11191097 11306555 11395938 11458786 11548180 11587619 11666158
3305A1666158P4106R5298R2920N5566J21306J50698J38460J94230K24150K55790
$$ 11666158 11740264 11835562 11928482 11984048 12105354 12256052 12394512 12588742 12812892 13068682
3295A3068682K57734K47063K85813L21994K99239K67569L05131L08537L52403
$$ 13068682 13326416 13573479 13859292 14181286 14480525 14748094 15053225 15361762 15714165
3286A5714165L60741L54091L26410L25048L55629L28529L40988L55175L31135
$$ 15714165 16074906 16428997 16755407 17080455 17436084 17764613 18105601 18460776 18791911
3277A8791911L37714L18823K36560K27707L18055L06240K63875L04481K15411
$$ 18791911 19129625 19448448 19685008 19912715 20230770 20537010 20800885 21105366 21320777
3268B1320777K56479L25741K76648K90370L54398L54986L54261K96925M10601
$$ 21320777 21577256 21902997 22179645 22470015 22824413 23179399 23533660 23830585 24241186
3259B4241186L65322L22588L65026L60256M03262M19866M10863N47375N26008
$$ 24241186 24606508 24929096 25294122 25654378 26057640 26477506 26888369 27435744 27961752
3250B7961752N01184O08689N80306O14184N92669O64550O93414O40407P02658
$$ 27961752 28462936 29071625 29651931 30266115 30858784 31523334 32216748 32857155 33559813
3241C3559813O58141P32197P33225P07299O92983O37312O63801N76515N42849
$$ 33559813 34217954 34950151 35683376 36390675 37083658 37720970 38384771 38961286 39504135
3232C9504135N41814M65123M73998M38993M20086L88525L30356L26194J73666
$$ 39504135 40045949 40511072 40985070 41424063 41844149 42232674 42563030 42889224 43062890
3223D3062890J17011m420j78206m14240n83111p28438q21097q21153q97713r22130
$$ 43062890 43179901 43175481 42997275 42583035 41999924 41271486 40450389 39629236 38731523 37809393
3213C7809393q50849p84928q28936q48099q80625q92776q84058q64226q69869
$$ 37809393 36958544 36173616 35344680 34496581 33615956 32723180 31839122 30974896 30105027
3204C0105027r00472q34125r20395q98256q64493q25843q48246p76713p55028
$$ 30105027 29204555 28370430 27450035 26551779 25687286 24861443 24013197 23236484 22481456
3195B2481456p22114o76504o62123o09926n71893n41161m43920m17098m30433
$$ 22481456 21759342 21082838 20420715 19810789 19238896 18697735 18253815 17836717 17406284
3186A7406284l76300l16207k69858k95585k81048j77095k00936k63252j97295
$$ 17406284 17029984 16713777 16443919 16148334 15867286 15690191 15489255 15226003 15028708
3177A5028708k85019k70231k16259j95695j60538j68897j31890j54487j53206
$$ 15028708 14743689 14473458 14257199 14061504 13900966 13732069 13600179 13445692 13292486
3168A3292486j57976j46249p0974k14227j65728j19747j13819j20716j70467j03308
$$ 13292486 13134510 12988261 12917287 12703060 12537332 12417585 12303766 12183050 12012583 11909275
3158A1909275q8126j14178r3055j51424o5884j7647k5102k2153m5286l3551r7413
$$ 11909275 11821149 11706971 11613916 11462492 11396608 11378961 11353859 11331706 11286420 11252869 11155456
3147A1155456n5153p9615n5884m0690K0547K291k9479J1193o4450m5672l9787
$$ 11155456 11100303 11020688 10964804 10924114 10944661 10946952 10917473 10928666 10864216 10818544 10778757
3136A0778757n6146j7668j4833m7456l1135q2653r2317j45955j04010q3280l5241
$$ 10778757 10722611 10704943 10690110 10642654 10611519 10528866 10436549 10290594 10186584 10103304 10068063
3125A0068063m8522M246k6190m2475O4144P901R2412L665O6603J48746J05239
$$ 10068063 10019541 10023787 9997597 9955122 10019266 10027167 10119579 10123244 10189847 10338593 10443832
3114A0443832Q4778J48085K10290J94230J98387K06603K66743K90662L01979L02659
$$ 10443832 10528610 10676695 10886985 11081215 11279602 11486205 11752948 12043610 12345589 12648248
3104A2648248K71806L38101L70122L73515L63419L24921L40811L77209L20911
$$ 12648248 12920054 13258155 13628277 14001792 14365211 14690132 15030943 15408152 15729063
3095A5729063L11180L08530K50592K26027K27171J74821J44142J21381M8633j8513
$$ 15729063 16040243 16348773 16599365 16825392 17052563 17227384 17371526 17492907 17541540 17523027
3085A7523027J5801P598M0223j537P0022P9362L6646N1783N1359J95838J72197
$$ 17523027 17538828 17546426 17586649 17585112 17655134 17734496 17771142 17822925 17874284 18070122 18242319
3074A8242319K30602J62706K39997L07275L07899L65539L45039L88791M38957
$$ 18242319 18472921 18635627 18875624 19182899 19490798 19856337 20201376 20590167 21029124
3065B1029124L52625L35923L04031K12827J61460K8664p1785j99229l14282l57462
$$ 21029124 21381749 21717672 22021703 22234530 22395990 22424654 22352869 22153640 21839358 21481896
3055B1481896l83757n38431o39888n80355n90973o02491o30057o10413n68242
$$ 21481896 21098139 20559708 19919820 19339465 18748492 18146001 17515944 16905531 16337289
3046A6337289n68288o17089o22589n59098n89098n61138n69492n69789m95529
$$ 16337289 15769001 15151912 14529323 13970225 13381127 12819989 12250497 11680708 11185179
3037A1185179m74267m89933m70373l94077l37272l35856l15474k91048k89430
$$ 11185179 10710912 10220979 9750606 9356529 9019257 8683401 8367927 8076879 7787449
3028G787449k87479k28698k28464k25907k17858j90297k16616j66580r6636j77996
$$ 7787449 7499970 7271272 7042808 6816901 6599043 6408746 6192130 6025550 5928914 5750918
3018E750918j47057j32504j38352o8577j03635r2505j15513j20748o9503p3502
$$ 5750918 5603861 5471357 5333005 5264428 5160793 5068288 4952775 4832027 4762524 4689022
3008D689022r0070m6811m7047m8824m4138k9465j11632o3617o3812p6918o7576
$$ 4689022 4598952 4552141 4505094 4456270 4412132 4382667 4271035 4207418 4143606 4066688 3999112
2997C999112o6591N1130n3241j9608o152q3335j1288k6539q3535J6024J009l7923
$$ 3999112 3932521 3983651 3930410 3910802 3904650 3821315 3810027 3783488 3699953 3715977 3716986 3679063
2985C679063p3148m5804j8801J5315o0580j8386J251j8437l1864j0742j1420k6755
$$ 3679063 3605915 3560111 3541310 3556625 3496045 3477659 3478910 3460473 3428609 3417867 3406447 3379692
2973C379692m8858r743l851l0664K782n0060J9561O613L1896J5945l3733j197
$$ 3379692 3330834 3321091 3317240 3286576 3289358 3239298 3258859 3265472 3297368 3313313 3279580 3278383
2961C278383O352M368J0558O139n879L9315M6950J7774O960J8212L8725R103J5469
$$ 3278383 3284735 3289103 3299661 3305800 3299921 3339236 3386186 3403960 3410920 3429132 3467857 3476960 3492429
2948C492429O75j5951M6416M2591K7528J7910L2496L1566J9629K604O0366M3973
$$ 3492429 3493104 3477153 3523569 3566160 3593688 3611598 3644094 3675660 3695289 3697893 3758259 3802232
2936C802232L2363J15424Q5652K2138O5946R6255P8416j2756K3397L0915L36O8021
$$ 3802232 3834595 3950019 4035671 4057809 4123755 4220010 4298426 4285670 4309067 4339982 4340318 4408339
2924D408339M0246K249L6726O6510J11464M7174p043L7883R1467J05452J16113
$$ 4408339 4448585 4450834 4487560 4554070 4665534 4712708 4705665 4743548 4835015 4940467 5056580
2913E056580N7705J9141Q0558K4332J06370N2442O5415P2606J04216J26883J05631
$$ 5056580 5114285 5133426 5213984 5238316 5344686 5397128 5462543 5535149 5639365 5766248 5871879
2902E871879P2649O5311J23664J25983J03704J11416J37760Q8125J06815J56899
$$ 5871879 5944528 6009839 6133503 6259486 6363190 6474606 6612366 6700491 6807306 6964205
2892F964205J59002J27032J72301K05835J83912J95355J56647K39941K47226K53217
$$ 6964205 7123207 7250239 7422540 7628375 7812287 8007642 8164289 8404230 8651456 8904673
2882H904673J94547K12212K43777J61269K30301K23333J41822K34191J92919K07090
$$ 8904673 9099220 9311432 9555209 9716478 9946779 10170112 10311934 10546125 10739044 10946134
2872A0946134K63369K76392L72955L91123M49899M76720N69885N47977O38515
$$ 10946134 11209503 11485895 11858850 12249973 12699872 13176592 13746477 14294454 14932969
2863A4932969P58604Q20645R33847J033623J236881J483132J771489K009588J759134
$$ 14932969 15691573 16512218 17446065 18479688 19716569 21199701 22971190 24980778 26739912
2854B6739912R34750j12447r20199j095284q75175n60351k29546K5210K63673
$$ 26739912 27674662 27562215 26642016 25546732 24671557 24111206 23881660 23906870 24170543
2845B4170543L56186M51147O39637P55583R50831J094493J145282J013655R56269
$$ 24170543 24526729 24977876 25617513 26373096 27323927 28418420 29563702 30577357 31533626
2836C1533626R87936Q68066Q08547R23447R59872J228991J510702J615735J679977
$$ 31533626 32521562 33389628 34198175 35121622 36081494 37310485 38821187 40436922 42116899
2827D2116899J565452J416469J361765J328451J093857O46803j7098n77763q11329
$$ 42116899 43682351 45098820 46460585 47789036 48882893 49529696 49512598 48934835 48123506
2818D8123506q55198o95031m69338l49510j16421N3441J33099O1015j18889l29588
$$ 48123506 47268308 46573277 46103939 45754429 45638008 45691449 45824548 45885563 45766674 45437086
2808D5437086m84673n92295o44654o62496o53578m53337k71987j69746P5844K54767
$$ 45437086 44952413 44360118 43715464 43052968 42399390 41946053 41674066 41504320 41580164 41834931
2798D1834931N50335Q25124J128086J520285J889340K299598K763984L268875
$$ 41834931 42385266 43210390 44338476 45858761 47748101 50047699 52811683 56080558
2790E6080558L774796M304327M687811M712494M240059L135228J285064j042640
$$ 56080558 59855354 64159681 68847492 73559986 77800045 80935273 82220337 81177697
2782H1177697l344181n016933n787708n956186n669342n142444m630531m020952
$$ 81177697 77833516 72816583 67028875 61072689 55403347 50260903 45630372 41609420
2774D1609420l545689l073027k669252k379587k102349j923032j706530j439137
$$ 41609420 38063731 34990704 32321452 29941865 27839516 25916484 24209954 22770817
2766B2770817j417895j250297j069325r26410q61832q14831p96334o62468o18776
$$ 22770817 21352922 20102625 19033300 18106890 17245058 16430227 15633893 14971425 14352649
2757A4352649o20165n07852n15206m32074m86196l96988l71832m34809l71267
$$ 14352649 13732484 13224632 12709426 12277352 11791156 11394168 11022336 10587527 10216260
2748A0216260l89689l48577k60252l57779k75306l07802k29840k09915k78856
$$ 10216260 9826571 9477994 9217742 8859963 8584657 8276855 8047015 7837100 7558244
2739G558244j59368j43523j83038k14827j55513k18868j84692j23324j43315j65757
$$ 7558244 7398876 7255353 7072315 6857488 6701975 6483107 6298415 6175091 6031776 5866019
2729E866019j42679j59315k02992j31712r9483j44660j38603j23914r9082j09240
$$ 5866019 5723340 5564025 5361033 5229321 5129838 4985178 4846575 4722661 4623579 4514339
2719D514339r7957j13142q3344n4650q7793p7061o7460l7937n7548r6394p8829
$$ 4514339 4416382 4303240 4219896 4165246 4077453 4000392 3932932 3894995 3837447 3741053 3662224
2708C662224m7223o0154r3798j16652o7252j580n9876r2370l8676q8363p3210
$$ 3662224 3615001 3554847 3461049 3344397 3277145 3275565 3215689 3123319 3084643 2996280 2923070
2697B923070o4787l5012q2325m1416o8794p1309o8225o07j6583q4456n1597l7298
$$ 2923070 2858283 2823271 2740946 2699530 2630736 2559427 2491202 2490595 2474012 2389556 2337959 2300661
2685B300661m1844k9022o0547K3040l9254j03526l2984l0169k0818q272k1189
$$ 2300661 2258817 2229795 2169248 2192288 2153034 2049508 2016524 1986355 1965537 1957265 1936076
2674A936076l7246m5038m9417j777o2187N414l9883l5788N273j3530r63o6146
$$ 1936076 1898830 1853792 1804375 1802598 1740411 1745825 1705942 1670154 1675427 1661897 1660934 1594788
2662A594788r9228k047j5545p1103L161j4012K2328q558m1686n3084k419N062
$$ 1594788 1495560 1493513 1477968 1406865 1410026 1396014 1418342 1409784 1368098 1315014 1312595 1317657
2650A317657n3775j2311O761l6626l2088m9016J6434N9991L746n4685k1153J2271
$$ 1317657 1263882 1251571 1258332 1221706 1189618 1140602 1157036 1217027 1220773 1166088 1144935 1157206
2638A157206o7503k3389j7576m1246l6150P3559l8855l8030r516M2227j5586j0227
$$ 1157206 1089703 1066314 1048738 1007492 971342 1044901 1006046 968016 958500 1000727 985141 974914
2626I74914l4917l6031L8635L281L639p7728J1275l862o0544O636M436k5122l885
$$ 974914 939997 903966 942601 945882 949521 871793 883068 879206 818662 825298 829734 804612 800727
2613H00727j7559Q504l946o1202J3536M8380j3157o6882K4121l532M2159j5909
$$ 800727 783168 791672 787726 726524 740060 788440 775283 708401 732522 728990 771149 755240
2601G55240Q664k9170l3383m8305J2603L1247R308n1293j7483O156J9080n7873
$$ 755240 763904 734734 701351 653046 665649 696896 706204 654911 637428 643584 662664 604791
2589F04791l1361k2127L5891l7170N142J5491k7553j2868m9298K8011k4046q056
$$ 604791 573430 551303 587194 550024 555166 570657 543104 530236 480938 508949 484903 476847
2577D76847J7842O6442O527L8259k0998K2084k1806o368n1938K2114j3132m7603
$$ 476847 494689 561131 567658 605917 584919 607003 585197 578829 526891 549005 535873 488270
2565D88270n1793M7390L2025j2772J5216K0798K6090k8582L969m5734j4567P4275
$$ 488270 436477 483867 515892 503120 518336 539134 565224 536642 540611 494877 480310 554585
2553E54585k3936l76J9985m41K957L2902L6052m097n6614M2762k5557k076p341
$$ 554585 530649 530273 550258 549817 552774 585676 621728 617631 561017 603779 578222 576146 568805
2540E68805m3293M2058m6528L471N0982j69p98n0236M7372k1535l6791j3205j490
$$ 568805 525512 567570 521042 524513 575495 575326 574528 524292 571664 550129 513338 500133 498643
2527D98643L8124K4810k9467l6937p038k8798K5652n057K3000K8395K6047p3342
$$ 498643 536767 561577 532110 495173 488135 459337 484989 479932 502932 531327 557374 484032
2515D84032p1514J9552J4030j9751P186K1840O0821K9991K2797k6044j2043K9593
$$ 484032 412518 432070 446100 426349 433535 455375 516196 546187 568984 542940 530897 560490
2503E60490m4513J8923M3072j1533K2923K2716q6511k0275k2939p6270m1249M7074
$$ 560490 515977 534900 577972 566439 589362 612078 525567 505292 482353 406083 364834 411908
2491D11908p316k2105K3342k9192Q72j9543j3498k232m9494J0348k0507J4165
$$ 411908 404592 382487 405829 376637 377509 357966 344468 342236 292742 303090 282583 296748
2479B96748j274l3526K7814L2592o181j8200l3313n8989Q203K0653J0516l022
$$ 296748 295474 261948 289762 322354 316173 297973 264660 205671 213874 234527 245043 242021
2467B42021Q079l6692n0109M5839j853l6227k4783k6132K7697K4624j848J0266
$$ 242021 250100 213408 163299 209138 207285 171058 146275 120143 147840 172464 170616 180882
2455A80882J9326n5478N8305J0141r0320j5512N2313j7102L7194q678J6258k529
$$ 180882 200208 144730 203035 213176 122856 107344 159657 142555 179749 171071 187329 184800
2443A84800j2899m2005R106K1265j009p59M1100J3414p0131j3715j0294n3855
$$ 184800 171901 129896 139002 160267 159258 158499 199599 213013 142882 129167 118873 65018
2431F5018j9475M4637o301n9K5146m1790l2834O1208K2799m5634J8072P294n2352
$$ 65018 45543 90180 83879 83820 108966 67176 34342 95550 118349 72715 90787 98081 45729
2418D5729P822J338j7247Q3404o352P047L7791o7213K701m8203R516R353n893
$$ 45729 53551 54889 37642 121046 114694 121741 159532 92319 95020 46817 56333 65686 59793
2405E9793N8686n6529k6072O0828O8597l6576p0107M4068K019J5977l3928k9494
$$ 59793 118479 61950 35878 96706 165303 128727 58620 102688 104707 120684 86756 57262
2393E7262K2062L2754J8245j9114J1827q7793p552L6596j60J6252m0336p495k6994
$$ 57262 79324 112078 130323 111209 123036 35243 27691 64287 64127 80379 40043 32548 5554
2380E554K8429j1103O7234m16m5386k793M5585k1444o8589l1730J3075R820K7570
$$ 5554 33983 22880 90114 89698 44312 41519 87104 65660 -2929 -34659 -21584 -11764 15806
2367A5806L1757k8766J9461P3724n4801j9238J7587j9492N2194o6950J0364k6744
$$ 15806 47563 18797 38258 111982 57181 37943 55530 36038 88232 21282 31646 4902
2355D902Q147K6786J3001O5262k1485l6253q088J7911N5422J6812k8268n713J4180
$$ 4902 13049 39835 52836 118098 96613 60360 52272 70183 125605 142417 114149 108436 122616
2342A22616l4771j6874n0145K2203K426J6806J0074m6008J7275p3212N8088K4523
$$ 122616 87845 70971 20826 43029 45455 62261 72335 26327 43602 -29610 28478 53001
2330E3001m0095L9505k028J1962l8909J0150J5123n265M4571r059j9225O841k5879
$$ 53001 12906 52411 50383 62345 23436 33586 48709 43444 88015 78956 59731 66572 40693
2317D0693Q221O987n6453K23L4775L3476P16J1675o292k2609M6826j7502J7611
$$ 40693 48914 55901 -552 -329 34446 67922 68638 80313 74021 51412 98238 80736 98347
2304I8347J6778O131l9292q839K7891j7068n3084m3965q550R0800k7752l6354
$$ 98347 115125 121256 81964 73125 101016 83948 30864 -13101 -21651 69149 41397 5043
2292E043J7493m1020L7474j1501K8465o400L3815k7574L4066L583J7058l4818
$$ 5043 22536 -18484 18990 7489 35954 29554 63369 35795 69861 73444 90502 55684
2280E5684n6720M4282K3725J862n3631N681j9945m4901M3618R812k710M3796K1351
$$ 55684 -1036 43246 66971 68833 15202 20883 938 -43963 -345 9467 6757 50553 71904
2267G1904j5731J4109m8208j9308L9095L1589p586n2241K5105n186k347R917J9335
$$ 71904 56173 70282 22074 2766 41861 73450 65864 13623 38728 33542 31195 41112 60447
2254F0447P557l0821j3580M3885K2518j9288L2830j2783n9823j1908O981M2669
$$ 60447 68004 37183 23603 67488 90006 70718 103548 90765 30942 19034 26015 68684
2242F8684k949m5711J8627m355L7465q142J153k0584k8578L2596M2012k0417j2118
$$ 68684 65735 20024 38651 34296 71761 63619 64772 44188 15610 48206 90218 69801 57683
2229E7683P135m1615N381m4794K9754N2463l4035M748Q139L4930n2765Q857K8098
$$ 57683 64818 23203 28584 -16210 13544 66007 31972 36720 44859 79789 27024 35881 63979
2216F3979n0064j6861j7266M35O5662O2618j7678k570m4741o522K3724J444L549
$$ 63979 13915 -2946 -20212 -19777 45885 108503 90825 88255 43514 36992 60716 62160 65709
2203F5709M3440l571n802m06N394n0946m1058n304N3491K4789o3255J4822J0802
$$ 65709 109149 105578 99776 99370 104764 53818 12760 7456 60947 85736 22481 37303 48105
2190D8105L1055N1606J5998k2778l8546M8071Q74p0508R516M1884k7733r414K4594
$$ 48105 79160 130766 146764 123986 85440 133511 134385 63877 73393 115277 87544 78130 102724
2177A02724m0320j4885M7028L7553N712j4790J823k1158L3949O2588J6678l2859
$$ 102724 62404 47519 94547 132100 137812 123022 124845 103687 137636 200224 216902 184043
2165A84043J4842m2583N009q053O0073m0909l806j1937K2369J1911J8277K4789
$$ 184043 198885 156302 161311 153258 213331 172422 168616 156679 179048 190959 209236 234025
2153B34025j7364J9094m7191k643J9054J4886P055J1120O9579m625p937K8197
$$ 234025 216661 235755 188564 185921 204975 219861 226916 238036 307615 302990 295053 323250
2141C23250k8406N923r556N2854j8081J2907l2016j2972O592M9615j6618K6450
$$ 323250 294844 300767 291211 344065 325984 338891 306875 293903 300495 350110 333492 359942
2129C59942M3823N8588l3358r348L2805J5973J2225L1477M3464L5163K5997P351
$$ 359942 403765 462353 428995 419647 452452 468425 480650 512127 555591 590754 616751 624102
2117F24102N2260L2429M1526l7496K4069K4274R511Q0618K0550O0755J2584j543
$$ 624102 676362 708791 750317 712821 736890 761164 770675 851293 871843 932598 945182 943639
2105I43639L8090N6988O6266O7555N7404O8527R6068J92209J54930J30462L6492
$$ 943639 981729 1038717 1104983 1172538 1229942 1298469 1394537 1586746 1741676 1872138 1908630
2094A908630R5183Q8004J38508J99154K57917L70605M08742N59759P86428R25992
$$ 1908630 2003813 2091817 2230325 2429479 2687396 3058001 3466743 4026502 4812930 5738922
$$ [...]
##END NTUPLES=NMR SPECTRUM
##END=
