##TITLE=1H_CG-1175-A
 CDCl3
 8 sc, 
 1.9.2023
##JCAMPDX= 6.0         $$ Bruker NMR JCAMP-DX V2.0
##DATA TYPE= NMR SPECTRUM
##DATA CLASS= NTUPLES
##ORIGIN= UXNMR, Bruker Analytische Messtechnik GmbH
##OWNER= root
$$ XWIN-NMR		Version 3.5
$$ Fri Sep  1 13:58:22 2023 Russian Standard Time (UT+4h)  she@DPX200
##.OBSERVE FREQUENCY= 200.13135
##.OBSERVE NUCLEUS= ^1H
##.ACQUISITION MODE= SIMULTANEOUS
##.ACQUISITION SCHEME= undefined
##.AVERAGES= 8
##.DIGITISER RES= 18
##SPECTROMETER/DATA SYSTEM= spect
##.PULSE SEQUENCE= zg30
##.SOLVENT NAME= CDCl3
##.SHIFT REFERENCE= (INTERNAL, CDCl3, 0, 15.7326)
##AUDIT TRAIL= $$ (NUMBER, WHEN, WHO, WHERE, WHAT)
$$ ##TITLE= Audit trail, XWIN-NMR		Version 3.5
$$ ##JCAMPDX= 5.01
$$ ##ORIGIN= Bruker BioSpin GmbH
$$ ##OWNER= she
$$ F:/spectra/data/she/nmr/H-F/1/pdata/1/auditp.txt
$$ ##AUDIT TRAIL=  $$ (NUMBER, WHEN, WHO, WHERE, WHAT)
(   1,<2023-09-01 13:57:03.12 +0400>,<she>,<DPX200>,
      <created by zg, POWCHK disabled, PULCHK disabled
       configuration hash MD5:
       00 E9 B6 7A A2 85 ED C7 34 08 36 98 17 FE 4E 26
       data hash MD5: 16K
       52 5F 55 55 3D FB 65 5D C4 66 38 B6 CE 52 E7 4B>)
(   2,<2023-09-01 13:57:10.82 +0400>,<she>,<DPX200>,
      <Start of raw data processing
       efp BC_mod = 2 LB = 0.24 FT_mod = 6 PKNL = 1 PHC0 = -21205.89 PHC1 = 8.05272 SI = 16K 
       data hash MD5: 16K
       2B BE CE CD FD 50 29 E5 F2 E3 53 33 44 44 2D 3D>)
(   3,<2023-09-01 13:57:30.37 +0400>,<she>,<DPX200>,
      <pk PHC0 = 153.7236 PHC1 = 7.400001 
       data hash MD5: 16K
       4C 8E 7A 88 67 EF 2B B4 54 34 D0 55 1D D8 31 10>)
(   4,<2023-09-01 13:57:34.46 +0400>,<she>,<DPX200>,
      <abs ABSG = 5 
       data hash MD5: 16K
       32 47 FD 71 83 A8 F4 AD EC 1C C8 E3 25 1B 18 C9>)
$$ ##END=
$$ 
$$ hash MD5
$$ 86 8A 9F A2 EE FF 7C 6D AC CA A6 07 2F 54 BC 1B
##$RELAX= 
##$RELAX= 
##$RELAX= 
##$RELAX= 
##$RELAX= 
##$RELAX= 
$$ Bruker specific parameters
$$ --------------------------
##$DU= <F:/spectra>
##$EXPNO= 1
##$NAME= <H-F>
##$PROCNO= 1
##$TYPE= <nmr>
##$USER= <she>
##$AMP= (0..31)
100 100 100 100 100 100 100 100 100 100 100 100 100 100 100 100 100 100 
100 100 100 100 100 100 100 100 100 100 100 100 100 100 
##$AQSEQ= 0
##$AQ_mod= 1
##$AUNM= <au_zg>
##$AUTOPOS= <>
##$BF1= 200.13
##$BF2= 200.13
##$BF3= 200.13
##$BF4= 200.13
##$BF5= 200.13
##$BF6= 200.13
##$BF7= 200.13
##$BF8= 200.13
##$BYTORDA= 1
##$CFDGTYP= 0
##$CFRGTYP= 5
##$CHEMSTR= <none>
##$CNST= (0..31)
1 1 145 1 1 1 1 1 1 1 1 1 1 1 1 1 1 1 1 1 1 1 1 1 1 1 1 1 1 1 1 1 
##$CPDPRG= <>
##$CPDPRG1= <>
##$CPDPRG2= <>
##$CPDPRG3= <>
##$CPDPRG4= <mlev>
##$CPDPRG5= <mlev>
##$CPDPRG6= <mlev>
##$CPDPRG7= <mlev>
##$CPDPRG8= <mlev>
##$CPDPRGB= <>
##$CPDPRGT= <>
##$D= (0..31)
0 1.2 0 0 0 0 0 0 0 0.06 0 0.03 0 0 0 0 0.0002 0 0 0 0 0 0 0 0 0 0 0 0 
0 0 0 
##$DATE= 1693562222
##$DBL= (0..7)
120 120 120 120 120 120 120 120 
##$DBP= (0..7)
150 150 150 150 150 150 150 150 
##$DBP07= 0
##$DBPNAM0= <>
##$DBPNAM1= <>
##$DBPNAM2= <>
##$DBPNAM3= <>
##$DBPNAM4= <>
$$ [...]
##$SUBNAM3= <"">
##$SUBNAM4= <"">
##$SUBNAM5= <"">
##$SUBNAM6= <"">
##$SUBNAM7= <"">
##$SUBNAM8= <"">
##$SUBNAM9= <"">
##$SW= 18.05172834244
##$SWIBOX= (0..15)
0 0 2 0 0 0 0 0 0 0 0 0 0 0 0 0 
##$SW_h= 3612.71676300578
##$TD= 16384
##$TD0= 1
##$TE= 0
##$TE2= 300
##$TE3= 300
##$TEG= 300
##$TL= (0..7)
0 120 120 120 120 120 120 120 
##$TP= (0..7)
150 150 150 150 150 150 150 150 
##$TP07= 0
##$TPNAME0= <>
##$TPNAME1= <>
##$TPNAME2= <>
##$TPNAME3= <>
##$TPNAME4= <>
##$TPNAME5= <>
##$TPNAME6= <>
##$TPNAME7= <>
##$TPOAL= (0..7)
0.5 0.5 0.5 0.5 0.5 0.5 0.5 0.5 
##$TPOFFS= (0..7)
0 0 0 0 0 0 0 0 
##$TUNHIN= 0
##$TUNHOUT= 0
##$TUNXOUT= 0
##$USERA1= <user>
##$USERA2= <user>
##$USERA3= <user>
##$USERA4= <user>
##$USERA5= <user>
##$V9= 5
##$VALIST= <valist>
##$VCLIST= <CCCCCCCCCCCCCCC>
##$VD= 0
##$VDLIST= <DDDDDDDDDDDDDDD>
##$VPLIST= <PPPPPPPPPPPPPPP>
##$VTLIST= <TTTTTTTTTTTTTTT>
##$WBST= 1024
##$WBSW= 4
##$XGAIN= (0..3)
0 0 0 0 
##$XL= 0
##$YL= 0
##$YMAX_a= 235857
##$YMIN_a= -274709
##$ZGOPTNS= <>
##$ZL1= 120
##$ZL2= 120
##$ZL3= 120
##$ZL4= 120
##$ABSF1= 15.73917
##$ABSF2= -2.312679
##$ABSG= 5
##$ABSL= 3
##$ALPHA= 0
##$AQORDER= 0
##$ASSFAC= 0
##$ASSFACI= 0
##$ASSFACX= 0
##$ASSWID= 0
##$AUNMP= <proc_1d>
##$AZFE= 0.1
##$AZFW= 0.1
##$BCFW= 0
##$BC_mod= 2
##$BYTORDP= 0
##$COROFFS= 0
##$CY= -3
##$DATMOD= 1
##$DC= 0
##$DFILT= <>
##$DTYPP= 0
##$F1P= 0
##$F2P= 0
##$FCOR= 1
##$FTSIZE= 16384
##$FT_mod= 6
##$GAMMA= 0
##$GB= 0
##$INTBC= 1
##$INTSCL= 3.70164e-10
##$ISEN= 128
##$LB= 0.24
##$LEV0= 0
##$LPBIN= 0
##$MAXI= 10000
##$MC2= 0
##$MEAN= 0
##$ME_mod= 0
##$MI= 1.114404
##$NCOEF= 0
##$NC_proc= -7
##$NLEV= 6
##$NOISF1= 3.799351
##$NOISF2= 2.8
##$NSP= 0
##$NTH_PI= 0
##$NZP= 0
##$OFFSET= 15.73257
##$PC= 1
##$PHC0= -21052.17
##$PHC1= 15.45272
##$PH_mod= 1
##$PKNL= yes
##$PPARMOD= 0
##$PSCAL= 0
##$PSIGN= 0
##$REVERSE= no
##$SF= 200.130007799147
##$SI= 16384
##$SIGF1= 3
##$SIGF2= 2
##$SINO= 5.538805
##$SIOLD= 16384
##$SREGLST= <1H.CDCl3>
##$SSB= 0
##$STSI= 16384
##$STSR= 0
##$SW_p= 3612.71676300578
##$SYMM= 0
##$S_DEV= 0
##$TDeff= 16384
##$TDoff= 0
##$TI= <>
##$TILT= no
##$TM1= 0
##$TM2= 0
##$TOPLEV= 0
##$USERP1= <user>
##$USERP2= <user>
##$USERP3= <user>
##$USERP4= <user>
##$USERP5= <user>
##$WDW= 1
##$XDIM= 16384
##$YMAX_p= 383165883
##$YMIN_p= -2979889
$$ End of Bruker specific parameters
$$ ---------------------------------
##NTUPLES= NMR SPECTRUM
##VAR_NAME=  FREQUENCY,     SPECTRUM/REAL,   SPECTRUM/IMAG
##SYMBOL=    X,             R,               I
##VAR_TYPE=  INDEPENDENT,   DEPENDENT,       DEPENDENT
##VAR_FORM=  AFFN,          ASDF,            ASDF
##VAR_DIM=   16384,         16384,           16384
##UNITS=     HZ,            ARBITRARY UNITS, ARBITRARY UNITS
##FACTOR=    0.220516191357247, 1,           1
##FIRST=     3148.55929566472, 0,            0
##LAST=      -464.157467341061, 0,           0
##MIN=       -464.157467341061, -2979889,    0
##MAX=       3148.55929566472, 383165883,    0
$$ Real data points
##PAGE= N=1
##DATA TABLE= (X++(R..R)), XYDATA
$$ [...]
5679C34874N2852k59202p4673p006N8258O0479L5119N999Q0143J33030l27057
$$ 334874 387726 128524 53851 46845 105103 165582 200701 206700 286843 419873 92816
5668I2816l3396O330l9332k6763J21L20177q619j25878p2072O2278O6341k35540
$$ 92816 59420 65750 26418 -345 -224 319953 311334 185456 113384 175662 242003 6463
5656F463n9622K89710J89336r2633j4213L5714R1341j9467R5242o0961r169k62330
$$ 6463 -53159 236551 425887 333254 319041 354755 446096 426629 521871 460910 451741 189411
5644A89411J16944J0478o0406o6098L1660J01328q385J01140N1695O8494r8331
$$ 189411 306355 316833 256427 190329 221989 323317 314932 416072 467767 536261 437930
5633D37930r2157j00719Q4727j22727Q2679P0546j31127l7128J07033P1675L6072
$$ 437930 345773 245054 329781 207054 289733 360279 229152 192024 299057 370732 406804
5622D06804J77206M922j24655P1775J35627Q944j64393J33917L7053k6357m3062
$$ 406804 584010 588932 464277 536052 671679 680623 516230 650147 687200 660843 617781
5611F17781m279M2782k43384J42187J71589k49745N0761K5038J20812R867k7483
$$ 617781 613502 656284 412900 555087 726676 476931 527692 552730 673542 683409 655926
5600F55926N7782P1511l6258k3817J20968K13517J33032j78529j81178k8343J07484
$$ 655926 713708 785219 748961 725144 846112 1059629 1192661 1014132 832954 804611 912095
5589I12095n353J79779K55747J0859q1708j58119m7053P8521n9118m4867N0771
$$ 912095 906742 1086521 1342268 1353127 1271419 1113300 1066247 1144768 1085650 1040783 1091554
5578A091554O5540J9108K2897n065R0159j36990J6888L20870o7675j14242N1430
$$ 1091554 1157094 1176202 1199099 1194034 1284193 1147203 1164091 1484961 1417286 1303044 1354474
5567A354474J41638q7230j15168K99992Q4159J92668J18183M7742J40078K24247
$$ 1354474 1496112 1408882 1293714 1593706 1677865 1870533 1988716 2036458 2176536 2400783
5557B400783k85663l2231p1339r268K2811j90637k8542p9039q9040J72372J01650
$$ 2400783 2115120 2082889 2011550 2002282 2025093 1834456 1805914 1726875 1637835 1810207 1911857
5546A911857k93051k7776M7296M1204j88257n5484J57827j10135l5703J35501
$$ 1911857 1618806 1591030 1638326 1679530 1491273 1435789 1593616 1483481 1447778 1583279
5536A583279K1688P7583L683k5423l0580P3020J11021q5950M425j29723j58002
$$ 1583279 1604967 1682550 1686233 1660810 1630230 1703250 1814271 1728321 1732746 1603023 1445021
5525A445021J29661r6112l1240l9163j77556j10902Q4719j57030N2840L96439
$$ 1445021 1574682 1478570 1447330 1408167 1230611 1119709 1204428 1047398 1100238 1496677
5515A496677r0301j80106K79629m3702o7006O4701m0645L0698j8762r5383Q9980
$$ 1496677 1406376 1226270 1505899 1462197 1395191 1459892 1419247 1449945 1431183 1335800 1425780
5504A425780k0397k92947j38146K00619k29924j89852O4532O814J62412O7952
$$ 1425780 1405383 1112436 974290 1174909 944985 755133 819665 826479 988891 1056843
5494A056843R9601k96995m0738J32185J36033L3745O1089N2507o4587l9993M3865
$$ 1056843 1156444 859449 818711 950896 1086929 1120674 1181763 1234270 1169683 1129690 1173555
5483A173555J02435j7495j2574k34401j34452j02371O1125p320J16054l1889j2316
$$ 1173555 1275990 1258495 1245921 1011520 877068 774697 835822 828502 944556 912667 900351
5472I00351k04260J25704n0626k28008J32360m7216M7131p8751K13008k5833n2765
$$ 900351 696091 821795 771169 543161 675521 628305 675436 596685 809693 783860 731095
5461G31095k34431n900J34956J20618K6661P149o3500p2505r5631k6316l3026
$$ 731095 496664 490764 625720 746338 772999 780148 716648 644143 548512 522196 489170
5450D89170o8982K33004J4870o7875J68953L7299j21827J2183m1294j37787p035
$$ 489170 420188 653192 668062 600187 769140 806439 684612 696795 655501 517714 510679
5439E10679K91340J28111q0164R9625J49009Q7815l8304k67555K09490k39494
$$ 510679 802019 930130 849966 949591 1098600 1186415 1148111 880556 1090046 850552
5429H50552m4393J36056O9755J00983j45715p9694J6188J19296j48496m9713j7205
$$ 850552 806159 942215 1011970 1112953 967238 887544 903732 1023028 874532 824819 807614
5418H07614q8298K58818P2967q4080K20621J37994J5334r6929j43765q0294J60396
$$ 807614 719316 978134 1051101 967021 1187642 1325636 1340970 1244041 1100276 1019982 1180378
5407A180378o713M8663L8673Q3848l0541p5430j42469J15089Q6741j55301K11600
$$ 1180378 1173665 1222328 1261001 1344849 1314308 1238878 1096409 1211498 1298239 1142938 1354538
5396A354538J21695K61810R2373r176p3885k7059K9466n8658k29291j57232n0838
$$ 1354538 1476233 1738043 1830416 1821240 1747355 1720296 1749762 1691104 1461813 1304581 1253743
5385A253743K8338N2984r1981m3473m6592M9538j95943J38126J21066J6703o131
$$ 1253743 1282081 1335065 1243084 1199611 1153019 1202557 1006614 1144740 1265806 1282509 1276378
5374A276378P4718j19643K0478j58634r3030p582j13407k1295J22667J33710m8919
$$ 1276378 1351096 1231453 1251931 1093297 1000267 992685 879278 857983 980650 1114360 1065441
5363A065441n5803R5516J74498J06046k8046K6401M415n1116J64912J79825n1658
$$ 1065441 1009638 1105154 1279652 1385698 1357652 1384053 1388468 1337352 1502264 1682089 1630431
5352A630431j88275O500j96904l5657L0133p696J04282l2032O8197L6102k7803
$$ 1630431 1442156 1448656 1251752 1216095 1246228 1238532 1342814 1310782 1378979 1415081 1387278
5341A387278j37623k02666J23000j27305r6151p4109Q7219J05725J72659o7781
$$ 1387278 1249655 1046989 1169989 1042684 946533 872424 959643 1065368 1238027 1170246
5331A170246k32155j19588L6967l2891o2618P3709P0271k084l3018m5217N3915
$$ 1170246 938091 818503 855470 822579 759961 833670 903941 901857 868839 823622 877537
5320H77537o1297J8599L1307p3321J763R8215r7155o463J04578j9068J45402Q4658
$$ 877537 816240 834839 866146 792825 794588 892803 795648 789185 893763 874695 1020097 1104755
5308A104755K8506l7468m3063j79990J51042j42169J03546J26175j8507j29820
$$ 1104755 1133261 1095793 1052730 872740 1023782 881613 985159 1111334 1092827 963007
5298I63007p7743K6826m2067j02982J26188K43635R9898j62269j69967m6906j36718
$$ 963007 885264 912090 870023 767041 893229 1136864 1236762 1074493 904526 857620 720902
5287G20902m6356L275K29617p0898o560l4408k1977K04045J04035n8336p5896
$$ 720902 674546 677821 907438 836540 829980 795572 773595 977640 1081675 1023339 947443
5276I47443L3511M1623j08097j41992j54524K51466r8010J29018K57116j51384
$$ 947443 980954 1022577 914480 772488 617964 869430 771420 900438 1157554 1006170
5266A006170k49344j0202J36336O8912j16881Q9138k5776m2009l385Q6937l623
$$ 1006170 756826 746624 882960 951872 834991 924129 898353 856344 852959 939896 936273
5255I36273n5277J45540k4402j56671R8461L7725K6793j31036j02038L2864j4094
$$ 936273 880996 1026536 1002134 845463 943924 981649 1008442 877406 775368 808232 794138
5244G94138J9259j83536J97566J61347J02104l3733J17928j82082k3121J491O1507
$$ 794138 813397 629861 827427 988774 1090878 1057145 1175073 992991 969870 971361 1032868
5233A032868r9454n341l4873J72868n133j71125P6146q8637K17891J89470j21810
$$ 1032868 933414 928073 893200 1066068 1060935 889810 965956 877319 1095210 1284680 1162870
5222A162870o6524j40384q88j65255j37031J14028o5417R5793R039P132Q3886
$$ 1162870 1096346 955962 955074 789819 652788 766816 701399 797192 806231 813363 897249
5211H97249K05619J68312j73351J8782l5380k56154O6856L3180M0771j57084J21856
$$ 897249 1102868 1271180 1097829 1116611 1081231 825077 891933 925113 965884 808800 930656
5200I30656K18850j33217l8834P7588N290M0983P6748k74989Q4567R8729l0286
$$ 930656 1149506 1016289 977455 1055043 1060333 1101316 1178064 903075 987642 1086371 1056085
5189A056085q0169r9048M6910J24846o904k01941K93081J48488j16174j14984
$$ 1056085 975916 876868 923778 1048624 1041720 839779 1132860 1281348 1165174 1050190
5179A050190j69430r3145J53848l3449P9977J02094J26417k80323q5920K49709
$$ 1050190 880760 787615 941463 908014 987991 1090085 1216502 936179 850259 1099968
5169A099968N1211n1823j96945n1120P3033q9782J63585j76863j25145K71598
$$ 1099968 1151179 1099356 902411 851291 924324 834542 998127 821264 696119 967717
5159I67717J67732j18722k36162M5331J22638K295L4256j35885m9651K13230J5779
$$ 967717 1135449 1016727 780565 825896 948534 950829 985085 849200 799549 1012779 1028558
5148A028558k45420j81695Q6842k8461L06411k514K23534r3033q1287j98829J6188
$$ 1028558 783138 601443 688285 659824 966235 963721 1187255 1094222 1012935 814106 830294
5137H30294k392Q1120l3268J98901k3324n3174k5628k9611K07643k38861k5297
$$ 830294 827902 909022 875754 1074655 1051331 998157 972529 942918 1150561 911700 886403
5126H86403J23042m4024k3907K2226j2947k630j74208J89285p3385r5081P0276
$$ 886403 1009445 965421 941514 963740 950793 948163 773955 963240 889855 794774 865050
5115H65050j39028J32223J03955j57904J75221J26583j30816p6620j75488p416
$$ 865050 726022 858245 962200 804296 979517 1106100 975284 898664 723176 715760
5105G15760q0708N4131J08204k61837J01665L72155n2688o4376J22090j12915
$$ 715760 635052 689183 797387 535550 637215 1009370 956682 892306 1014396 901481
5095I01481k6475j0535M4358k4015J4155p5770K57097P6717j03183j84518J01782
$$ 901481 875006 864471 908829 884814 898969 823199 1080296 1157013 1053830 869312 971094
5084I71094l1806q5427R3034j49688k217O3013M9100J7814J52865J89067j34729
$$ 971094 939288 853861 946895 797207 794990 858003 907103 924917 1077782 1266849 1132120
5073A132120l9557Q579r8922k12451Q6458Q2009M7091J13k7003Q4460M6414r550
$$ 1132120 1092563 1101142 1002220 789769 876227 958236 1005327 1005440 978437 1062897 1109311 1099761
5061A099761j0033L5900k06704p8596P3647O8208j05020K01750k6876L9366n3229
$$ 1099761 1089728 1125628 918924 840328 913975 982183 877163 1078913 1052037 1091403 1038174
5050A038174m3661l9556j14538q1795M5655J33310j2251p1133L9817J18824K0225
$$ 1038174 994513 954957 840419 758624 804279 937589 925338 854205 894022 1012846 1033071
5039A033071N6529k094j6571p7719J19719J6610j59848L2783m2911M9876R1957
$$ 1033071 1089600 1087506 1070935 993216 1112935 1129545 969697 1002480 959569 1009445 1101402
5028A101402r6408J44030k68315j698J29736P4626N5360l9134k37234p4308m1630
$$ 1101402 1004994 1149024 880709 879011 1008747 1083373 1138733 1099599 862365 788057 746427
5017G46427J63046K38339k08223R325J11260j16103L4351r5877j28786K53878
$$ 746427 909473 1147812 939589 948914 1060174 944071 978422 882545 753759 1007637
5007A007637l4800K0819J733j80291Q8484j37663j1255J40548J39063j6130k22872
$$ 1007637 972837 993656 995389 815098 903582 765919 754664 895212 1034275 1018145 795273
4996G95273q510p27P4976l5671j4550k012N1430P7719J26332k09510l0655k851
$$ 795273 786763 786036 861012 825341 810791 808779 860209 937928 1064260 854750 824095 821244
4984H21244j14190L17408O7045j89467j26207L0899O6200k12890M3659L38584
$$ 821244 707054 1024462 1091507 902040 775833 806732 872932 660042 703701 1042285
4974A042285k0335k05012k3712l6509O9341q2920q6945O7144K72645K3605l09796
$$ 1042285 1021950 816938 793226 756717 826058 743138 656193 723337 995982 1019587 709791
4963G09791q1766K26091j738j10146J19593R5921j20753j8497J50321K1459r9050
$$ 709791 628025 854116 852378 742232 861825 957746 836993 818496 968817 990276 891226
4952H91226j10971j45125J72111J73486l7458j30589j3203J59277j08290l5082
$$ 891226 780255 635130 807241 980727 943269 812680 799477 958754 850464 815382
4942H15382L297j58774l7220O0826L48571k18044j02930J06224M0009N7524m8095
$$ 815382 818679 659905 622685 683511 1032082 814038 711108 817332 857341 914865 866770
4931H66770P775q5398J90449j5599r1687K14352J08096j45476p4216r2760j3578
$$ 866770 874545 789147 979596 963997 872310 1086662 1194758 1049282 975066 882306 868728
4920H68728j2968P7263n6263J01031P2483m7729R585P9705l9683O5370j93837
$$ 868728 855760 933023 876760 977791 1050274 1002545 1012130 1091835 1052152 1117522 923685
4909I23685j49523K93114k03463m6614J9869j7542J77486j35854O5874K61213
$$ 923685 774162 1067276 863813 817199 837068 819526 997012 861158 927032 1188245
4899A188245k01913L3432j4374J18987k5711j0733l5957p2088J61632k80933n1474
$$ 1188245 986332 1019764 1005390 1124377 1098666 1087933 1051976 979888 1141520 860587 809113
4888H09113J45931J12690R9665o2322k1802J1574Q1059J6671k7481j45469P3050
$$ 809113 955044 1067734 1167399 1105077 1083275 1094849 1175908 1192579 1165098 1019629 1092679
4877A092679J52777l38821J33227l1054p2930K27807J20401k19401N0557n7776
$$ 1092679 1245456 906635 1039862 1008808 935878 1163685 1284086 1064685 1115242 1057466
4867A057466J94251J53462l05556K8929K29185p1027P4132j9538j45907j00533
$$ 1057466 1251717 1405179 1099623 1128552 1357737 1286710 1360842 1341304 1195397 1094864
4857A094864j01675J10393r056R1589L9119J07592k4439q4378J11528J174j12050
$$ 1094864 993189 1103582 1094526 1186115 1225234 1332826 1308387 1224009 1335537 1336711 1224661
4846A224661J675K6846m7437M2976J8419k3478J10576P6527n9215K2773R5854
$$ 1224661 1226336 1253182 1205745 1248721 1267140 1243662 1354238 1430765 1371550 1394323 1490177
4835A490177R559K06183m0079r8418j28167J21956J42673K2414k761J26906M7664
$$ 1490177 1499736 1705919 1665840 1567422 1439255 1561211 1703884 1726298 1723537 1850443 1898107
4824A898107l07306m6813J21890O3938k5595r858o3113J54950J7906J22687J48684
$$ 1898107 1590801 1543988 1665878 1729816 1704221 1694363 1631250 1786200 1804106 1926793 2075477
4813B075477J08800n519k80704J1749K81127J6825O4278N773K10521J18168j84904
$$ 2075477 2184277 2178758 1898054 1909803 2190930 2207755 2272033 2277806 2488327 2606495 2421591
4802B421591J54257K48499L5376j15669o881N6148N0584J92447l5r3722k8422
$$ 2421591 2575848 2824347 2859723 2744054 2737173 2793321 2843905 3036352 3036317 2942595 2914173
4791B914173n1567L1766j01231P8523j35453J8658N4180M9759J29554l9714J4969
$$ 2914173 2862606 2894372 2793141 2871664 2736211 2754869 2809049 2858808 2988362 2948648 2963617
4780B963617r5037o4837K04890L373J99643k508j2987K6228q0711J72856J99181
$$ 2963617 2868580 2803743 3008633 3012006 3211649 3209141 3196154 3222382 3141671 3314527 3513708
4769C513708N9882J78440K53919j7950L2945O8513K58871L77193K36535l0502
$$ 3513708 3573590 3752030 4005949 3987999 4020944 4089457 4348328 4725521 4962056 4931554
4759D931554M6187Q4122l95152q0292j45463k47477r5556j93724r0703j07296
$$ 4931554 4977741 5061863 4666711 4586419 4440956 4193479 4097923 3904199 3813496 3706200
4749C706200R5934J9424j51152r1637J58867J75558q7830j37812Q0539m7343p9284
$$ 3706200 3802134 3821558 3670406 3578769 3737636 3913194 3825364 3687552 3768091 3720748 3641464
4738C641464j91547K22762Q996j08245N6856J97464l7448N1016j01932L1203j4966
$$ 3641464 3449917 3672679 3681675 3573430 3630286 3827750 3790302 3841318 3739386 3770589 3755623
4727C755623L1112O8847j33385j3740q7830K0992Q7988J92671r1846k0001R4383
$$ 3755623 3786735 3855582 3722197 3708457 3620627 3641619 3729607 3922278 3830432 3810431 3904814
4716C904814O1776K6127O6001p2559M0172j27622K53572O4355o5250K75144K41104
$$ 3904814 3966590 3992717 4058718 3986159 4026331 3898709 4152281 4216636 4151386 4426530 4667634
4705D667634k05790R5985L9025M09018J80722j24948m525k7653l1041J14859K14160
$$ 4667634 4461844 4557829 4596854 5005872 5186594 5061646 5057121 5029468 4998427 5113286 5327446
4694E327446O6446J16621Q8435P3013R438R43K7055j60620r6578R8103k28932
$$ 5327446 5393892 5510513 5598948 5671961 5681399 5682342 5709397 5548777 5452199 5550302 5321370
4683E321370M8528k30k04090j49061m95471k96918J54092K8205j84191j87172
$$ 5321370 5369898 5369668 5165578 5016517 4521046 4224128 4378220 4406425 4222234 4035062
4673D035062j08924l73493J40862j5880p8478m5279m5321J2938j61649J01833
$$ 4035062 3926138 3552645 3693507 3677627 3599149 3553870 3508549 3521487 3359838 3461671
4663C461671K3196p8933n2947k45249M6844J67279j41468M9036O4635J13182j79778
$$ 3461671 3484867 3405934 3352987 3107738 3154582 3321861 3180393 3229429 3294064 3407246 3227468
4652C227468k9876j38102r9882K7736n2020Q2849j55331Q488J17298Q3104k32319
$$ 3227468 3197592 3059490 2959608 2987344 2935324 3018173 2862842 2871330 2988628 3071732 2839413
4641B839413j94144M1814j77754R499L2936J81543O6087n8291J9624K4901K5095
$$ 2839413 2645269 2687083 2509329 2518828 2551764 2733307 2799394 2741103 2760727 2785628 2810723
4630B810723r1574O8167j19094p3135j91202n0765K77008M6439q8262K30873L6669
$$ 2810723 2719149 2787316 2668222 2595087 2403885 2353120 2630128 2676567 2588305 2819178 2855847
4619B855847Q840m2394j07661r4605N240p937j14032J75785M2022M8956O5107
$$ 2855847 2864687 2822293 2714632 2620027 2625267 2617330 2503298 2679083 2721105 2770061 2835168
4608B835168L5359L3328M0706j3378M8201L5193J3325j0332q7031j303k37808
$$ 2835168 2870527 2903855 2944561 2931183 2979384 3014577 3027902 3017570 2930539 2929236 2691428
4597B691428L3614O5229p2193j28645N3882O4337R8423r0650n350M8326K49599
$$ 2691428 2725042 2790271 2718078 2589433 2643315 2707652 2806075 2715425 2710075 2758401 3008000
4586C008000O7604j25006J33181n4830l586R4081o6468o4653O1762J55636j90126
$$ 3008000 3075604 2950598 3083779 3028949 3025363 3119444 3052976 2988323 3050085 3205721 3015595
4575C015595L6547J41891j37609r9780L1748O2882J4069K63902K16466l10775
$$ 3015595 3052142 3194033 3056424 2956644 2988392 3051274 3065343 3329245 3545711 3234936
4565C234936J8427m900J18672J35735k3120J14068l05271m2350P0985J70517N3647
$$ 3234936 3253363 3248463 3367135 3502870 3479750 3593818 3288547 3246197 3317182 3487699 3541346
4554C541346j3501R6530M6491m2840M1974m9288k3737J2451J72823N9044J3557
$$ 3541346 3527845 3624375 3670866 3628026 3670000 3620712 3596975 3609426 3782249 3841293 3854850
4543C854850O6192j31803n3905R1965l2582O8109J31246O5868P4447P4611r0393
$$ 3854850 3921042 3789239 3735334 3827299 3794717 3862826 3994072 4059940 4134387 4208998 4118605
4532D118605M2412j17180Q3696O791O2460p655n7705L62967q931O8755J15263
$$ 4118605 4161017 4043837 4127533 4134324 4196784 4189129 4131424 4494391 4485460 4554215 4669478
4521D669478J0712M6865J27825p3602k60856J66632J62523L6169K9984K69780
$$ 4669478 4680190 4727055 4854880 4781278 4520422 4687054 4849577 4885746 4915730 5185510
4511E185510O069q7536m0433p9363K6574N9389K93659L03545j4421k90293N1304
$$ 5185510 5191579 5104043 5063610 4984247 5010821 5070210 5363869 5667414 5652993 5362700 5414004
4500E414004L56418J06881M3195L3323l4366j82173Q9592J86970P6009P3780l7676
$$ 5414004 5770422 5877303 5920498 5953821 5919455 5737282 5826874 6013844 6089853 6163633 6125957
4489F125957K38843Q5841j05484K59839l1922r4130J80574K70942O7162J61179
$$ 6125957 6364800 6450641 6345157 6604996 6573074 6478944 6659518 6930460 6997622 7158801
4479G158801j73354J37975K47092j13200n9032O8952J44455M60313O8073k30047
$$ 7158801 6985447 7123422 7370514 7257314 7198282 7267234 7411689 7872002 7940075 7710028
4469G710028M1239O0023J87409J54136N6153K38929L18596j6504K25791N3805
$$ 7710028 7751267 7811290 7998699 8152835 8208988 8447917 8766513 8750009 8975800 9029605
4459I029605O9879r5977K30787K71944K03144L1761K98159J59800o1429K41593
$$ 9029605 9099484 9003507 9234294 9506238 9709382 9741143 10039302 10199102 10137673 10379266
4449A0379266J27224J60437J77988J49433K12517L39256K63020P8801L4090L57813
$$ 10379266 10506490 10666927 10844915 10994348 11206865 11546121 11809141 11887942 11922032 12279845
4439A2279845K91042L05030J46982J79087K86241L08755K22101J97489L99504
$$ 12279845 12570887 12875917 13022899 13201986 13488227 13796982 14019083 14216572 14616076
4430A4616076M653L24634L17971L73641M97142L95656K34841K84301J24233M04270
$$ 14616076 14620729 14945363 15263334 15636975 16134117 16529773 16764614 17048915 17173148 17577418
4420A7577418N78316L18057L04115N14119L95146M70624L04119L04253N20715
$$ 17577418 18155734 18473791 18777906 19292025 19687171 20157795 20461914 20766167 21286882
4411B1286882L49064K69268J85396K39779M83783N21007N35100M28650L41198
$$ 21286882 21635946 21905214 22090610 22330389 22814172 23335179 23870279 24298929 24640127
4402B4640127N68581J15017L55014M07288L63280N51627L26997K06468N18501
$$ 24640127 25208708 25323725 25678739 26086027 26449307 27000934 27327931 27534399 28052900
4393B8052900N35914J74434K94581N04736L84195J48975l6486L16939K36963L20219
$$ 28052900 28588814 28763248 29057829 29562565 29946760 30095735 30059249 30376188 30613151 30933370
4383C0933370J68114K64104L37638K16490L62318J46147K07649k7939J81037J33457
$$ 30933370 31101484 31365588 31703226 31919716 32282034 32428181 32635830 32607891 32788928 32922385
4373C2922385R6909K38416J45161j12902p4495L6813J53061O5678k51825m7012
$$ 32922385 33019294 33257710 33402871 33289969 33215474 33252287 33405348 33471026 33219201 33172189
4363C3172189j19577n5352J74091k88778j93806m7904m0184j25713k85539q7371
$$ 33172189 33052612 32997260 33171351 32882573 32688767 32640863 32600679 32474966 32189427 32102056
4353C2102056l83413l36695j79191k65207k15333l86763j90959j28375k56489
$$ 32102056 31718643 31381948 31202757 30937550 30722217 30335454 30144495 30016120 29759631
4344B9759631m14412l02423m76886j50931n31885l97209k81069k31351k60185
$$ 29759631 29345219 29042796 28565910 28414979 27883094 27485885 27204816 26973465 26713280
4335B6713280l16062n8392j96987l03456k82000l63441n25412j13781l67889l74751
$$ 26713280 26397218 26338826 26141839 25838383 25556383 25192942 24667530 24553749 24185860 23811109
4325B3811109k83694q2320j02822m27495j78993k83712j69460j99619j74898K0604
$$ 23811109 23527415 23445095 23342273 22914778 22735785 22452073 22282613 22082994 21908096 21928700
4315B1928700l26256l86621j44794n3019k30966j30224j1445R803j77835j52701
$$ 21928700 21602444 21215823 21071029 21018010 20787044 20656820 20645375 20655178 20477343 20324642
4305B0324642q2821j46155k7433L34746O8616j34405l22240r0440p4640J88893
$$ 20324642 20241821 20095666 20068233 20402979 20471595 20337190 20014950 19924510 19849870 20038763
4295B0038763k05816O0212J08033M7575K48845J77367j49390K87578P6314J25400
$$ 20038763 19832947 19893159 20001192 20048767 20297612 20474979 20325589 20613167 20689481 20814881
4285B0814881K59416R9979J16335J46920J80745K14917l460K57319M56561K44982
$$ 20814881 21074297 21174276 21290611 21437531 21618276 21833193 21829733 22087052 22543613 22788595
4275B2788595K34353L88769M44230M75868M66962L70554K99194M27661L34682
$$ 22788595 23022948 23411717 23855947 24331815 24798777 25169331 25468525 25896186 26230868
4266B6230868L54791N80999L56167P16559L54409N49220P18859N11499O75697
$$ 26230868 26585659 27166658 27522825 28239384 28593793 29143013 29861872 30373371 31049068
4257C1049068O04232O04894P32888M83006O72245Q22522N38762O12884P84201
$$ 31049068 31653300 32258194 32991082 33474088 34146333 34968855 35507617 36120501 36904702
4248C6904702O19494N20946O75909N40085N01757N56037J86979M89250M51086
$$ 36904702 37524196 38045142 38721051 39261136 39762893 40318930 40505909 40995159 41446245
4239D1446245K75763L74125L43905L17536K69668L38350L76578J89445K58523
$$ 41446245 41722008 42096133 42440038 42757574 43027242 43365592 43742170 43931615 44190138
4230D4190138J32550K39636K01021R6397J7440J25295J88501K2719J32986K02661
$$ 44190138 44322688 44562324 44763345 44859742 44877182 45002477 45190978 45213697 45346683 45549344
4220D5549344j95621j66078r1341k0550O9102l03144m48865k34593j18324j49604
$$ 45549344 45353723 45187645 45096304 45075754 45144856 44841712 44392847 44158254 44039930 43890326
4210D3890326l89353l98900l27689n10932o28977l30705m33779m02793k56095
$$ 43890326 43500973 43102073 42774384 42263452 41634475 41303770 40869991 40467198 40211103
4201D0211103k03369o74145n63154l41554m50019l80413o36299o80781n79716
$$ 40211103 40007734 39333589 38770435 38428881 37978862 37598449 36962150 36281369 35701653
4192C5701653m22557l58409m40440n03512n68992n52498n45758l21134m47755
$$ 35701653 35279096 34920687 34480247 33976735 33407743 32855245 32309487 31988353 31540598
4183C1540598m71006j58006m55076l93730j16626m49384l58283m62867l25856
$$ 31540598 31069592 30911586 30456510 30062780 29946154 29496770 29138487 28675620 28349764
4174B8349764j17522j86246j42903n3847o8302q9545K02715J97530M02417N74600
$$ 28349764 28232242 28045996 27903093 27849246 27780944 27691399 27894114 28091644 28494061 29068661
4164B9068661P10116Q53860J502699K007044K416041J810255O38704m82451j730555
$$ 29068661 29778777 30632637 32135336 34142380 36558421 38368676 39007380 38524929 36794374
4155C6794374j861285k047720j890847j777718j296346r89657j300906p86824
$$ 36794374 34933089 32885369 30994522 29216804 27920458 26930801 25629895 24843071
4147B4843071n44305o40306j81390k95219j27926j48387j87286o5878N680J07339
$$ 24843071 24298766 23658460 23477070 23181851 23053925 22905538 22718252 22652374 22658054 22765393
4137B2765393j31961M8343k3303J13910J79078K21611K56248K43431J81017M67691
$$ 22765393 22633432 22681775 22658472 22772382 22951460 23173071 23429319 23672750 23853767 24321458
4127B4321458K67688K13769M32111l2239O4871j56972k73146o9746R381k12642
$$ 24321458 24589146 24802915 25235026 25202787 25267658 25110686 24837540 24767794 24777175 24564533
4117B4564533k73249j78552l02477l45710j41866k482q2940j84266k17741q76
$$ 24564533 24291284 24112732 23810255 23464545 23322679 23320197 23237257 23052991 22835250 22834374
4107B2834374j14591p5609K09590j16760j74389J38876r306J45073J97632J46631
$$ 22834374 22719783 22644174 22853764 22737004 22562615 22701491 22692185 22837258 23034890 23181521
4097B3181521k089K34963K65983J51437L3178M53081J71725K75976L09635M94904
$$ 23181521 23179432 23414395 23680378 23831815 23864993 24318074 24489799 24765775 25075410 25570314
4087B5570314N3212L62758L64460L23497K55147L39168M67555N58033O10290L23165
$$ 25570314 25623526 25986284 26350744 26674241 26929388 27268556 27736111 28294144 28904434 29227599
4077B9227599O38357Q25862O79809O98177Q11350P02286R01245Q77370Q17221
$$ 29227599 29865956 30691818 31371627 32069804 32881154 33583440 34484685 35362055 36179276
4068C6179276O62382O02807O63750P47128R17917J059136R91934J218077J118171
$$ 36179276 36841658 37444465 38108215 38855343 39773260 40832396 41824330 43042407 44160578
4059D4160578J279826J745757J855449J595177J865562K277089K160333K734890
$$ 44160578 45440404 47186161 49041610 50636787 52502349 54779438 56939771 59674661
4051E9674661L221149L026336L656835M100223M394556M992097N511268O196154
$$ 59674661 62895810 65922146 69578981 73679204 78073760 83065857 88577125 94773279
4043I4773279P005026P575308Q054828Q830492R308436R536213Q993403Q192593
$$ 94773279 101778305 109353613 117408441 126238933 135547369 145083582 154076985 162269578
4035A62269578P018222N662207L439162N98283j754563m330317n802614o926626
$$ 162269578 169287800 174950007 178389169 178987452 177232889 172902572 167099958 160173332
4027A60173332p681718q172229q359283q046225p427005o779402o102243n542430
$$ 160173332 152491614 144319385 135960102 127913877 120486872 113707470 107605227 102062797
4019A02062797m590090l892788l417182l141976k469621k272636k225406k159817
$$ 102062797 97472707 93579919 90162737 87020761 84551140 82278504 80053098 77893281
4011G7893281j834553j899931j649614j273333j206653j131533j000406p30164
$$ 77893281 76058728 74158797 72509183 71235850 70029197 68897664 67897258 67167094
4003F7167094o15593m77662p57616o44346p21037q21803n72775o37533q80766
$$ 67167094 66551501 66073839 65316223 64671877 63950840 63129037 62556262 61918729 61037963
3994F1037963p41441m44257k87844j54877J5476J82507K88053N39164M76908R2187
$$ 61037963 60296522 59852265 59564421 59409544 59425020 59607527 59895580 60434744 60911652 61003839
3984F1003839j96421Q2086j2091m10238p75335j500899j881533k264728k017233
$$ 61003839 60807418 60889504 60877413 60467175 59691840 58190941 56309408 54044680 52027447
3975E2027447j946746k191022k313316k045686j823947j820368j796943j941969
$$ 52027447 50080701 47889679 45576363 43530677 41706730 39886362 38089419 36147450
3967C6147450j668625j202488j080603r77221p51809q07279m46362n29746m33950
$$ 36147450 34478825 33276337 32195734 31218513 30466704 29659425 29213063 28683317 28249367
3958B8249367n80773j062254r07093j042949r65807r63438q98539q55523n90971
$$ 28249367 27668594 26606340 25699247 24656298 23690491 22727053 21828514 20972991 20382020
3949B0382020o27828q07320p29173n37392l00771m55138k96097j80338m30560
$$ 20382020 19754192 18946872 18217699 17680307 17379536 16924398 16628301 16447963 16017403
3940A6017403j81533k27141m47377j75411j61840m64895k79992j90449j42958
$$ 16017403 15835870 15608729 15161352 14985941 14824101 14359206 14079214 13888765 13745807
3931A3745807l35316j64312Q7996j97043j18568K7251O0350l70495j94918J13950
$$ 13745807 13410491 13246179 13334175 13137132 13018564 13045815 13106165 12735670 12540752 12654702
3921A2654702j24620j60759p9738j27944J61879j4840K6427j15483J75304M8438
$$ 12654702 12530082 12369323 12289585 12161641 12323520 12308680 12335107 12219624 12394928 12443366
3911A2443366M0370P8071L70424J20705m6828J74586L38o7284k56573j85603q7817
$$ 12443366 12483736 12561807 12932231 13052936 13006108 13180694 13181032 13113748 12857175 12671572 12583755
3900A2583755k37189m32497j12636j19511j96598k14446k64251n0985o6154j13504
$$ 12583755 12346566 11914069 11801433 11681922 11485324 11270878 11006627 10955642 10889488 10775984
3890A0775984n89k90367Q8071J29209o0733l02887L4128m9641q1363J4895j09431
$$ 10775984 10775395 10485028 10573099 10702308 10641575 10338688 10372816 10323175 10241812 10256707 10147276
3879A0147276o166r4346J1628j4139O5089r7908j19609J96979k08216L4886J69730
$$ 10147276 10141110 10046764 10058392 10044253 10109342 10011434 9891825 10088804 9880588 9915474 10085204
3868A0085204k4956k49837j42194K22074j54070j42916J86239j14038j39576k4346
$$ 10085204 10060248 9810411 9668217 9890291 9736221 9593305 9779544 9665506 9525930 9501584
3858I501584L00485N7347n960P8738o1358N3478J70653p5297L645j98260L05064
$$ 9501584 9802069 9859416 9853456 9932194 9870836 9924314 10094967 10019670 10023315 9825055 10130119
3847A0130119K37518j212J06233J47026J05131j27352L332j57575k9744j0368
$$ 10130119 10367637 10366425 10472658 10619684 10724815 10597463 10600795 10443220 10413476 10403108
3837A0403108P7357J9094L7870l1458o1550J00948j11130q8181k3146J53430J73279
$$ 10403108 10480465 10499559 10537429 10505971 10444421 10545369 10434239 10346058 10322912 10476342 10649621
3826A0649621Q9940J05279l9836j89009J85760R4604K53172M08308j4364K4059
$$ 10649621 10739561 10844840 10805004 10615995 10801755 10896359 11149531 11557839 11543475 11567534
3816A1567534o1445J40539J08040J86286K12860j65658j24704K8442J13053L8528
$$ 11567534 11506089 11646628 11754668 11940954 12153814 11988156 11863452 11891894 12004947 12043475
3806A2043475J08026Q5961l0368L5930J80225k840k8607K30376J64391j18044
$$ 12043475 12151501 12237462 12207094 12243024 12423249 12420409 12391802 12622178 12786569 12668525
3796A2668525M1350K9433N4346L64371J3696K49465M4660P7589L6076K0659J73513
$$ 12668525 12709875 12739308 12793654 13158025 13171721 13421186 13465846 13543435 13579511 13600170 13773683
3785A3773683J38857r5237K77759R104K08547R8986j11908J93098J67533K6441
$$ 13773683 13912540 13817303 14095062 14104166 14312713 14411699 14299791 14492889 14660422 14686863
3775A4686863L67484P7794Q1571J29908m170J11300j07423J56943Q3460K76595
$$ 14686863 15054347 15132141 15213712 15343620 15339450 15450750 15343327 15500270 15583730 15860325
3765A5860325J84398R2193J12317J50523L41728J73116K84590L32867K63694J16315
$$ 15860325 16044723 16136916 16249233 16399756 16741484 16914600 17199190 17532057 17795751 17912066
3755A7912066K54475L25812J81784K46670L43106K48391K73697K68755K94569
$$ 17912066 18166541 18492353 18674137 18920807 19263913 19512304 19786001 20054756 20349325
3746B0349325M91209N81816L27062N26779M93541K51759N39133N34078N57148
$$ 20349325 20840534 21422350 21749412 22276191 22769732 23021491 23560624 24094702 24651850
3737B4651850M63586M44926O74158O76589Q11701Q74152Q24508R84767P90937
$$ 24651850 25115436 25560362 26234520 26911109 27722810 28596962 29421470 30406237 31197174
3728C1197174J037187R92148J068252J274305J220101J372213J289771J514387
$$ 31197174 32234361 33226509 34294761 35569066 36789167 38161380 39451151 40965538
3720D0965538J460163J536345J565137J542205J776980K135347K081084K145929
$$ 40965538 42425701 43962046 45527183 47069388 48846368 50981715 53062799 55208728
3712E5208728K489420K651673K547908K766558K723903K755208K668737K349091
$$ 55208728 57698148 60349821 62897729 65664287 68388190 71143398 73812135 76161226
3704G6161226K199694K156114J664994J360707J005330M83844K52849K7278k43472
$$ 76161226 78360920 80517034 82182028 83542735 84548065 85031909 85284758 85312036 85068564
3695H5068564l86111q6662m17473n98512p56868j087508j104590j156163j590557
$$ 85068564 84682453 84595791 84178318 83579806 82822938 81735430 80630840 79474677 77884120
3686G7884120j572241j948075k293750k174622k465062k789845k573435k637419
$$ 77884120 76311879 74363804 72070054 69895432 67430370 64640525 62067090 59429671
3678E9429671k477237k613838k407164k516602k154260k145680j872470j549083
$$ 59429671 56952434 54338596 51931432 49414830 47260570 45114890 43242420 41693337
3670D1693337j510262j511138j404760j238575j075776j033402j122852o37519
$$ 41693337 40183075 38671937 37267177 36028602 34952826 33919424 32796572 32159053
3662C2159053q35034r67347p67791q14509o28789q43473n66076m74582p24867
$$ 32159053 31324019 30356672 29588881 28774372 28145583 27302110 26736034 26261452 25536585
3653B5536585n86267m59813m16328m70516m25657m58805k67017m00043m72088
$$ 25536585 24950318 24490505 24074177 23603661 23178004 22719199 22452182 22052139 21580051
3644B1580051k53694k10899n3157J6192k13654l54086j63820k05944k78875j03222
$$ 21580051 21326357 21115458 21062301 21078493 20864839 20510753 20346933 20140989 19862114 19758892
3634A9758892n1008j8926K8286j04375r3329j8270P5897j71412l3279k0600J71908
$$ 19758892 19707884 19688958 19717244 19612869 19519540 19501270 19577167 19405755 19372476 19351876 19523784
3623A9523784k3850J77607l5700j40337O4815j05622K81300j3107j38534K88666
$$ 19523784 19499934 19677541 19641841 19501504 19566319 19460697 19741997 19728890 19590356 19879022
3613A9879022J18378P3030R2938J96465Q2861K62421J78851N6639o4860K55866
$$ 19879022 19997400 20070430 20163368 20359833 20442694 20705115 20883966 20940605 20875745 21131611
3603B1131611L37680K12180L01537J59644L02237J22682L79775O16551L77832
$$ 21131611 21469291 21681471 21983008 22142652 22444889 22567571 22947346 23563897 23941729
3594B3941729Q4770M01998M03276O83435M86201N02148P04468P97419P11937J262315
$$ 23941729 24026499 24428497 24831773 25515208 26001409 26503557 27208025 28005444 28717381 29979696
3584B9979696J102360J028081P58512O80980K81158O34767N38634N45770P21780
$$ 29979696 31082056 32110137 32868649 33549629 33830787 34465554 35004188 35549958 36271738
3575C6271738O05833M83775M87971N98730L54951N00517O43569K41200J6196J56136
$$ 36271738 36877571 37361346 37849317 38448047 38802998 39303515 39947084 40188284 40204480 40360616
3565D0360616J49664L94681L78420K09058M72319M47374L52968P54502R15339
$$ 40360616 40510280 40904961 41283381 41492439 41964758 42412132 42765100 43519602 44434941
3556D4434941R30641J197893J298128J093655R70966R06959O55365Q71522J011503
$$ 44434941 45365582 46563475 47861603 48955258 49926224 50833183 51488548 52360070 53371573
3547E3371573J239320J200941J909441J689643J692683K129597K090226K197038
$$ 53371573 54610893 55811834 57721275 59410918 61103601 63233198 65323424 67520462
3539F7520462K057552K310568K443437K200360K325498K618469K796617K849155
$$ 67520462 69578014 71888582 74332019 76532379 78857877 81476346 84272963 87122118
3531H7122118K778717K937992L016750L364064L540419L824635L612116M025411
$$ 87122118 89900835 92838827 95855577 99219641 102760060 106584695 110196811 114222222
3523A14222222L653868L698587K944720K417462K391797J979096J215362P97516
$$ 114222222 117876090 121574677 124519397 126936859 129328656 131307752 132523114 133320630
3515A33320630O06445m8303n28937p19392r53726r43138j044988j282281j050034
$$ 133320630 133927075 133878772 133349835 132630443 131676717 130733579 129688591 128406310 127356276
3506A27356276j277276j610895j395407j551864j845146j961081k344578k521939
$$ 127356276 126079000 124468105 123072698 121520834 119675688 117714607 115370029 112848090
3498A12848090k699041l243988l640180l724532l695847l855994l844108l757891
$$ 112848090 110149049 106905061 103264881 99540349 95844502 91988508 88144400 84386509
3490H4386509m032338l856050l564715l565572l330780l282800l032361k594351
$$ 84386509 80354171 76498121 72933406 69367834 66037054 62754254 59721893 57127542
3482E7127542k737505k642303k205814j806228j769945j684732j805757j443034
$$ 57127542 54390037 51747734 49541920 47735692 45965747 44281015 42475258 41032224
3474D1032224j145506j133839j131001r54830r43122r14258q53455o95765n68000
$$ 41032224 39886718 38752879 37621878 36667048 35723926 34809668 33956213 33260448 32692448
3465C2692448n47810l64318l64539l93245k88027k4787l5288j36417k59186j19032
$$ 32692448 32144638 31780320 31415781 31022536 30734509 30709722 30674434 30538017 30278831 30159799
3455C0159799o055J9633j53975n5844J0337Q1836j71961k02173j62769j23152
$$ 30159799 30153744 30173377 30019402 29963558 29973895 30055731 29883770 29681597 29518828 29395676
3445B9395676n51533o21754l49811k55111l44263m87985m44413p25735m80638
$$ 29395676 28844143 28222389 27872578 27617467 27273204 26785219 26340806 25615071 25134433
3436B5134433l13546n02031m15045n31024l55027j87941l97465k26806l41874
$$ 25134433 24820887 24318856 23903811 23372787 23017760 22829819 22432354 22205548 21863674
3427B1863674n11156n46159N5812j26038k72522j78604l14461j52649j27641l18136
$$ 21863674 21352518 20806359 20862171 20736133 20463611 20285007 19970546 19817897 19690256 19372120
3417A9372120q873K7037j00842J9130j54552N1037j56679j32647J65621K02517
$$ 19372120 19363247 19390284 19289442 19308572 19154020 19205057 19048378 18915731 19081352 19283869
3407A9283869j59783q7789P8849J22936j24508P5248M8998P6864K27884P782J52206
$$ 19283869 19124086 19036297 19115146 19238082 19113574 19188822 19237820 19314684 19542568 19550350 19702556
3396A9702556j73285L5090M478k45527Q4744K07772K78314q2857j87517J26526
$$ 19702556 19529271 19564361 19568839 19323312 19408056 19615828 19894142 19811285 19623768 19750294
3386A9750294P3945N9784K15926J2476J62420O1499R5358K93167J56264J05087
$$ 19750294 19824239 19884023 20099949 20112425 20274845 20336344 20431702 20724869 20881133 20986220
3376B0986220J21504K51408J75205J01184L38513K47045K68577K41168J43369
$$ 20986220 21107724 21359132 21534337 21635521 21974034 22221079 22489656 22730824 22874193
3367B2874193K61678L81100L34047N24418L51749J93769M94909J21164O07924
$$ 22874193 23135871 23516971 23851018 24375436 24727185 24920954 25415863 25537027 26144951
3358B6144951N73582L58307N51134O33924N90491N89869N58286O75135P64755
$$ 26144951 26718533 27076840 27627974 28261898 28852389 29442258 30000544 30675679 31440434
3349C1440434N99980O71545O88528N96936L94783M90231Q05342K36896M44835
$$ 31440434 32040414 32711959 33400487 33997423 34392206 34882437 35687779 35924675 36369510
3340C6369510K74105K07407K69243K83702L44097N91484M29706J11139L34882
$$ 36369510 36643615 36851022 37120265 37403967 37748064 38339548 38769254 38880393 39215275
3331C9215275K90865L59072L26844J26420K27012K94510J46933L26024J92975
$$ 39215275 39506140 39865212 40192056 40318476 40545488 40839998 40986931 41312955 41505930
3322D1505930K89419M67265M20458M08889O95641Q10138P53273J185654J092781
$$ 41505930 41795349 42262614 42683072 43091961 43787602 44597740 45351013 46536667 47629448
3313D7629448J096248R29987R31785J087308J190770J545189J400693J265364
$$ 47629448 48725696 49655683 50587468 51674776 52865546 54410735 55811428 57076792
3305E7076792J486844J836727J899658J924526K255038K384618K421689L080437
$$ 57076792 58563636 60400363 62300021 64224547 66479585 68864203 71285892 74366329
3297G4366329L045613L121903L458448L285775L450906L271686L354300L076685
$$ 74366329 77411942 80533845 83992293 87278068 90728974 94000660 97354960 100431645
3289A00431645K740015K843445K583029K228527K080939J826414J576208J523140
$$ 100431645 103171660 106015105 108598134 110826661 112907600 114734014 116310222 117833362
3281A17833362J491162J493807J594358J648503J342653J557875J450287R25693
$$ 117833362 119324524 120818331 122412689 124061192 125403845 126961720 128412007 129337700
3273A29337700R48411R48944P39546O51651K35641J7763m15421n89443r24426
$$ 129337700 130286111 131235055 131974601 132626252 132861893 132879656 132464235 131874792 130950366
3264A30950366r92930r95899j118624r50187j062699j098276j101089r02136q99727
$$ 130950366 129957436 128961537 127842913 126892726 125830027 124731751 123630662 122728526 121828799
3255A21828799r16314r55795j038643q50023j087625j037745j298907j439125
$$ 121828799 120912485 119956690 118918047 118068024 116980399 115942654 114643747 113204622
3247A13204622j578939j807031k243916k878674l108402l734593m006800m107266
$$ 113204622 111625683 109818652 107574736 104696062 101587660 97853067 93846267 89739001
3239H9739001m200330m133359m006586l858250l239853k883293k812289k633769
$$ 89739001 85538671 81405312 77398726 73540476 70300623 67417330 64605041 61971272
3231F1971272j978013j771741j754614j570834j556672j548192j013141q04732
$$ 61971272 59993259 58221518 56466904 54896070 53339398 51791206 50778065 49973333
3223D9973333r95141q95951o72363l13813o27688n99835l53340l8636l8691o1288
$$ 49973333 48978192 48082241 47409878 47096065 46468377 45868542 45515202 45476566 45437875 45376587
3213D5376587P4178k46731k86302j19342l13353n26170m76848j49201l92504j99775
$$ 45376587 45450765 45204034 44917732 44798390 44485037 43958867 43482019 43332818 42940314 42740539
3203D2740539l10081m30172m53800m93577n08965o74594m84352n10863m90125
$$ 42740539 42430458 42000286 41546486 41052909 40543944 39869350 39384998 38874135 38384010
3194C8384010m54259m91755n68436p46544n70749n70214o60625r05405o17681
$$ 38384010 37929751 37437996 36869560 36123016 35552267 34982053 34321428 33416023 32798342
3185C2798342o26411p53555o80522n90854m97023m90261m66900m06389l67094
$$ 32798342 32171931 31418376 30737854 30147000 29649977 29159716 28692816 28286427 27919333
3176B7919333l75064j86216k26663j63121M80m4279k08179K4563j22974j11910
$$ 27919333 27544269 27358053 27131390 26968269 26968749 26924470 26716291 26740854 26617880 26505970
3166B6505970p9788l12339L57463Q8754j66141n5898L7982J24683K88739J83360
$$ 26505970 26426182 26113843 26471306 26560060 26393919 26338021 26376003 26500686 26789425 26972785
3156B6972785J31935K89663J91297M13790L12664M03200M08985L15095J70929
$$ 26972785 27104720 27394383 27585680 27999470 28312134 28715334 29124319 29439414 29610343
3147B9610343R28152O88104N25287P05026P30549P70707Q47038R57733J464918
$$ 29610343 30538495 31226599 31751886 32456912 33187461 33958168 34805206 35762939 37227857
3138C7227857J041179J084404J385149J287066J422371J482973J569921J393019
$$ 37227857 38269036 39353440 40738589 42025655 43448026 44930999 46500920 47893939
3130D7893939J667290J727433J958810J903990J889511K223123K169640K285515
$$ 47893939 49561229 51288662 53247472 55151462 57040973 59264096 61433736 63719251
3122F3719251K594550K740618L053225L542527L363902L848672M109872M135097
$$ 63719251 66313801 69054419 72107644 75650171 79014073 82862745 86972617 91107714
3114I1107714M280144L843308L523315K866189K373746K000010Q70566o4546j062905
$$ 91107714 95387858 99231166 102754481 105620670 107994416 109994426 110864992 110800446 109737541
3105A09737541k331929k989125l680454m266914m762475n341262n103049m853200
$$ 109737541 107405612 104416487 100736033 96469119 91706644 86365382 81262333 76409133
3097G6409133m864779m713059m262433l957289l864116l399893l162165k727330
$$ 76409133 71544354 66831295 62568862 58611573 54747457 51347564 48185399 45458069
3089D5458069k387548k223420j964768j780314j665650j630017j351549j332035
$$ 45458069 43070521 40847101 38882333 37102019 35436369 33806352 32454803 31122768
3081C1122768j178592j216216j116287r33638q83299o68789n07505m95151p54258
$$ 31122768 29944176 28727960 27611673 26678035 25794736 25125947 24618442 24123291 23369033
3072B3369033q32154n53955k90088m73250n78812m20323l90021m97817k78490
$$ 23369033 22536879 21982924 21692836 21219586 20640774 20220451 19830430 19332613 19054123
3063A9054123l16056k85065l05703k18014l44259k20636l54126j10683p837m13139
$$ 19054123 18738067 18453002 18147299 17929285 17585026 17364390 17010264 16899581 16891744 16478605
3053A6478605l51477j34603j98451k1482k28541j06363l840l48701l8329j02082
$$ 16478605 16127128 15992525 15794074 15772592 15544051 15437688 15433848 15085147 15046818 14944736
3043A4944736l84253j53578q5913j69755k49564O0661L1120j13264k19385j82979
$$ 14944736 14560483 14406905 14320992 14151237 13901673 13962334 13993454 13880190 13660805 13477826
3033A3477826j73044j24870M0963k95414m633M5850n6542q3443k16134j71126
$$ 13477826 13304782 13179912 13220875 12925461 12920828 12966678 12910136 12826693 12610559 12439433
3023A2439433J71537O3339j23983L6118j18961J06943J66634j45564P9270k11212
$$ 12439433 12610970 12674309 12550326 12586444 12467483 12574426 12741060 12595496 12674766 12463554
3013A2463554n7241L25956J99805J6092j29633j56368o880j31998J41664J76769
$$ 12463554 12406313 12732269 12932074 12948166 12818533 12662165 12655285 12523287 12664951 12841720
3003A2841720K57011l0777k25673j1710M916J55241l8748O2396K12178K34547
$$ 12841720 13098731 13067954 12842281 12830571 12835487 12990728 12951980 13014376 13226554 13461101
2993A3461101p1319j37820N6953K39971J53065M876J48797J82351N7517J9921
$$ 13461101 13389782 13251962 13308915 13548886 13701951 13706827 13855624 14037975 14095492 14115413
2983A4115413J11554K06581J71752K94584R5895m3521J46927J30276O8651R8689
$$ 14115413 14226967 14433548 14605300 14899884 14995779 14952258 15099185 15229461 15298112 15396801
2973A5396801K89981Q5811q5815K35269K27135J52707O5412M9631N0173k9020
$$ 15396801 15686782 15772593 15686778 15922047 16149182 16301889 16367301 16416932 16467105 16438085
2963A6438085J14614J35429O1167J06990K25782P7670Q0500K78606J01479K16008
$$ 16438085 16552699 16688128 16749295 16856285 17082067 17159737 17240237 17518843 17620322 17836330
2953A7836330J25741R2297J77211K49517L01525P1842J71041L11729J98005L85714
$$ 17836330 17962071 18054368 18231579 18481096 18782621 18854463 19025504 19337233 19535238 19920952
2943A9920952L48574J46218N37020N92265K56640N57508O62016M55889O13785
$$ 19920952 20269526 20415744 20952764 21545029 21801669 22359177 23021193 23477082 24090867
2934B4090867J97305J68001L43997K00343j3253K39111J81109J70762J78505J96757
$$ 24090867 24288172 24456173 24800170 25000513 24987260 25226371 25407480 25578242 25756747 25953504
2924B5953504J70142J78695J88038L43983L74241J36368K74375L76807L34342
$$ 25953504 26123646 26302341 26490379 26834362 27208603 27344971 27619346 27996153 28330495
2915B8330495N40078O89245M71986O04141N87179P23885J029633R10466O37765
$$ 28330495 28870573 29559818 30031804 30635945 31223124 31947009 32976642 33887108 34524873
2906C4524873J072910P01051M15465L75153P70264N73940N248k39535J67866L88260
$$ 34524873 35597783 36298834 36714299 37089452 37859716 38433656 38438904 38199369 38367235 38755495
2896C8755495L75251K15394L85086O24838Q11532Q23947R20300Q57012Q22107
$$ 38755495 39130746 39346140 39731226 40356064 41167596 41991543 42911843 43768855 44590962
2887D4590962J078951J102594J568401J589361J384207J397242J681721J400205
$$ 44590962 45669913 46772507 48340908 49930269 51314476 52711718 54393439 55793644
2879E5793644J745788K297029K118008J939359K313483K266210K074719K495222
$$ 55793644 57539432 59836461 61954469 63893828 66207311 68473521 70548240 73043462
2871G3043462K509926K690804K948282K759270L146755L615904M257242M821756
$$ 73043462 75553388 78244192 81192474 83951744 87098499 90714403 94971645 99793401
2863I9793401N249052N628837O239368O357153N970834M992479L804849K758390
$$ 99793401 105042453 110671290 116910658 123267811 129238645 134231124 138035973 140794363
2855A40794363K504365K287227K796640L003743L819490N200416O652025Q242859
$$ 140794363 143298728 145585955 148382595 151386338 155205828 160406244 167058269 175301128
2847A75301128R670991J1535751J3118156J4720493J6787958J8836628K0483641
$$ 175301128 184972119 196507870 209626026 224346519 241134477 259971105 280454746
2840B80454746K2715013K3672617K2553168J8900140J1869663L000536o010017
$$ 280454746 303169759 326842376 349395544 368295684 380165347 383165883 377155866
2833C77155866j4025207j9680989k2987562k4974588k4735354k3683466k2201057
$$ 377155866 363130659 343449670 320462108 295487520 270752166 247068700 224867643
2826B24867643k0042152j8008439j5908003j4070716j2345720j0826434r403776
$$ 224867643 204825491 186817052 170909049 156838333 144492613 133666179 124262403
2819A24262403q409967p598987o737852o078910n817105n160761m341688m174789
$$ 124262403 115852436 108253449 101515597 95436687 89619582 84458821 80117133 75942344
2811G5942344l849605l565154l120004k883595k776500k453165k350391k410893
$$ 75942344 72092739 68527585 65407581 62523986 59747486 57294321 54943930 52533037
2803E2533037k142950k008715k040711j845872j665878j590878j679879j484500
$$ 52533037 50390087 48381372 46340661 44494789 42828911 41238033 39558154 38073654
2795C8073654j314291j107100j178701j131364j063879j078802p70265p60086
$$ 38073654 36759363 35652263 34473562 33342198 32278319 31199517 30429252 29669166
2787B9669166r30816o01349q93040p88811n64874p97586p29340o59879q73611
$$ 29669166 28738350 28137001 27243961 26455150 25890276 25092690 24363350 23703471 22829860
2778B2829860m44695p36011n86617m52786n76828m96514m05621l42875m61569
$$ 22829860 22385165 21649154 21062537 20609751 20032923 19536409 19130788 18787913 18326344
2769A8326344m94544k07846n05111m18064j23237m00814k67147k58248k30476
$$ 18326344 17831800 17623954 17118843 16700779 16577542 16176728 15909581 15651333 15420857
2760A5420857j61903l11506l43302j94750l76555l53608l40628l66090m64431
$$ 15420857 15258954 14947448 14604146 14409396 14032841 13679233 13338605 12972515 12508084
2751A2508084l94962j37138j7022m06022k18533l21020k95465n81685k00500j11096
$$ 12508084 12113122 11975984 11958962 11552940 11334407 11013387 10717922 10136237 9935737 9824641
2741I824641k46475j13911l24057k06101j84558k47279k52030j70664l06414j63531
$$ 9824641 9578166 9464255 9140198 8934097 8749539 8502260 8250230 8079566 7773152 7609621
2731G609621j60550m1544k97178j24923o7053k32340r4950n7253n2171q6418j06868
$$ 7609621 7449071 7407527 7110349 6985426 6918373 6686033 6591083 6533830 6481659 6395241 6288373
2720F288373P6429O5390l17381k88632n3099j09878l26422j64225Q7318p9641
$$ 6288373 6364802 6430192 6112811 5824179 5771080 5661202 5334780 5170555 5257873 5178232
2710E178232k37688j48354j59836N0724j94412k88633Q1561q5431o108p9512k13215
$$ 5178232 4940544 4792190 4632354 4683078 4488666 4200033 4281594 4196163 4190055 4110543 3897328
2699C897328J38769k51803k28604J15136J61337K617k03830O4620j50624p019
$$ 3897328 4036097 3784294 3555690 3670826 3832163 3834780 3630950 3695570 3544946 3537927
2689C537927K5848J11191q1930j02018m9440m1531J6036r8356K4728J65950L3665
$$ 3537927 3563775 3674966 3593036 3491018 3441578 3400047 3416083 3317727 3342455 3508405 3542070
2678C542070j27217r4444J30111o7971L8679r6856j20389m7226k22851J02294
$$ 3542070 3414853 3320409 3450520 3382549 3421228 3324372 3203983 3156757 2933906 3036200
2668C036200L5720k4463J64782k20930j24903K27808j39940N9330j43867j94648
$$ 3036200 3071920 3047457 3212239 2991309 2866406 3094214 2954274 3013604 2869737 2675089
2658B675089K59370j70541j37009J89110k69742l2725j0419K6920L5313M4056
$$ 2675089 2934459 2763918 2626909 2816019 2546277 2513552 2503133 2530053 2565366 2609422
2648B609422N2415j04447r8496R395M3433J3665j26933N1891j50904j48398N9636
$$ 2609422 2661837 2557390 2458894 2468289 2511722 2525387 2398454 2450345 2299441 2151043 2210679
2637B210679j00171j67299M5513j9485l4252o1725R0844k7121J31570j32386p4066
$$ 2210679 2110508 1943209 1988722 1969237 1934985 1873260 1964104 1936983 2068553 1936167 1862101
2626A862101K52972N6308j27649o9127J60509m6575k22300L4092j0854j2651K3372
$$ 1862101 2115073 2171381 2043732 1974605 2135114 2088539 1866239 1900331 1889477 1876826 1900198
2615A900198o9029j97856o6031L3327M9031m6520Q1889o9159j99573J26394l3506
$$ 1900198 1831169 1633313 1567282 1600609 1649640 1603120 1685009 1615850 1416277 1542671 1509165
2604A509165J13324o2838p2142n4398J37215R3774J60359N2558j77975o7709K19668
$$ 1509165 1622489 1559651 1487509 1433111 1570326 1664100 1824459 1877017 1699042 1631333 1851001
2593A851001M1018o6698r0540p0728P6141q6872P0709K06689j41305k68025k97258
$$ 1851001 1892019 1825321 1734781 1664053 1740194 1653322 1724031 1930720 1789415 1521390 1224132
2582A224132K45595L29506l8134j28422J873M482N4149N973m5270q2626J49534
$$ 1224132 1469727 1799233 1761099 1632677 1634550 1639032 1693181 1699154 1653884 1571258 1720792
2571A720792j61053j3265K86817P5341n8147J11031J99907o7783l0204j86451
$$ 1720792 1559739 1546474 1833291 1908632 1850485 1961516 2161423 2093640 2063436 1876985
2561A876985J41575J9850J74381J42790Q9632J80054o1029R1471n045K8030n4959
$$ 1876985 2018560 2038410 2212791 2355581 2445213 2625267 2564238 2655709 2650664 2678694 2623735
2550B623735j97501P4968l6655j49678j2734j3371n16826m8185R0327r1351L3481
$$ 2623735 2426234 2501202 2464547 2314869 2302135 2288764 1771938 1723753 1814080 1722729 1756210
2539A756210l3460j97487p8927L8344l53770n4155j86263J74106Q9875J4442r126
$$ 1756210 1722750 1525263 1446336 1484680 1130910 1076755 890492 1064598 1154473 1168915 1159789
2528A159789k46983k01822J9257J77841l0154k5049J36607R4393j94919j90771
$$ 1159789 912806 710984 730241 908082 877928 852879 989486 1083879 888960 698189
2518F98189j4841o6453J37690R8779j64314M9749q097j32133j20644K01744K449
$$ 698189 683348 616895 754585 853364 689050 738799 730702 598569 477925 679669 682118
2507F82118R1285m2771K0583J7792J01865K282j00110r6258j24395N4898o5368
$$ 682118 773403 730632 751215 769007 870872 873154 773044 676786 552391 607289 541921
2496E41921j4297j85017j14252J14999J80859L162J33554o9316p06n4826j03532
$$ 541921 527624 342607 228355 343354 524213 527375 660929 591613 590907 536081 432549
2485D32549j43170J673J38217R6038J9526P7594j51700p4832O8644K04581k17157
$$ 432549 289379 291052 429269 525307 544833 622427 470727 395895 464539 669120 451963
2474D51963r9525n2717k61R4742N0498o7777j43026K7780o757l0335q8005J99612
$$ 451963 352438 299721 299460 394202 444700 376923 233897 261677 254920 224585 136580 336192
2462C36192j25415J6632R6050J90405k25879J34128p714m9297j06781q2898o4689
$$ 336192 210777 227409 323459 513864 287985 422113 414399 365102 258321 175423 110734
2451A10734j16718J46235J52743J7245Q9839M5355j12265R8700K5236j55351j15507
$$ 110734 -5984 140251 292994 310239 400078 445433 333168 431868 457104 301753 186246
2440A86246K14761j08572j2130p6429L6987L5560M4901j57767k03522K16497P9475
$$ 186246 401007 292435 280305 203876 240863 276423 321324 163557 -39965 176532 256007
2429B56007p2511P0216K35783k43853l7998R7871j62213J12528J60759l8800j0957
$$ 256007 183496 253712 489495 245642 207644 305515 143302 255830 416589 377789 366832
2418C66832m3252M8880j12781P9171J4969k29318p9859J91207o2956K2911J11884
$$ 366832 323580 372460 259679 338850 353819 124501 44642 235849 172893 195804 307688
2407C07688j52366k4823J97591p9580j22392J97044n3820j39211j87313J80360
$$ 307688 155322 130499 328090 248510 126118 323162 269342 130131 -57182 123178
2397A23178L7052M2527O2964j40926k2691O710Q3890P7620j24341J4803K47999
$$ 123178 160230 202757 265721 124795 102104 108814 192704 270324 145983 160786 408785
2386D08785N812K9300m00187N2271Q260P8689J93500r8881Q9138l7481J9703m35
$$ 408785 414597 443897 43710 95981 104241 182930 376430 277549 366687 329206 348909 348474
2374C48474n7325J63842R3445P8467j91459o2302J03848j69998J32331j78010
$$ 348474 291149 454991 548436 626903 435444 373142 476990 306992 439323 261313
2364B61313J75308J25314j77561j33866J1727K2503k39705K72540m2496j49342
$$ 261313 436621 561935 384374 250508 262235 284738 45033 317573 275077 125735
2354A25735N7934j50781J24727L2263J76864O8408N1955k30932O1960J04655k52443
$$ 125735 183669 32888 157615 189878 366742 435150 487105 256173 318133 422788 170345
2343A70345m6192P4462j35430K9953J53736J3364j2187r9412J00326N5976j95831
$$ 170345 124153 198615 63185 93138 246874 260238 248051 148639 248965 304941 109110
2332A09110K00832j15598K07740J3836j99143j55551r9626O2275L2216J74137
$$ 109110 309942 194344 402084 415920 216777 61226 -38400 23875 56091 230228
2322B30228Q169K7553Q4791J26356k1350q022k13143K217K0813k2803R3413R6005
$$ 230228 238397 265950 350741 477097 455747 447725 234582 236799 257612 234809 328222 424227
2310D24227J24899O692q6773k67014n3779P2566j13670L7980J25967J41563l24510
$$ 424227 549126 555818 469045 202031 148252 220818 107148 145128 271095 412658 88148
2299H8148K51443k6261j83769j7438J73380L0049j16179n3187r5720K22583l6132
$$ 88148 339591 313330 129561 112123 285503 315552 199373 146186 50466 273049 236917
2288B36917K03182J10509j57149r8235J70566O2078j45453J8103j22434O7813
$$ 236917 440099 550608 393459 295224 465790 527868 382415 400518 278084 345897
2278C45897n7114l7269P9719k0368n5272L51593o1312m41275J26646K04778k02132
$$ 345897 288783 251514 331233 310865 255593 607186 545874 104599 231245 436023 233891
2267B33891q3293R6369M4591O7220j19853p2504j3941J29045L9871J14599m8130
$$ 233891 150598 246967 291558 358778 238925 166421 152480 281525 321396 435995 387865
2256C87865m3574k1320l5961P7497J25457q0570R7915J32579p7039J93680k110
$$ 387865 344291 322971 287010 364507 489964 409394 507309 639888 562849 756529 754419
2245G54419N8744L5492k42896M9482Q8736j4344l7684j4740k6955n6725L7293
$$ 754419 813163 848655 605759 655241 743977 729633 691949 677209 650254 593529 630822
2234F30822P0535m4644J47920r254P1099k22754o291J2332J6533J6632o4499L5631
$$ 630822 701357 656713 804633 795379 866478 643724 637433 649765 666298 682930 618431 654062
2222F54062K3702o7410n9462L7845P2277K9058k1532o6650j0117L43478q9427
$$ 654062 677764 610354 550892 588737 661014 690072 668540 601890 591773 935251 845824
2211H45824p4670J75612R3985q6017J7547p1199N1593J52324Q4019P7727j09166
$$ 845824 771154 946766 1040751 954734 972281 901082 952675 1104999 1189018 1266745 1157579
2200A157579n851J19730Q0424Q5887k7682k11561k43953P3828J45385K7097K15439
$$ 1157579 1151728 1271458 1351882 1437769 1410087 1198526 954573 1028401 1173786 1200883 1416322
2189A416322m1625p7825K4147l9823K05881K1529O7489j44499K00111Q9555j67635
$$ 1416322 1374697 1296872 1321019 1281196 1487077 1508606 1576095 1431596 1631707 1721262 1553627
2178A553627J46080j3934j35272j8909J41808K2885m7054q059Q1692O3448L377
$$ 1553627 1699707 1685773 1550501 1531592 1673400 1696285 1649231 1641172 1722864 1786312 1789689
2167A789689M8181N497K01523k6066J86437R8452j14429q4753J69614J13173j5221
$$ 1789689 1837870 1843367 2044890 2018824 2205261 2303713 2189284 2104531 2274145 2387318 2372097
2156B372097K44426k2848J7761j16374J00019J18374K24217J79158K8662J93398
$$ 2372097 2616523 2593675 2611436 2495062 2595081 2713455 2937672 3116830 3145492 3338890
2146C338890K49789J002o8969J93198K40814J33150J97655L12921J21112L07306
$$ 3338890 3588679 3589681 3520712 3713910 3954724 4087874 4285529 4598450 4719562 5026868
2136E026868K61217n6442P2154K57856K68923L24276J38527K45069L86053N79333
$$ 5026868 5288085 5231643 5303797 5561653 5830576 6154852 6293379 6538448 6924501 7503834
2126G503834K83197N45286O95357L96481O82843R35581P48910P15591R73010J114106
$$ 7503834 7787031 8332317 9027674 9424155 10106998 11042579 11791489 12507080 13480090 14594196
2116A4594196J153119J485369J919710J900767K020871K787813L833224M965162
$$ 14594196 15747315 17232684 19152394 21053161 23074032 25861845 29695069 34660231
2108C4660231O823569R424076J0233127O649385L43530m538075n397591o965772
$$ 34660231 41483800 50907876 61141003 67790388 68133918 63595843 58198252 51232480
2100E1232480q101029p005602n284652m174143l757960k904355k295646j727836
$$ 51232480 43131451 36125849 30841197 26667054 22909094 20004739 17709093 15981257
2092A5981257j219041r24672q10560q30825p38383q58322q63228q35564o39691
$$ 15981257 14762216 13837544 13026984 12196159 11457776 10599454 9736226 8900662 8260971
2083H260971m39628n87743o58053k51429j66687l89843m70844j39826j12236k52782
$$ 8260971 7821343 7233600 6575547 6324118 6157431 5767588 5296744 5156918 5044682 4791900
2073D791900k99861k57457k69389m23845j28284j7363k66978j5872j82309k76787
$$ 4791900 4492039 4234582 3965193 3541348 3413064 3395701 3128723 3112851 2930542 2653755
2063B653755j80833Q2275m7868l07491j50717M0982N1862j91424K37233k72650
$$ 2653755 2472922 2555197 2507329 2199838 2049121 2090103 2141965 1950541 2187774 1915124
2053A915124Q23k8951j05806M5253o2780J5031k02186j01229r2324R5186o2857
$$ 1915124 1915947 1886996 1781190 1826443 1763663 1778694 1576508 1475279 1382955 1478141 1415284
2042A415284k52324J0692R799j4782q9320K26435J37026n7928j99690k9850j66436
$$ 1415284 1162960 1173652 1183451 1168669 1079349 1305784 1442810 1384882 1185192 1155342 988906
2031I88906J6357J43316k57447N9812j04683k9884O4791M0190j94914r2305J26261
$$ 988906 1005263 1148579 891132 950944 846261 816377 881168 921358 726444 634139 760400
2020G60400j00071M0433N9498o639L5057j19887j40042k4327j53785J3397k00
$$ 760400 660329 700762 760260 753621 788678 668791 528749 504422 350637 364034 363834
2009C63834J11201r758N2987r393M513K0040K6729l5755l622J38719k0872l1469
$$ 363834 475035 465277 518264 508871 513384 533424 560153 524398 520776 659495 638623 607154
1997F07154l26879j18458r429K0032n7797M7578J41367K3003j94667O9734j9943
$$ 607154 280275 161817 152388 172420 114623 162201 303568 326571 131904 201638 181695
1986A81695K44885R8434r8802j11136p0839J85643o5358p3422P7798P59l6125
$$ 181695 426580 525014 426212 315076 244237 429880 364522 291100 368898 369657 333532
1975C33532j2296J49917j55315j50371P5099j47130k3446L6575O5110M7948m0168
$$ 333532 321236 471153 315838 165467 240566 93436 69990 106565 171675 219623 179455
1964A79455n5860m3167l1040J37892K1097j04154P1353J09736j05754J90K5165
$$ 179455 123595 80428 49388 187280 208377 104223 175576 285312 179558 179748 204913
1953B04913M8648j15k45961j57798J42060o134J70090J9998j02651k342R558J64420
$$ 204913 253561 253446 7485 -150313 -8253 -14387 155703 175701 73050 70708 80266 244686
1941B44686j38230o9325J81892l2867j33662N2538J0767j9522j36713N8682J10742
$$ 244686 106456 37131 219023 186156 52494 105032 115799 96277 -40436 18246 128988
1930A28988L1725O2211j75072L9411L1877k16237J04642J3934j86565J1650J16961
$$ 128988 160713 222924 47852 87263 119140 -97097 7545 21479 -165086 -153436 -36475
1919c6475K35896P3803k2137j88791j37204M737j4851N1169J7474k4328K02923
$$ -36475 199421 273224 251087 62296 -74908 -70171 -85022 -33853 -16379 -40707 162216
1908A62216q9332q5318K2522j13084N276Q3275J27093n8545j55890k9991J9394
$$ 162216 72884 -12434 10088 -102996 -97720 -14445 112648 54103 -101787 -131778 -112384
1897a12384K05736M7308q5217J59311j13412k33993N9599M0710P7306o0906p8927
$$ -112384 93352 140660 55443 214754 101342 -132651 -73052 -32342 44964 -15942 -94869
1886i4869j8818J2970l0722M0597j52202l4676J61479o6499J99857K2277j96636
$$ -94869 -113687 -100717 -131439 -90842 -243044 -277720 -116241 -182740 17117 39394 -157242
1875a57242J09260j4440j03366J65981j09678j05081j2488j8817j0492P7460R7318
$$ -157242 -47982 -62422 -165788 193 -109485 -214566 -227054 -245871 -256363 -178903 -81585
1864h1585K7066M9p9451J38330K5737o4597Q2012J11268j30779Q9453J4610k06418
$$ -81585 -54519 -54470 -133921 4409 30146 -34451 47561 158829 28050 117503 132113 -74305
1852g4305J37751Q741K04645p7136k11791m7101J65393M7860k50295M7069J38097
$$ -74305 63446 72187 276832 199696 -12095 -59196 106197 154057 -96238 -49169 88928
1841H8928m4471M4295M0043K7441j21697J6162L03561j11004O9346M075p7199
$$ 88928 44457 88752 128795 156236 34539 50701 354262 243258 312604 316679 239480
1830B39480N8268k10973j99300J97149K6005j39271J38320q5887P3433j8716j96889
$$ 239480 297748 86775 -112525 84624 110629 -28642 109678 23791 97224 78508 -118381
1819a18381l3962K1118j42905q0371o7081N2009J10262p8105L25996p6480m5948
$$ -118381 -152343 -131225 -274130 -354501 -421582 -369573 -259311 -337416 -11420 -87900 -133848
1808a33848J21431o7839k4631m4011r3549J57680M3033J6841J6836J97454j15590
$$ -133848 -12417 -80256 -104887 -148898 -242447 -84767 -41734 -24893 -8057 189397 73807
1797G3807l33240O6054L4787M3594N4500J27090k48246j37370J98860M5260m3917
$$ 73807 -259433 -193379 -158592 -114998 -60498 66592 -181654 -319024 -120164 -74904 -118821
1786a18821O8847o919M0031j1023j19422l7735R8855j87836M0535j29204J46296
$$ -118821 -49974 -56893 -16862 -27885 -147307 -185042 -86187 -274023 -233488 -362692 -216396
1775b16396k51778K1190J22229K72252P7513J1361o9994r5800K89506o8495k54018
$$ -216396 -468174 -446984 -324755 -52503 25010 36371 -33623 -129423 160083 91588 -162430
1764a62430R7950J04064j18592j52151J19028M048l5834R6919j04630J09151k5817
$$ -162430 -64480 39584 -79008 -231159 -112131 -108083 -143917 -46998 -151628 -42477 -68294
1753f8294j6139N5531K9179N6059p992L4024k6600j02955M6811j49028J07324
$$ -68294 -84433 -28902 277 56336 48344 82368 55768 -47187 -376 -149404 -42080
1742d2080q2845n4602k817J20410J02766j28503l0767P2570n004j19507j50857
$$ -42080 -124925 -179527 -182344 -61934 40832 -87671 -118438 -45868 -50872 -170379 -321236
1731c21236L24689q9133l9810Q8271j73261j18680M5257j45021N1041K21058K3831
$$ -321236 3453 -85680 -125490 -37219 -210480 -329160 -283903 -428924 -377883 -156825 -132994
1720a32994j67032k1004P469J01743l7144L650J09427L0725j06231M9046l614
$$ -132994 -300026 -321030 -313561 -211818 -248962 -245312 -135885 -105160 -211391 -162345 -165959
1709a65959R1370Q3367k13608J37902J20480J52187j57168r4948n8611m4699k3648
$$ -165959 -74589 8778 -204830 -66928 53552 205739 48571 -46377 -104988 -149687 -173335
1698a73335L1151j6922j9769R2003j65132J30732j9824J13703j06392j529K85611
$$ -173335 -142184 -159106 -178875 -86872 -252004 -121272 -141096 -27393 -133785 -135314 150297
1687A50297j53102j64744N5092J78848k32737j06063N4248m9331J34176J45127
$$ 150297 -2805 -167549 -112457 66391 -166346 -272409 -218161 -267492 -133316 11811
1677A1811q8176J34775J83226k91181l4746m0179R0889Q7371K7295m0748j83393
$$ 11811 -76365 58410 241636 -49545 -84291 -124470 -33581 53790 81085 40337 -143056
1666a43056q0361r410k2495L8146J93717N684j41273P3291M8068l1181j2624o986
$$ -143056 -223417 -232827 -255322 -217176 -23459 -17775 -159048 -85757 -37689 -68870 -81494 -88480
1654h8480N6800L2633O9060J408J21930j26371j64324N0037q189k5487j9926M4905
$$ -88480 -31680 953 70013 71421 193351 66980 -97344 -47307 -55496 -80983 -100909 -56004
1642e6004M6575J70280m5080p4964J5758r9103J69872j8471k43171n5916K49679
$$ -56004 -9429 160851 115771 40807 56565 -42538 127334 108863 -134308 -190224 59455
1631E9455k9856j09733k1558R9654p9257K7987M9830j5109j21509r9173J13046
$$ 59455 29599 -80134 -101692 -2038 -81295 -53308 -3478 -18587 -140096 -239269 -126223
1620a26223J69877j0704J5832j46789j8571J23356k74845o5142K61605q5444j0214
$$ -126223 43654 32950 48782 -98007 -116578 6778 -268067 -333209 -71604 -157048 -167262
1609a67262l6550N2354R9299N7175J33738k85319J0864K0313q882N2624q218N4192
$$ -167262 -203812 -151458 -52159 5016 138754 -146565 -135701 -115388 -124270 -71646 -79864 -25672
1597b5672K8549Q6359j28554k35166J80044J48267l9660j37608N2037P8448o1052
$$ -25672 2877 89236 -39318 -274484 -94440 53827 14167 -123441 -71404 7044 -54008
1586e4008J653O7719P9236k88638R4972J34531L568m2814n1574N556m552N5101
$$ -54008 -52355 15364 94600 -194038 -99066 35465 39033 -3781 -55355 -49799 -54351 750
1574G50p4541o3271m0269R6471L6421j390J00565p8728j07404Q4259M814q2688
$$ 750 -73791 -137062 -177331 -80860 -44439 -45829 54736 -23992 -131396 -47137 -42323 -125011
1562a25011J63961m7056j57026N8251j32457J1534J87525k22166n3300L03742
$$ -125011 38950 -8106 -165132 -106881 -239338 -227804 -40279 -262445 -315745 -12003
1552a2003K2212P788O2045r5239r51k38783j49369K40278N6452m5784N6844j79735
$$ -12003 10209 17997 80042 -15197 -16148 -254931 -404300 -164022 -107570 -153354 -96510 -276245
1540b76245K87557j27173K9920J77396r0890j0006k1311r1516n8375j13Q5048
$$ -276245 11312 -115861 -85941 91455 565 -9441 -30752 -122268 -180643 -180756 -95708
1529i5708K98675J01459o0385k21644j36322o2738j49711M4731L4687M4367J00982
$$ -95708 202967 304426 244041 22397 -113925 -176663 -326374 -281643 -246956 -202589 -101607
1518a01607j37695K19691j40621j84618K66463j03571N8842K9025k3959K18202
$$ -101607 -239302 -19611 -160232 -344850 -78387 -181958 -123116 -94091 -118050 100152
1508A00152L6572J9668j93010j11151p1746L9222r9493J59412P4788J20722j66145
$$ 100152 136724 156392 -36618 -147769 -219515 -180293 -279786 -120374 -45586 75136 -91009
1497i1009k48587R4409J75870o6049J94786N48J0162m5982o4259j48076J97684
$$ -91009 -339596 -245187 -69317 -135366 59420 59968 70130 24148 -40111 -188187 9497
1486I497M7165M656p3062q7972J11838j5922m4864j64350n2881o2467P991J59957
$$ 9497 56662 61318 -11744 -99716 12122 -3800 -48664 -213014 -265895 -328362 -320371 -160414
1474a60414P5818J11128j10352Q1386R2406J3729q3266j14094j48953J13679K29580
$$ -160414 -84596 26532 -83820 -2434 89972 103701 20435 -93659 -242612 -128933 100647
1463A00647j20629Q9972j30309J55907k4126m5447n5120j13862L4051J91223p6396
$$ 100647 -19982 69990 -60319 95588 71462 26015 -29105 -142967 -108916 82307 5911
1452E911J06899j42476n5703J42666L2434L5011j23201l7381K9994P7091K25387
$$ 5911 112810 -29666 -85369 57297 89731 124742 1541 -35840 -5846 71245 296632
1441B96632p4512n6411k69101k05967R6705J51494R980N8453Q1494r6341O180
$$ 296632 222120 165709 -103392 -309359 -212654 -61160 -51180 7273 88767 -7574 -1394
1430a394M4163j9915j11122J50271j67394P160O3171q41O9818m5084j15365J86406
$$ -1394 42769 22854 -88268 62003 -105391 -98231 -35060 -35901 33917 -11167 -126532 59874
1418E9874n4005j04118j48797J94157Q2932j30330M7349P422j38012J29180J35842
$$ 59874 5869 -98249 -247046 -52889 30043 -100287 -52938 -45516 -183528 -54348 81494
1407H1494l07030J08248J22524r418j86347n7202J76833J25928k88173Q6624J73244
$$ 81494 -225536 -117288 5236 -4182 -190529 -247731 -70898 55030 -233143 -146519 26725
1396B6725k0788j77221K03023p1323k1645J06949n8095O4067q429q9640J07108
$$ 26725 5937 -171284 31739 -39584 -61229 45720 -12375 51692 43263 -46377 60731
1385F0731J50009r4246k13617K8782J30528o8641M9143P7036J043p4953n4144
$$ 60731 210740 116494 -97123 -68341 62187 -6454 42689 119725 120768 45815 -8329
1374h329l7539P975J02615j92466n7219J14149p2527o148K5838k12478o9741J84379
$$ -8329 -45868 -37893 64722 -127744 -184963 -70814 -143341 -149489 -123651 -336129 -405870 -221491
1362b21491L00039L3715k375j62326l6550n3792M2065P5833m3717J126J0828J55026
$$ -221491 78548 112263 109888 -52438 -88988 -142780 -100715 -24882 -68599 -67473 -56645 98381
1350I8381j07374n5956M382m9415L4762R3668P0269m6063K2644J1184k46106m0750
$$ 98381 -8993 -64949 -60567 -109982 -75220 18448 88717 42654 65298 76482 -169624 -210374
1338b10374J46948P8058J8786p8766n1699j51805J57828L1690r4051K8987J38423
$$ -210374 -63426 14632 33418 -45348 -97047 -248852 -91024 -59334 -153385 -124398 14025
1327A4025j19220n6673K36434l7107N9492k79927k4797J30882J48588j94364k8946
$$ 14025 -105195 -161868 74566 37459 96951 -182976 -207773 -76891 71697 -122667 -151613
1316a51613j5528Q3366J65069o8687j78145O1603l713N5855K05915L7427J7226
$$ -151613 -167141 -83775 81294 12607 -165538 -103935 -107648 -51793 154122 191549 208775
1305B08775j78100m6453Q4224j35802p5312q7721P4834l0273Q7385N7406j46957
$$ 208775 30675 -15778 68446 -67356 -142668 -230389 -155555 -185828 -98443 -41037 -187994
1294a87994K62544q8190n6527r8488m3740L4201K15813M8446m0198r5102O0328
$$ -187994 74550 -13640 -70167 -168655 -212395 -178194 37619 86065 45867 -49235 11093
1283A1093j42295j16011J71768l0023K28308k36770k3592P599K09551R5183k34097
$$ 11093 -131202 -247213 -75445 -105468 122840 -113930 -137522 -129923 79628 174811 -59286
1272e9286J80412K42243l65336j41500K00731o5668K2805L5556J17544J22817
$$ -59286 121126 363369 -1967 -143467 57264 -8404 14401 49957 167501 290318
1262B90318k40921j44787J58355P2690k46819K00984J35577j91496k57913Q2305
$$ 290318 49397 -95390 62965 135655 -111164 89820 225397 33901 -224012 -141707
1252a41707j23936j5813J08464J11191K08560q5643q0087l6389J15714j04214
$$ -141707 -265643 -281456 -172992 -61801 146759 61116 -18971 -55360 60354 -43860
1242d3860j65963J71236J8672j16567K6905K6187q7689M0725K4811L3350J23002
$$ -43860 -209823 -38587 -19915 -136482 -109577 -83390 -171079 -130354 -105543 -72193 50809
1231E0809k30769j25103R7720J69515J46140J0171m4713M372r849k85119J06318
$$ 50809 -179960 -305063 -207343 -37828 108312 118483 73770 78142 68293 -216826 -110508
1220a10508P9000P9534m3492j73653k484Q9910O6557k5783O0441j66943J2324
$$ -110508 -31508 48026 4534 -169119 -171603 -81693 -15136 -40919 19522 -147421 -135097
1209a35097k626K01631J1404M5902j30552J01905k54733J19972N2030J16085j70549
$$ -135097 -137723 63908 75312 121214 -9338 92567 -162166 -42194 9836 125921 -44628
1198d4628j13754O8706j62911J7468L7919K1603o464K39899P4858L9666J4853
$$ -44628 -158382 -89676 -252587 -235119 -197200 -175597 -182061 57838 132696 172362 187215
1187A87215k89383j15103J46546L3876J3089j0593q1638J3029J90984q7280l1678
$$ 187215 -102168 -217271 -70725 -36849 -23760 -34353 -115991 -102962 88022 742 -30936
1176c0936J49461R9286p2723o1361N5875q0266k25980N0714j33028q8961J05050
$$ -30936 118525 217811 145088 83727 139602 59336 -166644 -115930 -248958 -337919 -232869
1165b32869J13858j66484J22224J4640N3565j163m442K66509J456l1673K6353
$$ -232869 -119011 -285495 -163271 -148631 -95066 -96229 -100671 165838 167294 135621 161974
1154A61974O7927j52882J43331j21241j01875J31681k4506K1495J19742o5631
$$ 161974 229901 77019 220350 99109 -2766 128915 104409 125904 245646 180015
1144A80015J51507J6017q0696j99444L6844j02234j2988P9732n5247l2295k8974
$$ 180015 331522 347539 266843 67399 104243 2009 -10979 68753 13506 -18789 -47763
1133d7763k8027L8332n1550o8292R9162J6425J07526j32267J99465O7422j15394
$$ -47763 -75790 -37458 -89008 -157300 -58138 -41713 65813 -66454 133011 200433 85039
1122H5039J7292n7023m833n2307p7590J48406m0930o5649j52549J28878r4570
$$ 85039 102331 45308 40475 -11832 -89422 58984 18054 -47595 -200144 -71266 -165836
1111a65836q8634K03369M2181j56733K03747K0516o6564J26000j1619M0636l97840
$$ -165836 -254470 -51101 -8920 -165653 38094 58610 -7954 118046 106427 147063 -250777
1100b50777R863r254Q5858j0658O6070J6625K03818j73132j5331J9700j69186
$$ -250777 -240914 -250168 -164310 -174968 -108898 -92273 111545 -61587 -76918 -57218 -226404
1089b26404J05480J6429J16225n1218m8007Q3228J35738j09897J00604j33299
$$ -226404 -120924 -104495 11730 -39488 -87495 -4267 131471 21574 122178 -11121
1079a1121j86151m3805K35302l6853K4078K7188J33267p8069R9851J72288j13732
$$ -11121 -197272 -241077 -5775 -42628 -18550 8638 141905 63836 163687 335975 222243
1068B22243M2142K0353k59949j31957o7205J66208k9825L0264K19630p2270j58275
$$ 222243 264385 284738 24789 -107168 -174373 -8165 -37990 -7726 211904 139634 -18641
1057a8641l0648k7409O4122j13671K4688J05636r6009o2153n6583K15280q890
$$ -18641 -49289 -76698 -12576 -126247 -101559 4077 -91932 -154085 -210668 4612 -4278
1046d278K06380j56825k4506J95095j92292l6116N120k03040M8703Q2981L9537
$$ -4278 202102 45277 20771 215866 23574 -12542 -7422 -210462 -161759 -78778 -39241
1035c9241n749L7709J46424L1092J4553k00876J02357K23808k01798j31034P2891
$$ -39241 -44990 -7281 139143 170235 184788 -16088 86269 310077 108279 -22755 50136
1024E0136n7746l2500J30754r7147J3325o4529O5322k23415l423K75480j62385
$$ 50136 -7610 -40110 90644 -6503 6822 -57707 7615 -215800 -219223 56257 -106128
1013a06128j60098J52971R7428o952K69746m4531m025j11709k3489q0414k903
$$ -106128 -266226 -113255 -15827 -22779 246967 202436 198411 86702 63213 -17201 -20104
1002b0104n228J18477j56005J73607N1522q2311j7245k70544L05391r1861J6106
$$ -20104 -25332 93145 -62860 110747 162269 79958 62713 -207831 97560 5699 21805
991B1805o9093L458r3437K71774P929m0432Q6252j50768j36536N5046J16133j76470
$$ 21805 -47288 -43830 -137267 134507 142436 102004 188256 37488 -99048 -44002 72131 -104339
979a04339O6823J02968l5296m9753j33851P0752K57121k71051J24098O1304K1879
$$ -104339 -37516 65452 30156 -19597 -153448 -82696 174425 -96626 27472 88776 110655
968A10655n8583R3806O8672j66844o1411j8375P0949J48008j24205r9632L1529
$$ 110655 52072 145878 214550 47706 -13705 -32080 38869 186877 62672 -36960 -5431
957e431j04967p6613Q3673K3446M9093O4378J7400N8394j22394L3462m949J02778
$$ -5431 -110398 -187011 -103338 -79892 -30799 33579 50979 109373 -13021 20441 15492 118270
945A18270j32206R2181j21526P750M3262J8852o9660J17324N3538n3445p3589
$$ 118270 -13936 78245 -43281 -35531 7731 26583 -43077 74247 127785 74340 751
934G51j12665J91390J7972P5011K9650j36579j57296J35377J29196N2762j15965
$$ 751 -111914 79476 97448 172459 202109 65530 -91766 43611 172807 225569 109604
923A09604L9333J12768L1254l1544o6859k1397j39616n9561M6749k291r9319r3353
$$ 109604 148937 261705 292959 261415 194556 173159 33543 -26018 20731 18440 -80879 -174232
911a74232J15418K8288M7803N368o053R8983k36684n2202M6758P5604Q6090j2374
$$ -174232 -58814 -30526 17277 22645 16592 115575 -121109 -173311 -126553 -50949 35141 22767
899B2767k47861M4944k0679J82043J8622M4140j6190j7951l5038J24809J17797
$$ 22767 -225094 -180150 -200829 -18786 -164 43976 27786 9835 -25203 99606 217403
888B17403l11588k64919K47404K65669k9767j36758j79981K81540j52758r2592
$$ 217403 -94185 -359104 -111700 153969 124202 -12556 -192537 89003 -63755 -156347
878a56347k3082J84048j659Q8150J3263n4086k3520j3171P3192m442j07055N5227
$$ -156347 -179429 4619 2960 91110 104373 50287 26767 13596 86788 82346 -24709 30518
866C0518K9061P0495L7002l4313q4009q0720R2420q6772n8323J23264k16797J91863
$$ 30518 59579 130074 167076 132763 48754 -31966 60454 -26318 -84641 38623 -178174 13689
854A3689J82886j11123j00815n7064O9910o484L205j40038p5657N2834N0435R6217
$$ 13689 196575 85452 -15363 -72427 -2517 -9001 -5796 -145834 -221491 -168657 -118222 -22005
842b2005P0702J97284j89112M500N7067J71471j08853q6840J03350j71726M2462
$$ -22005 48697 245981 56869 61369 118436 289907 181054 94214 197564 25838 68300
831F8300M4618r9352j63031K39396j37295K0220j65498J8894J32324R1055o3995
$$ 68300 112918 13566 -149465 89931 -47364 -27144 -192642 -173748 -41424 49631 -14364
820a4364j7731k7001p7381M0862R3304j36345J46698R139j00946R4494n2584L9912
$$ -14364 -32095 -59096 -136477 -95615 -2311 -138656 8042 17181 -83765 10729 -41855 -1943
808a943J5989j80267j3218J77831k4526m5522K89073K12517m13824o1382o7544
$$ -1943 14046 -166221 -179439 -1608 -26134 -71656 217417 429934 16110 -45272 -112816
797a12816R5518L0613K9306j3357K4646q97k95611K91501L9355j28740J21854
$$ -112816 -17298 13315 42621 29264 53910 53013 -242598 48903 88258 -40482 81372
786H1372J0611k09070j8004K53695j03843R5943j8014R1052N2833q5778R563j88632
$$ 81372 91983 -117087 -135091 118604 14761 110704 92690 183742 236575 150797 160360 -28272
774b8272J8362M3266k5685P5299o4522p9036j0112K9330J62725K0420n4513m2266
$$ -28272 -9910 33356 7671 82970 18448 -60588 -70700 -41370 121355 141775 87262 44996
762D4996L2251J7763O3287K18462j39641k1099j89041l01931L7317P7509P1501
$$ 44996 77247 95010 158297 376759 237118 216019 26978 -274953 -237636 -160127 -88626
751h8626l1367J03776K8775j39719p9301O1405L7203p2856K3208L19200J28646
$$ -88626 -119993 -16217 12558 -127161 -206462 -145057 -107854 -180710 -157502 161698 290344
740B90344j57668l55572J4992K08082j50744N6822r496q7679J68830j0746k12668
$$ 290344 132676 -222896 -207904 178 -150566 -93744 -103240 -190919 -22089 -32835 -245503
729b45503J07646K05337M6285k54721Q7807M8212J15485l9888J86516n6692k53740
$$ -245503 -137857 67480 113765 -140956 -53149 -4937 110548 70660 257176 200484 -53256
718e3256n1609J21779r229n0419m9086j06659J85325j18228J69849M6023q2354
$$ -53256 -104865 16914 7685 -42734 -91820 -198479 -13154 -131382 38467 84490 2136
707B136M7593o5390P5236K0543q5285L7086K376Q7903j38280J10003J93382K71196
$$ 2136 49729 -15661 59575 80118 -5167 31919 34295 122198 -16082 93921 287303 558499
695E58499k09142j64055l32891o9523J08479K2019K09580r2917J24077j90236
$$ 558499 349357 185302 -147589 -217112 -108633 -86614 122966 30049 154126 -36110
685c6110M1030K02422l3081K8331j33809j92877J28462R9510j11390J21047m3333
$$ -36110 4920 207342 174261 202592 68783 -124094 4368 103878 -7512 113535 70202
674G0202j01413m6932j1885K24991q1883p8629N6685j76532M8599K53298k2123
$$ 70202 -31211 -78143 -90028 134963 53080 -25549 31136 -145396 -96797 156501 134378
663A34378j06499o3087O4695n8931R9916P7078j81732J02599p3525J08835N1893
$$ 134378 27879 -35208 29487 -29444 70472 147550 -34182 68417 -5108 103727 155620
652A55620l58604N7070K56430J53865m4236j91792O9595m343J0035j25058O7058
$$ 155620 -202984 -145914 110516 264381 220145 28353 97948 93605 103640 -21418 45640
641D5640j32438k2087l2706Q5987P0160O5388o7292O0318j3673j30447J42393
$$ 45640 -86798 -108885 -141591 -55604 14556 79944 12652 72970 59297 -71150 71243
630G1243k4261L2889j40461O3830J79047j93762L3292k44018P7404J30247L381
$$ 71243 46982 79871 -60590 3240 182287 -11475 21817 -222201 -144797 -14550 -11169
619a1169n0418o7395M7297K06585J6010k20649o1374J16889L7422m199q951k21237
$$ -11169 -61587 -128982 -81685 124900 140910 -79739 -141113 -24224 13198 8999 48 -221189
607b21189Q2843J30207J07085j88114O4226M6097O3952Q8562l6771o4453L01634
$$ -221189 -138346 -8139 98946 -89168 -24942 21155 85107 173669 136898 72445 374079
596C74079n3142j02550r1011L3027r0747o2625o3677R2773l341p3383M3606K21832
$$ 374079 320937 218387 127376 160403 69656 7031 -56646 36127 32786 -40597 3009 224841
584B24841k8513j61892j4577K30788P8640j54199M6802k23664k03368J92122K3334
$$ 224841 196328 34436 19859 250647 329287 175088 221890 -1774 -205142 -13020 10314
573A0314K4178j02518J4105J08751m9684P5739J27879k67768K6981k0908J24554
$$ 10314 34492 -68026 -53921 54830 5146 80885 208764 -59004 -32023 -52931 71623
562G1623M4348n3864m4163j59943K63206j07421k2491K51514j54628j46933K99392
$$ 71623 115971 62107 17944 -141999 121207 13786 -8705 242809 88181 -58752 240640
551B40640N2433k537j09663J19423o5616K6400J94606l04468j18378K3389J13247
$$ 240640 293073 290536 180873 300296 234680 261080 455686 151218 32840 56229 169476
540A69476k01408Q0116J17071P9278P7258j50394j35093Q8758P38k45625j0002
$$ 169476 -31932 48184 165255 244533 321791 171397 36304 125062 125800 -119825 -129827
529a29827J6694l5030P1303k9198P5763q9940O3072M0201l3025K8637k14740J94061
$$ -129827 -113133 -148163 -76860 -106058 -30295 -120235 -57163 -16962 -49987 -21350 -236090 -42029
517d2029o6529J95359j4020J86787j06119N6514m8174j64038J2166j4880J82921
$$ -42029 -108558 86801 72781 259568 153449 209963 161789 -2249 9917 -4963 177958
506A77958n2627j88670J40606p9310k0672J13604L2769q6724j72501J49148N5500
$$ 177958 125331 -63339 77267 -2043 -22715 90889 123658 36934 -135567 13581 69081
495F9081K7921k2845J37642J18772k68165j20923M4260L4815J46056m6713o4599
$$ 69081 97002 74157 211799 330571 62406 -58517 -14257 20558 166614 119901 55302
484E5302l090r7303L0254J06674n3448J70133n4982j44604K3911k9684m6644k0772
$$ 55302 52212 -45091 -14837 91837 38389 208522 153540 8936 32847 3163 -43481 -64253
472f4253K77612j67903p0264J59920N4339r7965q8106P0661L600J53370l03770
$$ -64253 213359 45456 -24808 135112 189451 91486 3380 74041 77641 231011 -72759
461g2759N8269K03909p8860j5944k42250R1964n2089R6625P4464l7089j1071K828
$$ -72759 -14490 189419 110559 94615 -147635 -55671 -107760 -11135 63329 26240 15169 17997
449A7997J52521j9102j92449K42577Q5844j26022j76505M294P7406q6143r3708
$$ 17997 170518 151416 -41033 201544 287388 161366 -15139 -10845 66561 -19582 -113290
438a13290J65458Q6450j18878R8525J03589r8766k72028o94K4728j49607P2042
$$ -113290 52168 138618 19740 118265 221854 123088 -148940 -149634 -124906 -274513 -202471
427b02471J43579J03448p959J31326J5152l8197j16568m0179M5881J25657j06493
$$ -202471 -58892 44556 36597 167923 183075 144878 28310 -11869 34012 159669 53176
416E3176j76435K63723k7198o8133r8821p4004p7460K29830N4134J48057j65007
$$ 53176 -123259 140464 113266 45133 -53688 -127692 -205152 24678 78812 226869 61862
405F1862k9721J66723j71864n1890n5055j31152N3705M1399P2607n1686K06219
$$ 61862 32141 198864 27000 -24890 -79945 -211097 -157392 -115993 -43386 -95072 111147
394A11147K5783j39481Q1041j7132j5242n2107M9796p7852m5106L8244J69490
$$ 111147 136930 -2551 78490 61358 46116 -5991 43805 -34047 -79153 -40909 128581
383A28581K4020j83934j57660l4059K19150M9679K0763j18613q456j05328J40834
$$ 128581 152601 -31333 -188993 -223052 -3902 45777 66540 -52073 -60529 -165857 -25023
372b5023K37348r7025l43646J58393J17408j55275J57449J82706j66587r0294
$$ -25023 212325 115300 -228346 -69953 47455 -107820 49629 232335 65748 -24546
362b4546Q40o3664L1757j6861Q1985j5831j38325P9109K3959O1840J56688k9520
$$ -24546 -23706 -87370 -55613 -72474 9511 -6320 -144645 -65536 -41577 20263 176951 147431
350A47431j77908r9991N8944J2240P8314J30062j93262m0585M1136m5744K39612
$$ 147431 -30477 -130468 -71524 -59284 19030 149092 -44170 -84755 -43619 -89363 150249
339A50249l1615l2499J04515q8449m3886K27493j8006k16366P8849k2943j22932
$$ 150249 118634 86135 190650 102201 58315 285808 267802 51436 130285 107342 -15590
328a5590J9007p6788J37127j0232J08874M523j43382Q5482r7420R1481P6769m5853
$$ -15590 3417 -73371 63756 53524 162398 166921 23539 109021 11601 103082 179851 133998
316A33998r7444j77199L9797J29099p3285j62123L14280K9012Q7943R6482j70684
$$ 133998 36554 -140645 -100848 28251 -45034 -207157 107123 136135 224078 320560 149876
305A49876j65591J32838q6802k909p3951k13408K07921R927K5716Q5937o3540
$$ 149876 -15715 117123 30321 27412 -46539 -259947 -52026 -42099 -16383 69554 6014
294F014j56636J05458J81509p5414j01000K36616J32005j72136q0756R5969m1664
$$ 6014 -150622 -45164 136345 60931 -40069 196547 328552 156416 75660 171629 129965
283A29965q7033J6207p7767r2370P4980p971k9336J62493j3406p988L999k21910
$$ 129965 42932 59139 -18628 -110998 -36018 -43989 -73325 89168 75762 67774 71773 -150137
271a50137J31208J33298m4086j02531J2469R5280p1167r0344r9494K20005Q8874
$$ -150137 -18929 114369 70283 -32248 -19779 75501 4334 -86010 -185504 34501 123375
260A23375j33543j09956J14383K8142J82934j40072k79923L01248j9255j71384
$$ 123375 -10168 -120124 -5741 22401 205335 65263 -214660 86588 67333 -104051
250a04051k4028J70851J53566j45565j04843J39230j10017K7163J71383j89740
$$ -104051 -128079 42772 196338 50773 -54070 85160 -24857 2306 173689 -16051
240a6051l7226J05094j21490n5423P4027n4651j27466K25950k2690j20356J90685
$$ -16051 -53277 51817 -69673 -125096 -51069 -105720 -233186 -7236 -29926 -150282 40403
229D0403L022Q3994j11438M4992j7220k12730J8481J01704K50535j71610j19601
$$ 40403 43425 127419 15981 60973 43753 -168977 -150496 -48792 201743 30133 -89468
218h9468R5733J0727O3445q0665R836l3974M1383n4441k707J7759j42841j00388
$$ -89468 6265 16992 80437 -228 9608 -24366 17017 -37424 -40131 -22372 -165213 -265601
206b65601K03844M0208N7375k03018J48638O7693K4865P9158r622N3361l3853
$$ -265601 -61757 -21549 35826 -167192 -18554 49139 74004 153162 143540 196901 163048
195A63048j25797J68844K0471j54062n3379r0587J32559j3343l6457J15819N8703
$$ 163048 37251 206095 226566 72504 19125 -71462 61097 47754 11297 127116 185819
184A85819j8567j59812O1730O2702K6254L4951k35958p3741l8972J95747J20012
$$ 185819 167252 7440 69170 131872 158126 193077 -42881 -116622 -155594 40153 160165
173A60165J30374j30740l5896k1482j11440q9973K9052P0202J91815p6003j84564
$$ 160165 290539 159799 123903 102421 -9019 -98992 -69940 262 192077 116074 -68490
162f8490N3241J73339l4761J16580j80260p2748q7420J33290J2655J61262o3568
$$ -68490 -15249 158090 123329 239909 59649 -13099 -100519 32771 45426 206688 143120
151A43120k1264m5483o9745o9334m7941K24267q220j23832k00010K20002o2646
$$ 143120 121856 76373 6628 -62706 -110647 113620 105400 -18432 -218442 1560 -61086
140f1086P8952J58238R605l0020m3067J3030m7385j137K26616j03285k4244J45644
$$ -61086 17866 176104 185709 155689 112622 125652 78267 77130 303746 200461 176217 321861
128C21861j06138j36502O6197o7149K8667L7308M965M7784j03590r2302j448L290
$$ 321861 215723 79221 145418 78269 106936 144244 149209 196993 93403 1101 -347 2943
116B943q0173J2776M3792N3109O935k2546n3799N7796j32754o82J47075J887J9795
$$ 2943 -77230 -64454 -20662 32447 39382 16836 -36963 20833 -111921 -112603 34472 36359 56154
103E6154r432J7589K8059R4850M6137n5202p6341Q2805M2973j9014L3102j40521
$$ 56154 46722 64311 92370 187220 233357 178155 101814 184619 227592 208578 241680 101159
91A01159L1832j72556j04915J29420n333l1343p5156k8467R6958m7196j17944
$$ 101159 132991 -39565 -144480 -15060 -20393 -51736 -126892 -155359 -58401 -105597 -223541
80b23541K00672J46169j13047m9843R3611L09708k67407k06226R7534j20373J15159
$$ -223541 -22869 123300 10253 -39590 54021 363729 96322 -109904 -12370 -132743 -17584
69a7584R580O3916j25990K1317K4168J06387P0659o8927n4566l5207K050k3243
$$ -17584 -8004 55912 -70078 -48761 -24593 81794 152453 83526 28960 -6247 -4197 -27440
57b7440l6606M5866J14942m5985p9244n4167O7436J47565N315j9693o0745O5656
$$ -27440 -64046 -18180 96762 50777 -28467 -82634 -15198 132367 137682 117989 57244 122900
45A22900k07109n211J45596n8117J599l4772L2067J12258K8908L5988r6530o9705
$$ 122900 -84209 -89420 56176 -1941 -342 -35114 -3047 109211 138119 174107 77577 7872
33G872J68311N9327n741q5932r460O7795J2887j39716j84629j9813K35348J46694
$$ 7872 176183 235510 229769 143837 134377 202172 215059 75343 -109286 -129099 106249 252943
21B52943P2387m4552q3388q6685j64975O8674j00156M3683J29641o066p6399N9205
$$ 252943 325330 280778 197390 110705 -54270 14404 -85752 -42069 87572 81506 5107 64312
9F4312O2242j28992m0261Q3335K2978j1586N9522n8261K3216
$$ 64312 126554 -2438 -42699 40636 63614 52028 111550 53289 76505
0G6505
$$ 76505
$$ Imaginary data points
##PAGE= N=2
##DATA TABLE= (X++(I..I)), XYDATA
16383b329853j13307q3592P1045J89097p854j9522J49184J22328j27543j10936
$$ -2329853 -2443160 -2526752 -2455707 -2266610 -2274464 -2293986 -2144802 -2022474 -2150017 -2260953
16373b260953P3213J11740p895m0671J40845o7441R1543K3626K2739R5851O8401
$$ -2260953 -2187740 -2076000 -2083895 -2124566 -1983721 -2051162 -1959619 -1935993 -1913254 -1817403 -1749002
16362a749002N9405r7916j1737Q4628M634J17188N0887J8896J67645j0790O588
$$ -1749002 -1689597 -1787513 -1799250 -1714622 -1709988 -1592800 -1541913 -1523017 -1355372 -1366162 -1359574
16351a359574q834J45613J36443j27664k5262K2165L4461J41031r8192N4584O8482
$$ -1359574 -1368408 -1222795 -1086352 -1214016 -1239278 -1217113 -1182652 -1041621 -1139813 -1085229 -1016747
16340a016747J47285J09496O5055j23759J3787J16622r978j07161p263J29115
$$ -1016747 -869462 -759966 -694911 -818670 -804883 -688261 -698239 -805400 -812663 -683548
16330f83548N6707m2168N7455J13917r0612J16963L4915L8610k2151k06065J04728
$$ -683548 -626841 -669009 -611554 -497637 -588249 -471286 -436371 -397761 -419912 -625977 -521249
16319e21249J91248j8528r3496J42090R8895l1236Q7321O3845l0206M9394o6739
$$ -521249 -330001 -348529 -442025 -299935 -201040 -232276 -144955 -81110 -111316 -61922 -128661
16308a28661O9293J59112j8426M3350R0286j37833J70502K24831N8211J12107
$$ -128661 -59368 99744 81318 124668 214954 77121 247623 472454 530665 642772
16298F42772q2108q7357R119l2366L0272k4540p0282Q3797P854Q3567Q2530l1648
$$ 642772 560664 473307 482426 450060 480332 455792 385510 469307 477161 560728 643258 611610
16286F11610K11729j13373O2875J88222n5634r1957n690J13142p0223j2645L3885
$$ 611610 823339 709966 772841 961063 905429 813472 807782 920924 850701 838056 871941
16275H71941J05272k6361J39138Q1154q5126N341n6634J7411R871P3953L0628
$$ 871941 977213 950852 1089990 1171144 1086018 1091359 1034725 1052136 1062007 1135960 1166588
16264A166588K9095L0956j2577J00100J58420r9536o7027J01018N3426J19933
$$ 1166588 1195683 1226639 1214062 1314162 1472582 1373046 1306019 1407037 1460463 1580396
16254A580396j7244J5472k63381r1978K1203K42234J79550k5260q838q741K2978
$$ 1580396 1563152 1578624 1315243 1223265 1244468 1486702 1666252 1640992 1632154 1623413 1646391
16243A646391J92970J1470R2450j8417o5068j30830P4096J33415k09281O6883
$$ 1646391 1839361 1850831 1943281 1924864 1859796 1728966 1803062 1936477 1727196 1794079
16233A794079M617L2433Q3674k06710J9522J34893K6545q9712K6422K82728O47
$$ 1794079 1798696 1831129 1914803 1708093 1727615 1862508 1889053 1799341 1825763 2108491 2109138
16222B109138J22209r7961j05120n8464j43804L35301j18503K8701R7485j6292
$$ 2109138 2231347 2133386 2028266 1969802 1825998 2161299 2042796 2071497 2168982 2152690
16212B152690r3136K13902O1933K8137J04570o6590q335p664j18416Q7107o3213
$$ 2152690 2059554 2273456 2335389 2363526 2468096 2401506 2393171 2385507 2267091 2354198 2290985
16201B290985p2281J67425j10581m9690J61907P8667q5891O6836J55845J51173
$$ 2290985 2218704 2386129 2275548 2225858 2387765 2466432 2380541 2447377 2603222 2754395
16191B754395p0864Q279j12575k3139N5819J6172j08170J37427j5174l9045Q2523
$$ 2754395 2683531 2691810 2579235 2556096 2611915 2628087 2519917 2657344 2642170 2603125 2685648
16180B685648J7314j4892k34059R083M1173k06974J62932K20748J14925j56193
$$ 2685648 2702962 2688070 2454011 2463094 2504267 2297293 2460225 2680973 2795898 2639705
16170B639705o5299J43289P8536m1472l2104l9690R6247Q899j80899J79110J85936
$$ 2639705 2574406 2717695 2796231 2754759 2722655 2682965 2779212 2788111 2607212 2786322 2972258
16159B972258k35287P5707N6878J63799J06959o8737p7587j68765Q0314O0955
$$ 2972258 2736971 2812678 2869556 3033355 3140314 3071577 2993990 2825225 2905539 2966494
16149B966494r2421N291j07354j27478P0277L40165O0499N5932j64929n115J39651
$$ 2966494 2874073 2879364 2772010 2644532 2714809 3054974 3115473 3171405 3006476 3001361 3141012
16138C141012m4620j83225j77571Q1014j06714K8450J11687R5565O1459K32938
$$ 3141012 3096392 2913167 2735596 2816610 2709896 2738346 2850033 2945598 3007057 3239995
16128C239995j70527K7824p3417J085L6994j09665J763K4845r4742l198L1929
$$ 3239995 3069468 3097292 3023875 3024960 3061954 2952289 2954052 2978897 2884155 2880957 2912886
16117B912886O5440j10584J31190J61122j18165N8123L2092q2682j10185J24732
$$ 2912886 2978326 2867742 2998932 3160054 3041889 3100012 3132104 3049422 2939237 3063969
16107C063969J0541K3963l251k7946j22778J7707J00234j81708j4074N0131O8528
$$ 3063969 3074510 3098473 3095222 3067276 2944498 2962205 3062439 2880731 2866657 2916788 2985316
16096B985316j1853O4248J19532M1711m0385J04092M0263J171K9168o5260J15338
$$ 2985316 2973463 3037711 3157243 3198954 3158569 3262661 3302924 3304095 3333263 3268003 3383341
$$ [...]
##END NTUPLES=NMR SPECTRUM
##END=
