##TITLE=1H_CG-1175-6
 CDCl3
 8 sc, 
 1.9.2023
##JCAMPDX= 6.0         $$ Bruker NMR JCAMP-DX V2.0
##DATA TYPE= NMR SPECTRUM
##DATA CLASS= NTUPLES
##ORIGIN= UXNMR, Bruker Analytische Messtechnik GmbH
##OWNER= root
$$ XWIN-NMR		Version 3.5
$$ Fri Sep  1 14:08:08 2023 Russian Standard Time (UT+4h)  she@DPX200
##.OBSERVE FREQUENCY= 200.13135
##.OBSERVE NUCLEUS= ^1H
##.ACQUISITION MODE= SIMULTANEOUS
##.ACQUISITION SCHEME= undefined
##.AVERAGES= 8
##.DIGITISER RES= 18
##SPECTROMETER/DATA SYSTEM= spect
##.PULSE SEQUENCE= zg30
##.SOLVENT NAME= CDCl3
##.SHIFT REFERENCE= (INTERNAL, CDCl3, 0, 15.7248)
##AUDIT TRAIL= $$ (NUMBER, WHEN, WHO, WHERE, WHAT)
$$ ##TITLE= Audit trail, XWIN-NMR		Version 3.5
$$ ##JCAMPDX= 5.01
$$ ##ORIGIN= Bruker BioSpin GmbH
$$ ##OWNER= she
$$ F:/spectra/data/she/nmr/H-F/1/pdata/1/auditp.txt
$$ ##AUDIT TRAIL=  $$ (NUMBER, WHEN, WHO, WHERE, WHAT)
(   1,<2023-09-01 14:06:54.68 +0400>,<she>,<DPX200>,
      <created by zg, POWCHK disabled, PULCHK disabled
       configuration hash MD5:
       00 E9 B6 7A A2 85 ED C7 34 08 36 98 17 FE 4E 26
       data hash MD5: 16K
       1D 96 19 EE 88 E1 68 CD 9D 61 AE 08 05 73 36 62>)
(   2,<2023-09-01 14:06:56.93 +0400>,<she>,<DPX200>,
      <Start of raw data processing
       efp BC_mod = 2 LB = 0.24 FT_mod = 6 PKNL = 1 PHC0 = -21052.17 PHC1 = 15.45272 SI = 16K 
       data hash MD5: 16K
       FD 54 03 4D 48 A1 CA 64 92 F4 BF A8 1F B6 9A 8B>)
(   3,<2023-09-01 14:07:12.65 +0400>,<she>,<DPX200>,
      <pk PHC0 = -1.671383 PHC1 = -2.4 
       data hash MD5: 16K
       B2 A1 29 11 C7 B7 CA 3C 87 1C 23 BE 79 9F 71 28>)
(   4,<2023-09-01 14:07:19.32 +0400>,<she>,<DPX200>,
      <abs ABSG = 5 
       data hash MD5: 16K
       F1 06 9C 15 F4 1D 96 EF 56 4E F0 7A AE 41 B0 A9>)
$$ ##END=
$$ 
$$ hash MD5
$$ CE 2A 9F 80 79 3F 7E 7B DA CC 97 95 58 38 AC BB
##$RELAX= 
##$RELAX= 
##$RELAX= 
##$RELAX= 
##$RELAX= 
##$RELAX= 
$$ Bruker specific parameters
$$ --------------------------
##$DU= <F:/spectra>
##$EXPNO= 1
##$NAME= <H-F>
##$PROCNO= 1
##$TYPE= <nmr>
##$USER= <she>
##$AMP= (0..31)
100 100 100 100 100 100 100 100 100 100 100 100 100 100 100 100 100 100 
100 100 100 100 100 100 100 100 100 100 100 100 100 100 
##$AQSEQ= 0
##$AQ_mod= 1
##$AUNM= <au_zg>
##$AUTOPOS= <>
##$BF1= 200.13
##$BF2= 200.13
##$BF3= 200.13
##$BF4= 200.13
##$BF5= 200.13
##$BF6= 200.13
##$BF7= 200.13
##$BF8= 200.13
##$BYTORDA= 1
##$CFDGTYP= 0
##$CFRGTYP= 5
##$CHEMSTR= <none>
##$CNST= (0..31)
1 1 145 1 1 1 1 1 1 1 1 1 1 1 1 1 1 1 1 1 1 1 1 1 1 1 1 1 1 1 1 1 
##$CPDPRG= <>
##$CPDPRG1= <>
##$CPDPRG2= <>
##$CPDPRG3= <>
##$CPDPRG4= <mlev>
##$CPDPRG5= <mlev>
##$CPDPRG6= <mlev>
##$CPDPRG7= <mlev>
##$CPDPRG8= <mlev>
##$CPDPRGB= <>
##$CPDPRGT= <>
##$D= (0..31)
0 1.2 0 0 0 0 0 0 0 0.06 0 0.03 0 0 0 0 0.0002 0 0 0 0 0 0 0 0 0 0 0 0 
0 0 0 
##$DATE= 1693562814
##$DBL= (0..7)
120 120 120 120 120 120 120 120 
##$DBP= (0..7)
150 150 150 150 150 150 150 150 
##$DBP07= 0
##$DBPNAM0= <>
##$DBPNAM1= <>
##$DBPNAM2= <>
##$DBPNAM3= <>
##$DBPNAM4= <>
$$ [...]
##$SUBNAM3= <"">
##$SUBNAM4= <"">
##$SUBNAM5= <"">
##$SUBNAM6= <"">
##$SUBNAM7= <"">
##$SUBNAM8= <"">
##$SUBNAM9= <"">
##$SW= 18.05172834244
##$SWIBOX= (0..15)
0 0 2 0 0 0 0 0 0 0 0 0 0 0 0 0 
##$SW_h= 3612.71676300578
##$TD= 16384
##$TD0= 1
##$TE= 0
##$TE2= 300
##$TE3= 300
##$TEG= 300
##$TL= (0..7)
0 120 120 120 120 120 120 120 
##$TP= (0..7)
150 150 150 150 150 150 150 150 
##$TP07= 0
##$TPNAME0= <>
##$TPNAME1= <>
##$TPNAME2= <>
##$TPNAME3= <>
##$TPNAME4= <>
##$TPNAME5= <>
##$TPNAME6= <>
##$TPNAME7= <>
##$TPOAL= (0..7)
0.5 0.5 0.5 0.5 0.5 0.5 0.5 0.5 
##$TPOFFS= (0..7)
0 0 0 0 0 0 0 0 
##$TUNHIN= 0
##$TUNHOUT= 0
##$TUNXOUT= 0
##$USERA1= <user>
##$USERA2= <user>
##$USERA3= <user>
##$USERA4= <user>
##$USERA5= <user>
##$V9= 5
##$VALIST= <valist>
##$VCLIST= <CCCCCCCCCCCCCCC>
##$VD= 0
##$VDLIST= <DDDDDDDDDDDDDDD>
##$VPLIST= <PPPPPPPPPPPPPPP>
##$VTLIST= <TTTTTTTTTTTTTTT>
##$WBST= 1024
##$WBSW= 4
##$XGAIN= (0..3)
0 0 0 0 
##$XL= 0
##$YL= 0
##$YMAX_a= 39129
##$YMIN_a= -40625
##$ZGOPTNS= <>
##$ZL1= 120
##$ZL2= 120
##$ZL3= 120
##$ZL4= 120
##$ABSF1= 15.73257
##$ABSF2= -2.31928
##$ABSG= 5
##$ABSL= 3
##$ALPHA= 0
##$AQORDER= 0
##$ASSFAC= 0
##$ASSFACI= 0
##$ASSFACX= 0
##$ASSWID= 0
##$AUNMP= <proc_1d>
##$AZFE= 0.1
##$AZFW= 0.1
##$BCFW= 0
##$BC_mod= 2
##$BYTORDP= 0
##$COROFFS= 0
##$CY= -3
##$DATMOD= 1
##$DC= 0
##$DFILT= <>
##$DTYPP= 0
##$F1P= 0
##$F2P= 0
##$FCOR= 1
##$FTSIZE= 16384
##$FT_mod= 6
##$GAMMA= 0
##$GB= 0
##$INTBC= 1
##$INTSCL= 3.70164e-10
##$ISEN= 128
##$LB= 0.24
##$LEV0= 0
##$LPBIN= 0
##$MAXI= 10000
##$MC2= 0
##$MEAN= 0
##$ME_mod= 0
##$MI= 1.114404
##$NCOEF= 0
##$NC_proc= -9
##$NLEV= 6
##$NOISF1= 3.799351
##$NOISF2= 2.8
##$NSP= 0
##$NTH_PI= 0
##$NZP= 0
##$OFFSET= 15.72485
##$PC= 1
##$PHC0= -21053.84
##$PHC1= 13.05272
##$PH_mod= 1
##$PKNL= yes
##$PPARMOD= 0
##$PSCAL= 0
##$PSIGN= 0
##$REVERSE= no
##$SF= 200.13000934345
##$SI= 16384
##$SIGF1= 3
##$SIGF2= 2
##$SINO= 5.538805
##$SIOLD= 16384
##$SREGLST= <1H.CDCl3>
##$SSB= 0
##$STSI= 16384
##$STSR= 0
##$SW_p= 3612.71676300578
##$SYMM= 0
##$S_DEV= 0
##$TDeff= 16384
##$TDoff= 0
##$TI= <>
##$TILT= no
##$TM1= 0
##$TM2= 0
##$TOPLEV= 0
##$USERP1= <user>
##$USERP2= <user>
##$USERP3= <user>
##$USERP4= <user>
##$USERP5= <user>
##$WDW= 1
##$XDIM= 16384
##$YMAX_p= 273282577
##$YMIN_p= -10878416
$$ End of Bruker specific parameters
$$ ---------------------------------
##NTUPLES= NMR SPECTRUM
##VAR_NAME=  FREQUENCY,     SPECTRUM/REAL,   SPECTRUM/IMAG
##SYMBOL=    X,             R,               I
##VAR_TYPE=  INDEPENDENT,   DEPENDENT,       DEPENDENT
##VAR_FORM=  AFFN,          ASDF,            ASDF
##VAR_DIM=   16384,         16384,           16384
##UNITS=     HZ,            ARBITRARY UNITS, ARBITRARY UNITS
##FACTOR=    0.220516191357247, 1,           1
##FIRST=     3147.01431757101, 0,            0
##LAST=      -465.702445434766, 0,           0
##MIN=       -465.702445434766, -10878416,   0
##MAX=       3147.01431757101, 273282577,    0
$$ Real data points
##PAGE= N=1
##DATA TABLE= (X++(R..R)), XYDATA
$$ [...]
4915A394958l81438M63889p57446J25277l43617Q14421Q3088J16433N7582o14823
4905I58324L63563n02377n0074m89101M77447L5264J31740j52280J75478r58574
4895a0590N82287L64716O5719p99810M62477j47814l00544M00234L83102P36567
4885A736344o10494O64196J65022o12933k48378J46112l27296R52788m44964j81706
4875A238691J16592k96447N90850l04159o37422P44790L80839j7111K24677k96896
4865A744404J01585K01497O78491j84249j458817M578J16456J146946m78018l11750
4855A561123p1653l37075j08808K79364M6101l0088M37332M70390j56721k93750
4845A796215j71977K37061J91240N94J105K4561n78390k6235R36404j18895r79340
$$ y = [1394958, 1013520, 1477409, 719963, 845240, 501623, 1316044, 1399132, 1515565, 1573147, 958324, 1321887, 819510, 769436, 280335, 757782, 793046, 924786, 772506, 947984, -10590, 571697, 936413, 1002132, 202322, 664799, 516985, 216441, 616675, 999777, 1736344, 1125850, 1790046, 1955068, 1342135, 1093757, 1239869, 912573, 1865361, 1420397, 1238691, 1355283, 1058836, 1649686, 1345527, 708105, 1452895, 1833734, 1816623, 2041300, 1744404, 1845989, 2047486, 2725977, 2541728, 1082911, 1087489, 1203945, 2350891, 1872873, 1561123, 1489470, 1152395, 1043587, 1322951, 1369052, 1338964, 1776296, 2246686, 2089965, 1796215, 1624238, 1861299, 2052539, 2053133, 2054238, 2078799, 1500409, 1474174, 2410578, 2291683, 1312343]
4834A312343K90895j08013N50333r34839M38733J00951M70904j56912n39147J88190
4824A613438K93992L10148M4573l02935m01176k73006P65454n9131J08551r5174
4814B004734n11743L92171j01869K306N84451J208142r92499k63199P14757r5377
4804B941874J07743M4646o1814J03935l1688J055977k58707R9744l33942j49167
4794C518601N9925M00343k44418j17805l57557j74282n14916L85106K7815J7979
4784C000791P6994j585k51844l69579M0798K12096l41856L68657l63891j58634
4774B211947l03630K32303l13746L17528j9815N4471P29157M03260k3146q84104
4764B404225k19249M0063m91004l70009L79909L58750K97988O31361J70678o07785
$$ y = [1312343, 1603238, 1495225, 2045558, 1110719, 1549452, 1650403, 2121307, 1964395, 1425248, 1613438, 1907430, 2217578, 2262151, 1959216, 1558040, 1285034, 2050488, 1991357, 2099908, 2004734, 1492991, 1885162, 1783293, 1785599, 2370050, 3578192, 2585693, 2322494, 3037251, 2941874, 3049617, 3094263, 3032449, 3136384, 3104696, 4160673, 3901966, 4001710, 3667768, 3518601, 3578526, 3978869, 3734451, 3616646, 3259089, 3084807, 2569891, 2954997, 2982812, 3000791, 3077785, 3076200, 2824356, 2454777, 2495575, 2707671, 2365815, 2734472, 2370581, 2211947, 1908317, 2140620, 1826874, 2144402, 2124587, 2179058, 2908215, 3311475, 3288329, 2404225, 2184976, 2225039, 1734035, 1364026, 1743935, 2102685, 2400673, 3032034, 3202712, 2594927]
4754B594927K14746K67574K12383m19332L30129J1157r0276l22280l38930K02099
4744B662197k79401J78259l8190l80479M59216P09298n51097L44345j3855p6398
4734C013895k45883j62445N22481N1730R6698P15993k86664J79559o8136o82558
4724C134670m24079Q85778l21384o15915P40935j39404p06124L50632J3809j86820
4714B732098k39041o53645R47084j35702l2417k27990J6880L27970L12391p57367
4704B290261J69007L97148l27012k50963J19359j36662m4394O64026l92942j57945
4694B329883n90203J25345N291N09041L38781R1492L21646J14935j66595M45846
4684C525462M44286P35252n8955q88782J9805m02495n6312L51408O53144J0944
$$ y = [2594927, 2809673, 3077247, 3289630, 2870298, 3200427, 3211584, 3121308, 2799028, 2460098, 2662197, 2382796, 2561055, 2522865, 2142386, 2601602, 3310900, 2759803, 3104148, 3090293, 3013895, 2768012, 2605567, 3128048, 3179778, 3276476, 3992469, 3705805, 3885364, 3817228, 3134670, 2710591, 3596369, 3274985, 2659070, 3400005, 3260601, 2554477, 2905109, 2918918, 2732098, 2493057, 1839412, 2786496, 2650794, 2618377, 2390387, 2407267, 2735237, 3047628, 2290261, 2459268, 2856416, 2529404, 2278441, 2397800, 2261138, 2216744, 2880770, 2487828, 2329883, 1739680, 1865025, 1870316, 2379357, 2718138, 2809630, 3131276, 3246211, 3079616, 3525462, 3969748, 4705000, 4646045, 3757263, 3777068, 3374573, 3318261, 3669669, 4322813, 4333757]
4674D333757L25343r82582J76095K19711K71129r3890j44416n60583J61875L00869
4664D007308M94263q4666o42769J74198J33912m83460l64239k75857K08863L73929
4654C541482L01274p99363n34610k68758N41645N44208q0539k47649R91265n82837
4644C406118q27725M16860l4817m73204r1906L71443m27165O90392R83669m71712
4634C541953K83729J23607q53827p53783k6599M89597j94851M29944K45264J52337
4624C437371N70100r53395n07286N33661N97705J10568J5617k54368o26997N00298
4614C423274l52018K13987o24895J90788L70088O33426J75973j16339m57681l91779
4604C064824j4738p448k80978K80355J28090M08466O349k53165N16389n03112
$$ y = [4333757, 4659100, 3676518, 3852613, 4072324, 4343453, 4249563, 4105147, 3544564, 3706439, 4007308, 4501571, 4416905, 3774136, 3948334, 4082246, 3598786, 3234547, 2958690, 3167553, 3541482, 3842756, 3043393, 2508783, 2240025, 2781670, 3325878, 3245339, 2997690, 3988955, 3406118, 2578393, 2995253, 2960436, 2487232, 2395326, 2766769, 2339604, 3029996, 4013665, 3541953, 3825682, 3949289, 3095462, 2341679, 2315080, 2804677, 2609826, 3039770, 3285034, 3437371, 4007471, 3054076, 2546790, 3080451, 3678156, 3788724, 3804341, 3549973, 2922976, 3423274, 3071256, 3285243, 2660348, 2851136, 3221224, 3854650, 4030623, 3914284, 3456603, 3064824, 3050086, 3042638, 2761660, 3042015, 3170105, 3578571, 3584920, 3331755, 3848144, 3345032]
4594C345032P00852p97558n11570R62075j57419k5266P07047O0398K69991q17671
4584C735911J94865M99779n46949j55331N5101M35354J69072N75720R8382M27907
4574E489811k78445J90794j000694Q5495P37356O99237l89055P27832N25410j093139
4564E694602Q33275N41804j11705j57214j082382l10034O46940n74266k79209
4555E201811J61573n3183o00885Q25567P48741N23988j42468n6847j21363N08521
4545F995455K94920l75520Q0620M51899l85034O75847N07320L83546P97024J89501
4535I615578j75707l14086Q61982o51067M33471n41782N69209l44179M00042K41464
4525A0094925j03409p70267M18089L4141k71492N00585J89363O90689r60953J78907
$$ y = [3345032, 4045884, 3248326, 2736756, 3698831, 3541412, 3516146, 4223193, 4283591, 4553582, 3735911, 3930776, 4430555, 3883606, 3728275, 3783376, 4218730, 4387802, 4963522, 5061904, 5489811, 5211366, 5402160, 4401466, 4486961, 5224317, 5923554, 5534499, 6262331, 6787741, 5694602, 6527877, 7069681, 6957976, 6800762, 5718380, 5408346, 6055286, 5481020, 5201811, 5363384, 5310201, 4709316, 5534883, 6283624, 6807612, 6665144, 6608297, 6486934, 6995455, 7290375, 6914855, 6995475, 7447374, 7062340, 7738187, 8245507, 8629053, 9426077, 9615578, 9439871, 9125785, 9987767, 9336700, 9770171, 9228389, 9797598, 9453419, 9853461, 10094925, 9991516, 9221249, 9639338, 9673479, 9401987, 9902572, 10091935, 10782624, 9821671, 10000578]
4515A0000578N61282l24185K6900P54121Q68531O46734L69172R48693O69045P98966
4505A5319837J47354M77204J26160o49100K5876p47303j55571J72409n42731j18946
4495A4055189n35494r9261K85493j54037p27340p25141j56003M45340M48469Q64051
4485A3701266n23638m59949j8303n95195L28373p17643m11664J83206K55828K0443
4475A1762724k07565L28809l14306J67023J10008m5419L75019k11269l26792N72336
4465A2210568j65414L55958K1883J7948p92100q3492l2989P40075K22192j025346
4455A1469283p18892n6207L98863m64137j63178j05579O55494k85319Q49402N38523
4445A2118253Q65533o42328M26669M62950o63493n00762L98762R4711j49458k02727
$$ y = [10000578, 10561860, 10237675, 10264575, 11018696, 11887227, 12533961, 12903133, 13851826, 14520871, 15319837, 15467191, 15944395, 16070555, 15421455, 15447331, 14700028, 14544457, 14716866, 14174135, 14055189, 13519695, 13420434, 13705927, 13551890, 12824550, 12099409, 11943406, 12388746, 12837215, 13701266, 13177628, 12717679, 12699376, 12104181, 12432554, 11714911, 11303247, 11486453, 11742281, 11762724, 11555159, 11883968, 11569662, 11736685, 11846693, 11801274, 12176293, 11965024, 11638232, 12210568, 12045154, 12401112, 12422995, 12440943, 11648843, 11565351, 11532362, 12272437, 12494629, 11469283, 10750391, 10694184, 11093047, 10628910, 10465732, 10360153, 11015647, 10730328, 11579730, 12118253, 12983786, 12341458, 12768127, 13231077, 12567584, 12066822, 12465584, 12560295, 12410837, 12208110]
4435A2208110j58040K96197L18759J49625k22386m87668n01833P65540m0730m82498
4425A1845076o04781L10545m75368j9544p57712m95055o01770N6245j70896K73666
4415I360406r42901k47447j50385m43171j02122K04127p83411K83170k06686j25297
4405F846283L4389p1707N527M64338k33815o5732J63197o66379l41451J35409
4395F270059O60859r05528P29863M3694K41584k05594p6094j029633P1513K59831
4385F060554O69305j13327M00803k25203l16716O88021M4528J00402P6744n30627
4375F854484j64281L55569l21902N4031J97386J28380K04506p7504n67948R37401
4365G600122J55582O57282p50930o35704K02846O85936J19174L52946K96128N65406
$$ y = [12208110, 12050070, 12346267, 12665026, 12814651, 12592265, 12104597, 11602764, 12368304, 12327574, 11845076, 11240295, 11550840, 11075472, 11055928, 10298216, 9803161, 9201391, 9257636, 9086740, 9360406, 8417505, 8170058, 8019673, 7576502, 7474380, 7678507, 6895096, 7178266, 6971580, 6846283, 6880672, 6808965, 6814492, 7278830, 7045015, 6979283, 7142480, 6476101, 6134650, 6270059, 6930918, 6025390, 6755253, 6798947, 7040531, 6834937, 6758843, 5729210, 5800723, 6060554, 6729859, 6616532, 7017335, 6792132, 6475416, 7163437, 7207965, 7308367, 7385111, 6854484, 6690203, 7045772, 6723870, 6777901, 6975287, 7103667, 7308173, 7230669, 6662721, 7600122, 7755704, 8412986, 7662056, 7026352, 7229198, 7915134, 8034308, 8387254, 8683382, 9248788]
4355I248788O31479N32138J39351n27855O00614M61572J344929l48807P8466r5859
4345A2064816o96806J98990R17931k71033L48965j97628J033759n35168l28292
4336A2535534J076843m84776N57356n20824j52415q5335j10347Q92065j34656
4327A3573445m41488K5255l10400k75455m44215J18458J79169R30412O32018j30827
4317A3856372O63034m84959k57373J33522m83578M8523M97450K39498l68524m92564
4307A3351401l12470Q86983J85925l87876o5462p55905k97493K19990K5672K56168
4297A3106933N53344K71535M64231o04823J15136l54369p97039L99724k64628
4288A2890044n09619J97566n1214n76135j001065k60331K66344K68409r21014
$$ y = [9248788, 9880267, 10412405, 10551756, 10023901, 10624515, 11086087, 12431016, 12082209, 12160675, 12064816, 11368010, 11567000, 12484931, 12213898, 12562863, 12365235, 13398994, 12863826, 12535534, 13612377, 13127601, 13684957, 13164133, 13011718, 12926383, 12816036, 13708101, 13573445, 13131957, 13157212, 12846812, 12571357, 12127142, 12245600, 12424769, 13355181, 13987199, 13856372, 14519406, 14034447, 13777074, 13910596, 13427018, 13475541, 13972991, 14212489, 13843965, 13351401, 13038931, 13925914, 14111839, 13723963, 13658501, 12902596, 12605103, 12825093, 12850765, 13106933, 13660277, 13931812, 14396043, 13791220, 13906356, 13551987, 12754948, 13154672, 12890044, 12380425, 12577991, 12526777, 11950642, 10949577, 10689246, 10955590, 11223999, 10302985]
4279A0302985j101142R11930K05347m19489M29717m61369m61551O02106l12872
4270I695662k66085L3565p0646n4497N65186K24417M45252o49407J3024r2627
4260I843844m83734P65348M36159N8777m99378L92685P272L0665j54560P04536
4250A1101614j21430m60080k9238R58207P02090n04032L29994Q02211k65198j6037
4240A2498101L65409J05954M57409N60003l76739m09397n48771l73819R87735
4231A3265885k12810j29299J4040R01218m4259o37169r75768M51728K31051L46860
4221A3211477o15188N81066j71323N60143P91465q74403O87186k16502N08246
4212A4462167K28460J270323k77169J46323J359653L82739j02538k22441k64010
$$ y = [10302985, 9201843, 10113773, 10319120, 9899631, 10329348, 9867979, 9406428, 10008534, 9695662, 9429577, 9463142, 9392496, 9337999, 9903185, 10127602, 10572854, 9923447, 9936471, 9843844, 9360110, 10125458, 10561617, 10620394, 10121016, 10513701, 10520973, 10551638, 10397078, 11101614, 10980184, 10520104, 10490866, 11449073, 12151163, 11647131, 11977125, 12779336, 12514138, 12498101, 12863510, 12969464, 13426873, 13986876, 13610137, 13200740, 12651969, 12278150, 13265885, 13053075, 12923776, 12937816, 13839034, 13794775, 13157606, 12181838, 12633566, 12864617, 13211477, 12596289, 13177355, 13006032, 13566175, 14357640, 13483237, 14170423, 13953921, 14462167, 14690627, 15960950, 15683781, 15830104, 17189757, 17572496, 17469958, 17247517, 16983507]
4203A6983507J138811L02531k61163K4502n26956L51417k27049K23713J66280
4194A8175593J99397N6000N96717m89028m27598N65472p2895K00029K25509J99597
4184A9228793k64479L84485m57961l0259m3912O36968R7549p35412k24355L6140
4174A8627557J60726J2190L13267k77328n9538n93913Q77366J17105p88959p04422
4164A7684051K14019q13797J8388M04964J16146m26099j058642P84442p26748
4155A6196724k40605m78889l18088J172536o8888R334q8596O866J21059m28363
4145A5883090J90028J20457n22055J66869m384J188976Q37639J481l54856m77537
4135A7029708M82615O60013K40229M72564K73823Q80962j81181J97713L47452
$$ y = [16983507, 18122318, 18424849, 18163686, 18188188, 17661232, 18012649, 17785600, 18009313, 18175593, 18374990, 18430990, 19027707, 18538679, 18111081, 18676553, 18603658, 18803687, 19029196, 19228793, 18964314, 19348799, 18890838, 18860579, 18816667, 19453635, 19551184, 18815772, 18591417, 18627557, 18788283, 18800473, 19113740, 18836412, 18776874, 18182961, 19060327, 19177432, 18388473, 17684051, 17898070, 17084273, 17102661, 17507625, 17623771, 17197672, 16139030, 16923472, 16196724, 15956119, 15477230, 15159142, 16331678, 16262790, 16272124, 16183528, 16190394, 16311453, 15883090, 16073118, 16193575, 15671520, 15838389, 15834005, 17022981, 17860620, 17862101, 17507245, 17029708, 17512323, 18172336, 18412565, 18885129, 19158952, 20039914, 19858733, 20056446, 20403898]
4126B0403898L13751J315640L03974J187727L16881P04639J183263Q23325O16305
4117B7169403K64624Q81313J498665J52642K20405N89887L77362J090448Q02467
4108C3047216N33509L4567R75407P24362N01820J275188L56551J711313K266656
4099D1426589J922892J741095J920718L497396N009146M713073N649521M836087
4091G0716517J159336k32581r43915q86093j152238k460176l183020l480016k461850
4082E7075964k674716k329986k195617j921317j151401j377258j285546j525033
4074D2615090k058078k83356q75075j989577j586278M2396o21848p84402r97493
4065C3461379j875703l81462K18481q77533o00260M2718l13306N9912K36051l70734
$$ y = [20403898, 20717649, 22033289, 22337263, 23524990, 23841871, 24546510, 25729773, 26553098, 27169403, 27434027, 28315340, 29814005, 29966647, 30187052, 30776939, 31154301, 32244749, 33047216, 33580725, 33615292, 34590699, 35315061, 35816881, 37092069, 37448620, 39159933, 41426589, 43349481, 45090576, 47011294, 50508690, 55517836, 60230909, 65880430, 70716517, 71875853, 71643272, 70699357, 69813264, 68661026, 66200850, 63017830, 59537814, 57075964, 54401248, 52071262, 49875645, 47954328, 46802927, 45425669, 44140123, 42615090, 40557012, 40273656, 39398581, 37409004, 35822726, 35865122, 35243274, 34458872, 33461379, 31585676, 31204214, 31422695, 30545162, 29944902, 29987620, 29674314, 29734226, 29970277, 29599543]
4055B9599543O71842M37707K17741n74225l14047Q7330m58580J46725L28127j41455
4045C0000708l28764k54803J36366K60618o8090O31171P0394K77249R80020k97413
4035C1407456k187781l28042L1695n26971J93653n525n27623N66540K49409l3092
4025B8839719o80970n22177L90894j04714r17581q20199N75011K63121o87422
4016B6335682n22341L9549k5862p01244n19432j86464j95079P39644j41898L8253
4006B4860808J50066q43370m10606k5114M3923l33845r02242m53349K68791K25608
3996B2580670l49420M00253k41376k91466k33061n54916q58323m36614R74823
3987B0990570Q39966n06494m75169L82080j31372R38072J147883q1615O10261
$$ y = [29599543, 30271385, 30709092, 30926833, 30352608, 30038561, 30125891, 29667311, 29814036, 30142163, 30000708, 29671944, 29417141, 29553507, 29814125, 29746035, 30377206, 30447600, 30724849, 31704869, 31407456, 29219675, 28891633, 28923328, 28396357, 28590010, 28584485, 28056862, 28623402, 28872811, 28839719, 28158749, 27636572, 28027466, 27922752, 27005171, 26184972, 26759983, 27023104, 26335682, 25813341, 25852890, 25827028, 25125784, 24606352, 24419888, 24224809, 24964453, 24822555, 24860808, 25010874, 24167504, 23756898, 23731784, 23775707, 23441862, 22539620, 22086271, 22355062, 22580670, 22231250, 22631503, 22390127, 22098661, 21865600, 21310684, 20452361, 20015747, 20990570, 21830536, 21324042, 20848873, 21230953, 21099581, 22037653, 23185536, 23103921, 23714182]
3978B3714182J311460J646178K486902K585173L467121M638739K927879K13591
3970D2991225j537594k899632j605551j950619j912740k071150k109926j722219
3962B7181794j050396j560601l04578r36706n41499m74280p63328q40458l34595
3953B0375353r59444j157597j086820n45396K86434k25572K45161o57680j199867
3944A5074572j74720j69946L54430r75525l40019P92805n65979j99747n87235
3935A3208636o26043O90950j89785n9467J50914o07326J90918K73810m25650J97974
3925A2804931K08983M7861o35434k78811J66988k37566L10204n56350l34552K69335
3915A1765589l42777L47541L88872n74084r75249K89919M43703p34660J63397
$$ y = [23714182, 25025642, 26671820, 29158722, 31743895, 35211016, 39849755, 42777634, 42991225, 41453631, 38553999, 36948448, 34997829, 33085089, 31013939, 28904013, 27181794, 26131398, 24570797, 24266219, 23329513, 22788014, 22313734, 21550406, 20709948, 20375353, 19415909, 18258312, 17171492, 16626096, 16912530, 16686958, 16932119, 16274439, 15074572, 14899852, 14729906, 15084336, 14108811, 13768792, 14561597, 13995618, 13795871, 13208636, 12582593, 13273543, 13083758, 13024291, 13175205, 12567879, 12758797, 13032607, 12606957, 12804931, 13013914, 13061775, 12426341, 12147530, 12314518, 12076952, 12387156, 11830806, 11496254, 11765589, 11422812, 11770353, 12159225, 11585141, 10609892, 10899811, 11343514, 10608854, 10772251]
3906A0772251O15771K4769l05505Q49153m24924q13141m13090M88721j70475K82916
3896A0906446l99728P30586K50554q12130L29437P21485j26156J08354J36319
3887A1845167K52500p11629L88689K12464r38529q34718M246P4984R89803O22808
3877A1905785j32698m46400p35958K64454P96061m21053k03635P97342l934l61836
3867A1458128O11854j7702M21927m26639r09299R68715L41578q55517K04959P5581
3857A1873585K7990j28879k42868k10951n42265N07766K14781Q4028l86198L95099
3847A1592088j25631K1153M52303J166630l07149m78371j29297J19324o34035
3838A1677015j34354K0974l37057n6138N60717P85306K97667n53948m8776K58562
$$ y = [10772251, 11388022, 11412791, 11107286, 11956439, 11531515, 10718374, 10305284, 10794005, 10623530, 10906446, 10506718, 11237304, 11487858, 10675728, 11005165, 11726650, 11600494, 11708848, 11845167, 12097667, 11386038, 11774727, 11987191, 11048662, 10213944, 10218190, 10293174, 11282977, 11905785, 11773087, 11326687, 10590729, 10855183, 11651244, 11230191, 11026556, 11823898, 11819964, 11458128, 12069982, 12052280, 12474207, 12047568, 11138269, 12106984, 12448562, 11593045, 11798004, 11873585, 11901575, 11772696, 11529828, 11318877, 10776612, 11284378, 11499159, 11583187, 11196989, 11592088, 11466457, 11487610, 11939913, 13106543, 12799394, 12321023, 12191726, 12311050, 11677015, 11542661, 11563635, 11226578, 11170440, 11731157, 12516463, 12814130, 12260182, 12211406, 12469968]
3828A2469968k3092Q41260O43833o31239k09538k7956k855O69845o57276J06211
3818A3179161k53917L82255K24818l80286K01681O03098j529N5471m8532l36879
3808A3625341Q8574l37295N11373Q8131l43827k39623O16524q5605O5828p2566
3798A3916855m51903M61727P26166p8511M52504L72254J42853r1164l95116m24723
3788A4630942q6090L54658l46677P76071J36436m6391N8607M20130j44361k84419
3778A5468906R34158r89126P18984Q18610M38017J96426m35331K34723K22798
3769A7608165L5135M13194J62481L68074M6775n33414P45267O92498O48178J215240
3759B1401593L30175m66632L82711N85292L77803P72929k94794Q00570J029960
$$ y = [12469968, 12446876, 13288136, 13931969, 13300730, 13091192, 13063236, 13060381, 13730226, 13072950, 13179161, 12925244, 13307499, 13532317, 13152031, 13353712, 13956810, 13955281, 14010752, 13962220, 13625341, 13713915, 13376620, 13887993, 13976124, 13632297, 13392674, 14009198, 13923593, 13989421, 13916855, 13464952, 13926679, 14652845, 14574334, 15026838, 15399092, 15541945, 15450781, 15055665, 14630942, 14544852, 14899510, 14552833, 15328904, 15465340, 15418949, 15477556, 15897686, 15753325, 15468906, 16403064, 15413938, 16132922, 16951532, 17389549, 17585975, 17150644, 17385367, 17608165, 17643300, 18056494, 18218975, 18587049, 18633824, 18100410, 18845677, 19538175, 20186353, 21401593, 21731768, 21265136, 21647847, 22233139, 22610942, 23383871, 23089077, 23889647, 24919607]
3750B4919607J91926O92757O84481J400045K37462k17328P27520M48694L34978
3741B9420142l84617L85540J208338L6564L91390K70034p75359m74499L72900
3732C0450433J081808O46105j177187n20932M57821o05982r66595Q67247r02341
3723B9330377l50830J62884l44326k76385N13968K241m83623M62286N27347J63123
3713B9707062k20616j99084N87426K95643k95766L87685Q08265o23874n4574M30047
3703C0822214J76341k21115l49179j16343o40100O39637Q10993L920n66037l02696
3693C0257635j15873J58408l73781m60139K12565O73581m20819N0335o40759q45974
3683B8495179n02036j76509K22735K9359n07513M99615l37694r55989Q13649k83539
$$ y = [24919607, 25111533, 25804290, 26488771, 27888816, 28126278, 27908950, 28636470, 29085164, 29420142, 29035525, 29421065, 30629403, 30665967, 31057357, 31327391, 30552032, 30077533, 30450433, 31532241, 32178346, 31001159, 30480227, 30938048, 30332066, 29365471, 30232718, 29330377, 28979547, 29142431, 28798105, 28521720, 29035688, 29037929, 28554306, 29016592, 29543939, 29707062, 29486446, 29287362, 29874788, 30170431, 29874665, 30262350, 31070615, 30446741, 30392167, 30822214, 30998555, 30777440, 30428261, 30311918, 29671818, 30311455, 31122448, 31126368, 30560331, 30257635, 30141762, 30300170, 29926389, 29466250, 29678815, 30352396, 29931577, 29981912, 29341153, 28495179, 27993143, 27816634, 28039369, 28068728, 27561215, 28060830, 27723136, 26767147, 27580796, 27297257]
3673B7297257m58782q9239l69320K5499J58209M70960k42539k73192l10290L03947
3663B6512510M73426q82813n88457p65276l77879k00398l06537P88377J65660
3654B4818613L2530l68023j18458J90726o75801l62202j13712j50732L65740Q9822
3644B3708503j03563J034681p06454J10812m03486J0336N58996l41192p70086
3635B3098547q5262k00704J10156N56469k32115k56116m31585M85447N20914K82783
3625B3848534j407283K24772Q55421k57732K88845J394719o28808l79751N35104
3616B4473821m47135P49777M89307k80193l71193l0385j38404P4756m0913J01922
3606B4581360K07654L8642O7129J24568k05370K08893N13753j55379l53376M36475
$$ y = [27297257, 26838475, 26749236, 26379916, 26405415, 26563624, 27034584, 26792045, 26518853, 26208563, 26512510, 26985936, 26103123, 25514666, 24749390, 24371511, 24171113, 23864576, 24652953, 24818613, 24851143, 24483120, 24364662, 24555388, 23879587, 23517385, 23403673, 23252941, 23618681, 23708503, 23604940, 24639621, 23933167, 24043979, 23640493, 23650829, 24209825, 23868633, 23098547, 23013285, 22812581, 22922737, 23479206, 23247091, 22990975, 22559390, 23044837, 23565751, 23848534, 22441251, 22666023, 23521444, 23263712, 23552557, 24947276, 24318468, 23938717, 24473821, 24026686, 24776463, 25265770, 24985577, 24614384, 24583999, 24445595, 24520351, 24479438, 24581360, 24789014, 24827656, 24894785, 25019353, 24813983, 25022876, 25536629, 25381250, 25027874, 25464349]
3596B5464349J308710K82404J88844n79233n3072J296022K90968j864J122586
3587B9319714J162100R6055Q36074N45418J292423J28156M362J844207N36292
3578C5764801O28082N20140N01000L15472J32567M74216Q87300J509025R4840
3569D0827443O63644R71399O63826J58538J209071Q56070O46968J25705m03569
3560D5719095N74084L4529m9369o240P27447R55849K92769l09352J119288N34253
3550D9592353j31355L51462O18694N77109N34066J109432J62987N77900P08316
3541E4100964N63113j01995L39619Q29688J43014j117262j793365j051809j538685
3532E0373282r97514j018855k019504j434333j577721q83493r43433j528140j127565
$$ y = [25464349, 26773059, 27055463, 27244307, 26665074, 26612002, 27908024, 28198992, 28197128, 29319714, 30481814, 30577869, 31413943, 31959361, 33251784, 33379940, 33384302, 35228509, 35764801, 36392883, 36913023, 37414023, 37729495, 37862062, 38336278, 39223578, 40732603, 40827443, 41491087, 42462486, 43126312, 43284850, 44493921, 45349991, 45996959, 46122664, 45719095, 46293179, 46327708, 46278339, 46272099, 46999546, 47955395, 48248164, 47938812, 49058100, 49592353, 49460998, 49812460, 50431154, 51008263, 51542329, 52651761, 52814748, 53392648, 54100964, 54664077, 54562082, 54901701, 55731389, 55874403, 54757141, 52963776, 51911967, 50373282, 49375768, 48356913, 46337409, 44903076, 43325355, 42441862, 41498429, 39970289, 38842724]
3523C8842724q01339p54569j806864j08302j301820L94343P06387n11116j063732
3514C3595712r35918L91672k7419k14145m19343l84513p52102K34342o50604j2862
3504C0824820N61212m43559j82309M40515K24957L16317o12162p06040j99989
3495C0223762J62340j080611m10862j76527j145282p85495l86906L42563k21092
3486B6521890j411421q52543p65014m46548Q0948j731505M20229O13715m34307
3477B1995444J26580n26463p82189o68826o63090k65890O1742N50692r96303K76716
3467A9108413J63866j46265n48094m54695j270346K8990q2148j003588j69244
3458A5626889M08107o10660L29517k21914k91752J409231j050419l93538k11955
$$ y = [38842724, 38041385, 37286816, 35479952, 35371650, 34069830, 34464173, 35170560, 34659444, 33595712, 32659794, 33051466, 33024047, 32809902, 32390559, 32006046, 31253944, 31488286, 30837682, 30824820, 31386032, 30942473, 30760164, 31200679, 31425636, 31741953, 31129791, 30423751, 30223762, 30386102, 29305491, 28894629, 28718102, 27572820, 26787325, 26400419, 26742982, 26521890, 25110469, 24257926, 23492912, 23046364, 23127312, 21395807, 21816036, 22429751, 21995444, 22122024, 21595561, 20813372, 20144546, 19481456, 19215566, 19277308, 19828000, 18831697, 19108413, 19272279, 19126014, 18577920, 18123225, 16852879, 16881869, 16799721, 15796133, 15626889, 16034996, 15424336, 15753853, 15531939, 15240187, 16649418, 15598999, 15205461, 14993506]
3449A4993506r2784m70270Q6179k27543N6406l27832l04289k54927M52033L52281
3439A4262760N2598o09811k76408l61726k08522M27720n08877P81442k35139l64925
3429A2959112K46393n50282L2074l23652K97575N27396J79053M10713r3141o47011
3419A3038230j88275n05932n15349O24206M19852j69569k33333L73927l11619
3410A2532138Q34099R89194p10060R5116l17535Q60937N06216j266959k39326
3401A3283820L39163j56009L16632M37812j155847Q30359J259984N4124K64152
3392A5474190M5246K99169K87625l07166J8232P55519q7228O4335L33237J292433
3382A8175592R50954k63604j79003N51895K56870K94446l24431J0218N71974J40775
$$ y = [14993506, 14900722, 14430452, 14516631, 14289088, 14345494, 14017662, 13713373, 13458446, 13910479, 14262760, 14315358, 13705547, 13429139, 13067413, 12858891, 13286611, 12777734, 13559176, 13324037, 12959112, 13205505, 12655223, 12687297, 12363645, 12661220, 13188616, 13367669, 13778382, 13685241, 13038230, 12849955, 12344023, 11828674, 12452880, 12872732, 12703163, 12469830, 12843757, 12532138, 13366237, 14355431, 13645371, 13740487, 13422952, 14283889, 14790105, 13523146, 13283820, 13622983, 13466974, 13783606, 14221418, 13065571, 13895930, 15155914, 15210038, 15474190, 15519436, 15818605, 16106230, 15799064, 15817296, 16572815, 16485587, 16549922, 16883159, 18175592, 19126546, 18862942, 18683939, 19235834, 19492704, 19787150, 19462719, 19472937, 20044911, 20185686]
3372B0185686k26419j128728r0479J48671N75938j96219K39526Q16783L06969
3363B0631728L03175m85734n08099p47366L37342N64698k61393P54333K98269
3354B0886953M91995o69491N21351P9005j1765N91534K01103N94092k38026N49181
3344B2995932L90066J66925M19027P39274K39856R30367J011116P66653L32114
3335B7991330L5851J207069J228061N56648J288875M05494M75762J106817J171774
3326C5467681P59009J394517J256711J654274N44137K84496J557169K49061k66283
3317D2900772J091520P78658P15266M32200N26196J128032P05800R36829J52725
3308D9367998n4546J12810Q00700J130438O89300J257454j04870K67025J08925
$$ y = [20185686, 19959267, 18830539, 18740060, 18888731, 19464669, 19268450, 19507976, 20324759, 20631728, 20934903, 20449169, 19941070, 19193704, 19531046, 20095744, 19834351, 20588684, 20886953, 21378948, 20709457, 21230808, 21309813, 21298048, 21889582, 22090685, 22684777, 22446751, 22995932, 23385998, 23552923, 23971950, 24711224, 24951080, 25881447, 26892563, 27659216, 27991330, 28027181, 29234250, 30462311, 31018959, 32307834, 32713328, 33189090, 34295907, 35467681, 36226690, 37621207, 38877918, 40532192, 41076329, 41360825, 42917994, 43167055, 42900772, 43992292, 44770950, 45486216, 45918416, 46444612, 47572644, 48278444, 49215273, 49367998, 49313452, 49426262, 50226962, 51357400, 52046700, 53304154, 53199284, 53466309, 53575234]
3299E3575234P79205P28968l0104R58267J097640P36824L90365J133351J112317
3290F0482067P54970Q77882M16959k97552m81307q97127J40422r88193l87142
3281E9620979l40067r64395r10677m96304j714451r17102p95646j452903k5542
3272E2003892l27191L79553l72631j631863j492813O02081L55643l70701L75387
3263D9521357j65089K40853R83005J361007K166384K685542K963988L376115J607030
3254F4740192J627517J989205R06912m98507k153105k725308k488655k440359
3246E8957892k153762k325630k094225j376517j039459j423915o52856j776269
3238D6115259j840749q38227p93739j854065q62531j372359p76215j61183j232309
$$ y = [53575234, 54354439, 55083407, 55053303, 56011570, 57109210, 57846034, 58236399, 59369750, 60482067, 61237037, 62114919, 62531878, 62234326, 61753019, 60855892, 60996314, 60008121, 59620979, 59280912, 58316517, 57405840, 56909536, 55195085, 54277983, 53482337, 52029434, 52003892, 51676701, 52056254, 51683623, 50051760, 48558947, 49161028, 49516671, 49145970, 49521357, 49356268, 49597121, 50580126, 51941133, 54107517, 56793059, 59757047, 63133162, 64740192, 66367709, 68356914, 69263826, 68765319, 66612214, 63886906, 61398251, 58957892, 56804130, 54478500, 52384275, 51007758, 49968299, 48544384, 47891528, 46115259, 44274510, 43436283, 42642544, 40788479, 39925948, 38553589, 37777374, 37616191, 36383882]
3229C6383882l72971n7106M89377k3754Q17595M72844p17927q21481j423544j035934
3219C3710981l22172o15678j199970n41764q24822o69191r0240o34539l61980
3210B8450625k59595m89776p27915p32987m80247j288498k16558n15681p24137
3201B3015231O70598l23521j004183m25134n36970k87862P9239m71336r60091
3192A9755971j61132K97118j71512L69927l56646k63252J9584o1682k74380l60292
3182A8793704O59486K50138l07475m09937j85777j33093J69420m4128l37223L22961
3172A8778076P19400J18275l59162m89836k04720N76015J353186k21798R0812
3163B0360248P25990L00802R07152M04027K72410K07059J217379J200925P71733
$$ y = [36383882, 36010911, 35953805, 36443182, 36419428, 37237023, 37709867, 36991940, 36170459, 34746915, 33710981, 33388809, 32773131, 31573161, 31031397, 30206575, 29537384, 29447144, 28812605, 28450625, 28191030, 27701254, 26973339, 26240352, 25760105, 24471607, 24255049, 23739368, 23015231, 23685829, 23362308, 22358125, 21932991, 21396021, 21108159, 21187398, 20716062, 19755971, 19594839, 19891957, 19720445, 20090372, 19733726, 19470474, 19490058, 19428376, 19153996, 18793704, 19453190, 19703328, 19395853, 18985916, 18800139, 18667046, 18836466, 18792338, 18455115, 18778076, 19497476, 19615751, 19256589, 18766753, 18562033, 19138048, 20491234, 20269436, 20360248, 21086238, 21387040, 22294192, 22698219, 22970629, 23177688, 24395067, 25595992, 26367725]
3154B6367725O98894J752130Q83341J724536J078458J944919J294206O66948J031976
3145C7443133K089380J425140J160877R40135Q12049J187850l31891m17987j0355
3136D4298331l83986N45401j544715o96364m97318r68715j696341j151926j713844
3127C6190523j265473r98270p88036j263668j029304m36704j136704q65776p50640
3118B7655948J12143p95501n67991r66492o20862r25801j317537o46422j125646
3109B0801839l97140q57732m90633o8125l97695R1774q16448o84264l26504k30086
3099A6624986p89554J23637o00821k99340n45273J00613N71647l88250j418555
3090A3379090l10451k00105l71732L9600K94266r05656j5478K39781l52122l02693
$$ y = [26367725, 27066619, 28818749, 29702090, 31426626, 32505084, 34450003, 35744209, 36411157, 37443133, 39532513, 40957653, 42118530, 43058665, 43870714, 45058564, 44726673, 44308686, 44298331, 43914345, 44459746, 42915031, 42218667, 41721349, 40752634, 39056293, 37904367, 36190523, 34925050, 33926780, 33138744, 31875076, 30845772, 30409068, 29272364, 28406588, 27655948, 27768091, 26972590, 26404599, 25438107, 24817245, 23891444, 22573907, 21927485, 20801839, 20404699, 19546967, 19056334, 18988209, 18590514, 18682288, 17865840, 17181576, 16855072, 16624986, 15835432, 15959069, 15358248, 15058908, 14513635, 14614248, 15185895, 14797645, 13379090, 13068639, 12868534, 12496802, 12536402, 12830668, 11925012, 11909534, 12149315, 11797193, 11494500]
3080A1494500L56807J95503j4473n87559q14153k5646m43665o20964L20982m03630
3070I457702m98751M72326R76499l70512n81186p17344R7226k99849j07531K54959
3060H683539l70389l73646j41631k79526m76346j66174J007411K94047q34643
3051G342642q50144l18893K58377J08342J08315R09284O1915j16442m23505m74109
3041F605782l09610L7804R7297l04232M8392q34257J31291M55202k1815Q6063
3031E991917j82215K30617m60453o20562M16212R502J49594O75386K71423m36947
3021F044474p09312o39264K30427L07466M09390j39051O02222k57313k77651p2636
3011E498752N00578n1778n95860M200l03324N16964Q68756j4763J11386p77985
$$ y = [11494500, 11851307, 12046810, 12032337, 11444778, 10630625, 10604979, 10161314, 9540350, 9861332, 9457702, 8958951, 9431277, 10407776, 10037264, 9456078, 8738734, 8835960, 8536111, 8428580, 8683539, 8313150, 7939504, 7797873, 7518347, 7042001, 6875827, 7883238, 8177285, 7342642, 6492498, 6173605, 6431982, 6540324, 6648639, 7557923, 7619838, 7503396, 7079891, 6605782, 6296172, 6333976, 6431273, 6127041, 6175433, 5341176, 5472467, 5927669, 5905854, 5991917, 5809702, 6040319, 5579866, 4959304, 5375516, 5385018, 5534612, 6209998, 6481421, 6044474, 5335162, 4695898, 4926325, 5233791, 5643181, 5504130, 6106352, 5849039, 5571388, 5498752, 5999330, 5947552, 5351692, 5355892, 5052568, 5569532, 6438288, 6423525, 6534911, 5756926]
3001E756926M32583P3713j423943N7738P64464J66928k09653k94528j46002O53248
2991E831474j12312j19342J23547k48088J50748J54278n96731J43063l02044m39411
2981D585182O91134j01958L32710L21777o3351J91277K94121k23262J043147m12193
2971F658584N7479K41005p99368k98162O50153O80847l22814j17480N41891J15915
2961G408050n02844J17544N24930K7971k30473K80694J75622P38598l15286L95188
2951H619994p37099J20157J080996p81860l24239O87664l35007j4083O51617j72194
2941H795946q4869n56357M72480l49286R93892N43983L49479m43540k03750N23822
2931A0041800l14225m4008L14101L36933N04691P75073p9431O687R95127k08777
$$ y = [5756926, 6189509, 6263222, 4839279, 4897017, 5661481, 5828409, 5618756, 5324228, 5178226, 5831474, 5719162, 5599820, 5723367, 5475279, 5626027, 5780305, 5183574, 5326637, 5024593, 4585182, 5276316, 5174358, 5507068, 5828845, 5765494, 5956771, 6250892, 6027630, 7070777, 6658584, 6716063, 6957068, 6157700, 5859538, 6509691, 7190538, 6867724, 6750244, 7292135, 7408050, 6905206, 7022750, 7547680, 7575651, 7345178, 7625872, 7801494, 8540092, 8224806, 8619994, 7882895, 8003052, 9084048, 8302188, 7977949, 8665613, 8330606, 8316523, 8968140, 8795946, 8711077, 8154720, 8627200, 8277914, 9271806, 9815789, 10165268, 9721728, 9517978, 10041800, 9727575, 9683567, 9997668, 10334601, 10839292, 11614365, 11534934, 11541621, 12536748, 12327971]
2921A2327971k43949O44804J323336Q28291k73399J188093j53268J110096O44804
2912A7396779O95371L52912K88051J613757N25096j45112O24361J012484J177783
2903B3541482Q04987O34487P03643O14599J118743P41753M54114J444815J170280
2894C1228903J685940J164780R7656J539352N65068J603771K290377J877446J160350
2885D3213643J462627J946131K884224K365593L086231K877119K962386L376021
2877F4173975K893395L895924M499006N145862N304921O607884P082962Q522186
2869A08126115Q516295Q804131P754136O233575L461349N96516k802933l490000
2861A37199184m834740m870757m746719o055373n280434l219175l583222l345549
$$ y = [12327971, 12084022, 12728826, 14052162, 14880453, 14607054, 15795147, 15641879, 16751975, 17396779, 18092150, 18445062, 18733113, 20346870, 20871966, 20726854, 21351215, 22363699, 23541482, 24346469, 24980956, 25684599, 26299198, 27417941, 28159694, 28613808, 30058623, 31228903, 32914843, 34079623, 34177279, 35716631, 36281699, 37885470, 40175847, 42053293, 43213643, 44676270, 46622401, 49506625, 51872218, 54958449, 57835568, 60797954, 64173975, 67067370, 70963294, 75462300, 80608162, 85913083, 92520967, 99603929, 108126115, 116642410, 125446541, 133200677, 139434252, 142895601, 143492117, 140689184, 137199184, 132364444, 127493687, 122746968, 116691595, 111411161, 108191986, 104608764, 101263215]
2853A01263215j702359k021453k295517l042144k973817k431606l075223k982141
2845H0738955m337686l551322l259886l625322k745127k630222k533142l149387
2837E4906861j105215k198562j067949j890481j299257r94554j264955p62350
2829D4323538o11381m54530j394767k253398j255386j007029j417186j621023
2821C4308838q18164j485741j342990q21181j355001j193287p85008m20583k034343
2812B4052540L01180l08479r46964n75294p97260j435361j030070j16887k99420
2803A8843985k40927n13005q61127q59129n10932m26726M52321M7931j283198
2794A4649193o34639r14330n21264l77821P9666N25335l54978j287987m10638
$$ y = [101263215, 99560856, 97539403, 95243886, 92201742, 89227925, 86796319, 83721096, 80738955, 76401269, 72849947, 69590061, 65964739, 63219612, 60589390, 58056248, 54906861, 53801646, 51603084, 50535135, 48644654, 47345397, 46350843, 45085888, 44323538, 43712157, 43257627, 41862860, 39609462, 38354076, 37347047, 35929861, 34308838, 33490674, 32004933, 30661943, 29840762, 28485761, 27292474, 26507466, 26086883, 24052540, 24353720, 24045241, 23098277, 22522983, 21725723, 20290362, 19260292, 19143405, 18843985, 18603058, 18090053, 17228926, 16369797, 15858865, 15432139, 15884460, 15932391, 14649193, 14014554, 13100224, 12578960, 12201139, 12280805, 12806140, 12451162, 11163175, 10752537]
2785A0752537K38562m99634o31796j72335m57413K84729J00451l43828K66404
2776I537677j79013p05331n36962r36081M23342O26392j81127l68351j23602N4399
2766G611343n19616l8556r02340K88830j28780k85349j72166L97585j150280j45555
2756D955116J413883q41415J291792j37682j155386n35134j2315L49783o36808
2747D691834L34827n72380Q8030J00878l46722K09909j68418r07837K95106P13516
2737D438743o0128o65983M15282M54475J79769q27853k98032k26157l61766j0783
2727C037567k67124R8207K82377n0880j72994Q2721p55507L57190R7487n21120
2717B187924k43278M26383N818L36497K65603o42390J25199N64422O6388j56936
$$ y = [10752537, 10991099, 10491465, 9859669, 9687334, 9229921, 9514650, 9615101, 9271273, 9537677, 9358664, 8653333, 8116371, 7180290, 7603632, 8230024, 8048897, 7680546, 7556944, 7611343, 7091727, 7053171, 6150831, 6439661, 6310881, 6025532, 5853366, 6250951, 5100671, 4955116, 6368999, 5527584, 6819376, 6681694, 5526308, 4991174, 4978859, 5328642, 4691834, 5026661, 4454281, 4542311, 4643189, 4296467, 4506376, 4337958, 3430121, 3725227, 4438743, 4378615, 3712632, 4127914, 4582389, 4762158, 3934305, 3636273, 3410116, 3048350, 3037567, 2770443, 2868650, 3151027, 3100147, 2927153, 3009874, 2254367, 2611557, 2709044, 2187924, 1944646, 2371029, 2376847, 2713344, 2978947, 2336557, 2461756, 3026178, 3092566, 2935630]
2707B935630l44163n31996J94265j04239J5561m09742r2491O91246n55701N71366
2697B369736J36994k84141O26449K68414p62838m02598l87375j65732O62383K44489
2687B305781p05749l75071M93441m30777k38950O36384p4998K39965L49455o51061
2677A548420K61371J96504j49839p74873j61957M63672n20722R4697Q7475N98634
2667A643382k8267M93087l85501K8006J063170j048351k54032K17241o46285m69278
2657F13172L92934o45095k47043L00458r22875p19917J214488R31543m09234j0098
2647D98333N20415K3207K43887r26028k27013R6975l9621J53546J5501j34007
2637B25195N952j79967L29677J10553J30129J5049m47087p7562M50587j22385
$$ y = [2935630, 2591467, 2059471, 2253736, 2149497, 2165058, 1755316, 1662825, 2354071, 1798370, 2369736, 2506730, 2222589, 2849038, 3117452, 2354614, 1952016, 1564641, 1398909, 2061292, 2305781, 1600032, 1224961, 1718402, 1287625, 1048675, 1685059, 1610061, 1850026, 2199481, 1548420, 1809791, 2006295, 1856456, 1081583, 919626, 1383298, 862576, 957273, 1044748, 1643382, 1615115, 2108202, 1722701, 1750707, 2813877, 1765526, 1511494, 1728735, 1082450, 613172, 1006106, 361011, 113968, 414426, -508449, -1228366, -13878, 917665, 508431, 498333, 1018748, 1041955, 1285842, 359814, 132801, 229776, 190155, 343701, 359202, 225195, 231147, 51180, 380857, 491410, 621539, 636588, 189501, 111939, 562526, 440141]
2627D40141l06278m37741J022849l79457M76606R67689o74064p01970l88867Q83237
2617I02145o94334M80493k78901M32700n25579l71695o02294Q09917l3021K19823
2607C39254K71780j42801O37873p21336j34650K15662J06707j51635l39353n8024
2597B3477Q7756J4085k45519K24799O22278J49856r62701R76622L15506l07948
2587H98211M09853p64189L32969K88280L0853p94860l32731J016207o95524m22409
2577c3340N63910K66583L1715l66927n56239M36294j91496O69805m35947n28876
2567a44518R90325J43168K48809m20060k59783o88655J22054M26937r3801J59755
2557D84231J49559o07585M17001k4657k49604J37913L59814j28962n3541J54260
$$ y = [440141, 133863, -303878, 718971, 339514, 816120, 1783809, 1109745, 407775, 18908, 902145, 207811, 688304, 409403, 842103, 316524, -55171, -657465, 152452, 119431, 339254, 611034, 468233, 1106106, 384770, 250120, 465782, 572489, 420854, 81501, 23477, 111233, 125318, -120201, 104598, 726876, 876732, -85969, 890653, 1206159, 898211, 1308064, 543875, 876844, 1165124, 1195977, 401117, 68386, 1084593, 389069, -33340, 530570, 797153, 828868, 461941, -94298, 341996, 150500, 820305, 384358, -144518, 845807, 988975, 1237784, 817724, 557941, -130714, -8660, 418277, 324476, 484231, 633790, 26205, 443206, 418549, 168945, 306858, 666672, 537710, 484169, 638429]
2547F38429p11778k76205O02573J94982K21541l15996j81390L7698k93643Q64311
2537G80522J7274p79763Q7198j55102K14838J05043J80432m06260M3308N0662
2527A38152m68998O8446M21452J184L0758K54125K46191k01382L13161p29871
2517G3218j93901k81228o69880M07740n74545L70193K17681k50431n32087L63474
2507a069766O33183P62438k87363n30894N51540R44072n77476o61123L65452k83711
2497a53648P2138N69427J80553n45983l67524l03843K75754K65292k88203K04370
2487i1667l23938K02859M36732l67204L61622J30151q55817k48112j05294r6658
2477i57326N26017L02991p32914O5016L90425N25106N25195p81396M63534p19314
$$ y = [638429, -73349, -349554, 253019, 448001, 669542, 353546, 172156, 209854, -83789, 780522, 797796, 18033, 105231, -49871, 164967, 270010, 450442, 44182, 87490, 138152, -330846, -262400, 159052, 160236, 190994, 445119, 691310, 489928, 803089, 73218, -120683, -401911, -1071791, -664051, -1238596, -868403, -650722, -901153, -1433240, -1069766, -436583, 325855, 38492, -492402, 59138, 1003210, 425734, -235389, 130063, -153648, -81510, 487917, 668470, 122487, -245037, -548880, -273126, -7834, -296037, -91667, -415605, -212746, 223986, -143218, 218404, 348555, -507262, -755374, -860668, -957326, -431309, -128318, -861232, -796216, -405791, 119315, 644510, -136886, 326648, -392666]
2467c92666j9508k80349j95062O37948l70061m8489q18459l5809J117294L09568
2457i5593k03587M61932L50691J89361j40063k93653l49565M15923L60764m57790
2447B38420o11819o831K03557o88523K94403O25747N7639m74945L93147Q3422
2437A14217j36792m37861M63676M34194j289772M37007J0727k36995N4328L91659
2427a95612j68285r38745Q61808J95092l49321M65688J78101j72204p37159q5995
2417i46632l4658P77572m61776k3430K86572O01880k35356n04327J67431q6897
2407d59621k44677J54872O51083P0291j43084K40244o77286j088421J42571J772058
2397D18030K52989p15368p9535l45925M88401J89465l08621o58820o3489l0170
$$ y = [-392666, -412174, -692523, -887585, -249637, -619698, -668187, -1486646, -1522455, -405161, -95593, -299180, 162752, 513443, 702804, 562741, 269088, -80477, 335446, 696210, 238420, -373399, -380230, -176673, -865196, -570793, 54954, 112593, -362352, 30795, 114217, -22575, -460436, 3240, 437434, -852338, -415331, -404604, -641599, -587271, -195612, -363897, -1302642, -440834, -245742, -595063, -129375, 48726, -123478, -860637, -946632, -981290, -203718, -665494, -688924, -402352, 199528, -35828, -540155, -372724, -459621, -704298, -549426, 101657, 171948, 28864, 269108, -408178, -1496599, -1354028, 418030, 671019, -44349, -123884, -469809, 18592, 208057, -100564, -759384, -822873, -853043]
2387h53043K63722J93348J025625n54022J06653K88574k93792J186400J058515
2378B421980j90951l13216j238950l16738J6397P87839L50001j00735m97988J29441
2368A047080k84319n70884N74111j80150R5028J84416m75792r8353j40014q35715
2358f84592P63228M37272O4025o96320o7006R22407p28500p6274p45088M42143
2348c68705k392M24064N61237p78136N16827K32726L5570L95568k21145m85886
2338C09728j55121O37264M77148q68275O04726M21216q40083J99174k14318k58805
2328C12654N08042j87264J47473m56274o65169j46612M67467M04088n655n73327
2318a94577j18380n44899K07717J104629L84497n33549L61298p65188R20778m4048
$$ y = [-853043, -589321, -395973, 629652, 75630, 182283, 470857, 177065, 1363465, 2421980, 2231029, 1917813, 678863, 362125, 378522, 1166361, 1516362, 1415627, 917639, 1047080, 762761, 191877, 765988, 585838, 680866, 865282, 389490, 291137, 151123, -684592, 78636, 515908, 579933, -116387, -183393, 739014, 10514, -65760, -810848, -368705, -371097, 52967, 614204, -163932, 352895, 585621, 621191, 1016759, 795614, 309728, 154607, 791871, 1269019, 400744, 1005470, 1426686, 586603, 785777, 571459, 312654, 820696, 633432, 780905, 324631, -340538, -487150, -19683, 384405, 378750, -194577, -312957, -857856, -650139, 454490, 838987, 305438, 666736, -98452, 822326, 778278]
2308G78278J39314o2785K4047q0481J30681N58926k25213n90512J63192J50412
2298I85859m08877N2004O05627j30352r3290L34154j99041l58520j20499M64344
2288A131409N17263P20194j006445m17719O59094n45616n8844j88617n36574M82559
2278G56704J17308l45153L56564P51541l42360j141330N39149N23775O85967r33258
2268I68907j4448R07774o32905n40056L71800L41586j30762J04670k49077l28674
2258G98815o71462N67956r48812N84281J52461N3181L39415N5503L51847K54320
2248A537505L58859P6581j116454J57080M05837j26177n1144k30932l29421Q24525
2238A506259P91402k24341o78647L30561k33369K47589l80890K01731J71371Q59466
$$ y = [778278, 917592, 854807, 878854, 798373, 929054, 1487980, 1262767, 672255, 835447, 985859, 576982, 628986, 1234613, 1104261, 1010971, 1345125, 1146084, 787564, 667065, 1131409, 1648672, 2368866, 1362421, 944702, 1603796, 1058180, 999336, 810719, 274145, 756704, 874012, 528859, 885423, 1636964, 1294604, 153274, 692423, 1216198, 1902165, 968907, 954459, 1862233, 1229328, 689272, 1061072, 1402658, 1271896, 1376566, 1127489, 798815, 127353, 695309, -253503, 330778, 483239, 536420, 875835, 931338, 1283185, 1537505, 1896364, 1972945, 856491, 1013571, 1419408, 1293231, 1242087, 1011155, 681734, 1506259, 2297661, 2073320, 1394673, 1725234, 1491865, 1739454, 1358564, 1560295, 1731666, 2591132]
2228B591132o60832o16169m1936P5521L55731j83962R06058J9960k21949P23495
2218B947049r94006K93004p56161O3828O05426l82436J47537j02107N50387m1516
2208B331005M86581n54986o90488L99708R88416R4138M4606q00620k77222J18940
2198B140078K00413L19271J3572P75909O59822k19092J66078o42317K823O29972
2188D046529L82933j020120J23011J03960J17706L51520K69333O34133N43918
2179E552923L88598l58700P31302Q9193J84410o45199k39445P48106j35850k5338
2169F290000J27689N42679N27820m44139n79385J71718N10530j21494J629195
2160H654613L46815l62814R40434K0280K90460N56610J89633n39371O93896M27542
$$ y = [2591132, 1930300, 1314131, 1272195, 1347716, 1703447, 1519485, 2425543, 2445503, 2223554, 2947049, 1953043, 2246047, 1489886, 1553714, 2159140, 1776704, 1924241, 1822134, 2372521, 2331005, 2817586, 2262600, 1572112, 1971820, 2960236, 3054374, 3098980, 2298360, 2021138, 2140078, 2340491, 2659762, 2673334, 3449243, 4109065, 3889973, 4056051, 3413734, 3416557, 4046529, 4429462, 3409342, 3532353, 3636313, 3754019, 4105539, 4374872, 5009005, 5552923, 5941521, 5582821, 6314123, 6403316, 6587726, 5942527, 5703082, 6451188, 6315338, 6290000, 6417689, 6960368, 7488188, 7044049, 6464664, 6636382, 7146912, 7025418, 8654613, 9001428, 8638614, 9579048, 9599328, 9889788, 10446398, 10636031, 10096660, 10790556, 11218098]
2150A1218098O83841N14029K48423M62581J269702Q79476Q03784J02758O4698
2141A6247390J350196J204685J58154J496682M48512O21555J466484J375167J644985
2132B6013810K273337J691488J422259L519436L162431M721969L427859L359277
2124D9591866M272446L728995N493027O516998O542982Q398411J2808196J5795433
2116A13148354J8557048K3398944K8943798M0043901M3579018N611514p251152
2109B66031425k0358056k1192596r055576j8351299j9387162k1604792j7233249
2102A38848695j2729360p241264o947622o335105n620311n999808o139741l450143
2094H4385341l604578p343567p594696o400343n960477l961513m378781m356462
$$ y = [11218098, 11901939, 12415968, 12664391, 13126972, 14396674, 15276150, 16079934, 16182692, 16247390, 17597586, 18802271, 18960425, 20457107, 20905619, 21527174, 22993658, 24368825, 26013810, 28287147, 29978635, 31400894, 34920330, 38082761, 42804730, 46232589, 49591866, 53864312, 57593307, 63086334, 69603332, 76146314, 84544725, 97352921, 113148354, 131705402, 155104346, 184048144, 224092045, 267671063, 273282577, 266031425, 245673369, 224480773, 215425197, 197073898, 177686736, 156081944, 138848695, 126119335, 118878071, 111930449, 105595344, 99975033, 93975225, 87835484, 84385341, 80780763, 73437196, 65842500, 59442157, 53481680, 49520167, 45141386, 40784924]
2086D0784924m058495k257721k955439j645896k118952j175898j223025j805857
2078B3543641j460812n83313l49776j126766j783629k13992r933p58293o04052
2069A6653075n38154m16594J82985j179864j583317L96421n47814p51975j32035
2060A2082728M50025k45071l0244r03112l83467n51219j27181o11419p59230O96126
2050I617936L8572o78710p35711k12823p94249L517J31747j23228k51311N28399
2040G524139N2731r02715j246858P28129J82623k19072K2126L46766o61770Q3624
2030E909723n72222J57587j37178P4300l53442n81461n13945n01663k01397o36253
2020B644049O53068q20824l829J26622J07125L0577m13655n14270L44960P99406
$$ y = [40784924, 36726429, 34468708, 31513269, 29867373, 27748421, 26572523, 25349498, 23543641, 22082829, 21499516, 21149740, 20022974, 18239345, 18025353, 18015420, 17257127, 16653075, 16114921, 15698327, 15881312, 14701448, 13118131, 13514552, 12966738, 12214763, 12082728, 12532753, 12287682, 12257438, 11354326, 10970859, 10419640, 10292459, 9681040, 8921810, 9617936, 9656508, 8977798, 8242087, 8029264, 7235015, 7238532, 7370279, 7247051, 6995740, 7524139, 7576870, 6674155, 5427297, 6155426, 6338049, 6118977, 6141103, 6487869, 5826099, 5909723, 5337501, 5495088, 5357910, 5432210, 5078768, 4497307, 3983362, 3481699, 3280302, 2644049, 3297117, 2476293, 2472464, 2599086, 2706211, 2736788, 2323133, 1808863, 2153823, 2953229]
2010B953229L4113j362941M9839k32931l09001j24446J098552k12281r3491L01175
2000B101817k91829k26781O436M3501p1493q24747K75242O16047m18216n68162
1990F41815n106k0985N45940l16450j6891J2438Q91732J27731p67427M53957j72395
1979A374359l30448k01423l44414l48316P03277k9574l3445K23648j300901O14878
1969C27641J121377p05091N05828l02200q53166R3061L77997n58033k95860K55677
1959c2769R29516K4212q5866q51684J20013O14806K77640k84512m32158K15407
1949D94605J92695k29951j07915K90771j53454l00112L60103p73070J94796M46161
1939D14629K18585p65946L5283M45236o41752N3310k03193L17984m22254j5565
$$ y = [2953229, 2987342, 1624401, 1674240, 1441309, 1132308, 1007862, 2106414, 1894133, 1800642, 2101817, 1809988, 1583207, 1589643, 1633144, 1561651, 736904, 1012146, 1628193, 1209977, 641815, 636709, 615724, 1161664, 845214, 828323, 840761, 1732493, 1860224, 1092797, 1546754, 1374359, 1043911, 842488, 498074, 149758, 853035, 823461, 790016, 1013664, -287237, 327641, 1449018, 743927, 1249755, 947555, 94389, 187450, 565447, 7414, -288446, -32769, 896747, 920959, 835093, -16591, 103422, 718228, 995868, 711356, 279198, 494605, 687300, 457349, 349434, 640205, 486751, 186639, 546742, -226328, -31532, 414629, 633214, -132732, -97449, 347787, -293965, -240655, -443848, -125864, -548118, -563683]
1929e63683O23976j84844j79557l14247N00703o27234m27932J30952m9413N44721
1919e46558K57212r03103j94410Q718k06276Q66467j36713K77222q1854P24504
1909F5209M76731j52792o90600P65714j021595k41156K51987M44711r0403J50465
1899d1729l13206j44685J76577J17289r08057M70357L51274j3006J99803j30632
1889b36015J32683j91796j69583J96174N10665l5111k78071k70909k6373m49434
1879h17770Q79544M09937j332554M17039l37000k60979N80814K13570p38989j16227
1869a102615K90043m67903J009349P7139Q0997l10119J21536M95606K7952q17003
1859e95018m81515P72637P16517Q5606m76275m02775M73934M22877l5601m92771
$$ y = [-563683, 60293, -124551, -304108, -618355, -117652, -744886, -1172818, -1041866, -1091279, -546558, -289346, -1192449, -1386859, -1378141, -1584417, -717950, -854663, -577441, -659295, 65209, 541940, 389148, -301452, 464262, -557333, -798489, -546502, -101791, -192194, -41729, -354935, -499620, -323043, -205754, -1113811, -643454, -292180, -305186, -105383, -236015, -103332, -295128, -464711, -268537, 242128, 207017, -71054, -341963, -368336, -817770, 61774, 471711, -860843, -443804, -780804, -1041783, -460969, -247399, -986388, -1102615, -812572, -1280475, -271126, -193987, -112990, -423109, -301573, 194033, 221985, -595018, -1076533, -303896, 412621, 498227, 21952, -380823, 93111, 515988, 480387, -12384]
1849a2384M41945M43878M04727l16392O47370l85664j019099o60644R55065Q60284
1839A359086o05784o73959m89593M12156J088800k53365k66448O7631J99856m3793
1829G94587O75563n01724m91246l83947N3829l37356l05050M32648M59467m60391
1819f3620p46365O59682l330R914M67891k56508J38036p87328q7897j26403k95853
1808a091781Q46351o3414L51987j189387N6207M55502j52516o21103j74086M9929
1798a532311N74780n89812M13201O69524Q7951Q49152J59451k89199j292785j43570
1788a093618J47396J16265R16254k5547L9656K81516l69805k20825o81320P05065
1778a84963N93473r87324L3643r79565n49253j61336J41525Q09987l2860M21155
$$ y = [-12384, 429561, 873439, 1278166, 961774, 1609144, 1223480, 204381, -456263, 498802, 1359086, 753302, 79343, -410250, 1906, 1090706, 837341, 570893, 638524, 838380, 794587, 1470150, 968426, 477180, 93233, 147062, -190294, -495344, -62696, 396771, -63620, -809985, -150303, -153633, -143719, 324172, 67664, 205700, -581628, -669525, -795928, -1091781, -245430, -308844, 43143, -1146244, -1090037, -634535, -787051, -1408154, -1582240, -1532311, -957531, -1547343, -1134142, -464618, -376667, 472485, 631936, 342737, -950048, -1093618, -946222, -829957, 86297, 60750, 100406, 381922, 12117, -208708, -890028, -184963, 408510, -578814, -545171, -1524736, -2073989, -2235325, -2093800, -1283813, -1316673, -895518]
1768h95518k96636Q90363p4132j60297J11793K13324m79204M76146q8799Q585
1758b94375l23096J52615M474p81201P98373k23895l44352J12634M2032M30253
1748d26538n06363r17516P42552N60904m1124J61771n08809m16851P08267J91294
1738d52413J46171m53826Q95255J22671n17303k32107r8596j05797K72932l42335
1728g65348j69381k7553j46449M89610R40824k50809m86131L45961Q187p70505
1718h31594N50888k88022l43875p15154N50400K96409O11877j86113j402791K53049
1708a504926P39067p8543k1487k33964J55909L84752J674R2985L68039L60694
1698B64200o83651q0776J78611l9396P35505k65355j44846j61125p27668K93692
$$ y = [-895518, -1192154, -301791, -375923, -536220, -424427, -211103, -690307, -214161, -302960, -294375, -617471, -464856, -460382, -1241583, -443210, -667105, -1011457, -898823, -856791, -426538, -932901, -1850417, -1107865, -546961, -588085, -426314, -935123, -1351974, -643707, -452413, -306242, -760068, 135187, 257858, -259445, -491552, -590148, -695945, -423013, -765348, -934729, -962282, -1108731, -619121, 321703, 70894, -415237, -69276, -61089, -831594, -280706, -568728, -912603, -1627757, -1077357, -780948, -169071, -355184, -1757975, -1504926, -765859, -844402, -865889, -1099853, -943944, -559192, -557518, -464533, -96494, 264200, -419451, -500227, -321616, -361012, 374493, 109138, -35708, -196833, -924501, -630809]
1688f30809L44190M40298l53304l63094N38048r62398j0214M78602l7139j06859
1678f62679p10779M15330K01989l98744m57301Q62066N16675M08918q71690O47293
1668d8922K72879n63519m52670k7212n7281o77930J015325N84592n75109p37597
1658a267444N50558L80576L63928M90289k20913K98370j91120l31507p62506K21024
1648d68745K00174K79524m27885K88232K28545j10458k17753L91768R8471j122466
1638h60593N97570M628K89516P35375j469141J3895J001632p59139k8860R47070
1628D71953K82257j378357L08729K98390m83687M44375k63086n16975k49098L00049
1618g85450p46285L15604R70829J62597O8224J4439O53919r8068K68246m8869
$$ y = [-630809, -286619, 153679, -199625, -562719, -24671, -987069, -997283, -518681, -555820, -662679, -1373458, -958128, -756139, -1154883, -1612184, -750118, -233443, 175475, -696215, -48922, 223957, -339562, -792232, -819444, -876725, -1554655, -539330, 45262, -529847, -1267444, -716886, -336310, 27618, 517907, 296994, 595364, 404244, 72737, -689769, -468745, -268571, 10953, -416932, -128700, 99845, -10613, -228366, 163402, 261873, -860593, -263023, -258395, 31121, 766496, -702645, -688750, 312882, -446257, -475117, 471953, 754210, -624147, -315418, -17028, -500715, -56340, -319426, -836401, -1085499, -785450, -1531735, -1216131, -245302, -82705, -14481, -42, 653877, 555809, 824055, 775186]
1608G75186o28314q9694Q9638J49069p52494m9019L72939R74922n29160K71669
1598E84742q12133o35868J7186P00555M42011R5246k42741J30336Q6389j162393
1588g96670l1233L96633n60630J75125J075477n40631k94714m9454Q93527K66642
1578E34072L36889j037261j221720O65381j55340m42375K14974n4022j64524O18920
1568g05006L57253j07423k17588j09605L47060k92988m2124p92477l03919K20815
1558a646002J051304O7250M65802n2591N6870n99683k75567M68802N33173M91566
1548E60924j098424n68041O95090k91252q9806Q35408J44353q39207q75195O74661
1538h51489Q11396m19753l17648m87320l32868M16237O65554R485L93485k43487
$$ y = [775186, 146872, 57178, 146816, 295885, -456609, -505628, -132689, 842233, 313073, 584742, -227391, -863259, -846073, -145518, 296493, 391739, 148998, 279334, 365723, -796670, -827903, -431270, -991900, -816775, 258702, -281929, -576643, -626097, 267430, 534072, 870961, -166300, -1388020, -722639, -877979, -1320354, -1105380, -1159402, -1323926, -705006, -347753, -455176, -672764, -782369, -435309, -728297, -770421, -1562898, -1866817, -1646002, -594698, -527448, -61646, -114237, -57367, -657050, -932617, -463815, 69358, 560924, -537500, -1105541, -410451, -701703, -791509, 43899, 188252, -650955, -1526150, -851489, -40093, -459846, -777494, -1264814, -1597682, -1181445, -515891, -506406, -112921, -356408]
1528c56408p60046J59266L15834j69861K9596L37193N42882o71282n69012J63425
1518i78413q0897O65417M1016M96501p43291J90396k3966l062N71970l41093p57822
1507i63244j9202p9070K94957R8232l69342K56497L05922j85074N19371K79190
1497A38237P7289n45927k07854L43017n41768j98122r00307P07474l39927L96005
1487a071883K16664M27838J65840o63080M04591L15283p6937l46366J73192J53347
1477c01511k06621O08705n47452j65119R98741q6810j71699m94563K68409k37405
1467c35325L00706J03635k78025k302L9207k72366Q3467L3659N48222l61100m92176
1456f32398R53585J67004n85370j00587j18727M98262O0395k81415M36486R91245
$$ y = [-356408, -1116454, -957188, -641354, -811215, -781619, -444426, 98456, -572826, -1141838, -978413, -1059310, -393893, -352877, 143624, -599667, -409271, -433237, -436299, 135671, -205422, -963244, -982446, -1061516, -766559, -668327, -1037669, -781172, -475250, -660324, -140953, 138237, 215526, -330401, -538255, -195238, -737006, -935128, -1835435, -1127961, -1467888, -1071883, -855219, -427381, -261541, -924621, -520030, -204747, -281684, -628050, -454858, -301511, -508132, 100573, -446879, -611998, 386743, 299933, 128234, -366329, -97920, -335325, -34619, 69016, -209009, -211311, -172104, -444470, -361003, -327344, 220878, -140222, -632398, 321187, 488191, -97179, -197766, -316493, 181769, 242164, -39251, 397235, 1388480]
1446A388480r43986k08966k22421K24915K0161j52039J41752m36508P72615m31031
1436A52972O3679n99061p03076p5306p3263L91767N48300m80208j1093M71114
1426c14175r69247R52352k03648k14036J3813m26368Q40834J67849K40366o80113
1416e92373l0763O1360J71421l52152J62306k21410J85419K8744J226674n24549
1406A14677j133656K39513L38675M02670L57664J28874p13037n73074M5631J11591
1396f80472L6328Q20564K26056k68496L29258N6529m36479O26690L3401k65705
1386D77674p33042J04499J61688L87272O44205l63577n49042l75984o1713J85778
1376a22242n82781L94664k15507R6860Q21609n74784l78042P8085o18601M08115
$$ y = [1388480, 444494, 235528, 13107, 238022, 258183, 106144, 247896, -188612, 584003, 152972, 216651, -382410, -1085486, -1160792, -1234055, -842288, -293988, -774196, -785289, -314175, -1283422, -331070, -534718, -748754, -734941, -1161309, -320475, -152626, 87740, -592373, -623136, -561776, -390355, -742507, -580201, -801611, -616192, -587448, 639226, 114677, -1018979, -779466, -440791, -38121, 319543, 448417, -264620, -837694, -792063, -680472, -644144, 176420, 402476, 133980, 463238, 519767, 83288, 709978, 743379, 477674, -255368, -150869, 10819, 398091, 1042296, 678719, 129677, -246307, -308020, -122242, -705023, -310359, -525866, -429006, 392603, -182181, -560223, -482138, -1100739, -692624]
1366f92624N45382K94769l04227J46040j56577p55725p3263j44133M84111M90675
1356a65572q145l29610j90904j34668K16468R8706O78323r34546N6211j12063
1346h25800O39887K21716k20839M7955o50617l85145P65829R68528m63105r5584
1336B825J49442m99467L05158Q06004M65085m76372r76913K43107m53643M07738
1326b7036P03077O1183m41714j98367J9904j99706k40036L72395J55663J64079
1316C69442o5239J68467J7656l70372k23246n2922j98948k26608n07691O81112
1306d08349j59210K07110M1994L70481k06609p84941M57860l02215q7594O64685
1296b06788K00454m3473M32677l27509p32709m25763M62364M3100p9942l3886
$$ y = [-692624, -147242, 147527, -156700, -10660, -167237, -922962, -996225, -1140358, -656247, -165572, -173717, -503327, -694231, -828899, -612431, -513725, 164598, -769948, -713737, -825800, -185913, 35803, -185036, -137081, -787698, -1172843, -407014, 561514, 98409, 2825, 152267, -347200, -42042, 763962, 1229047, 752675, -224238, 18869, -434774, -27036, 676041, 737224, 295510, 97143, 117047, -82659, -322695, 49700, 205363, 369442, 304203, 472670, 490326, 119954, -103292, -156214, -355162, -581770, -1089461, -408349, -567559, -360449, -318455, 52026, -154583, -939524, -481664, -783879, -871473, -206788, -6334, -49807, 382870, 55361, -677348, -1103111, -640747, -597647, -677589, -711475]
1286g11475O77968j28967L95782K91076L52696k59398l48372J39497j33851j2663
1276B62293L45906m00627l78129K35544o7340n19905L05384K38980N19134r8183
1266D43057j139135M63642m9907k69447N4212k07373P51662l9419P01020K75399
1256I83711r67005o20374N3498K6692m11540Q51445J66240J9706O89250o25375
1246A66248l58785K57678R9008O17529n35795k6697P12246j80885k53456j67271
1236C29820o35425K65838p06710L77973l57684Q9259M21640P4589k86594l71358
1226g98652L71437l39762P21472L98115j79745m78609N21937J86745r6152q18910
1216e12124N08362M18229r20842R27576Q8159p1534l71109j498576N55319J87118
$$ y = [-711475, -33507, -162474, 233308, 524384, 877080, 617682, 269310, 408807, 274956, 262293, 608199, 207572, -170557, 64987, -2353, -522258, -216874, 22106, 541240, 443057, -696078, -232436, -282343, -551790, -497578, -704951, 46711, 7292, 708312, 983711, 16706, -603668, -550170, -523478, -935018, -83573, 82667, 102373, 791623, 166248, -192537, 65141, 164149, 781678, 245883, 219186, 931432, 750547, 497091, 329820, -305605, -39767, -746477, -368504, -726188, -636929, -215289, -140700, -427294, -798652, -427215, -766977, -45505, 352610, 172865, -305744, 216193, 402938, 306786, -512124, -3762, 414467, -506375, 421201, 509360, 437826, 66717, -1431859, -876540, -689422]
1206f89422K65270L74631N86752j75615j287487n52937K36821P09258J095683
1197E62954N0655r38694k78887L87227K1708Q26363K68797J7334j048225q62511
1187i93279Q07683R46990n6793j130886j59938k29997Q45365K74219l27570k61829
1177b86035J55716L33963J089089p57825p15940l50049j44041j836O01194l97122
1167d72886K05607p3283Q9624K76131o5256j76544J47223o2785K91616M03666
1157E63113p67209n80189J35352r6059P90241R6482n31104M1732j61716O90078
1147A80721k12616o53910L3212L98694l78754k52979m68745M12732M41174N69299
1137F8828k5531k18663N2177k53591k11223n83451P04648N59609m96575L26299
$$ y = [-689422, -424152, -49521, 537231, 361616, -925871, -1478808, -1241987, -532729, 562954, 613609, -325085, -603972, -216745, -195037, 631326, 900123, 917457, -130768, -993279, -185596, 761394, 704601, -426285, -586223, -816220, 29145, 303364, -24206, -286035, -130319, 203644, 1292733, 534908, -181032, -531081, -675122, -676958, -75764, -472886, -267279, -340562, -250938, 25193, -40063, -216607, -69384, -132169, 159447, 563113, -204096, -784285, -648933, -744992, 45249, 141731, -389373, -347641, -509357, 180721, -31895, -685805, -652593, -253899, -632653, -885632, -1354377, -941645, -500471, 68828, 43297, -175366, -123189, -376780, -588003, -1171454, -466806, 92803, -403772, -77473]
1127g7473Q0413M07850J55008k14704o22375l1654P22489J45339o35271R1592
1117B1214o8545m13762M04863K60387j98899J90241n22297L69799p68297K64716
1107d60580L02289M45343O44768m9680j250704j37235k36610m66435M17058K80178
1097e11608k77148K52534m17089P2180O1624J56755J145672j47008l90893l39184
1087c94165O65796N94233r56628p83972J301622L06581k30219o30767P80829j03397
1077E49913J41340m2141k60879m7375n43746j98520K01608m88750K81948r0316
1067d96918l2168k86787J1656M46991M1646L07469j00742k02889m66370P46659
1057c1453L98713q40684j11648M71929Q53843j77324Q999q77264R9554K47982
$$ y = [-77473, 2940, 410790, 565798, 351094, -271281, -302935, 419554, 564893, -70378, 21214, -47331, -461093, -56230, 204157, 5258, 195499, -326798, 43001, -725296, -460580, -158291, 287052, 931820, 882140, -368564, -505799, -742409, -1208844, -791786, -511608, -788756, -536222, -953311, -881131, -819507, -662752, 482920, 335912, -54981, -394165, 271631, 865864, -90764, -874736, 426886, 733467, 503248, -127519, 653310, 549913, 691253, 649112, 388233, 340858, -202888, -401408, -199800, -688550, -406602, -496918, -529086, -815873, -804217, -357226, -315580, -8111, -108853, -311742, -778112, -31453, 367260, -473424, -585072, -113143, 740700, 563376, 572375, -304889, -205335, 42647]
1047D2647r03571l36205j43156N98595M41125Q46950m90861m13121k67762L53833
1037b71526L69657m71015J58517L67816O16299j062356m51922Q9826Q42335l4586
1027A53045k09467M64469n83212O66326r822n05757M60836M11042k20421p4600
1017E52439j279151M98872L03675p54770N25386L93805N42211p8761m55969K4865
1007B72602L27997m10600l35881K8984O15836n89431L99938M63009j300845L74816
997a53575j14843j05065k92265K48643J055476k76627j217358m94645R92946M48470
987I1157r8126j31300Q65642J36792l55829l00834N23262m21733m46667Q93135
977G55499k98925J91227K075M21310j108908l06495R1524n3995O93580o31337
$$ y = [42647, -860924, -1197129, -1340285, -741690, -300565, 546385, 55524, -357597, -625359, -271526, 98131, -372884, -214367, 153449, 769748, -292608, -744530, -654704, 187631, 153045, -56422, 408047, -175165, 491161, 481339, -24418, 436418, 847460, 627039, 552439, -726712, -227840, 75835, -678935, -153549, 240256, 782467, 703706, 247737, 272602, 600599, 189999, -145882, -116898, 498938, -90493, 309445, 772454, -528391, -153575, -268418, -373483, -665748, -417105, 638371, 361744, -855614, -1350259, -357313, 91157, -6969, -138269, 727373, 864165, 508336, 207502, 730764, 309031, -137636, 755499, 456574, 647801, 649876, 1071186, -37722, -344217, -252693, -306688, 386892, -244445]
967b44445N40819k20685O0525J04399N33546p9085m99588P5986J25876K36039
957F33387o16506O11519o40499m27897k45923L68098k35951R1976Q53560l31721
947F0043j51758m64570L92969L95066L16910J54006j90156o79431L92546O8168
937B93793l55346Q78780k67587n38675m46823K56163M5676m1243L84302O11145
927H20185k75392j041443K05980N85550j127141Q12683m58357Q6451K39558J71546
917A9620J6344l51884l05511j39119R96977k76922k48697K14676L95220J83079
907E03783K85987J74900O828n01987k60190m86569L43208j45437l12270l11805
897g03552k48332K12442M83768M68777q4699N23809n72742k68342j19937l28426
$$ y = [-244445, 296374, 75689, 136214, 240613, 774159, 695074, 195486, 271472, 397348, 633387, 16881, 628400, -12099, -439996, -685919, -317821, -553772, -461796, 391764, 60043, -91715, -556285, -163316, 231750, 548660, 702666, 512510, -166921, 225625, 293793, -61553, 817227, 549640, 10965, -435858, -179695, -134019, -175262, 209040, 820185, 544793, -496650, -290670, 294880, -832261, -19578, -477935, -391484, -151926, 19620, 35964, -315920, -621431, -760550, 236427, -40495, -289192, -74516, 320704, 503783, 789770, 964670, 971498, 469511, 209321, -277248, 65960, -79477, -391747, -703552, -951884, -739442, -255674, 213103, 128404, 652213, 79471, -188871, -308808, -637234]
887f37234N12638J998m23798Q48623J20618P8778l77916j20072R74199k48981
877G28853l34770p90146k45600N69953j07197l14625o4230M7179O45831l88907
867b53659L97835M9520O53691p44584j08369M32929r10587m71005R71803N18983
857E36557n80979J72823k75302r99990L78315N82665N51257m25187L69362j91007
847A18514p7928j071214N08854P97894L38765k0761m65544l16118l69881N63099
837E680N02706K33933J6138l50919J47881o38818N59743P36139q69234O4827m08767
826f91N53758m72554n49358n00642J274684Q8471p71819L20192O40269o9140n40161
815b6991j4482M84120P2242l13988P30258k85507k26818m9960l66745N66856M75912
$$ y = [-637234, -124596, -122598, -546396, 302227, 422845, 501623, 123707, 3635, 977834, 728853, 394083, -396063, -641663, -71710, -178907, -493532, -557762, -510583, 135248, -253659, 144176, 193696, 847387, 102803, -5566, 427363, -483224, -954229, 17574, 536557, -44422, 128401, -146901, -1146891, -768576, -185911, 365346, -59841, 309521, 118514, 40586, -1030628, -521774, 276120, 614885, 594124, 128580, -187538, -557419, 5680, 508386, 742319, 758457, 407538, 555419, -83399, 476344, 1212483, 343249, 408076, -691, 553067, 80513, -468845, -969487, 305197, 393668, -378151, -57959, 582310, 513170, -26991, -41473, 442647, 514889, 200901, 931159, 645652, 418834, 368874, 2129, 568985, 1044897]
804A044897n50846o32625J216J76117k15987q59392O41456R85572K14394l40160
794D64642L59081j01769j08913M78169l87421k72946O85836q30665K46687R93633
784A526334l91043m73332O20131p40544q5863O09966k9341p21760m01541q77470
774i64463O11996K62476n40596J06592P74924o24585O00147m33582m6483K97562
764D3988l10872l95433J292867l13624N21118K9003j31477K55526j89712M98615
754A299999o32192J90851o67865L82910p01423N12138N04449m70668k3726M80352
744H74825n35825M79679n75162n53355O2064Q14922K58950o7436j53029p2007
734E33626m36479L32107j44310J12562n7741k41691M96552o6426l58504j45268
$$ y = [1044897, 494051, -138574, -137358, 38759, -177228, -1036620, -395164, 590408, 804802, 464642, 823723, 721954, 613041, 1091210, 703789, 430843, 1116679, 286014, 532701, 1526334, 1135291, 661959, 1282090, 541546, 455683, 1065649, 1036308, 314548, -86993, -964463, -352467, -89991, -630587, -523995, 250929, -373656, 226491, -207091, -253574, 43988, -266884, -662317, 630550, 316926, 838044, 867047, 735570, 991096, 801384, 1299999, 667807, 858658, 190793, 573703, -127720, 384418, 888867, 418199, 394473, 874825, 339000, 818679, 243517, -309838, -247774, 567148, 826098, 758662, 605633, 533626, 97147, 429254, 284944, 397506, 339765, 98074, 594626, 528200, 169696, 24428]
724B4428n46538l0642j8295J048840o98789L77589J18043j32980p87479L15004
714c30819K45054l49241p65378L46521K98310m15098R62965J17793n127n1207
704E3773L7866P98856p14776n97599L57007M31433n86774P1157k07589K7307O21096
693B91757J37815J70049o71174Q5884o83387J33641N73790k4296n00793k25841
683g12555R54622J37690m48797K88685j09683L02470q27021K10021N7075M06450
673B58957K26136O544n48686L69176m89870m60938K38874O86861o28862M91605
663A49797L57594j5427n63646j18142N7600R27701n1318o22698J82053m4290L77686
652F36910l66222l26027j57858M63072o50472J134754l50724k69732M36342k27668
$$ y = [24428, -522110, -552752, -571047, 477793, -220996, 156593, 274636, 141656, -645823, -330819, -85765, -435006, -1200384, -853863, -555553, -970651, -7686, 110107, 104980, 53773, 91639, 890495, 175719, -421880, -64873, 366560, -220214, -149057, -356646, -329339, 291757, 429572, 599621, -71553, 14331, -669056, -535415, 38375, 14079, -486714, -712555, 242067, 379757, -69040, 219645, 109962, 412432, -414589, -204568, -147493, 258957, 485093, 491637, -57049, 312127, -177743, -638681, -399807, 287054, -341808, 149797, 507391, 491964, -71682, -189824, -132224, 795477, 744159, 121461, 303514, 259224, 636910, 270688, -55339, -213197, 249875, -400597, 734157, 383433, 113701, 550043, 322375]
642C22375N88282j32007J33564p03394o23074N35624j81423j085735M96128Q27308
632A77648l44515J37793M58977l36446J48992K1557j59579l36701J231505N47438
622A546669j034030Q65525m58107o16104J02420J07889M52005j036290o45410
613g15433O77699M56981k44020l98279K54632K07760o02945L15691P67849k53382
603D66553j19532K55718l19845m39583j67949L66038K25271n28909o42830K7590
593h77478J049363j42691j51149P158P1658j173177K85167J116372J55754M19398
583G60375L28261j30998L3728K90348l05104o23546k87872K88845m43283l2019
573a21265K48709q4223k51527m11443N27496j74169k12048K73003M33287n56066
$$ y = [322375, 910657, 778650, 912214, 208820, -414254, 121370, -60053, -1145788, -649660, 177648, -166867, -29074, 429903, 93457, 242449, 264006, 104427, -232274, 999231, 1546669, 512639, 1378164, 920057, 303953, 406373, 514262, 966267, -70023, -715433, -37734, 419247, 175227, -223052, 31580, 239340, -363605, -47914, 719935, 466553, 347021, 602739, 282894, -156689, -324638, 41400, 266671, -262238, -905068, -877478, 171885, 29194, -121955, -114797, -43139, -1216316, -931149, 185223, 340977, 760375, 1088636, 957638, 991366, 1281714, 976610, 353064, 65192, 354037, -89246, -121265, 127444, 43221, -208306, -619749, -92253, -266422, -478470, -205467, 227820, -328246]
563c28246Q9675N91375l10690n67518N85693L67389j26649l3403J44039L94290
553H05955k36424J46795K11980j29301o70407J26118l58313n9157J033256n17450
543C53052k44678m44241j64931K50370O72927O77951l8984o00884n29458L44233
533B75357O7082n40059O3412M3606J57152j039387m61572J300240n69071k01159
523i04399J305651P88176k38590j30367r80312m5546N56857k32484j019328m02089
513a302431J247652P71036p25405M26008M04331J16270j04624p9107k12586o61345
503a20201K60557J35431m19844J27065L63405N99371M20280j99353K97244M90984
493A954939m84681r77463J05450M45130k84410q28329j94595K0867O58606n13220
$$ y = [-328246, -238571, 352804, 42114, -525404, 60289, 427678, 301029, 267626, 411665, 805955, 569531, 716326, 928306, 799005, 128598, 254716, -103597, -162754, 870502, 353052, 108374, -335867, -500798, -250428, 422499, 1100450, 1061466, 460582, -68876, 275357, 342439, -197620, -134208, -90602, 66550, -972837, -1434409, -134169, -703240, -904399, 401252, 1189428, 950838, 820471, -159841, -205387, 351470, 118986, -900342, -1302431, -54779, 716257, -9148, 416860, 821191, 937461, 832837, 753730, 541144, -120201, 140356, 275787, -144057, -16992, 346413, 945784, 1366064, 1166711, 1463955, 1954939, 1470258, 492795, 598245, 1043375, 758965, -69364, -263959, -243092, 415514, -97706]
483i7706M49826L48140j76650o74608N77962Q00807j257694J25218M06515J30815
473F32625Q7434J07857m3891J9767m9451p16335J87590J076275l30872o43364
463C27635L72669k67611o44804P87772m91778P22151k94160K75451P77904m8883
453A516346o34687o7431j79977K10531M70310q02460j65309K54806l7974q1506
443D82649n98444m4083Q16862J09882k72104q2160l88421m49397M24302J101960
433A101046k46772n85026l01145N90680J44306q80951K61507L17113l19717r13172
423h32131N67761K82429p0106K46497M21471n10688K28939k68789M77273J028665
413A571321n27305k81526p85898j05685J337463j41351m80915J70229l01904m3165
$$ y = [-97706, 352120, 700260, 523610, -150998, 426964, 1227771, -29923, 95295, 501810, 632625, 720059, 827916, 784025, 803792, 754341, 38006, 225596, 1301871, 970999, 327635, 700304, 432693, -212111, 575661, 83883, 806034, 511874, 787325, 1565229, 1516346, 881659, 814228, 634251, 844782, 1315092, 512632, 347323, 602129, 564155, 482649, -115795, -159878, 656984, 766866, 494762, 412602, 24181, -425216, -914, 1101046, 854274, 269248, -31897, 558783, 703089, -177862, 83645, 400758, 81041, -832131, -264370, 18059, -52047, 194450, 615921, 105233, 334172, 65383, 542656, 1571321, 1044016, 762490, -23408, -129093, 1208370, 1067019, 586104, 756333, 454429, 411264]
403D11264L35954n32332j91383K19446K3692r00771K08254M67700Q96556p41095
393A97285j330203M89437O97018j8806m07155J25137o49513M19539R77178j59290
383C40627o75021L74825M08139N29786N13747k35677q28090L06025L01031m98049
373E37343k34943K00045j32811J59980N1706J38568J45940O2097q6780k20737
363F20408m55835L49624M87939p56663o79526m61698n0120R4653L47746K95907
353b07565N97920P89381o3654m96727M11902q67236o86202R87229J49948r90880
343c75884K20649J057364L997q34432K43080m57594l85723K60554J89805m8705
333a26889L79817k88564M7788P98201k95153P86654o22437n13029K31082k98600
$$ y = [411264, 747218, 214886, 23503, 242949, 266641, -634130, -425876, 41824, 938380, 197285, -1132918, -643481, 53537, 34731, -372424, -247287, -896800, -477261, 499917, 340627, -334394, 40431, 448570, 978356, 1492103, 1256426, 428336, 734361, 1035392, 537343, 302400, 502445, 369634, 529614, 581320, 719888, 865828, 927925, 841145, 620408, 164573, 514197, 1002136, 245473, -434053, -895751, -945871, -851218, -503472, -207565, 390355, 1179736, 1116082, 619355, 1031257, 164021, -522181, 465048, 614996, -375884, -155235, 902129, 906126, 71694, 314774, -142820, -528543, -267989, -78184, -126889, 252928, -35636, 12152, 810353, 515200, 1301854, 679417, 166388, 397470, 98870]
323I8870M53N69679l31706L52252j0860j39129N3953k37704K60201p91777N59215
312C83447J00413K29934J328q59303r09235O28493K0264M61896l15722P50329
302D91844L22457j68654N38774K66592q54327q14878q1015l99983N19863j95592
292c74919L27461j67842J15634M91862l59106K46943J06631k37313J54070L61984
282F65405o4215q09446l2037O11424Q09398m69331J14376m23961M32049l30885
272E02777N53226l86213k87559k93528K53640o19176N73495J087592r33194R96365
262A447425K00770m00955k92676k63055k4679r01003o6915K56479L30615K4088
252C10094n90534N46805L99128j90625m17024L1532M11933l19752l01129M95759
$$ y = [98870, 99323, 669002, 337296, 689548, 678688, 539559, 593512, 355808, 616009, -175768, 383447, 483860, 713794, 715122, -144181, -1053416, -424923, -404659, 57237, -258485, 491844, 814301, 645647, 1184421, 1451013, 596686, -218192, -299207, -699190, -179327, -374919, -47458, -215300, -99666, 392196, 33090, 280033, 386664, 149351, 303421, 665405, 601190, -208256, -240293, 371131, 1180529, 711198, 825574, 401613, 833662, 502777, 1056003, 669790, 382231, 88703, 342343, -276833, 296662, 1384254, 451060, 1447425, 1648195, 1247240, 954564, 691509, 666830, -234173, -301088, -44609, 286006, 310094, -280440, 266365, 665493, 474868, 57844, 89376, 501309, 181557, -119572, 376187]
242C76187m98864l65130o8313k35499N80185N76925M37749M59471k0334p63003
232D79374m40527L54375J40396k74615j25710J08370p0598j65978N87594l57154
222B35527k84241M89558l78121M33095j04343r73297L40953J93964L11163L25196
212E89454N84599o46138q51600Q20855J4139n6441J02417k8331k05778Q3132J23193
201E29501j076733Q49666m7517k0281M62218M11489O10361q92150o5919n48107
191B12528O65917L09746o9743o49672p85934K89145K42010J94293J52765J22399
181F83454P70646L99838j332558q08852k2560l78759M72157J16966o4989L02611
171A37954Q55981q0273n97337M51721O1736o20312K05945J27830P89817j59230
$$ y = [376187, -122677, -487807, -556120, -791619, -211434, 365491, 803240, 1262711, 1242377, 479374, 38847, 393222, 533618, 259003, 133293, 241663, 171065, 5087, 592681, 235527, -48714, 440844, 62723, 495818, 391475, -581822, -240869, -46905, 264258, 589454, 1174053, 527915, -323685, 497170, 511309, 454868, 557285, 528954, 323176, 406308, 529501, -547232, 302434, 254917, 234636, 696854, 1108343, 1718704, 826554, 760635, 212528, 878445, 1188191, 1118448, 468776, -317158, -28013, 213997, 408290, 561055, 683454, 1454100, 1853938, 521380, -287472, -310032, -688791, -216634, -99668, -164657, 137954, 993935, 913662, 316325, 768046, 829782, 209470, 415415, 543245, 1333062, 1173832]
161A173832l31821m83942j91530o86347N1555J172700O95133o64178l91889k0357
151C23156l7345l53951o9769l72395M11794n55096Q64143l55056m20082N82778
141A8177J33079L77626k27439K29707J44461j63039j98861l87176n31307M38106
131a66666n8046J57755J78597l5100P1275J80675j3835n352o7175o390K51372
120D87110j21861m47900o6234N56124M19760p09440K10189n57058K46852j03641
110h6099O91275l53832l94941K41655L99232M18008k73811n16588K60301j35828
100B49372J70787N6680J53235k0022o02547L43875L16161m13639L12671j73519
90C93054O15272k99382k8444K68240k26243m33848j64553r7981K91100P94765
$$ y = [1173832, 842011, 358069, 166539, -519808, -468253, 704447, 1399580, 735402, 343513, 323156, 285811, -68140, -137909, -510304, -98510, -653606, 210537, -144519, -564601, 18177, 151256, 528882, 301443, 531150, 675611, 512572, 313711, -73465, -604772, -166666, -224712, -66957, 111640, 76540, 147815, 328490, 314655, 309303, 242128, 235738, 487110, 365249, -82651, -148885, 407239, 826999, 117559, 327748, -229310, 17542, -86099, 605176, 251344, -143597, 98058, 497290, 915298, 641487, 124899, 385200, 249372, 420159, 476839, 630074, 610052, 7505, 351380, 667541, 253902, 566573, 393054, 1008326, 708944, 680500, 948740, 722497, 288649, 124096, 26115, 317215, 1111980]
80A111980l22235k51631J04970j24739m84727J39311O5626M33276J95545k70220
70E97156p39567k1307O54280j99727k93184M26506k05068P17910l04424n50387
60H2188J28808q1038J7901L01233J00558j00647J96150l32202k19368j15045M80740
49D59278K14734l67054K46892K71519o51071k03453n00175N98115Q33782k71699
39F30868k47706j92877M2870l30073M36450K21457n20380N64748n8629q6789N76604
28A036543l59629O0625j12902P751j29320J27156J91243k78441K10626L99362
18A153014k24294q51953l02981K15987K6487k18470N6091L80838k96735n506Q39266
7G71744J02933k38742p19606L86452M7720n86329L65425
$$ y = [1111980, 789745, 538114, 643084, 518345, 33618, 172929, 238555, 671831, 867376, 597156, -142411, -163718, 490562, 290835, -2349, 424157, 219089, 936999, 632575, 82188, 210996, 129958, 147859, 449092, 549650, 449003, 645153, 312951, 93583, -21462, 459278, 674012, 306958, 553850, 825369, 174298, -29155, -529330, 68785, 902567, 630868, 383162, 190285, 233155, -96918, 339532, 560989, 40609, 605357, 546728, 459939, 1036543, 676914, 737539, 624637, 632388, 503068, 630224, 821467, 543026, 753652, 1153014, 928720, 76767, -226214, -10227, 16260, -202210, -146119, 234719, -62016, -67522, 771744, 874677, 635935, -83671, 302781, 350501, -235828, 129597]
0A29597
$$ y = [129597]
$$ Imaginary data points
##PAGE= N=2
##DATA TABLE= (X++(I..I)), XYDATA
16383a614693o68303K38424O67528j50684j66379n4506K36263n12335K6928Q13574
16373a184183j01909l28681q1497L34407K98006K05714m51911K01041O3702k12363
16363a257674j26388k40656M69338j87024R97417j34292m67068N8362j27000m87799
16353a502784K04686P57026J19553J37245o13586l57484K15443M59096J20129
16344d60676j38543m23817L29677N7365n6737r8163k29303j11566L61892J025178
16334B55307l03192j68489L17004J52176O0518n10794k4659J03316j48626L39797
16324G2358k65427k30301K55244j98612k78540l2924N39015L74055j024888m97756
16314a287776J38964P17808K89828o43005L73802k9201P80515J25799q27304N83490
$$ y = [-1614693, -2282996, -2044572, -1377044, -1527728, -1694107, -1748613, -1512350, -2024685, -1997757, -1184183, -1286092, -1614773, -1696270, -1361863, -1063857, -858143, -1310054, -1109013, -1045311, -1257674, -1384062, -1624718, -1155380, -1342404, -344987, -479279, -946347, -887985, -1014985, -1502784, -1298098, -541072, -421519, -284274, -897860, -1255344, -1039901, -580805, -460676, -599219, -1023036, -693359, -635994, -692731, -790894, -1020197, -1131763, -769871, 255307, -47885, -216374, 100630, 252806, 313324, -197470, -222129, -118813, -267439, 72358, -193069, -423370, -168126, -366738, -645278, -678202, -139187, 234868, -790020, -1287776, -1148812, -431004, -141176, -784181, -410379, -439580, 340935, 466734, -360570, 222920]
16304B22920J44615n03203O74003k25025o8056J00092K18144M31595p55426o3297
16294A76362m41402l46571R20524J41207l8057N12685k43321J67829N0455k08232
16284F91479o71359Q13914n34745N28067n4217P4594K22421l36181O17361J93572
16274A544906p76055j41705M74109Q52195j23504p53575l90373L54381m82976
16265E57403N47210K6291q06975K34462O08503J87899o91303M42037l51339N3562
16255H07750K10264L08562j92997N89131K57474l35266q55234j75918N46592l11782
16245H48576J93434n41894N0762L83158M76137m3064p39625k9905Q35901j57939
16235A275541l39153J41377N46247N9574k70405j69381L0726k93387k23515J030726
$$ y = [222920, 367535, -135668, 538335, 313310, 245254, 345346, 563490, 995085, 239659, 176362, -265040, -611611, 308913, 450120, 412063, 924748, 681427, 849256, 899711, 691479, 20120, 834034, 299289, 827356, 773139, 847733, 1070154, 733973, 1351334, 1544906, 768851, 627146, 1101255, 1953450, 1829946, 1076371, 685998, 1040379, 557403, 1104613, 1130904, 323929, 558391, 1166894, 1354793, 663490, 1105527, 754188, 807750, 1018014, 1326576, 1133579, 1722710, 1980184, 1644918, 789684, 613766, 1160358, 848576, 1042010, 500116, 550878, 934036, 1410173, 1367109, 627484, 597579, 1433480, 1275541, 936388, 1077765, 1624012, 1683586, 1413181, 1243800, 1274526, 981139, 757624, 1788350]
16225A788350n13990l49049J389178J69896o20990j47345k40604J58171o40088
16216I93529K78113N08625R2022L22259N6939j076981L75232K58091L45760l46679
16206A806910N32235k62782l90510N69371O94119r92567q75599N44310M22905
16197B048392k10631m37412M41628o86261r0229N64385K4924O77929J64570r03969
16187A593326L27408R35819q06313r7148L35130m08832r01883P69110j20169l38566
16177A287882R70677L81146k50326l84193K17629K33530k38168j50859n48359
16168A518959L92881N37157N21190Q7310q92881n4472l31750J45320J56764k80830
16158A799648L82533L99429m47175o61172n0096Q8129k99402K28702M66596K87708
$$ y = [1788350, 1274360, 925311, 2314489, 2484385, 1863395, 1716050, 1475446, 1633617, 993529, 1271642, 1780267, 1872289, 2194548, 2251487, 1174506, 1549738, 1807829, 2153589, 1806910, 2339145, 2076363, 1685853, 2255224, 2949343, 1956776, 1081177, 1625487, 2048392, 1837761, 1400349, 1841977, 1155716, 1065487, 1629872, 1654796, 2332725, 2497295, 1593326, 1920734, 2856553, 2050240, 1953092, 2288222, 1879390, 977507, 1746617, 1626448, 1287882, 2258559, 2639705, 2389379, 2005186, 2222815, 2456345, 2218177, 2067318, 1518959, 1911840, 2448997, 2970187, 3057497, 2164616, 2110144, 1778394, 1923714, 2080478, 1799648, 2182181, 2581610, 2134435, 1473263, 1423167, 1511296, 1211894, 1440596, 1907192, 2194900]
16148B194900r1985K53234n84069J99494m45342N6352P01002J4925L2243l95586
16138A935168L70632k46757n25687l45826K22696M17030L11819J47976o36884
16129A650167j69801L53648j13080l16112N84566J74754l91760j89864Q34085
16120B416603p18596L46843l50690j77207L90363M35766P3723L34648n03917L98675
16110B646211L07818p52988Q176n96638k70531N18243K45028K86255r38110K03882
16100A657346P23262J52664j70911L16001p53860o44264J67442j99045M60209
16091A708844j58120l7529L82907K92173r20577Q37648R04828K95399j000734
16082B304839L72812O93885m75875j88756m93341q1507J61399L84558M77343o53894
$$ y = [2194900, 2102915, 2356149, 1772080, 1971574, 1526232, 1582584, 2283586, 2298511, 2330754, 1935168, 2305800, 2059043, 1533356, 1187530, 1410226, 1827256, 2139075, 2287051, 1650167, 1480366, 1834014, 1720934, 1404822, 1989388, 2164142, 1772382, 1582518, 2416603, 1698007, 2044850, 1694160, 1516953, 1907316, 2343082, 2416805, 2751453, 2247536, 2646211, 2954029, 2201041, 2209217, 1612579, 1342048, 1860291, 2105319, 2391574, 1453464, 1657346, 2380608, 2533272, 2362361, 2678362, 1924502, 1280238, 1447680, 1248635, 1708844, 1550724, 1513195, 1896102, 2188275, 1267698, 2105346, 3010174, 3305573, 2304839, 2677651, 3371536, 2895661, 2706905, 2213564, 2132057, 2293456, 2678014, 3155357, 2501463]
16072B501463m3862j12450p7584m63763K57659K99676L61437m1046R18343q46053
16062B753820l01139l28898J3083k87083O3483O27799o67608M81828K40506J5940
16052B611731j090639Q53085k67291K20051R03161J06981n90761N98525j23411
16043C221432o94276m94981j44096k15280K72362M75163K44817K76280o28166
16034B313255M64188J74014m95875k53586M41355q6790k0740J29920M6949l99520
16024B313170m90403m38859Q98617L11590L4203m02079o96355j307J35622O5135
16014A729334o11430l15947J40528O9428N51363K92284O4810O34611q61226N04756
16004B198511P08779m64739K77030j90460j69677j4858q52524J49707Q05312m85883
$$ y = [2501463, 2457601, 2345151, 2267567, 1803804, 2061463, 2361139, 2722576, 2681530, 3599873, 2753820, 2452681, 2123783, 2136866, 1849783, 1913266, 2541065, 1873457, 2355285, 2595791, 2611731, 1521092, 2374177, 2106886, 2326937, 3230098, 3337079, 2746318, 3344843, 3221432, 2527156, 2032175, 1888079, 1672799, 1945161, 2420324, 2665141, 2941421, 2313255, 2777443, 2951457, 2455582, 2201996, 2643351, 2556561, 2535821, 2665741, 2712690, 2313170, 1822767, 1383908, 2282525, 2594115, 2628318, 2226239, 1529884, 1528577, 1664199, 1729334, 1117904, 801957, 942485, 1011913, 1563276, 1855560, 1920370, 2554981, 1693755, 2198511, 2907290, 2442551, 2719581, 2529121, 2359444, 2344586, 1492062, 1641769, 2447081, 1961198]
15994A961198M12570N24928K02305o12635j87695J96259m87582k06783q9457K88470
15984B001578O7986M01888j71809r7894O7437N5965O57337k91521n39328N09520
15974B661159m2062K79649J37432j73002p77735k90003M30808k24861j22849k51092
15964A627444k28236J217146J66262p06995l12931R2354K35988p5527o4668P46320
15954B697157k34578j56703K42321l14350L98522J9086k83166q2343O10175l24727
15944B571394J11523m86949q37121K47395k10413p1299J007343J30567L56195
15935B818635j36731m35427l73293o7333J091N99056k15500m89706R92338o0590
15925B632540l68787k74784P4660J410492j57023r17473l03398p00294O37770
$$ y = [1961198, 2373768, 2898696, 3101001, 2488366, 2300671, 2496930, 2009348, 1802565, 1713108, 2001578, 2069564, 2471452, 2299643, 2201749, 2269186, 2325151, 2982488, 2690967, 2151639, 2661159, 2619097, 2898746, 3036178, 2863176, 2085441, 1795438, 2226246, 2001385, 1878536, 1627444, 1399208, 2616354, 2782616, 2075621, 1762690, 1855044, 2091032, 2015505, 1950837, 2697157, 2462579, 2305876, 2548197, 2233847, 2632369, 2651455, 2368289, 2285946, 2896121, 2571394, 2682917, 2195968, 1358847, 1606242, 1395829, 1324530, 2331873, 2462440, 2818635, 2681904, 2246477, 1873184, 1805851, 1806942, 2405998, 2190498, 1700792, 2693130, 2632540, 2263753, 1988969, 2063629, 3474121, 3317098, 2399625, 2096227, 1395933, 2033703]
15916B033703J201090m34829m11397L12688l66957J156912k87475L2194j37001
15907C098928O785q07340l30779N04178m30277L70950o02638l67051K08867J123591
15897B775214K76661l91495o48652R19451K1889m64453q46178J393152J81005
15888C216594j176370o00248Q22071N46031k63655l93604j011463Q7057L01911
15879A528324J72559M60891L46815m43420m69667j6445k02263M47591P99650J20297
15869B744332M51657p76831p90097L40011K72288M75207J71963p9353L19783n68890
15859B560070o74594k2486M17081n36125O62837o45742K39992Q55447j07301r23628
15849A825551R72073K15624r58849K22286O80933j08101l48980l79600l6734K5680
$$ y = [2033703, 3234793, 2799964, 2388567, 2701255, 2334298, 3491210, 3203735, 3235929, 3098928, 3105713, 2298373, 1967594, 2471772, 2041495, 2412445, 1809807, 1442756, 1651623, 2775214, 3051875, 2660380, 2011728, 2931179, 2953068, 2488615, 1642437, 3035589, 3216594, 2040224, 1439976, 2262047, 2808078, 2544423, 2150819, 1139356, 1226413, 1528324, 1700883, 2161774, 2508589, 2065169, 1595502, 1579057, 1376794, 1824385, 2624035, 2744332, 3195989, 2419158, 1629061, 1969072, 2241360, 2716567, 2888530, 2809177, 3128960, 2560070, 1885476, 1862990, 2280071, 1743946, 2406783, 1761041, 2001033, 2856480, 2749179, 1825551, 2797624, 3013248, 2054399, 2276685, 2957618, 2849517, 2500537, 2120937, 2084203, 2109883]
15839B109883M93831m40526J140056l61315m00467j12265J07152M43070j96258
15830B783161l69905j4554M81680K76826K80956l86475q4015O50804o67922o73990
15820B276566L52396q74509Q92428l0662m64601k86584l82885M23480N4509Q00828
15810B760966j10042o79447O49202k76437K28388l60917r33065J211515K53400
15801B743563k72914J18818o98453N19794L78238l63774n02720M50034l14221
15792B058365M20358k59103j34882l76146M41084k63913L63218R6502j3493L57489
15782B689479m74439J27367j50635q92334L44588P8340O55459J29979q90757P37656
15772B354703N33296N15015m73144r25785r8309K12528R23921j3036j044253m02835
$$ y = [2109883, 2603714, 2163188, 3303244, 2941929, 2541462, 2429197, 2536349, 2979419, 2783161, 2413256, 2398702, 2880382, 3157208, 3438164, 3051689, 2967674, 3618478, 2950556, 2276566, 2628962, 1754453, 2646881, 2616219, 2151618, 1865034, 1482149, 1905629, 1960138, 2760966, 2650924, 1971477, 2620679, 2344242, 2572630, 2211713, 1278648, 2490163, 2743563, 2470649, 2589467, 1891014, 2410808, 2789046, 2425272, 1922552, 2372586, 2058365, 2478723, 2219620, 2084738, 1708592, 2149676, 1885763, 2248981, 2345483, 2331990, 2689479, 2215040, 2342407, 2191772, 1299438, 1644026, 1722366, 2377825, 2507804, 1617047, 2354703, 2887999, 3403014, 2929870, 2004085, 1905776, 2118304, 3042225, 3029189, 1984936, 1582101]
15762A582101L23370J36873k55470L86874l32492K47445J63828r2324m3364o10245
15752A506596J69112O86844N26911r67058n11674R21103r3438J79113K00094o16489
15742B001114m67840K75473J294930O6478l09227p29652J59473J75954k86406
15733B180297L18860L00406j004016l20218O8571m79515m6236Q69442M90629k89753
15723B088467k11443p52417J51407Q09672L20858n9897J57133q72666J86646P19473
15713B537233N64077o95500K68222O83914m55417n27841Q39187m59422q28895
15704A925558Q84365M20826N2951j39725j18927j081126Q49322j61877m94649
15695B136718p7936k26166R82686j143799N45867o6602l2637L76287J89108K2066
$$ y = [1582101, 1905471, 2042344, 1786874, 2173748, 1841256, 2088701, 2252529, 2160205, 2116841, 1506596, 1675708, 2362552, 2889463, 1922405, 1410731, 2331834, 2238396, 2417509, 2617603, 2001114, 1533274, 1808747, 3103677, 3170155, 2860928, 2131276, 2290749, 2466703, 2180297, 2499157, 2799563, 1795547, 1475329, 1543900, 1064385, 1018149, 1887591, 2378220, 2088467, 1877024, 1124607, 1276014, 2085686, 2406544, 2346647, 2503780, 1631114, 1817760, 2537233, 3101310, 2405810, 2674032, 3357946, 2902529, 2374688, 3213875, 2754453, 1925558, 2809923, 3230749, 3283700, 3143975, 3025048, 1943922, 2793244, 2631367, 2136718, 2058782, 1832616, 2815302, 1671503, 2217370, 2150768, 2118131, 2494418, 2683526, 2705592]
15685B705592J74182m07458m21352m86813o6244N22753k14244j26769J262537
15676B942184q3k88028O77272k89686l10838M47679K04490r05617l26747O3209
15666B213835P8554k23376l1671L13026J4101l5551J08064J13508J91719l50935
15656B391274o66598j86477M66183l11614m14119R2177Q29928q0383o92212k66332
15646A161827R321O58405P71480l8126o30554n0717p63519n670Q88997n36873
15636A464571N55573J280175j72144m41973L2253l39186j45233L42121P65386
15627C341543n4384j199952L66146M33461n03172j73097J96510M3115o00701j06487
15617A742982L50956j67873M02271K10761l18201M39523P3625Q8165l44033l81151
$$ y = [2705592, 2879774, 2472316, 2050964, 1564151, 1497907, 2020660, 1806416, 1679647, 2942184, 2942101, 2654073, 3331345, 3041659, 2730821, 3178500, 3382990, 2477373, 2150626, 2213835, 2292389, 2069013, 2037342, 2350368, 2364469, 2328918, 2436982, 2550490, 2742209, 2391274, 1724676, 1538199, 2004382, 1692768, 1278649, 1370826, 2200754, 2120371, 1428159, 1161827, 1171148, 1829553, 2601033, 2562907, 1932353, 1881636, 1118117, 1112447, 2001444, 1464571, 2020144, 3300319, 3128175, 2686202, 2718455, 2379269, 2234036, 2576157, 3341543, 3287159, 2087207, 2453353, 2886814, 2383642, 2210545, 2407055, 2450170, 1849469, 1742982, 2093938, 1926065, 2328336, 2539097, 2220896, 2660419, 2734044, 2822209, 2478176, 2097025]
$$ [...]
##END NTUPLES=NMR SPECTRUM
##END=
