##TITLE=1H_CG-1175-5
 CDCl3
 8 sc, 
 1.9.2023
##JCAMPDX= 6.0         $$ Bruker NMR JCAMP-DX V2.0
##DATA TYPE= NMR SPECTRUM
##DATA CLASS= NTUPLES
##ORIGIN= UXNMR, Bruker Analytische Messtechnik GmbH
##OWNER= root
$$ XWIN-NMR		Version 3.5
$$ Fri Sep  1 14:34:53 2023 Russian Standard Time (UT+4h)  she@DPX200
##.OBSERVE FREQUENCY= 200.13135
##.OBSERVE NUCLEUS= ^1H
##.ACQUISITION MODE= SIMULTANEOUS
##.ACQUISITION SCHEME= undefined
##.AVERAGES= 8
##.DIGITISER RES= 18
##SPECTROMETER/DATA SYSTEM= spect
##.PULSE SEQUENCE= zg30
##.SOLVENT NAME= CDCl3
##.SHIFT REFERENCE= (INTERNAL, CDCl3, 0, 15.7326)
##AUDIT TRAIL= $$ (NUMBER, WHEN, WHO, WHERE, WHAT)
$$ ##TITLE= Audit trail, XWIN-NMR		Version 3.5
$$ ##JCAMPDX= 5.01
$$ ##ORIGIN= Bruker BioSpin GmbH
$$ ##OWNER= she
$$ F:/spectra/data/she/nmr/H-F/1/pdata/1/auditp.txt
$$ ##AUDIT TRAIL=  $$ (NUMBER, WHEN, WHO, WHERE, WHAT)
(   1,<2023-09-01 14:33:47.10 +0400>,<she>,<DPX200>,
      <created by zg, POWCHK disabled, PULCHK disabled
       configuration hash MD5:
       00 E9 B6 7A A2 85 ED C7 34 08 36 98 17 FE 4E 26
       data hash MD5: 16K
       BA 41 CC 89 66 29 3A F4 AC 8D EF C2 DC A0 E0 6B>)
(   2,<2023-09-01 14:33:49.26 +0400>,<she>,<DPX200>,
      <Start of raw data processing
       efp BC_mod = 2 LB = 0.24 FT_mod = 6 PKNL = 1 PHC0 = -21049.38 PHC1 = 13.05272 SI = 16K 
       data hash MD5: 16K
       39 09 05 60 FB 85 AF 66 C7 02 A0 A1 34 24 26 03>)
(   3,<2023-09-01 14:34:04.75 +0400>,<she>,<DPX200>,
      <pk PHC0 = 1.622263 PHC1 = -1.6 
       data hash MD5: 16K
       06 EF DE BE DC 97 94 AD 79 1B DB C2 FC 4C 34 94>)
(   4,<2023-09-01 14:34:08.28 +0400>,<she>,<DPX200>,
      <abs ABSG = 5 
       data hash MD5: 16K
       46 31 2B 80 22 09 F1 C2 11 3C EA D3 B4 56 DA AB>)
$$ ##END=
$$ 
$$ hash MD5
$$ BD 79 02 9E C9 7E 63 64 12 3F EE C2 8F FE 00 8E
##$RELAX= 
##$RELAX= 
##$RELAX= 
##$RELAX= 
##$RELAX= 
##$RELAX= 
$$ Bruker specific parameters
$$ --------------------------
##$DU= <F:/spectra>
##$EXPNO= 1
##$NAME= <H-F>
##$PROCNO= 1
##$TYPE= <nmr>
##$USER= <she>
##$AMP= (0..31)
100 100 100 100 100 100 100 100 100 100 100 100 100 100 100 100 100 100 
100 100 100 100 100 100 100 100 100 100 100 100 100 100 
##$AQSEQ= 0
##$AQ_mod= 1
##$AUNM= <au_zg>
##$AUTOPOS= <>
##$BF1= 200.13
##$BF2= 200.13
##$BF3= 200.13
##$BF4= 200.13
##$BF5= 200.13
##$BF6= 200.13
##$BF7= 200.13
##$BF8= 200.13
##$BYTORDA= 1
##$CFDGTYP= 0
##$CFRGTYP= 5
##$CHEMSTR= <none>
##$CNST= (0..31)
1 1 145 1 1 1 1 1 1 1 1 1 1 1 1 1 1 1 1 1 1 1 1 1 1 1 1 1 1 1 1 1 
##$CPDPRG= <>
##$CPDPRG1= <>
##$CPDPRG2= <>
##$CPDPRG3= <>
##$CPDPRG4= <mlev>
##$CPDPRG5= <mlev>
##$CPDPRG6= <mlev>
##$CPDPRG7= <mlev>
##$CPDPRG8= <mlev>
##$CPDPRGB= <>
##$CPDPRGT= <>
##$D= (0..31)
0 1.2 0 0 0 0 0 0 0 0.06 0 0.03 0 0 0 0 0.0002 0 0 0 0 0 0 0 0 0 0 0 0 
0 0 0 
##$DATE= 1693564426
##$DBL= (0..7)
120 120 120 120 120 120 120 120 
##$DBP= (0..7)
150 150 150 150 150 150 150 150 
##$DBP07= 0
##$DBPNAM0= <>
##$DBPNAM1= <>
##$DBPNAM2= <>
##$DBPNAM3= <>
##$DBPNAM4= <>
$$ [...]
##$SUBNAM3= <"">
##$SUBNAM4= <"">
##$SUBNAM5= <"">
##$SUBNAM6= <"">
##$SUBNAM7= <"">
##$SUBNAM8= <"">
##$SUBNAM9= <"">
##$SW= 18.05172834244
##$SWIBOX= (0..15)
0 0 2 0 0 0 0 0 0 0 0 0 0 0 0 0 
##$SW_h= 3612.71676300578
##$TD= 16384
##$TD0= 1
##$TE= 0
##$TE2= 300
##$TE3= 300
##$TEG= 300
##$TL= (0..7)
0 120 120 120 120 120 120 120 
##$TP= (0..7)
150 150 150 150 150 150 150 150 
##$TP07= 0
##$TPNAME0= <>
##$TPNAME1= <>
##$TPNAME2= <>
##$TPNAME3= <>
##$TPNAME4= <>
##$TPNAME5= <>
##$TPNAME6= <>
##$TPNAME7= <>
##$TPOAL= (0..7)
0.5 0.5 0.5 0.5 0.5 0.5 0.5 0.5 
##$TPOFFS= (0..7)
0 0 0 0 0 0 0 0 
##$TUNHIN= 0
##$TUNHOUT= 0
##$TUNXOUT= 0
##$USERA1= <user>
##$USERA2= <user>
##$USERA3= <user>
##$USERA4= <user>
##$USERA5= <user>
##$V9= 5
##$VALIST= <valist>
##$VCLIST= <CCCCCCCCCCCCCCC>
##$VD= 0
##$VDLIST= <DDDDDDDDDDDDDDD>
##$VPLIST= <PPPPPPPPPPPPPPP>
##$VTLIST= <TTTTTTTTTTTTTTT>
##$WBST= 1024
##$WBSW= 4
##$XGAIN= (0..3)
0 0 0 0 
##$XL= 0
##$YL= 0
##$YMAX_a= 52828
##$YMIN_a= -55000
##$ZGOPTNS= <>
##$ZL1= 120
##$ZL2= 120
##$ZL3= 120
##$ZL4= 120
##$ABSF1= 15.72926
##$ABSF2= -2.322589
##$ABSG= 5
##$ABSL= 3
##$ALPHA= 0
##$AQORDER= 0
##$ASSFAC= 0
##$ASSFACI= 0
##$ASSFACX= 0
##$ASSWID= 0
##$AUNMP= <proc_1d>
##$AZFE= 0.1
##$AZFW= 0.1
##$BCFW= 0
##$BC_mod= 2
##$BYTORDP= 0
##$COROFFS= 0
##$CY= -3
##$DATMOD= 1
##$DC= 0
##$DFILT= <>
##$DTYPP= 0
##$F1P= 0
##$F2P= 0
##$FCOR= 1
##$FTSIZE= 16384
##$FT_mod= 6
##$GAMMA= 0
##$GB= 0
##$INTBC= 1
##$INTSCL= 3.70164e-10
##$ISEN= 128
##$LB= 0.24
##$LEV0= 0
##$LPBIN= 0
##$MAXI= 10000
##$MC2= 0
##$MEAN= 0
##$ME_mod= 0
##$MI= 1.114404
##$NCOEF= 0
##$NC_proc= -9
##$NLEV= 6
##$NOISF1= 3.799351
##$NOISF2= 2.8
##$NSP= 0
##$NTH_PI= 0
##$NZP= 0
##$OFFSET= 15.73257
##$PC= 1
##$PHC0= -21047.76
##$PHC1= 11.45272
##$PH_mod= 1
##$PKNL= yes
##$PPARMOD= 0
##$PSCAL= 0
##$PSIGN= 0
##$REVERSE= no
##$SF= 200.130007799074
##$SI= 16384
##$SIGF1= 3
##$SIGF2= 2
##$SINO= 5.538805
##$SIOLD= 16384
##$SREGLST= <1H.CDCl3>
##$SSB= 0
##$STSI= 16384
##$STSR= 0
##$SW_p= 3612.71676300578
##$SYMM= 0
##$S_DEV= 0
##$TDeff= 16384
##$TDoff= 0
##$TI= <>
##$TILT= no
##$TM1= 0
##$TM2= 0
##$TOPLEV= 0
##$USERP1= <user>
##$USERP2= <user>
##$USERP3= <user>
##$USERP4= <user>
##$USERP5= <user>
##$WDW= 1
##$XDIM= 16384
##$YMAX_p= 311243497
##$YMIN_p= -7471738
$$ End of Bruker specific parameters
$$ ---------------------------------
##NTUPLES= NMR SPECTRUM
##VAR_NAME=  FREQUENCY,     SPECTRUM/REAL,   SPECTRUM/IMAG
##SYMBOL=    X,             R,               I
##VAR_TYPE=  INDEPENDENT,   DEPENDENT,       DEPENDENT
##VAR_FORM=  AFFN,          ASDF,            ASDF
##VAR_DIM=   16384,         16384,           16384
##UNITS=     HZ,            ARBITRARY UNITS, ARBITRARY UNITS
##FACTOR=    0.220516191357247, 1,           1
##FIRST=     3148.55929566357, 0,            0
##LAST=      -464.157467342209, 0,           0
##MIN=       -464.157467342209, -7471738,    0
##MAX=       3148.55929566357, 311243497,    0
$$ Real data points
##PAGE= N=1
##DATA TABLE= (X++(R..R)), XYDATA
$$ [...]
$$ plain form
5648 1321513 1398899 451972 -6148 768013 305221 7642 612898 697314 992569 1231218
5638 1231218 696411 -321081 13407 46264 432622 -402168 -713522 -506530 -277037 -69725
5628 -69725 708775 611039 179040 907968 424683 791252 34722 489579 280601 226845
5618 226845 215757 657616 1182072 687266 493478 664830 635361 46087 120695 627743
5608 627743 723867 302819 730445 1560953 1454590 211336 615561 442776 470835 445773
5598 445773 683532 216331 930581 1569599 1275008 929387 1533972 931811 425707 470939
5588 470939 1253031 1386101 967734 1418689 1387149 1648412 1507564 1171650 728468 839456
5578 839456 741675 1092816 1777236 1675115 1273125 1521573 2188358 1250651 1022019 1966820
$$ packed form
5648A321513P7386r46927m58120P74161m62792k97579O05256Q4416K95255K38649
5638A231218n34807j017492L34488L2857L86358q34790l11354K06992K29493K07312
5628f9725P78500r7736m31999P28928m83285L66569p56530M54857k08978n3756
5618B26845j1088M41859N24456m94806j93788J71352k9469n89274P4608N07048
5608F27743R6124m21048M27626Q30508j06363j243254M04225j72785K8059k5062
5598D45773K37759m67201P14250O39018k94591l45621O04585o02161n06104M5232
5588D70939P82092J33070m18367M50955l1540K61263j40848l35914m43182J10988
5578H39456r7781L51141O84420j02121m01990K48448O66785r37707k28632R44801
$$ plain form
5568 1966820 2311739 2102513 1574938 2062221 1210204 1380624 1465982 1600886 2054195 1453947
5558 1453947 1600099 2026097 2096659 2665314 2122098 2500732 2492212 2323215 2651955 2350438
5548 2350438 1605737 2271181 2545187 1877271 2111854 2154922 2099453 1848297 2031044 2466945
5538 2466945 1379027 1350027 1563247 1766118 1819459 2802550 2806815 2882277 3833426 4488171
5528 4488171 4408155 3373568 2971171 2973354 2600497 2959493 3114735 1776435 1579531 1621458
5518 1621458 1842154 1968362 1362051 667724 1037763 1370081 1447163 1122350 822503 1305166
5508 1305166 752037 172199 -40533 165019 1017942 1372325 1327325 1632646 1391042 983046
5498 983046 1709825 1625567 1299661 984698 862650 89934 508600 -5366 455753 455795 417022
$$ packed form
5568A966820L44919k09226n27575M87283q52017J70420Q5358J34904M53309o00248
5558A453947J46152M25998P0562N68655n43216L78634q520j68997L28740l01517
5548B350438p44701O65444K74006o67916K34583M3068n5469k51156J82747M35901
5538B466945j087918k9000K13220K02871N3341R83091M265P5462R51149O54745
5528D488171q0016j034587m02397K183l72857L58996J55242j338300j96904M1927
5518A621458K20696J26208o06311o94327L70039L32318P7082l24813k99847M82663
5508A305166n53129n79838k12732K05552Q52923L54383m5000L05321k41604m07996
5498I83046P26779q4258l25906l14963j22048p72716M18666n13966M61119M2l8773
$$ plain form
5487 417022 621916 520066 584089 950616 797050 977890 395312 727875 1014851 507019
5477 507019 -13143 414301 1161389 1374678 1519061 457029 140882 394185 667819 1462326
5467 1462326 1517147 1132393 1458068 1136506 821791 397805 -114519 -274808 740161 1186961
5457 1186961 1100138 1235297 908677 1168438 729173 267802 -463859 328166 604113 297258
5447 297258 332003 -326757 -51307 210329 1082817 1124426 541723 861090 226456 328694
5437 328694 869553 704293 1684647 1780349 2149239 1285017 1379925 2199356 1771830 1208559
5427 1208559 429240 1174104 1432298 996006 928738 642082 1013455 1124460 173349 337330
5417 337330 678761 804201 1049855 1026167 1372268 1063076 1226920 993902 565336 1121131
$$ packed form
5487D17022K04894j01850O4023L66527j53566J80840n82578L32563K86976n07832
5477E07019n20162M27444P47088K13289J44383j062032l16147K53303K73634P94507
5467A462326N4821l84754L25675l21562l14715m23986n12324j60289J014969M46800
5457A186961q6823J35159l26620K59761m39265m61371p31661P92025K75947l06855
5447B97258L4745o58760K75450K61636Q72488M1609n82703L19367o34634J02238
5437C28694N40859j65260R80354R5702L68890q64222R4908Q19431m27526n63271
5427A208559p79319P44864K58194m36292o7268k86656L71373J11005r51111J63981
5417C37330L41431J25440K45654k3688L46101l09192J63844k33018m28566N55795
$$ plain form
5407 1121131 1718978 1482844 1204351 1425891 970275 1169239 1633858 1066633 419444 -26447
5397 -26447 475962 1597027 1662764 1252702 925379 1121750 820294 674043 957253 1292774
5387 1292774 1436071 885755 1100612 1119255 1097961 262133 747318 1167692 1911594 1191573
5377 1191573 1093259 108677 783356 578301 631261 1010642 1107363 1147174 1398263 1339444
5367 1339444 1161196 966651 506676 983887 1210006 1585310 1550087 1278558 1123975 682524
5357 682524 390628 1186459 276447 392000 961217 1272374 667660 109933 984315 1240686
5347 1240686 678464 653955 249707 506536 243358 14513 123554 665913 858463 304234
5337 304234 602846 1178980 1484797 1050776 766062 994602 956020 1122285 1691460 1048644
$$ packed form
5407A121131N97847k36134k78493K21540m55616J98964M64619n67225o47189m45891
5397b6447N02409J121065O5737m10062l27323J96371l01456j46251K83210L35521
5387A292774J43297n50316K14857J8643k1294q35828M85185M20374P43902p20021
5377A191573r8314r84582O74679k05055N2960L79381R6721L9811K51089n8819
5367A339444j78248j94545m59975M77211K26119L75304l5223k71529j54583m41451
5357F82524k91896P95831r10012J15553N69217L11157o04714n57727Q74382K56371
5347A240686n62222k4509m04248K56829k63178k28845J09041N42359J92550n54229
5337C04234K98612N76134L05817m34021k84714K28540l8582J66265N69175o42816
$$ plain form
5327 1048644 417857 760033 705143 914104 946050 590980 917649 1824714 629784 1309546
5317 1309546 1418460 238649 224850 649841 -381106 2770 393678 828240 767568 1174180
5307 1174180 855522 604668 -94355 142332 908422 443509 434009 258453 672812 31471
5297 31471 271872 600217 465796 728125 1255256 959619 307932 242542 169398 522912
5287 522912 1055673 1170957 2092 -257873 721674 317925 47450 23502 1291526 1092034
5277 1092034 1058652 1396176 1758082 1826058 1488699 1102307 87101 279276 1185172 1316665
5267 1316665 1251861 1144381 879781 1229442 1258750 1011610 953355 719889 370752 337408
5257 337408 1017384 981688 583475 594273 300972 -77478 522279 530370 902823 696114
$$ packed form
5327A048644o30787L42176n4890K08961L1946l55070L26669R07065j194930O79762
5317A309546J08914j179811j3799M24991j030947L83876L90908M34562o0672M06612
5307A174180l18658k50854o99023K36687P66090m64913r500j75556M14359o41341
5297C1471K40401L28345j34421K62329N27131k95637o51687o5390p3144L53514
5287E22912N32761J15284j168865k59965R79547m03749k70475k3948J268024j99492
5277A092034l3382L37524L61906O7976l37359l86392j015206J92175R05896J31493
5267A316665o4804j07480k64600L49661K9308k47140n8255k33466l49137l3344
5257C37408O79976l5696l98213J0798k93301l78450N99757Q091L72453k06709
$$ plain form
5247 696114 268137 196837 512815 744449 717847 1225399 386888 819786 394890 -83071
5237 -83071 565344 417111 292735 -49578 644007 472310 489266 277463 -445394 87228
5227 87228 -51927 17601 275408 569573 1075169 777658 430514 474220 916894 328596
5217 328596 -364466 -259629 -322134 -158794 309499 -767225 -313707 687381 729609 1234629
5207 1234629 1163688 1272568 938837 650997 587070 868175 194574 818046 311594 -244914
5197 -244914 92215 -423893 458539 896543 275151 630619 1835388 1812939 559824 36972
5187 36972 49683 252741 405761 -388246 -589191 -239827 -52857 566469 405668 665554
5177 665554 443870 -446019 -30498 771463 890739 -90494 696756 1090287 809863 1061311
$$ packed form
5247F96114m27977p1300L15978K31634k6602N07552q38511M32898m24896m77961
5237h3071O48415j48233j24376l42313O93585j71697J6956k11803p22857N32622
5227H7228j39155O9528K57807K94165N05596k97511l47144M3706M42674n88298
5217C28596o93062J04837o2505J63340M68293j076724M53518J001088M2228N05020
5207A234629p0941J08880l33731k87840o3927K81105o73601O23472n06452n56508
5197b44914L37129n16108Q82432M38004o21392L55468J204769k2449j253115n22852
5187C6972J2711K03058J53020p94007k00945L49364J86970O19326j60801K59886
5177F65554k21684q89889M15521Q01961J19276r81233P87250L93531k80424K51448
$$ plain form
5167 1061311 1198154 1279085 777910 525949 361331 509399 39656 -286539 -397845 -1089116
5157 -1089116 -195997 602772 378173 201746 681995 620128 364667 259356 631152 831285
5147 831285 1013792 1536495 1116930 920611 1149808 1192404 1680661 2268125 2101807 1963944
5137 1963944 2309070 2405521 2235467 2623872 1880677 1031478 1344488 2328421 1950751 1702535
5127 1702535 2026832 1558001 1266203 1441052 1253013 1618391 1836358 2015938 3086950
5118 3086950 2948176 2145465 2262387 2923409 2550788 2649509 3041039 1994149 2104558 1598158
5108 1598158 744721 1617716 1387650 1374601 1282957 1883960 2214291 1885382 2136819 2014711
5098 2014711 2141406 2720098 3109562 2896864 2592327 2704768 2324267 2278472 2530582 2918732
$$ packed form
5167A061311J36843Q0931n01175k51961j64618J48068m69743l26195j11306o91271
5157a089116Q93119P98769k24599j76427M80249o1867k55461j05311L71796K00133
5147H31285J82507N22703m19565j96319K29197M2596M88257N87464j66318j37863
5137A963944L45126R6451j70054L88405p43195q49199L13010R83933l77670k48216
5127A702535L24297m68831k91798J74849j88039L65378K17967J79580J071012
5118C086950j38774q02711J16922O61022l72621R8721L91530j046890J10409n06400
5108A598158q53437Q72995k30066j3049r1644O01003L30331l28909K51437j22108
5098B014711J26695N78692L89464k12698l04537J12441l80501m5795K52110L88150
$$ plain form
5088 2918732 2007231 2029283 2334429 2291262 3149902 2724265 2537190 2181510 1910006 1735638
5078 1735638 2097962 2554368 2721018 2249157 1913272 1658207 2162152 2929657 1979992 1742345
5068 1742345 1961894 1564424 187620 -77934 464707 -58919 223397 517953 438416 697073
5058 697073 340429 253984 995272 409827 -523798 -224116 262884 47322 293336 737880
5048 737880 1146695 1016022 1062324 369071 501578 1539890 1043068 845944 918126 779792
5038 779792 303409 528716 856869 786843 475746 584994 463006 26186 -249473 -619061
5028 -619061 -19901 -27744 443754 494354 21518 -300944 -110649 1073392 772036 283441
5018 283441 -146218 194837 -21557 351480 492228 -219552 -123635 154116 385698 131972
$$ packed form
5088B918732r11501K2052L05146m3167Q58640m25637j87075l55680k71504j74368
5078A735638L62324M56406J66650m71861l35885k55065N03945P67505r49665k37647
5068A742345K19549l97470j376804k65554N42641n23626K82316K94556p9537K58657
5058F97073l56644q6445P41288n85445r33625K99682M87000k15562K46014M44544
5048G37880M08815j30673M6302o93253J32507J038312m96822j97124P2182j38334
5038G79792m76383K25307L28153p0026l11097J09248j21988m36820k75659l69588
5028f19061N99160p843M71498N0600m72836l22462J90295J184041l01356m88595
5018B83441m29659L41055k16394L73037J40748p11780R5917K77751K31582k53726
$$ plain form
5008 131972 -555942 94019 935079 673994 326431 -514019 -86535 236584 471841 1237432
4998 1237432 906773 1024977 851225 892415 833941 162029 -60852 24368 -64708 -268518
4988 -268518 242227 545503 875803 629724 521966 460693 1171560 225819 160392 837175
4978 837175 808902 -65203 48171 267011 133047 645764 129264 -239037 309881 787308
4968 787308 557683 501941 148870 426404 424880 372950 398241 552170 378209 -86184 465319
4957 465319 1352618 1001052 905502 1151566 416046 33146 -156054 -1057077 -286162 -91101
4947 -91101 -68972 338044 -584887 -99899 467000 404076 -246337 -729180 -741588 -260480
4937 -260480 445631 651656 -494321 -80502 -107568 -554317 -14667 -537296 306462 64170
$$ packed form
5008A31972o87914O49961Q41060k61085l47563q40450M27484L23119K35257P65591
4998A237432l30659J18204j73752M1190n8474o71912k22881Q5220q9076k03810
4988b68518N10745L03276L30300k46079j07758o1273P10867r45741o5427O76783
4978H37175k8273q74105J13374K18840j33964N12717n16500l68301N48918M77427
4968G87308k29625n5742l53071K77534j524n1930K5291J53929j73961m64393N51503
4957D65319Q87299l51566r5550K46064p35520l82900j89200r01023P70915J95061
4947i1101K2129M07016r22931M84988N66899o2924o50413m82843j2408M81108
4937b60480P06111K06025j145977M13819k7066m46749N39650n22629Q43758k42292
$$ plain form
4927 64170 41907 387064 389862 573953 1026065 1100444 1287988 775137 271684 298336 -18179
4916 -18179 -144177 432333 83281 715344 1521352 1344944 1154796 1165243 1414320 38220
4906 38220 477928 894055 735741 550468 635172 1067730 462444 299926 596215 1079171
4896 1079171 896976 488647 264447 1267165 1347785 341661 157107 255520 -608527 8291
4886 8291 132559 99014 260925 42396 1067796 640950 530366 1056531 797628 -211376
4876 -211376 -91889 187211 71629 943797 178526 407060 777534 370079 -11626 -682800
4866 -682800 404123 1310376 604719 426493 472949 978834 1077255 797978 900971 -176004
4856 -176004 -449930 370738 1039247 1182162 1120668 1109628 610914 1233790 1426626 917614
$$ packed form
4927F4170k2263L45157K798J84091M52112P4379J87544n12851n03453K6652l16515
4916a8179j25998N76510l49052O32063Q06008j76408j90148J0447K49077j376100
4906C8220M39708M16127j58314j85273Q4704M32558o05286j62518K96289M82956
4896A079171j82195m08329k24200J002718Q0620j006124j84554R8413q64047O16818
4886H291J24268l3545J61911k18529J025400m26846j10584N26165k58903j009004
4876b11376J19487K79100j15582Q72168p65271K28534L70474m07455l81705o71174
4866f82800J086923R06253p05657j78226M6456N05885R8421k79277J02993j076975
4856a76004k73926Q20668O68509J42915o1494j1040m98714O22876J92836n09012
$$ plain form
4846 917614 1031070 595473 722753 1185677 771667 1106113 1663721 1007018 1348530 1233724
4836 1233724 706123 558561 1445765 1008190 676147 975947 1049574 656241 941972 1070793
4826 1070793 795145 1191021 1934082 1909181 2054776 1760577 1660132 2372046 3171698 2966753
4816 2966753 1885827 1736746 2360795 2201300 1573700 1166874 1552802 1449259 1637870
4807 1637870 1240889 983903 1810370 2058636 1887006 1572485 1374771 1569976 2165317 2394486
4797 2394486 3212097 3969971 4553077 4983876 4766880 6445430 8293444 9964844 10488720
4788 10488720 9997160 9784340 8419051 6692796 5769717 4628857 3304393 3272141 3473016
4779 3473016 2747455 2359949 2125212 1410243 1272076 1915916 2374482 1265208 1976704
$$ packed form
4846I17614J13456m35597J27280M62924m14010L34446N57608o56703L41512j14806
4836A233724n27601j47562Q87204m37575l32043K99800P3627l93333K85731J28821
4826A070793k75648L95876P43061k4901J45595k94199j00445P11914P99652k04945
4816B966753j080926j49081O24049j59495o27600m06826L85928j03543J88611
4807A637870l96981k56986Q26467K48266j71630l14521j97714J95205N95341K29169
4797B394486Q17611P57874N83106M30799k16996J678550J848014J671400N23876
4788A0488720m91560k12820j365289j726255r23079j140860j324464l2252K00875
4779C473016p25561l87506k34737p14969j38167O43840M58566j109274P11496
$$ plain form
4770 1976704 2505435 2012105 1542942 2227188 1819212 1905932 2286116 1745826 1696956 1715247
4760 1715247 1566843 1836051 1865621 1815807 2207503 3026688 2412909 2087875 2795898 2328154
4750 2328154 1291923 1748896 2128454 2269103 2584320 2604560 3033157 3223671 3395499 4277479
4740 4277479 4421644 4149909 4585758 5473730 5866108 6540363 7470817 8423004 9195916 10091950
4730 10091950 9214013 7560728 6997139 6978114 7843618 8577690 9780285 11186234 11579951
4721 11579951 11569837 10923069 10530208 8826289 7910822 7619673 7062497 6795467 6196933
4712 6196933 6947620 7272535 7463667 8264549 9135285 9386269 10052089 9278854 8082458
4703 8082458 6810854 5689862 4529400 4933051 4717002 3378983 2756721 2507264 2939888
$$ packed form
4770A976704N28731m93330m69163O84246m07976Q6720L80184n40290m8870J8291
4760A715247j48404K69208K9570m9814L91696Q19185o13779l25034P08023m67744
4750B328154j036231M56973L79558J40649L15217K0240M28597J90514J71828Q81980
4740D277479J44165k71735M35849Q87972L92378O74255R30454R52187P72912Q96034
4730A0091950q77937j653285n63589j9025Q65504P34072J202595J405949L93717
4721A1579951j0114o46768l92861j703919r15467k91149n57176k67030n98534
4712F196933P50687L24915J91132Q00882Q70736K50984O65820p73235j196396
4703H082458j271604j120992j160462M03651k16049j338019o22262k49457M32624
$$ plain form
4694 2939888 1766098 1790161 2564578 2880593 2740795 2846948 2759081 2794420 3379044 2064272
4684 2064272 2122333 3276570 2581813 1362995 2190862 2800296 1866313 1729380 2432992
4675 2432992 2809468 2091084 877326 1149146 2701928 2686800 2204191 2924860 2776200
4666 2776200 2185241 1493658 1599431 1182497 1144015 1757621 1559372 1141260 1567585 1232867
4656 1232867 1636949 2320876 1921093 2059421 2051131 1543174 1696728 1389804 1614487 1690082
4646 1690082 1076654 922418 1873378 2250186 2277066 1920321 1869064 2558979 2207823 2154473
4636 2154473 1795308 746599 562331 581870 324416 78956 839350 802232 601404 534436
4626 534436 1148878 1165324 1194496 1169172 691055 1133464 1514262 1250878 943917 1561290
$$ packed form
4694B939888j173790K4063P74417L16015j39798J06153q7867L5339N84624j314772
4684B064272N8061J154237o94757j218818Q27867O09434r33983j36933P03612
4675B432992L76476p18384j213758K71820J552782j5128m82609P20669j48660
4666B776200n90959o91583J05773m16934l8482O13606j98249m18112M26325l34718
4656A232867M04082O83927l99783J38328q290n07957J53554l06924K24683P5595
4646A690082o13428j54236R50960L76808K6880l56745n1257O89915l51156n3350
4636B154473l59165j048709j84268J9539k57454k45460P60394l7118k00828o6968
4626E34436O14442J6446K9172k5324m78117M42409L80798k63384l06961O17373
$$ plain form
4616 1561290 1259708 1399383 1637306 1663442 1547404 1515273 1058388 1141777 1509740 2160004
4606 2160004 2004904 1983026 1726394 2079360 1840652 919515 -34114 730449 1735239 1559362
4596 1559362 1335387 1729779 1732570 1690793 1768956 980094 498459 1109578 1179730 1341157
4586 1341157 808094 894913 1646266 1660366 1667719 1328315 1689480 2085634 1628611 2278915
4576 2278915 1977450 1256678 1448638 1931513 3120855 3299212 2716434 3012329 3389352
4567 3389352 3251794 2752461 2540343 2202620 2563844 3118107 3132680 2123935 916180
4558 916180 2067903 2685122 3307062 3299553 3058950 2512772 3186137 3556159 2742479 2636497
4548 2636497 2713875 2066658 2575350 3624533 3508744 3700839 3424933 2727504 3017157 3174731
$$ packed form
4616A561290l01582J39675K37923K6136j16038l2131m56885Q3389L67963O50264
4606B160004j55100k1878k56632L52966k38708r21137r53629P64563J004790j75877
4596A559362k23975L94392K791m1777P8163p88862m81635O11119P0152J61427
4586A341157n33063Q6819P51353J4100P353l39404L61165L96154m57023O50304
4576B278915l01465p20772J91960M82875J189342J78357n82778K95895L77023
4567C389352j37558m99333k12118l37723L61224N54263J4573j008745j207755
4558I16180J151723O17219O21940p509k40603n46178O73365L70022q13680j05982
4548B636497P7378o47217N08692J049183j15789J92095k75906o97429K89653J57574
$$ plain form
4538 3174731 3845343 4344426 4307894 4561348 3964634 3749791 3964950 3946808 3817111 3475580
4528 3475580 3032321 3659296 3731769 3741880 4384824 3726111 3743624 4009908 4002839 4956883
4518 4956883 5029783 4334269 4749595 4130001 3823914 4755655 4775642 4293059 4670501 5304737
4508 5304737 5070881 5321649 5312704 5523759 5853311 5876551 5637974 5411250 5765669 6036668
4498 6036668 5970778 6185062 6651427 7491033 6587870 6111859 6473792 6721834 7834941 8021277
4488 8021277 9006303 9399315 9768343 10321933 10671794 11906432 13860271 15171475 16067857
4479 16067857 17086038 19113252 19705248 18510705 17686734 17724093 17330373 16970176 16921739
4470 16921739 16630485 16883858 16943870 17742918 18522527 18510626 18632942 18965512 19761374 20316892
$$ packed form
4538C174731O70612M99083l6532K53454n96714k14843K15159j8142j29697l41531
4528C475580m43259O26975P2473J0111O42944o58713J7513K66284p069R54044
4518D956883P2900o95514M15326o19594l06087R31741J9987m82583L77442O34236
4508E304737k33856K50768q945K11055L29552K3240k38577k26724L54419K70999
4498F036668o5890K14284M66365Q39606r03163m76011L61933K48042J113107J86336
4488H021277R85026L93012L69028N53590L49861J234638J953839J311204Q96382
4479A6067857J018181K027214N91996j194543q23971L7359l93720l60197m8437
4470A6921739k91254K53373O0012P99048P79609j1901J22316L32570P95862N55518
$$ plain form
4460 20316892 20677163 20895064 20992118 20778991 21456536 21659217 22174874 21896705 20684241
4451 20684241 20973355 21205856 20926961 20478942 18783250 18247158 18108398 17176897 16776825
4442 16776825 16876510 17233500 18872317 20381049 22095901 22675959 22627432 23108806 23011195
4433 23011195 23393917 23494587 24148373 24406367 24756765 25281614 25472194 24582685 23459770
4424 23459770 22983851 22645843 21986722 21820005 20915679 20850342 20050273 19246142 17150972
4415 17150972 15679053 14639238 14054010 12817333 11487415 11372326 11809944 11476900 11241227
4406 11241227 10268654 9486852 9130032 9305778 10210462 9962126 9607000 9476868 8366739
4397 8366739 8021735 7774369 7737323 8244975 7956959 7559933 7177206 7109131 7229080 7452916
$$ packed form
4460B0316892L60271K17901R7054k13127O77545K02681N15657k78169j212464
4451B0684241K89114K32501k78895m48019j695692n36092j38760r31501m00072
4442A6776825R9685L56990J638817J508732J714852N80058m8527M81374r7611
4433B3011195L82722J00670O53786K57994L50398N24849J90580q89509j122915
4424B3459770m75919l38008o59121j66717r04326o5337q00069q04131k095170
4415A7150972j471919j039815n85228j236677j329918j15089M37618l33044k35673
4406A1241227r72573p81802l56820J75746R04684k48336l55126j30132j110129
4397H366739l45004k47366l7046N07652k88016l97026l82727o8075J19949K23836
$$ plain form
4387 7452916 7432425 7844142 8095835 7383546 6690441 6957350 6635913 7698821 7810163 7869354
4377 7869354 8279169 8204414 8593361 9194070 9317946 9848941 9628887 10130355 9432499 9434084
4367 9434084 9418259 8277367 7382553 8039329 9013657 8354540 8588475 8591316 8881382 9375658
4357 9375658 9787862 9530045 8942650 8688528 9457599 10047865 10041914 10863075 11197662 11414748
4347 11414748 12590846 13250395 14660810 16305372 17112079 18872193 19862700 20907494 22711432
4338 22711432 23562794 23703718 24550324 24300333 24842566 26002763 26092461 26828084 27159680
4329 27159680 27336930 27637267 27088684 26047225 25853761 26139317 26316288 25938744 25960120
4320 25960120 24863784 24392618 23890672 23355684 22442721 21626344 21736326 22296255 22220904
$$ packed form
4387G452916k0491M11717K51693p12289o93105K66909l21437J062908J11342N9191
4377G869354M09815p4755L88947O00709J23876N30995k20054N01468o97856J585
4367I434084j5825j140892q94814O56776R74328o59117K33935K841K90066M94276
4357I375658M12204k57817n87395k54122P69071N90266n951Q21161L34587K17086
4347A1414748J176098O59549J410415J644562Q06707J760114R90507J044794J803938
4338B2711432Q51362J40924Q46606k49991N42233J160197Q9698P35623L31596
4329B7159680J77250L00337n48583j041459j93464K85556J76971l77544K1376
4320B5960120j096336m71166n01946n34988r12963q16377J09982N59929p5351
$$ plain form
4311 22220904 21819091 22497738 23285071 23941254 23579585 23361049 23766142 23743285 22922098 23549481
4301 23549481 23950006 23441605 22707334 22241928 22219365 22246927 22179297 21842588 21852905 21609432
4291 21609432 21761049 21495012 20686564 19847217 18831356 19043730 19764553 20292177 20229716
4282 20229716 20111221 20154716 19605692 18592658 17894922 16519967 16326132 14671386 13507149
4273 13507149 14042195 13186653 11968238 10915458 11226071 10829361 10680125 10604951 9852425
4264 9852425 9933685 10871120 11233937 10492404 9559246 9740394 10273773 10379995 10524229 10372893
4254 10372893 9914766 9935909 9436547 9300291 9560870 8912664 9227118 8792506 9252372 9307054
4244 9307054 9116219 9578425 9010512 9440191 9771963 9993700 9800659 10372645 10577378 11077287
$$ packed form
4311B2220904m01813O78647P87333O56183l61669k18536M05093k2857q21187O27383
4301B3549481M00525n08401p34271m65406k2563K7562o7630l36709J0317k43473
4291B1609432J51617k66037q08448q39347j015861K12374P20823N27624o2461
4282B0229716j18495M3495n49024j013034o97736j374955j93835j654746j164237
4273A3507149N35046q55542j218415j052780L10613l96710j49236p5174p52526
4264I852425Q1260R37435L62817p41533r33158J81148N33379J06222J44234j51336
4254A0372893m58127K1143m99362j36256K60579o48206L14454m34612M59866N4682
4244I307054j90835M62206n67913M29679L31772K21737j93041N71986K04733M99909
$$ plain form
4234 11077287 11970747 12331426 12521952 12416884 12834320 13022187 12856333 12945324 12988082 13214656
4224 13214656 13466235 13730886 14834913 14693867 15784985 16906280 17312679 19171323 19190616
4215 19190616 20823611 21909629 21953006 20098534 18531516 16361859 14365241 14419448 14300328
4206 14300328 14329239 13525237 14402169 14808233 14438296 14133861 13863266 14257645 15298179
4197 15298179 14828673 14943838 14027805 14712297 14109296 13570296 14325910 14113011 13876535
4188 13876535 14010059 14394747 15117427 15345576 15415363 15634847 16287694 16238020 16244960 15718644
4178 15718644 15454976 15878329 15520942 15910523 15742030 15724669 15614614 16032052 15452629 15105679
4168 15105679 15038114 15427643 15248630 15161527 14409326 14613651 15202301 15740358 16100435 15847712
$$ packed form
4234A1077287Q93460L60679J90526j05068M17436J87867j65854Q8991M2758K26574
4224A3214656K51579K64651J104027j41046J091118J121295M06399J858644J9293
4215A9190616J632995J086018M3377j854472j567018k169657j996618N4207j19120
4206A4300328K8911q04002Q76932M06064l69937l04435k70595L94379J040534
4197A5298179m69506J15165r16033O84492o03001n39000P55614k12899k36476
4188A3876535J33524L84688P22680K28149O9787K19484O52847m9674O940n26316
4178A5718644k63668M23353l57387L89581j68493j7361j10055M17438n79423l46950
4168A5105679o7565L89529j79013q7103p52201K04325N88650N38057L60077k52723
$$ plain form
4158 15847712 14960716 16525394 16577769 15762882 14831701 13911361 13940342 14963873 14590816
4149 14590816 14330482 14751863 15387317 15295967 15602316 15211055 16065026 16844076 15975510 16356547
4139 16356547 17425147 18188820 18840550 20218536 20272753 21126770 21428813 21474300 21019775
4130 21019775 21229571 21378898 21643544 21588747 21873814 20925780 20561459 19730029 19891576 20165997
4120 20165997 19755711 20704606 20957243 21015083 21225463 21548367 22414082 23602391 24163903
4111 24163903 24301087 24493576 24460873 25876601 26030083 27650631 28178711 28330610 28884374
4102 28884374 29446652 30967584 32474856 34557128 36447978 37726917 37944963 39045704
4094 39045704 40887748 43174178 45870596 49219126 55780033 64030039 74578468 88180309
$$ packed form
4158A5847712q86996J564678N2375q14887r31181r20340K8981J023531l73057
4149A4590816k60334M21381O35454r1350L06349l91261Q53971P79050q68566L81037
4139A6356547J068600P63673O51730J377986N4217Q54017L02043M5487m54525
4130B1019775K09796J49327K64646n4797K85067r48034l64321q31430J61547K74421
4120B0165997m10286R48895K52637N7840K10380L22904Q65715J188309N61512
4111B4163903J37184J92489l2703J415728J53482J620548N28080J51899N53764
4102B8884374N62278J520932J507272K082272J890850J278939K18046J100741
4094C9045704J842044K286430K696418L348530O560907Q250006J0548429J3601841
$$ plain form
4086 88180309 106359840 129481175 153620262 176598381 182876007 165836903 141273479
4079 141273479 120213724 102795968 88105784 77646072 70710604 65461574 61151313
4072 61151313 58513937 55571919 51912923 48490578 45531804 43632904 42364488 41738026
4064 41738026 40560479 40108543 39693030 38406774 36919598 36151001 37004581 36555177 35204185
4055 35204185 34855582 34691024 34910082 35443592 36474905 37608144 37554873 37702429 38842703
4046 38842703 38697803 38465454 38507937 37401191 37510950 37703111 37087824 37220925 38357697
4037 38357697 39967974 42031813 44136486 45541115 46898515 46565920 44910907 43521627
4029 43521627 42158666 40669043 39935488 38740698 38984037 38721735 39065970 38855074 38485973
$$ packed form
4086H8180309J8179531K3121335K4139087K2978119O277626j7039104k4563424
4079A41273479k1059755j7417756j4690184j0459712o935468n249030m310261
4072F1151313k637376k942018l658996l422345k958774j898900j268416o26462
4064D1738026j177547m51936m15513j286256j487176p68597Q53580m49404j350992
4055C5204185l48603j64558K19058N33510J031313J133239n3271J47556J140274
4046C8842703j44900k32349M2483j106746J09759J92161o15287J33101J136772
4037C8357697J610277K063839K104673J404629J357400l32595j655013j389280
4029D3521627j362961j489623p33555j194790K43339k62302L44235k10896l69101
$$ plain form
4020 38485973 38844792 38457003 38462666 37832315 37102352 36006748 34295531 33423160 33036962
4011 33036962 33097218 31602976 30405207 29888450 30123789 30970725 31193393 30264609 29412916
4002 29412916 28803839 27790969 28661134 27685493 26110353 26575493 27286572 26828956 26629974
3993 26629974 26444224 26696072 26958928 26816465 25970524 25379859 25795121 25767870 24767667
3984 24767667 24826685 25316798 25615889 25798366 25927109 26628026 26742171 28814568 28319356
3975 28319356 28473912 30245152 32930048 35873309 40719786 47414208 56571993 68418058
3967 68418058 85054991 105853921 125523269 128600614 110013473 85516679 66248282
3960 66248282 53557735 44818746 40595145 37106143 34031936 30700729 29025587 26714797
$$ packed form
4020C8485973L58819l87789N663o30351p29963j095604j711217q72371l86198
4011C3036962O0256j494242j197769n16757K35339Q46936K22668r28784q51693
4002B9412916o09077j012870Q70165r75641j575140M65140P11079m57616j98982
3993B6629974j85750K51848K62856j42463q45941n90665M15262k7251j000203
3984B4767667N9018M90113K99091J82477J28743P00917J14145K072397m95212
3975B8319356J54556J771240K684896K943261M846477O694422R157785J1846065
3967F8418058J6636933K0798930J9669348L077345j8587141k4496794j9268397
3960F6248282j2690547q738989m223601l489002l074207l331207j675142k310790
$$ plain form
3952 26714797 24885856 23765566 22979066 22270974 21654001 20371522 19495174 19688614 20164197
3943 20164197 19914458 20021998 19000143 19200062 18134647 16949144 16734616 15540010 16537617
3934 16537617 17268333 16875232 16497622 15732286 15316926 15080869 15994920 16187256 16327852
3925 16327852 16855381 16984011 17606360 17143038 17349675 17243339 16928386 16836329 16016674 15730096
3915 15730096 15763010 15502438 14907256 15295383 14823031 13885838 14001799 14738374 14593870 13322980
3905 13322980 13596940 13782650 13159787 12964320 12936301 12617772 12668696 12423436 12151104 12344648
3895 12344648 12745338 12085926 13017384 12819176 12459344 11573502 11692522 11733368 11969563 12928063
3885 12928063 13072272 12617946 11830235 11612709 11252157 12147462 12681521 12383407 12169872
$$ packed form
3952B6714797j828941j120290p86500p08092o16973j282479q76348J93440M75583
3943B0164197k49739J07540j021855J99919j065415j185503k14528j194606R97607
3934A6537617P30716l93101l77610p65336m15360k36057R14051J92336J40596
3925A6327852N27529J28630O22349m63322K06637j06336l14953r2057q19655k86578
3915A5730096L2914k60572n95182L88127m72352r37193J15961P36575j44504j270890
3905A3322980K73960J85710o22863j95467k8019l18529N0924k45260k72332J93544
3895A2344648M00690o59412R31458j98208l59832q85842J19020M0846K36195R58500
3885A2928063J44209m54326p87711k17526l60552Q95305N34059k98114k13535
$$ plain form
3876 12169872 12250901 11955799 11336215 10421789 10860310 11575941 11830749 11851039 11765545 11445528
3866 11445528 11613803 11653468 12282918 12665057 12091666 12299861 12868502 12239310 12208284 12472262
3856 12472262 12215903 11928228 11958300 12319001 12445313 11711573 11483277 11758159 11427158 10898455
3846 10898455 11079986 11673210 11680031 11709198 11900253 12586782 12192786 11699267 11898721 11760081
3836 11760081 11600979 11663745 12102613 12649127 12433102 12646967 12287184 12372886 12632961 12896339
3826 12896339 13218993 12964579 13404144 12599495 12319405 12489642 12557210 12840788 12816801 12596865
3816 12596865 11860654 11941254 12235129 12986373 12517056 12704357 13403849 12708142 12553403 13433176
3806 13433176 13702779 13117099 13857214 13974217 13490684 13738899 14962774 15193080 15186453 15550091
$$ packed form
3876A2169872Q1029k95102o19584r14426M38521P15631K54808K0290q5494l20017
3866A1445528J68275L9665O29450L82139n73391K08195N68641o29192l1026K63978
3856A2472262k56359k87675L0072L60701J26312p33740k28296K74882l31001n28703
3846A0898455J81531N93224O821K9167J91055O86529l93996m93519J99454j38640
3836A1760081j59102O2766M38868N46514k16025K13865l59783Q5702K60075K63378
3826A2896339L22654k54414M39565q04649k80090J70237O7568K83578k3987k19936
3816A2596865p36211Q0600K93875P51244m69317J87301O99492o95707j54739Q79773
3806A3433176K69603n85680P40115J17003m83533K48215J223875K30306o627L63638
$$ plain form
3796 15550091 15520325 15565899 16065588 16019567 16328252 16560916 16624725 16814072 16134105 16176805
3786 16176805 15679734 15468433 16103793 16109384 16885371 17888734 18072146 18390210 18031180 17641059
3776 17641059 17653424 18696601 19369841 19596215 20017845 20979267 21109694 22380125 22624504
3767 22624504 22774301 23450750 23668328 24438963 25435854 26425157 27389607 27799612 29248759
3758 29248759 31100147 33716200 35550020 37657419 40052876 41451597 41828637 41686082
3750 41686082 40350984 39765149 40234724 39809138 39474508 40280218 40973894 41575387 44273405
3741 44273405 46001683 47894017 49676533 52316773 54917556 56071465 56432219 57089616
3733 57089616 56872929 55662940 53939058 53384757 53607879 52407887 50930360 49834401 49021760
$$ packed form
3796A5550091k9766M5574M99689m6021L08685K32664O3809J89347o79967M2700
3786A6176805m97071k11301O35360N591P75987J003363J83412L18064l59030l90121
3776A7641059J2365J043177O73240K26374M21630R61422J30427J270431K44379
3767B2624504J49797O76449K17578P70635R96891R89303R64450M10005J449147
3758B9248759J851388K616053J833820K107399K395457J398721L77040j42555
3750D1686082j335098n85835M69575m25586l34630Q05710O93676O01493K698018
3741D4273405J728278J892334J782516K640240K600783J153909L60754O57397
3733E7089616k16687j209989j723882n54301K23122j199992j477527j095959q12641
$$ plain form
3724 49021760 49124335 49164949 49207054 48213679 47301454 46277724 45695024 44266625 41416436
3715 41416436 39731992 38491758 35474421 34732666 33186249 30786184 29536956 28620670
3707 28620670 27406639 27202485 26431597 25159335 24633017 23600228 22996321 23299073 23507372
3698 23507372 23651257 22430389 21825231 21432231 21200606 22441480 22603191 22902521 22629439
3689 22629439 22733082 22720915 22464735 22610354 22255773 23105465 23772868 23923336 23842849 24161199
3679 24161199 24211078 24365834 24616076 24277863 23778268 23017618 23767400 24329103 23962274 24570504
3669 24570504 24875492 24713104 24065662 23268424 23018165 22886775 22303144 21868777 21413233
3660 21413233 21288572 22042286 21088585 19553198 18984945 19661648 19473901 19322717 18854003
$$ packed form
3724D9021760J02575M0614M2105r93375r12225j023730n82700j428399k850189
3715D1416436j684444j240234l017337p41755j546417k400065j249228r16286
3707B8620670j214031k04154p70888j272262n26318j032789o03907L02752K08299
3698B3507372J43885j220868o05158l93000k31625J240874J61711K99330k73082
3689B2629439J03643j2167k56180J45619l54581Q49692O67403J50468q0487L18350
3679B4161199M9879J54756K50242l38213m99595p60650P49782N61703l66829O08230
3669B4570504L04988j62388o47442p97238k50259j31390n83631m34367m55544
3660B1413233j24661P53714r53701j535387n68253O76703j87747j51184m68714
$$ plain form
3651 18854003 18799825 19158907 18824806 19108445 18471881 17830368 18133243 17823615 17594413 17208000
3641 17208000 17262386 17534249 17715301 17418657 18107234 17852758 17601518 18734543 19624668
3632 19624668 18720652 18490386 19234886 19865266 20270226 19707064 20005483 20806145 20445191
3623 20445191 20645389 20721515 22644823 22423620 22328742 22649528 21878876 22686617 23430183 23720552
3613 23720552 24847334 25921754 26066645 26294148 27165467 28079278 29072840 28704382 28063255
3604 28063255 28476234 29408097 29831869 30107390 30413623 29845899 30393005 31202873 31464673
3595 31464673 31440182 31326747 31791691 32819949 33983104 34840817 35591512 36347201 36419357
3586 36419357 36987923 38046842 39236585 40601893 41177760 42397317 43489135 45872742
$$ packed form
3651A8854003n4178L59082l34101K83639o36564o41513L02875l09628k29202l86413
3641A7208000N4386K71863J81052k96644O88577k54476k51240J133025Q90125
3632A9624668r04016k30266P44500O30380M04960n63162K98419Q00662l60954
3623B0445191K00198P6126J923308k21203r4878L20786p70652Q07741P43566K90369
3613B3720552J126782J074420J44891K27503Q71319R13811R93562l68458o41127
3604B8063255M12979R31863M23772K75521L06233n67724N47106Q09868K61800
3595C1464673k4491j13435M64944J028258J163155Q57713P50695P55689P2156
3586C6419357N68566J058919J189743J365308N75867J219557J091818K383607
$$ plain form
3578 45872742 47916646 49304875 50404303 51547684 53814327 55543913 56870916 57742526
3570 57742526 59019981 60090691 61511284 62196963 63355645 64461023 65819105 67243279
3562 67243279 68278492 70327498 73644640 74940514 77248806 79628675 82363568 83864382
3554 83864382 84892750 85388164 86667956 86122953 85092128 84425571 83797661 82183634 81400571
3545 81400571 80973663 79182967 78234379 77104905 76343509 74835543 73282326 71124986 68389486
3536 68389486 66189220 62948153 60410895 57814413 54285052 51676867 49171770 46964370
3528 46964370 44209784 42190621 40780666 38209504 37566431 37326539 36548786 35625813 35469863
3519 35469863 34604374 34598179 35800109 35451569 35840470 35767753 36864672 37600455 38031257 39116593
$$ packed form
3578D5872742K043904J388229J099428J143381K266643J729586J327003Q71610
3570E7742526J277455J070710J420593O85679J158682J105378J358082J424174
3562F7243279J035213K049006L317142J295874K308292K379869K734893J500814
3554H3864382J028368M95414J279792n45003j030825o66557o27910j614027p83063
3545H1400571m26908j790696r48588j129474p61396j507966j553217k157340k735500
3536F8389486k200266l241067k537258k596482l529361k608185k505097k207400
3528D6964370k754586k019163j409955k571162o43073k39892p77753r22973j55950
3519C5469863q65489o195J201930l48540L88901p2717J096919P35783M30802J085336
$$ plain form
3509 39116593 40290460 40608968 41431040 41349549 40825345 41335139 41054685 40808804 40151807
3500 40151807 38328713 37237672 37089427 36146786 33560378 32338020 31567569 30953529 29799565
3491 29799565 29032416 27933348 27350348 27936873 28066160 27157908 27051420 27271218 26424551
3482 26424551 26166619 26223912 26200468 25403209 24665591 24882269 24909267 24792156 24041033 23828837
3472 23828837 22957413 22634854 22126215 21395279 21618487 20991256 20822553 20447850 19276546
3463 19276546 18180973 19008050 18804316 18340611 17815548 17358062 16269400 15613812 15760347
3454 15760347 15774893 15526469 15462804 15545538 14865940 15334977 16026151 15749936 14991034 15174733
3444 15174733 15201123 15203513 15236266 15895348 15927237 14879915 14336531 14783268 14594760 14549091
$$ packed form
3509C9116593J173867L18508Q22072q1491n24204N09794k80454k45881o56997
3500D0151807j823094j091041j48245r42641k586408j222358p70451o14040j153964
3491B9799565p67149j099068n83000N86525J29287r08252j06488K19798q46667
3482B6424551k57932N7293k3444p97259p37618K16678K6998j17111p51123k12196
3472B3828837q71424l22559n08639p30936K23208o27231j68703l74703j171304
3463A9276546j095573Q27077k03734m63705n25063m57486j088662o55588J46535
3454A5760347J4546k48424o3665Q2734o79598M69037O91174k76215p58902J83699
3444A5174733K6390K390L2753O59082L1889j047322n43384M46737j88508m5669
$$ plain form
3434 14549091 15070929 14896857 13615922 13728215 14275814 13449735 13540861 13954830 14110657
3425 14110657 14611185 14602549 15391065 15255183 15340963 15273758 14990158 14764425 15250161 15167749
3415 15167749 15124579 15310604 14688670 14961022 14642846 15044191 15381053 15575362 16357523 16057924
3405 16057924 15439766 15940103 16064552 15904951 16216281 16121722 15826373 16165566 16657510 17129438
3395 17129438 17184977 17660723 17670002 17477602 17996199 18203381 18345404 19051716 19304762 19841240
3385 19841240 19111864 19093835 19490737 20641902 21058065 21847278 21408734 22127485 22692743
3376 22692743 22484829 23221549 23501714 23808755 24512242 24980571 24827800 25389558 26014568
3367 26014568 25858480 25771813 26537500 26550334 27203081 26742447 26404357 27175556 26808569 27467660
$$ packed form
3434A4549091N21838j74072j280935J12293N47599q26079R1126M13969J55827
3425A4110657N00528q636P88516j35882Q5780o7205k83600k25733M85736q2412
3415A5167749m3170J86025o21934K72352l18176M01345L36862J94309P82161k99599
3405A6057924o18158N00337J24449j59601L11330r4559k95349L39193M91944M71928
3395A7129438N5539M75746R279j92400N18597K07182J42023P06312K53046N36478
3385A9841240p29376j8029L96902J151165M16163P89213m38544P18751N65258
3376B2692743k07914P36720K80165L07041P03487M68329j52771N61758O25010
3367B6014568j56088q6667P65687J2834O52747m60634l38090P71199l66987O59091
$$ plain form
3357 27467660 27851910 27685141 27795541 28500430 29125785 28584841 28504728 28147263 27972796 28689352
3347 28689352 28812639 28798299 29583602 29496138 30074857 31792269 31599241 31975965 33024899
3338 33024899 33771080 34673119 34857737 36345922 37905529 38124529 39518034 40703500 41669770
3329 41669770 43713055 44610778 46502270 48081796 49034821 50548949 52317641 54463031
3321 54463031 56972759 59492676 61709086 63641566 65861703 67586425 69774964 71644585
3313 71644585 73409703 73447858 74388241 75528607 76889123 77607678 78294704 78709730 79189768
3304 79189768 80798001 82709919 83085830 83954038 85054323 85244127 85952373 86471871 87825308
3295 87825308 87986098 88516766 89086353 89197518 90626746 92518940 93002180 94160149 95535033
$$ packed form
3357B7467660L84250j66769J10400P04889O25355n40944q0113l57465j74467P16556
3347B8689352J23287j4340P85303q7464N78719J717412j93028L76724J048934
3338C3024899P46181R02039J84618J488185J559607K19000J393505J185466R66270
3329D1669770K043285Q97723J891492J579526R53025J514128J768692K145390
3321E4463031K509728K519917K216410J932480K220137J724722K188539J869621
3313G1644585J765118L8155R40383J140366J360516P18555O87026M15026M80038
3304G9189768J608233J911918L75911Q68208J100285J89804P08246N19498J353437
3295H7825308J60790N30668N69587J11165J429228J892194M83240J157969J374884
$$ plain form
3286 95535033 98463432 101515344 105752878 110415482 114881169 114591128 109600582 103423758
3278 103423758 98466949 94948051 92764858 90905508 89338370 88121375 85777417 84702734
3270 84702734 83262520 81065656 79149612 77880392 76722754 75826431 74301907 72940906
3262 72940906 72866910 72352716 72483794 73271609 74892243 77159407 79042584 82315124 87579959
3253 87579959 94080125 102241707 113873235 127472754 135304002 130124613 119341992 111366675
3245 111366675 105839401 102194168 98203554 94202425 90450236 86325930 80880014 76353231
3237 76353231 73254796 70182018 68357342 66591622 65165061 63160418 61915019 60864158
3229 60864158 59164824 58108052 58232925 57827352 57278777 56889805 57108208 58208757 60467766
$$ packed form
3286I5535033K928399L051912M237534M662604M465687k90041m990546o176824
3278A03423758m956809l518898k183193j859350j567138j216995k343958j074683
3270H4702734j440214k196864j916044j269220j157638q96323j524524j361001
3262G2940906p3996n14194J31078P87815J620634K267164J883177L272540N264835
3253H7579959O500166Q161582J1631528J3599519P831248n179389j0782621p975317
3245A11366675n527274l645233l990614m001129l752189m124306n445916m526783
3237G6353231l098435l072778j824676j765720j426561k004643j245399j050861
3229F0864158j699334j056772J24873m05573n48575l88972K18403J100549K259009
$$ plain form
3220 60467766 62728657 66448623 69905005 73295800 72352956 65691202 58716257 53798422
3212 53798422 51342902 49211838 46917235 44460514 42943084 41274569 39722005 39236423
3204 39236423 38878282 38446568 37774017 36394975 36487837 35876937 34758923 32396762 31417688
3195 31417688 31554220 30067348 29724733 29050620 28503014 27606297 27392314 27676700 26794371
3186 26794371 26602094 26125642 26054532 25809848 25780193 25711633 25949042 25799853 25454468 25464738
3176 25464738 25358480 25480766 26407599 26523532 26873317 26948018 27232930 27584845 28006786 28527729
3166 28527729 28566216 29131886 30085415 30702788 30553777 30134632 30605462 32664953 32512802
3157 32512802 33311961 34165812 34769018 35164233 35985880 36907682 38117722 39129397 40219952
$$ packed form
3220F0467766K260891L719966L456382L390795r42844o661754o974945m917835
3212E3798422k455520k131064k294603k456721j517430j668515j552564m85582
3204C9236423l58141m31714o72551j379042R2862o10900j118014k362161r79074
3195C1417688J36532j486872l42615o74113n47606q96717k13983K84386q82329
3186B6794371j92277m76452p1110k44684k9655o8560K37409j49189l45385J0270
3176B5464738j06258J22286R26833J15933L49785P4701K84912L51915M21941N20943
3166B8527729L8487N65670R53529O17373j49011m19145M70830K059491j52151
3157C2512802P99159Q53851O03206L95215Q21647R21802J210040J011675J090555
$$ plain form
3148 40219952 42515789 44468747 46720152 49687338 52368178 56498644 59357303 61695075
3140 61695075 64618868 67601137 71550787 73292115 76285241 78691530 79855909 79746240
3132 79746240 78802007 77259857 75319230 73043458 69871049 65831017 62799122 59978085
3124 59978085 56427404 52866665 50065013 47595129 45768058 44002800 41302466 39813644
3116 39813644 38868930 37875330 36164896 33643621 32662309 32163352 30668330 28990757 28060221
3107 28060221 26118011 24714051 24607679 23952054 22844243 22065329 21315035 19928576 19656112
3098 19656112 19835001 19558819 18672355 18846076 18480704 17453445 17558822 17764880 18194004
3089 18194004 18768830 18221116 17876468 17519109 17509940 16974386 17181484 17890250 17512755 16678478
$$ packed form
3148D0219952K295837J952958K251405K967186K680840M130466K858659K337772
3140F1695075K923793K982269L949650J741328K993126K406289J164379j09669
3132G9746240r44233j542150j940627k275772l172409m040032l031895k821037
3124E9978085l550681l560739k801652k469884j827071j765258k700334j488822
3116C9813644r44714r93600j710434k521275r81312m98957j495022j677573r30536
3107B8060221j942210j403960j06372o55625j107811p78914p50294j386459k72464
3098A9656112J78889k76182q86464J73721l65372j027259J05377K06058M29124
3089A8194004N74826n47714l44648l57359r169n35554K07098P08766l77495q34277
$$ plain form
3079 16678478 15803017 16572237 16637451 16393103 16730162 17274618 16574384 16212239 15818234 15901607
3069 15901607 16842978 15536340 15237977 14802406 15127664 15051247 15011360 14492324 13576498 12915305
3059 12915305 13210676 12597311 12271725 12453505 12674599 12205457 11943111 11738705 11067252
3050 11067252 10370375 10523675 10473512 9697355 9683896 9541871 10254104 10367733 9827305 10401129
3040 10401129 10426641 10153610 10139427 8842356 8896908 9177091 9311579 9174596 9078724 8600269
3030 8600269 8670252 8749452 8488825 7808032 7493304 7698068 7989802 8188953 8222290 8146175
3020 8146175 8592299 8661853 7662953 7412574 7601811 7805377 8705832 8305527 7913494 7451113
3010 7451113 7755417 7966541 8785089 8276068 7963691 8498073 8261736 8152917 8076101 7442965
$$ packed form
3079A6678478q75461P69220O5214k44348L37059N44456p00234l62145l94005Q3373
3069A5901607R41371j306638k98363m35571L25258p6417l9887n19036r15826o61193
3059A2915305K95371o13365l25586J81780K21094m69142k62346k04406o71453
3050A1067252o96877J53300n0163p76157j3459j42025P12233J13629n40428N73824
3040A0401129K5512k73031j4183j297071N4552K80183J34488j36983r5872m78455
3030H600269O9983P9200k60627o80793l14728K04764K91734J99151L3337p6115
3020H146175M46124O9554r98900k50379J89237K03566R00455m00305l92033m62381
3010G451113L04304K11124Q18548n09021l12377N34382k36337j08819p6816o33136
$$ plain form
3000 7442965 7530299 8375612 8068472 7939996 7987345 7822294 7958489 7924283 8155665 7913360
2990 7913360 7870279 8099876 8682431 8240220 8772056 9269857 8597487 9113829 9469674 9188399
2980 9188399 8929699 9460920 10016301 10646891 10411240 10606780 10355231 9441552 9353218 9367728
2970 9367728 10264020 10528670 9622313 10388250 10257007 10380444 10039174 10977759 10589317 10659707
2960 10659707 11154164 11548072 11665741 11037431 11367691 12026929 12194986 12099188 12249670 12650630
2950 12650630 13365044 13439866 13437499 13755761 14741454 15041164 15097226 16111122 16472777 16209490
2940 16209490 16459794 17068545 17595277 18255509 18742623 18607310 18719815 19381789 19610780
2931 19610780 20654488 20978650 21352237 22633536 21960596 21839362 22017460 22520638 22630642
$$ packed form
3000G442965Q7334Q45313l07140j28476M7349j65051J36195l4206K31382k42305
2990G913360m3081K29597N82555m42211N31836M97801o72370N16342L55845k81275
2980I188399k58700N31221N55381O30590k35651J95540k51549r13679q8334J4510
2970I367728Q96292K64650r06357P65937j31243J23437l41270R38585l88442P0390
2960A0659707M94457L93908J17669o28310L30260O59238J68057r5798J50482M00960
2950A2650630P14414P4822k367L18262R85693K99710N6062J013896L61655k63287
2940A6209490K50304O08751N26732O60232M87114j35313J12505O61974K28991
2931A9610780J043708L24162L73587J281299o72940j21234J78098N03178J10004
$$ plain form
2922 22630642 23507371 24119944 24910581 25948538 26295804 26858878 27489823 29281256 29407782
2913 29407782 28769973 30200355 31090188 32811187 33835785 34108371 35637531 37111970 39180772
2904 39180772 40430888 41184538 41871752 41708412 43266313 44431041 44586934 44782818 46251494
2895 46251494 47684871 49211727 51509005 53982343 56788781 59275294 63093713 67544871
2887 67544871 72080651 74996057 76744105 77616261 78684752 79773019 80531503 82433861
2879 82433861 84117315 86089882 88004645 90525835 94909517 98383913 103008056 107527562
2871 107527562 113094583 120160763 127380712 136924246 151473847 167900093 187623033 211494401
2863 211494401 236072067 259717589 281258129 298525962 306519486 302580020 284722397
$$ packed form
2922B2630642Q76729O12573P90637J037957L47266N63074O30945J791433J26526
2913B9407782o37809J430382Q89833J720999J024598K72586J529160J474439K068802
2904C9180772J250116P53650O87214j63340J557901J164728J55893J95884J468676
2895D6251494J433377J526856K297278K473338K806438K486513L818419M451158
2887F7544871M535780K915406J748048Q72156J068491J088267P58484J902358
2879H2433861J683454J972567J914763K521190M383682L474396M624143M519506
2871A07527562N567021P066180P219949R543534J4549601J6426246J9722940K3871368
2863B11494401K4577666K3645522K1540540J7267833P993524l939466j7857623
$$ plain form
2856 284722397 257910325 231200238 208668238 191113849 177375181 165180371 154286270
2849 154286270 144342588 136582970 129846728 123994103 117986868 112188661 105631589 98430252
2841 98430252 92486070 85842441 80295375 75049831 70952523 66055319 61999511 59312835
2833 59312835 56046360 54028484 52644259 50999234 49026911 47986690 46707723 45220798
2825 45220798 44169510 43098573 42942074 41870101 40811958 40416430 40074641 39692564 39834035
2816 39834035 41126145 41695903 42074905 42205466 41716951 40869974 39192448 36968704 35082188
2807 35082188 32333718 29748540 28575395 26372424 24615687 24386747 22773203 21957623
2799 21957623 20582978 19954357 19158814 18002946 16965282 16381392 16255225 16195393 15589286
$$ packed form
2856B84722397k6812072k6710087k2532000j7554389j3738668j2194810j0894101
2849A54286270r943682p759618o736242n852625o007235n798207o557072p201337
2841I8430252n944182o643629n547066n245544m097308m897204m055808k686676
2833E9312835l266475k017876j384225j645025j972323j040221j278967j486925
2825D5220798j051288j070937j56499j071973j058143l95528l41789l82077J41471
2816C9834035J292110N69758L79002J30561m88515q46977j677526k223744j886516
2807C5082188k748470k585178j173145k202971j756737k28940j613544q15580
2799B1957623j374645o28621p95543j155868j037664n83890j26167n9832o06107
$$ plain form
2790 15589286 16046431 15159822 15163204 14808118 13431439 13645948 13628799 13049321 12937190 12940111
2780 12940111 12392089 12775815 12971189 12964066 13027480 11748384 11656988 12082487 11580320 11559843
2770 11559843 11515204 11104050 10646955 10369782 9417671 9032877 9653946 9803683 8791611
2761 8791611 9325919 9510048 8740688 9341636 9639583 8635936 7621805 7534327 7425698
2752 7425698 7232908 7095076 6874841 6857633 6689281 6839913 6277208 6394532 6152232 6143268
2742 6143268 6654550 6303835 5960553 5144769 4634519 5011285 4709190 4636413 4200685 3909869
2732 3909869 4020365 5017200 5376551 4832990 4631993 4504267 4537338 4208634 4259216 3791656
2722 3791656 4242926 3546511 3243853 3192924 3444502 3542066 2991839 3166501 2835685 2612138
$$ packed form
2790A5589286M57145q86609L382l55086j376679K14509j7149n79478j12131K921
2780A2940111n48022L83726J95374p123O3414j279096r1396M25499n02167k0477
2770A1559843m4639m11154m57095k77173r52111l84794O21069J49737j012072
2761H791611N34308J84129p69360O00948K97947j003647j014131q7478j08629
2752G425698j92790j37832k20235j7208j68352J50632n62705J17324k42300q964
2742F143268N11282l50715l43282q15784n10250L76766l02095p2777m35728k90816
2732C909869J10496R96835L59351n43561k00997j27726L3071l28704N0582m67560
2722C791656M51270o96415l02658n0929K51578R7564n50227J74662l30816k23547
$$ plain form
2712 2612138 2485940 3385813 3257111 2659952 2682436 2897839 3029286 3292168 3460845 3515784
2702 3515784 2892486 3095271 2863312 2621955 2748518 2233815 1986181 1918058 2165523 2769876
2692 2769876 2366692 2923036 2800046 2710074 2265952 2349750 2434854 2622534 2801950 2833953
2682 2833953 2625163 2247268 2599919 2776347 1361381 1404128 1041250 1424633 1946173 1456282
2672 1456282 1635195 1504144 1947095 1680333 892567 1331503 2291132 2019850 1588675 2270351
2662 2270351 2250868 692994 1205777 1563723 1447952 1962409 2040092 1551653 1529426 739323
2652 739323 1591346 1977335 1959125 2060141 1736240 1393485 1159907 1488424 1578897 1165826
2642 1165826 852134 1534673 1631511 1204200 1231294 1243666 1295671 1248794 1281693 1231333 1043718
$$ packed form
2712B612138j26198Q99873j28702n97159K2484K15403J31447K62882J68677N4939
2702C515784o23298K02785k31959k41357J26563n14703k47634o8123K47465O04353
2692B769876m03184N56344j22990q9972m44122Q3798Q5104J87680J79416L2003
2682B833953k08790l77895L52651J76428j414966M2747l62878L83383N21540m89891
2672A456282J78913j31051M42951k66762p87766M38936R59629k71282m31175O81676
2662B270351j9483j557874N12783L57946j15771N14457P7683m88439k2227p90103
2652G39323Q52023L85989j8210J01016l23901l42755k33578L28517R0473m13071
2642A165826l13692O82539R6838m27311K7094J2372N2005m6877L2899n0360j87615
$$ plain form
2631 1043718 1277663 1231770 1475159 1559318 910802 1645430 1357246 1024714 1233638 1386924
2621 1386924 1155696 321188 283366 111712 830106 1231852 922717 519134 367829 920861
2611 920861 278055 897759 1203250 1270174 1050836 748062 913107 1652480 1640457 1510342
2601 1510342 530982 708885 1581744 1698972 1226188 980145 887437 1494363 676544 323680
2591 323680 74751 15247 980528 616393 335035 723209 1168274 864747 1041460 739449
2581 739449 899108 1643132 940581 1017146 1528781 2046590 1977314 1519544 1923624 1814844
2571 1814844 1654344 1758901 1381656 1610281 2066966 1402157 578520 782480 949781 2367263
2561 2367263 2069660 1528268 1495165 1768539 1528052 831250 1087477 1060793 1290914 441265
$$ packed form
2631A043718K33945m5893K43389Q4159o48516P34628k88184l32532K08924J53286
2621A386924k31228q34508l7822j71654P18394M01746l09135m03583j51305N53032
2611I20861o42806O19704L05491O6924k19338l02774J65045P39373j2023j30115
2601A510342r79360J77903Q72859J17228m72784k46043r2708O06926q17819l52864
2591C23680k48929n9504R65281l64135k81358L88174M45065l03527J76713l02011
2581G39449J59659P44024p02551P6565N11635N17809o9276m57770M04080j08780
2571A814844j60500J04557l77245K28625M56685o64809q23637K03960J67301J417482
2561B367263k97603n41392l3103K73374k40487o96802K56227k6684K30121q49649
$$ plain form
2551 441265 520844 441026 978582 598565 881622 -59241 674390 889486 758902 834071
2541 834071 225812 517060 882428 596452 473149 630097 283156 160060 262431 836056
2531 836056 495645 574430 1403996 678046 509044 877662 923968 542273 279213 70244
2521 70244 163477 -560154 320293 -398763 -764281 -14949 185124 522060 1140021 119413
2511 119413 37177 198809 -137447 5672 459234 -58023 377170 545311 -293235 370287
2501 370287 468557 -352402 -135221 452383 4327 387582 511943 -22541 -308671 -81731
2491 -81731 -106575 -246867 -10790 477500 287398 320647 107286 -112898 -51920 -308944
2481 -308944 -247822 -312067 -722024 -454065 -993318 -640219 223727 -165197 2480 704056
$$ packed form
2551D41265P9579p9818N37556l80017K83057r40863P33631K15096j30584P5169
2541H34071o08259K91248L65368k85976j23303J56948l46941j23096J02371N73625
2531H36056l40411P8785Q29566p25950j69002L68618M6306l81695k63060k08969
2521G0244R3233p23631Q80447p19056l65518P49332K00073L36936O17961j020608
2511A19413q2236J61632l36256J43119M53562n17257M35193J68141q38546O63522
2501C70287R8270q20959K17181N87604m48056L83255J24361n34484k86130K26940
2491h1731k4844j40292K36077M88290j90102L3249k13361k20184O0978k57024
2481c08944O1122o4245m09957K67959n39253L53099Q63946l88924J67677P01576
$$ plain form
2471 704056 -131385 -858493 -461231 -225337 347117 -465096 206569 920267 128104 -403738
2461 -403738 55895 787835 105904 142672 -286726 482632 956319 340064 -846657 235836
2451 235836 -61798 80114 74342 286621 646226 1266237 470954 -38837 -262426 496771
2441 496771 331440 585603 134683 482167 1282081 700807 939164 545947 46087 -326981
2431 -326981 187268 689978 523072 338489 -365758 -831646 -583997 -360528 606350 -113718
2421 -113718 13162 914740 641575 536313 213752 -165058 -330185 -1028899 -891655 -998414
2411 -998414 -186609 458890 245203 -220363 -768463 -104806 -71138 -561348 299998 257989
2401 257989 146660 -362353 -157344 312341 305588 -1154087 -908274 -759693 -310456 288770
$$ packed form
2471G04056q35441p27108L97262K35894N72454q12213O71665P13698p92163n31842
2461d03738M59633P31940o81931L6768m29398P69358M73687o16255j186721J082493
2451B35836k97634J41912n772K12279L59605O20011p95283n09791k23589P59197
2441D96771j65331K54163m50920L47484P99914n81274K38357l93217m99860l73068
2431c26981N14249N02710j66906j84583p04247m65888K47649K23469R66878p20068
2421a13718J26880R01578k73165j05262l22561l78810j65127o98714J37244j06759
2411i98414Q11805O45499k13687m65566n48100O63657L3668m90210Q61346m2009
2401B57989j11329n09013K05009M69685o753j459675K45813J48581M49237N99226
$$ plain form
2391 288770 222533 -537620 -554852 -698762 -97697 273127 -94043 -81974 -885268 -628956
2381 -628956 -557215 -580677 11456 245032 1148933 1774998 2010565 995704 796655 1635970
2371 1635970 1704685 1387782 916855 1070716 282847 205265 16162 948419 481391 259665
2361 259665 298377 43330 439164 595719 13225 161106 383924 502355 -648782 -380517
2351 -380517 319657 -115507 -380344 -522725 -439845 27490 -260041 -127826 67117 424160
2341 424160 619536 254372 94930 -523428 -532267 -847837 -1052871 -1700495 -801308 -445626
2331 -445626 -936993 -850301 -202289 -71643 -397241 475860 680973 158643 -348413 -421775
2321 -421775 -193648 -186186 -137250 275729 -624389 -954692 -1441557 -1248124 -716140 -81542
$$ packed form
2391B88770o6237p60153j7232j43910O01065L70824l67170J2069q03294K56312
2381f28956P1741k3462N92133K33576R03901O26065K35567j014861j99049Q39315
2371A635970O8715l16903m70927J53861p87869p7582j89103R32257m67028k21726
2361B59665L8712k55047L95834J56555n82494J47881K22818J18431j151137K68265
2351c80517P00174m35164k64837j42381Q2880M67335k87531J32215J94943L57043
2341D24160J95376l65164j59442o18358q839l15570k05034o47624Q99187L55682
2331d45626m91367Q6692O48012J30646l25598Q73101K05113n22330n07056p3362
2321d21775K28127P462M8936M12979r00118l30303m86865J93433N31984O34598
$$ plain form
2311 -81542 529138 39312 -398271 -893075 -11105 426073 836684 1179005 417797 -51179
2301 -51179 144410 13111 -50818 -304139 328368 -45538 20744 -801269 -798991 -486789 -28555
2290 -28555 -241288 -723321 848671 292908 -33523 94260 -1370966 -1483550 -477443
2281 -477443 -214642 -143245 -445178 -141788 615012 575341 -53904 -300254 -278202 -376376
2271 -376376 -307112 -721596 -540993 -173054 34805 730452 1043400 483427 -11661 -508829
2261 -508829 -478173 -875786 -312227 591256 1238116 1786052 797724 -131286 -338619 323321
2251 323321 620399 666565 1259744 771965 524946 625528 802274 984044 673387 1166277
2241 1166277 960744 564090 391773 13846 192621 652046 227731 344815 960735 1285304
$$ packed form
2311h1542O10680m89826m37583m94804Q81970M37178M10611L42321p61208m68976
2301e1179J95589j31299o3929k53321O32507l73906O6282q22013K278L12202M58234
2290b8555k12733m82033J571992n55763l26431J27783j465226j12584J006107
2281d77443K62801P1397l01933L03390P56800l9671o29245k46350K2052r8174
2271c76376O9264m14484J80603L67939K07859O95647L12948n59973m95088m97168
2261e08829L0656l97613N63559R03483O46860N47936r88328r29010k07333O61940
2251C23321K97078M6166N93179m87779k47019J00582J76746J81770l10657M92890
2241A166277k05533l96654j72317l77927J78775M59425m24315J17084O15920L24569
$$ plain form
2231 1285304 1296315 1436624 953416 1383377 747412 -48969 786653 637754 782451 1431515
2221 1431515 1795860 1347069 1353670 1282149 894906 835848 886319 362921 597579 828015
2211 828015 896881 462119 251877 612152 1228032 804144 889169 1363624 1455345 1287711
2201 1287711 906488 268450 680814 1089026 693846 311819 593336 934002 627360 924760
2191 924760 1058551 647868 1228472 1803778 2169415 1920016 1244755 1621638 1894489 1931354
2181 1931354 2136520 2901781 3219549 3434771 2933729 3343597 3900558 4150186 4005096 3453583
2171 3453583 3931969 3736074 3786221 3919463 3005334 3390574 4582971 4395249 3428495 3607549
2161 3607549 3562659 4744006 4783183 4978209 4916634 6136808 6981681 7444831 6625394 6523905
$$ packed form
2231A285304J1011J40309m83208M29961o35965p96381Q35622j48899J44697O49064
2221A431515L64345m48791O601p1521l87243n9058N0471n23398K34658K30436
2211H28015O8866m34762k10242L60275O15880m23888Q5025M74455R1721j67634
2201A287711l81223o38038M12364M08212l95180l82027K81517L40666l06642K97400
2191I24760J33791m10683N80604N75306L65637k49399o75261L76883K72851L6865
2181A931354K05166P65261L17768K15222n01042M09868N56961K49628j45090n51513
2171C453583M78386j95895N0147J33242r14129L85240J192397j87722r66754J79054
2161C607549m4890J181347L9177J95026o1575J220174Q44873M63150q19437j01489
$$ plain form
2151 6523905 6514068 6841596 7999568 8290099 7715085 7190651 7454257 9215243 8759707 9770451
2141 9770451 10031036 10199584 10524575 11919132 11905335 12538033 13483528 14422145 14543425 14632132
2131 14632132 14770687 16174905 17163313 18433868 18711658 19152611 21830978 23480921 26208713
2122 26208713 28889909 31448092 34234829 35190950 34348502 34724340 36545295 40383957 46610553
2113 46610553 53458608 64929288 80290494 100740196 125425798 162513749 211973211
2106 211973211 268032568 311243497 269880910 197072794 141376068 105757477 84400284
2099 84400284 69818065 59456831 51292633 44187168 39809267 36533045 33151928 31203011
2091 31203011 29239091 28736707 25870246 22722345 20457077 19205677 18377227 17396213 15815223
$$ packed form
2151F523905r837L27528J157972K90531n75014n24434K63606J760986m55536J010744
2141I770451K60585J68548L24991J394557j3797O32698R45495R38617J21280Q8707
2131A4632132J38555J404218R88408J270555K77790M40953K678367J649943K727792
2122B6208713K681196K558183K786737R56121q42448L75838J820955L838662O226596
2113D6610553O848055J1470680J5361206K0449702K4685602L7087951M9459462
2106B11973211N6059357M3210929m1362587p2808116n5696726l5618591k1357193
2099H4400284j4582219j0361234q164198p105465m377901l276222l381117j948917
2091C1203011j963920n02384k866461l147901k265268j251400q28450r81014j580990
$$ plain form
2082 15815223 14434784 13469791 12944334 12543443 11912602 10439006 10486815 9192994 8646578
2073 8646578 9090370 8451807 8337024 8424336 7616284 7023280 6243115 6347375 5126445 5290184
2063 5290184 5120286 4628362 4859793 5578579 5492707 5594729 5155744 4781769 4854066 3591332
2053 3591332 3238010 3094397 3751626 4045551 3793147 3849979 3364617 3344111 2487051 2409729
2043 2409729 1755875 2238698 2507764 1820178 2949679 2442860 1401899 1326255 2123570
2034 2123570 3024979 1936270 1822302 1675805 817693 1586246 1849552 1215083 1767926
2025 1767926 2194897 2359602 2456786 1733374 1319993 1560616 2252316 2325598 2282268 2874415
2015 2874415 2162818 748509 538982 1576385 1442772 1762496 1552422 1100965 1389131
$$ packed form
2082A5815223j380439r64993n25457m00891o30841j473596M7809j293821n46416
2073H646578M43792o38563j14783Q7312q08052n93004p80165J04260j220930J63739
2063E290184j69898m91924K31431P18786q5872J02022m38985l73975P2297j262734
2053C591332l53322j43613O57229K93925k52404N6832m85362k0506q57060p7322
2043B409729o53854M82823K69066o87586J129501n06819j040961p5644P97315
2034B123570R01409j088709j13968j46497q58112P68553K63306o34469N52843
2025A767926M26971J64705R7184p23412m13381K40623O91700P3282m3330N92147
2015B874415p11597j414309k09527J037403j33613L19724k10074m51457K88166
$$ plain form
2006 1389131 1453684 1566966 1109246 949169 1263257 1301108 1020421 710018 730898 523338
1996 523338 870622 414496 577626 158660 216447 80182 -98119 -170597 351733 603414
1986 603414 -800657 63598 -61996 210538 552049 896277 1295060 766774 264751 31553
1976 31553 814396 929628 962780 745481 375040 324809 -402673 -402877 -223445 -417583 247263
1965 247263 872178 1115029 554571 -264714 215388 524532 -319324 302950 -644496 -422025
1955 -422025 -132931 -16318 -606236 -157795 -113128 -606889 -523880 -253958 324509 565263
1945 565263 794001 73130 505013 -123691 -72857 474573 541473 424758 -19645 326235
1935 326235 782985 963119 808394 58971 442810 200721 27123 -22403 -303630 -284836
$$ packed form
2006A389131O4553J13282m57720j60077L14088L7851k80687l10403K0880k07560
1996E23338L47284m56126J63130m18966N7787j36265j78301p2478N22330K51681
1986F03414j404071Q64255j25594K72534L41511L44228L98783n28286n02023k33198
1976C1553P82843J15232L3152k17299l70441n0231p27482k04J79432j94138O64846
1965B47263O24915K42851n60458q19285M80102L09144q43856O22274r47446K22471
1955d22025K89094J16613n89918M48441M4667m93761Q3009K69922N78467K40754
1945E65263K28738p20871M31883o28704N0834N47430O6900j16715m44403L45880
1935C26235M56750J80134j54725p49423L83839k42089j73598m9526k81227J8794
$$ plain form
1925 -284836 -432821 -31744 718430 301485 220555 437411 482621 -110633 -440537 -580944
1915 -580944 -248793 -166538 -104278 -49181 247509 -424375 -857217 325039 -355142 -780016
1905 -780016 -331775 -551000 -397827 -328041 -252140 -214432 -493216 -215760 129837 -967679
1895 -967679 -816411 -798954 -1028185 -380829 259173 347231 85909 -383459 -694881 -619996
1885 -619996 -26343 597290 714234 -341183 -1126026 -1399141 -762110 -41988 289576 20958
1875 20958 276660 -404835 -359500 60973 486207 657320 657355 812093 168272 412211 46073
1864 46073 157334 192711 -311591 520468 958864 -251105 -468481 231862 290207 332255
1854 332255 311729 -137790 78784 48409 10280 -52961 741737 178475 -102246 -135084 436562
$$ packed form
1925b84836j47985M01077P50174m16945q0930K16856M5210n93254l29904j40407
1915e80944L32151Q2255O2260N5097K96690o71884m32842J182256o80181m24874
1905g80016M48241k19225J53173O9786P5901L7708k78784K77456L45597j097516
1895i67679J51268J7457k29231O47356O40002Q8058k61322m69368l11422P4885
1885f19996N93653O23633J16944j055417p84843k73115O37031P20122L31564k68618
1875B0958K55702o81495M5335M20473M25234J71113L5J54738o43821K43939l66138
1864D6073J11261L5377n04302Q32059M38396j209969k17376P00343N8345M2048
1854C32255k0526m49519K16574l0375l8129o3241P94698n63262k80721l2838N71646
$$ plain form
1843 436562 1207249 519921 -88865 355395 763079 1641934 871956 1391503 1601775 704907
1833 704907 -320914 -234732 970599 502827 -37625 51232 651778 -113620 71970 162233
1823 162233 477475 893635 852054 720116 338923 187497 25031 496758 -303280 -349456
1813 -349456 79979 206455 482604 -258285 -28393 634525 63644 -163009 506116 -401645
1803 -401645 -61807 -282433 -371744 -533951 -1218098 -771591 430999 33349 -566348 -894340
1793 -894340 -176194 481437 75231 -488966 -1019155 -454590 -468064 -778093 -788575 -209349
1783 -209349 147707 -56185 301417 324679 -402196 -557626 -605889 -196572 268149 5863
1773 5863 -218179 -215703 108349 -194265 219295 -655342 -491561 441990 503343 344200 45152
$$ packed form
1843D36562P70687o87328o08786M44260M07684Q78855p69978N19547K10272q96868
1833G04907j025821Q6182J205331m67772n40452Q8857O00546p65398J85590R0263
1823A62233L15242M16160m1581j31938l81193j51426j62466M71727q00038m6176
1813c49456M29435J26476K76149p40889K29892O62918n70881k26653O69125r07761
1803d01645L39838k20626q9311j62207o84147M46507J202590l97650n99697l27992
1793h94340P18146O57631m06206n64197n30189N64565j3474l10029j0482N79226
1783b09349L57056k03892L57602K3262p26875j55430m8263M09317M64721k62286
1773E863k24042K476L24052l02614M13560q74637J63781R33551O1353j59143k99048
$$ plain form
1762 45152 780414 235935 -868799 -1333139 233963 -90786 -312955 -90496 -126722 -786594
1752 -786594 -584091 -108673 -263839 -2414 -795717 -618876 -51197 -530222 -461222 -543313
1742 -543313 -578465 -573901 -489062 -710113 -220494 -354350 -395199 663051 961189 486261
1732 486261 224060 -568114 -735878 -730806 209139 547909 692295 235263 -68157 -399889
1722 -399889 13024 -674846 -1044309 -1007962 -1212809 -1119257 -1032415 -666842 109332 758695
1712 758695 220472 -104997 -457051 -51881 73273 3052 -572859 42854 687825 803650
1702 803650 436841 -76726 337759 965907 2457 -970576 -1389986 -620066 -290537 -250360
1692 -250360 -215301 -181401 143880 158299 -77949 490110 -727904 -933239 26601 -23543
$$ packed form
1762D5152P35262n44479j104734m64340J567102l24749k22169K22459l6226o59872
1752g86594K02503M75418j55166K61425p93303J76841N67679m79025O9000q2091
1742e43313l5152M564Q4839k21051M89619j33856m0849J058250K98138m74928
1732D86261k62201p92174j67764N072R39945L38770J44386m57032l03420l31732
1722c99889M12913o87870l69463L6347k04847R3552Q6842L65573P76174O49363
1712G58695n38223l25469l52054M05170J25154p0221n75911O15713O44971J15825
1702H03650l66809n13567M14485O28148r63450r73033m19410P69920L29529M0177
1692b50360L5059L3900L25281J4419k36248N68059j218014k05335R59840n0144
$$ plain form
1682 -23543 265764 291920 161582 -248859 102730 -120147 -438496 -683802 -1038837 -657685
1672 -657685 -654203 -32709 91193 96420 221464 -183480 -49632 -284388 -297503 -183857 -12957
1661 -12957 283694 -268163 -236804 -246831 257222 183906 -508916 16321 304624 760965
1651 760965 1198668 1143607 958212 535 -228981 -290368 -169478 -539641 -558328 197456
1641 197456 -389907 -517098 -449280 -1078939 -1522551 -1356519 -379561 -259661 -457936 -89792
1631 -89792 519723 -245292 -270024 -140728 406454 478386 156637 627304 -171499 -915351
1621 -915351 -1190734 -910126 499869 211104 -899802 -1671076 -315108 143991 -323343
1612 -323343 -712857 -554656 101274 -197097 -124092 344271 54195 -379418 -438936 -465798
$$ packed form
1682b3543K89307K6156j30338m10441L51589k22877l18349k45306l55035L81152
1672f57685L482O21494J23902N227J25044m04944J33848k34756j3115J13646J70900
1661a2957K96651n51857L1359j0027N04053p3316o92822N25237K88303M56341
1651G60965M37703n5061j85395r57677k29516o1387J20890l70163j8687P55784
1641A97456n87363j27191O7818o29659m43612J66032R76958J19900j98275L68144
1631h9792O09515p65015k4732J29296N47182P1932l21749M70667p98803p43852
1621i15351k75383K80608J409995k88765j110906p71274J355968M59099m67334
1612c23343l89514J58201O55930k98371P3005M68363k90076m33613n9518k6862
$$ plain form
1602 -465798 -76439 -582719 -90227 181527 -284041 -573402 278889 147300 502257 417093
1592 417093 -352533 -736813 -416629 -90863 231256 575181 436688 -439521 -1268660 -899273
1582 -899273 -801390 -151562 75462 -104495 -743613 -995559 -931520 -588057 -629600 -587632
1572 -587632 -644378 -849619 -325967 -887069 -788308 -458786 157751 101583 730623 161232
1562 161232 -218878 55575 -111357 383308 746092 749631 454703 -95124 -464152 -786213
1552 -786213 -588534 -1017267 -1006312 -111293 -357482 -436519 171193 451371 113918 -142629
1542 -142629 -132888 213636 -23815 -483382 -202039 -370079 -665961 -99065 715992 375912
1532 375912 284568 147729 -927816 -513034 -515572 -624182 -273964 -420110 -367233 -950208
$$ packed form
1602d65798L89359n06280M92492K71754m65568k89361Q52291j31589L54957q5164
1592D17093p69626l84280L20184L25766L22119L43925j38493q76209q29139L69387
1582h99273R7883O49828K27024j79957o39118k51946O4039L43463m1543M1968
1572e87632n6746k05241N23652n61102R8761L29522O16537n6168O29040n69391
1562A61232l80110K74453j66932M94665L62784L539k94928n49827l69028l22061
1552g86213J97679m28733J0955Q95019k46189p9037O07712K80178l37453k56547
1542a42629R741L46524k37451m59567K81343j68040k95882N66896Q15057l40080
1532C75912r1344j36839j075545M14782k538j08610L50218j46146N2877n82975
$$ plain form
1522 -950208 -63153 -137501 -1322421 -803693 -635226 -671202 -854748 145689 441541 -476022
1512 -476022 57042 -714316 -1100650 -654602 -172146 -339600 -160866 842394 -32318 -296979
1502 -296979 -212467 -750906 -424159 -1070057 -678132 -572263 -1011766 -708393 -330643 -339806
1492 -339806 -697698 -70496 -491753 -1099923 -700458 -335504 346823 -458992 -226246 -727932
1482 -727932 -992319 -1001409 -593917 -526994 -843297 -396712 241033 -574752 -685842 -89453
1472 -89453 -188196 88525 -1044010 -879258 -70103 -198146 -708988 234656 653940 -25686
1462 -25686 80682 59644 -225018 51290 -606853 -722485 -175947 890326 48372 308203
1452 308203 35553 -612171 -1615283 -996673 -534239 -212752 309224 -166776 -227326 240599
$$ packed form
1522i50208Q87055p4348j184920N18728J68467l5976j83546J000437K95852r17563
1512d76022N33064p71358l86334M46048M82456j67454J78734J003260q74712k64661
1502b96979Q4512n38439L26747o45898L91925J05869m39503L03373L77750r163
1492c39806l57892O27202m21257o08170L99465L64954O82327q05815K32746n01686
1482g27932k64387r090M07492O6923l16303M46585O37745q15785j11090N96389
1472h9453r8743K76721j132535J64752Q09155j28043n10842R43644M19284o79626
1462b5686J06368k1038k84662K76308o58143j15632N46538J066273q41954K59831
1452C08203k72650o47724j003112O18610M62434L21487N21976m76000o0550M67925
$$ plain form
1442 240599 -66194 -515956 8848 412024 -364342 -600684 -612392 -490038 -515078 -768298
1432 -768298 -875981 -397669 304463 2718 -446983 -30784 -107617 312822 -822805 -615037
1422 -615037 -658916 -231132 47835 -880899 -835414 -1482388 -608986 -515400 -72040 -217662
1412 -217662 -466645 -559595 -290743 -363278 -501776 131318 236780 -68184 -370607 687502
1402 687502 -203031 -278602 346531 466429 264341 -308750 -38084 -1021577 -538780 -347260
1392 -347260 315585 -1285003 -1161262 -697725 -746828 -476938 -194192 726623 93311 -287554
1382 -287554 575534 172434 -524790 683058 456706 54920 228422 198245 -545711 -1003379
1372 -1003379 143315 1520802 795911 -449904 -870093 -618200 -559949 -973937 -143091
$$ packed form
1442B40599l06793m49762N24804M03176p76366k36342j1708J22354k5040k53220
1432g68298j07683M78312P02132l01745m49701M16199p6833M20439j135627K07768
1422f15037m3879M27784K78967r28734M5485o46974Q73402R3586M43360j45622
1412b17662k48983r2950K68852p2535j38498O33094J05462l04964l02423J058109
1402F87502q90533p5571O25133J19898k02088n73091K70666r83493M82797J91520
1392c47260O62845j600588J23741M63537m9103K69890K82746R20815o33312l80865
1382b87554Q63088m03100o97224J207848k26352m01786J73502l0177p43956m57668
1372a003379J146694J377487p24891j245815m20189K51893N8251m13988Q30846
$$ plain form
1363 -143091 266748 505551 -505121 -1310739 -1190269 -583242 -253736 35408 28372 34412
1353 34412 -259828 -219467 102070 -758362 -488785 -184196 -132764 434225 171339 1089640
1343 1089640 623359 214952 -359047 -838409 -412326 -647499 -514384 -472275 -28884 153570
1333 153570 -742054 -1124724 -479404 -149064 159937 79973 -194527 -441881 -757797 -722091
1323 -722091 -642673 -14190 320651 1200470 551795 -599467 -155129 -65920 -217757 -421281
1313 -421281 -262099 -252701 356185 425055 60882 -556424 398349 286724 28495 -439934
1303 -439934 -542443 -8024 -693425 -1156212 -1548045 -1129753 -928181 -1265282 -498619 -488925
1293 -488925 -1105284 -1054697 -611424 -630215 -1436107 -1022605 -1037081 -578023 -240601 -554585
$$ packed form
1363a43091M09839K38803j010672q05618J20470O07027L29506K89144p036O040
1353C4412k94240M0361L21537q60432K69577L04589N1432N66989k62886R18301
1343A089640m66281m08407n73999m79362M26083k35173J33115M2109M43391J82454
1333A53570q95624l82670O45320L30340L09001p9964k74500k47354l15916L5706
1323g22091P9418O28483L34841Q79819o48675j151262M44338Q9209j51837k03524
1313d21281J59182R398O08886O8870l64173o17306R54773j11625k58229m68429
1303d39934j02509N34419o85401m62787l91833M18292K01572l37101P66663R694
1293d88925o16359N0587M43273j8791q05892M13502j4476M59058L37422l13984
$$ plain form
1283 -554585 107888 120861 -47279 117725 -147410 173823 746354 -140029 -587411 -134080
1273 -134080 -379525 -1080355 -796001 -627548 -763491 -1121594 -208197 125082 -436720 -16457
1263 -16457 -226598 -276716 161861 47529 -929015 -796729 -895573 -906922 -377619 437028
1253 437028 823468 281862 176673 718764 -810009 -1440881 -1214841 -814014 -719465 -866589
1243 -866589 -556498 -183805 423089 317002 208630 270723 656289 190115 224823 -445008
1233 -445008 -892291 -374070 -107310 163539 -127706 -652154 48436 347893 -146718 -25302
1223 -25302 -314573 -665412 274681 -60011 -779222 -430337 280406 -90980 -25190 310607
1213 310607 -721418 -372024 -178142 -896441 -1150960 -1278062 -1080720 -1156109 -971619 -649977
$$ packed form
1283e54585O62473J2973j68140J65004k65135L21233N72531q86383m47382M53331
1273a34080k45445p00830K84354J68453j35943l58103R13397L33279n61802M20263
1263a6457k10141n0118M38577j14332r76544J32286r8844j1349N29303Q14647
1253D37028L86440n41606j05189N42091j528773o30872K26040M00827R4549j47124
1243h66589L10091L72693O06894j06087j08372O2093L85566m66174L4708o69831
1233d45008m47283N18221K66760K70849k91245n24448P00590K99457m94611J21416
1223b5302k89271l50839R40093l34692p19211L48885P10743l71386O5790L35797
1213C10607j032025L49394J93882p18299k54519j27102J97342p5389J84490L21642
$$ plain form
1203 -649977 -359939 -483249 -687266 -74802 252305 718641 283121 -420248 -348753 -118321
1193 -118321 82686 268702 255382 -261946 148314 164509 70979 -416231 -595752 -896975
1183 -896975 -418877 540 333415 169307 1445 -196148 320757 403213 -264589 364773
1173 364773 -364672 -983349 -291996 319298 9198 -131044 -145023 -122319 -410965 -540431
1163 -540431 -25133 -926923 -308008 101941 -657163 108116 59802 453739 -237873 -118812
1153 -118812 -106355 -697251 -773720 -903883 -1134849 -65102 494029 167146 224477 -532082
1143 -532082 -1101833 -1207163 -1019415 -185403 293901 504085 -646545 -382225 72946 184746
1133 184746 474421 510022 318931 -254741 78115 276741 90044 -583496 50637 461094
$$ packed form
1203f49977K90038j23310k04017O12464L27107M66336m35520p03369P1495K30432
1193a18321K01007J86016j3320n17328M10260J6195r3530m87210j79521l01223
1183h96975M78098M19417L32875j64108j67862j97593N16905Q2456o67802O29362
1173C64773p29445o18677O91353O11294l10100j40242j3979K2704k88646j29466
1163e40431N15298r01790O18915M09949p59104P65279m8314L93937o91612J19061
1153a18812J2457n90896p6469j30163k30966J069747N59131l26883N7331p56559
1143e32082n69751j05330J87748Q34012M79304K10184j150630K64320M55171J11800
1133A84746K89675L5601j91091n73672L32856J98626j86697o73540O34133M10457
$$ plain form
1123 461094 541681 -322218 -122431 -48538 -244515 97993 182789 -93637 -593064 -1157382
1113 -1157382 -1054423 -517768 -761948 -627430 140037 -115141 -409165 -35853 -138135 -75029
1103 -75029 -91536 -47336 -542641 -123922 413374 877205 1419980 697843 659118 -66118
1093 -66118 -488076 -429392 -671517 -154832 245001 463354 388607 -685997 -674085 -120340
1083 -120340 -561040 169455 153796 145639 413878 713701 257964 537508 202132 -65385
1073 -65385 233870 866793 -211500 -729404 -692340 211340 -33253 -260951 225323 92140
1063 92140 -530173 -279387 138656 -389443 -107770 107497 -293761 92876 466664 175780
1053 175780 560854 131882 -342964 -37314 827981 318059 -66324 445622 1108049 -317909
$$ packed form
1123D61094Q0587q63899J99787P3893j95977L42508Q4796k76426m99427n64318
1113a157382J02959N36655k44180J34518P67467k55178k94024L73312j02282O3106
1103g5029j6507M4200m95305M18719N37296M63831N42775p22137l8725p25236
1093f6118m21958N8684k42125N16685L99833K18353p4747j074604J1912N53745
1083a20340m40700P30495j5659q157K68239K99823m55737K79544l35376k67517
1073f5385K99255O32923j078293n17904L7064R03680k44593k27698M86274j33183
1063I2140o22313K50786M18043n28099K81673K15267m01258L86637L73788k90884
1053A75780L85074m28972m74846L05650Q65295n09922l84383N11946O62427j425958
$$ plain form
1043 -317909 -318443 464610 507446 151437 393357 -416635 -207335 534341 26427 -408475
1033 -408475 454339 116341 -741450 -790906 -406154 75993 521042 705027 478577 254206
1023 254206 221290 -608195 -1078679 -1150799 -743417 -483598 -561068 -401807 144981 417543
1013 417543 219401 -49247 655429 1770011 1107377 217715 -428227 -416896 -436220 -771379
1003 -771379 -392708 -343821 -61031 -30417 -271149 411088 536744 341876 247151 819791
993 819791 862410 758124 -20054 -890426 -1135740 -747606 -1033076 -788470 -312394 -115462
983 -115462 282502 737009 -175305 -1103644 -939410 -590633 -451958 -442820 291377 281791 -67038
972 -67038 -215020 -476975 -169027 -63498 -276945 370723 389120 -167188 79247 434091
$$ packed form
1043c17909n34P83053M2836l56009K41920q09992K09300P41676n07914m34902
1033d08475Q62814l37998q57791m9456L84752M82147M45049J83985k26450k24371
1023B54206l2916q29485m70484p2120M07382K59819p7470J59261N46788K72562
1013D17543j98142k68648P04676J114582o62634q89662o45942J1331j9324l35159
1003g71379L78671M8887K82790L0614k40732O82237J25656j94868r4725N72640
993H19791M2619j04286p78178q70372k45314L88134k85470K44606M76076J96932
983a15462L97964M54507r12314r28339J64234L48777J38675R138P34197r586l48829
972f7038j47982k61955L07948J05529k13447O47668J8397n56308K46435L54844
$$ plain form
962 434091 729918 -71903 -436549 164889 440564 564898 118918 321359 -38767 -302069
952 -302069 -391158 -1053176 -929811 -513090 -881482 -731350 -396913 -685631 -445964 -559760
942 -559760 -21883 -359498 -1069674 -301958 326888 307835 -19497 -396925 -694275 -890765
932 -890765 -518113 -545690 -198476 -333892 -248275 167247 824803 792555 271274 117367
922 117367 292772 -86851 -91840 -543833 -1085087 -364397 -845495 -1332557 -639462 176655
912 176655 -709788 -361097 2161 -431861 -211338 -26863 272683 373967 -1026076 -859700
902 -859700 -619970 -413367 -86838 -315491 -452363 -190571 -429815 9680 185082 -402958
892 -402958 617727 1198864 1238992 946025 749214 -403289 -863535 -111306 -956363 -591719
$$ packed form
962D34091K95827q01821l64646O01438K75675J24334m45980K02441l60126k63302
952c02069q9089o62018J23365M16721l68392J50132L34437k88718K39667j13796
942e59760N37877l37615p10176P67716O28846j9053l27332l77428k97350j96490
932h90765L72652k7577L47214j35416Q5617M15522O57556l2248n21281j53907
922A17367J75405l79623m989m51993n41254P20690m81098m87062O93095Q16117
912A76655q86443L48691L63258m34022K20523J84475K99546J01284j400043J66376
902h59700K39730K06603L26529k28653j36872K61792k39244M39495J75402n88040
892d02958J020685N81137M0128k92967j96811j152503m60246P52229q45057L64644
$$ plain form
882 -591719 162541 246992 383558 227102 -55397 80380 85906 159661 129181 391241 328818
871 328818 517869 232254 684594 678654 -706605 -901242 -141892 226145 418868 380780
861 380780 134866 126300 -317870 453191 230356 -193424 -418698 586353 900137 187286
851 187286 -216589 -590765 -573471 531668 501611 634157 720112 348738 -93267 -575800
841 -575800 -353952 -341334 -520651 -125811 137627 -659854 -160316 429985 668640 1044134
831 1044134 843053 159630 -438175 408418 665622 55803 120402 -329220 -389669 -10066
821 -10066 -670533 -625242 -481055 -216594 510109 182611 -126613 107253 127440 333146
811 333146 712397 127166 -133757 101331 -452942 -90094 -381232 147862 627437 239214
$$ packed form
882e91719P54260Q4451J36566j56456k82499J35777N526P3755l0480K62060o2423
871C28818J89051k85615M52340n940j385259j94637P59350L68037J92723l8088
861C80780k45914q566m44170P71061k22835m23780k25274J005051L13784p12851
851A87286m03875l74176J7294J105139l0057J32546Q5955l71374m42005m82533
841e75800K21848J2618j79317L94840K63438p97481M99538N90301K38655L75494
831A044134k01081o83423n97805Q46593K57204o09819O4599m49622o0449L79603
821a0066o60467M5291J44187K64461P26703l27498l09224K33866K0187K05706
811C33146L79251n85231k60923K35088n54273L62848k91138N29094M79575l88223
$$ plain form
801 239214 120744 49864 226423 -252898 -172674 514650 -81068 -268425 -309520 -17046
791 -17046 384610 -266190 9285 -150639 -578044 -90474 -466994 -429670 -488858 -698389
781 -698389 -397115 -165140 207879 -297935 404226 356730 178020 531289 3170 -284643
771 -284643 576684 854888 506995 489973 679240 -432927 -267313 273873 -299038 75303
761 75303 -96992 253308 519074 -69981 -306033 579135 1266981 666329 -33658 -20246
751 -20246 -318023 -284506 -260847 -78096 -539071 -468425 117073 -164269 -424843 -42765 -393416
740 -393416 -950676 -124612 -264165 -107059 -287231 -565424 -119370 136002 336359 672256
730 672256 855706 274939 -424248 453865 -175431 99352 -194788 -367831 -42958 871076
$$ packed form
801B39214j18470p0880J76559m79321Q0224O87324n95718j87357m1095K92474
791a7046M01656o50800K75475j59924m27405M87570l76520L7324n9188k09531
781f98389L01274K31975L73019n05814P02161m7496j78710L53269n28119k87813
771b84643Q61327K78204l47893j7022J89267j112167J65614N41186n72911L74341
761G5303j72295L50300K65766n89055k36052Q85168O87846o00652o99987J3412
751b0246k97777L3517K3659J82751m60975P0646N85498k81342k60574L82078l50651
740c93416n57260Q26064j39553J57106j80172k78193M46054K55372K00357L35897
730F72256J83450n80767o99187Q78113o29296K74783k94140j73043L24873R14034
$$ plain form
720 871076 411362 -245003 -27311 313758 584707 654470 1000647 473091 123767 -31119
710 -31119 353143 513304 876891 2266 -356572 -540440 -911989 -896304 -607848 -513959
700 -513959 -137348 -361018 -31579 596526 497003 992106 615927 62970 378177 -663108
690 -663108 -48876 -355012 -547356 1044410 565195 -235623 -579208 -96521 -309265 -113414
680 -113414 334622 593348 741542 1434521 1302191 1275376 639281 785330 1260742 983192
670 983192 -238216 -782105 -331327 -380785 -324685 -732022 -1272377 -758549 -423251 -498917
660 -498917 -76019 -272580 146701 404498 221644 -409302 -331276 -244977 86824 381554
650 381554 -334963 -570135 -222799 -527403 -236008 198922 -108767 -890798 -1246981 -1346389
$$ packed form
720H71076m59714o56365K17692L41069K70949O9763L46177n27556l49324j54886
710c1119L84262J60161L63587q74625l58838j83868l71549J5685K88456R3889
700e13959L76611k23670L29439O28105r9523M95103l76179n52957L15207j041285
690f63108O14232l06136j92344J591766m79215q00818l43585M82687k12744J95851
680a13414M48036K58726J48194O92979j32330k6815o36095J46049M75412k77550
670I83192j221408n43889M50778m9458N6100m07337n40355N13828L35298p5666
660d98917M22898j96561M19281K57797j82854o30946P8026Q6299L31801K94730
650C81554p16517k35172L47336l04604K91395M34930l07689p82031l56183r9408
$$ plain form
640 -1346389 -898154 -519849 -396268 9065 530728 503643 9132 432524 -254594 -131164
630 -131164 59633 -714983 -654984 -703481 80674 373015 231653 -179739 591849 111395
620 111395 -363163 685953 1237584 145878 -40113 -450742 -124647 182288 -201699 -663007
610 -663007 -460414 181207 -4088 -192343 -661438 -1297211 -660229 90587 1105 182572
600 182572 489229 279043 557935 -53708 -271353 320483 853472 452255 158733 -106571
590 -106571 104502 85658 -194356 -73198 371048 -126637 -80667 612304 303916 -131492
580 -131492 -147155 -57446 -357281 25984 -277264 11075 581234 1211295 347238 701044
570 701044 163323 -395495 -548731 627029 444049 235510 -3026 150422 383563 286121
$$ packed form
640a346389M48235L78305J23581M05333N21663k7085m94511M23392o87118J23430
630a31164J90797p74616N9999m8497P84155K92341j41362m11392P71588m80454
620A11395m74558J049116N51631j091706j85991m10629L26095L06935l83987m61308
610f63007K02593O41621j85295j88255m69095o35773O36982P50816q9482J81467
600A82572L06657k10186K78892o11643k17645N91836N32989m01217k93522k65304
590a06571K11073j8844k80014J21158M44246m97685M5970O92971l08388m35408
580a31492j5663Q9709k99835L83265l03248K88339N70159O30061q64057L53806
570G01044n37721n58818j53236J175760j82980k08539k38536J53448K33141r7442
$$ plain form
560 286121 180438 -52569 -343068 300237 93990 181879 144706 424149 530393 -368889
550 -368889 -326471 -885703 -673151 738591 560079 363495 -281309 -196512 716174 232569
540 232569 -718677 -511996 448883 59100 -91298 168206 788919 449689 -579221 -136726
530 -136726 408411 467729 1146091 564905 -439399 -43076 671290 207062 467286 426411
520 426411 133337 404256 553084 339410 603386 -387655 -466958 -168245 -887925 -459794
510 -459794 449940 197260 384253 338082 269947 483421 -6326 -196897 832391 874760
500 874760 -13390 430509 354998 28821 -439190 522978 1008092 880951 478996 46267
490 46267 290562 -43865 426480 325879 -365416 -207279 493089 474875 141212 152869
$$ packed form
560B86121j05683k33007k90499O43305k06247Q7889l7173K79443J06244q99282
550c68889M2418n59232K12552J411742j78512j96584o44804Q4797R12686m83605
540B32569r51246K06681R60879l89783j50398K59504O20713l39230j028910M42495
530a36726N45137N9318O78362n81186j004304L96323P14366m64228K60224m0875
520D26411k93074K70919J48828k13674K63976r91041p9303K98713p19680M28131
510d59794R09734k52680J86993m6171o8135K13474m89747j90571J029288M2369
500H74760q88150M43899p5511l26177m68011R62168M85114j27141m01955m32729
490D6267K44295l34427M70345j00601o91295J58137P00368j8214l33663J1657
$$ plain form
480 152869 -74308 25570 407665 32958 217236 1109216 -8127 -179495 106353 473618
470 473618 631257 162227 -110524 -106639 -208192 531448 429929 304773 451795 233913
460 233913 452108 540319 256797 824501 803663 351622 -82351 -657461 -10200 -932373
450 -932373 -276931 259233 241592 49749 -860 60254 258836 -253439 581423 312888
440 312888 -338326 -750752 -41749 89392 -744893 41352 873769 238400 914397 1131979
430 1131979 871531 2208898 993140 278711 909732 417246 149493 265370 55413
421 55413 -270798 -310219 -16886 -173499 61034 -148229 -2013 738974 470447 198357
411 198357 403082 962238 1411857 352602 1040081 739385 179260 461687 110670 42077
$$ packed form
480A52869k27177R9878L82095l74707J84278Q91980j117343j71368K85848L67265
470D73618J57639m69030k72751L885j01553P39640j01519j25156J47022k17882
460B33913K18195Q8211k83522N67704k0838m52041m33973n75110O47261r22173
450i32373O55442N36164j7641j91843n0609O1114J98582n12275Q34862k68535
440C12888o51214m12426P09003J31141q34285P86245Q32417o35369O75997K17582
430A131979k60448J337367j215758p14429O31021m92486k67753J15877k09957
421E5413l26211l9421K93333j56613K34533k09263J46216P40987k68527k72090
411A98357K04725N59156M49619j059255O87479l00696n60125K82427l51017o8593
$$ plain form
401 42077 13013 304067 782690 234873 -562916 -170561 313374 393526 641984 319572
391 319572 443394 206471 104997 128284 -189301 -826296 -1048930 -172084 -645359 -417027
381 -417027 -12761 590464 558756 105788 -224277 -95145 -349093 -217399 -43264 -81847
371 -81847 130569 -124871 -152065 -12228 414688 -54488 -101634 87021 415237 872101
361 872101 1022779 474181 99503 85350 450201 530784 271673 847091 1174804 429137
351 429137 -254250 -255601 79674 42877 -594390 -613142 118712 -18008 -79900 -792266 -1058885
340 -1058885 136983 422653 200713 659781 543758 -95496 -198006 -154797 124191 73584
330 73584 101694 163763 -194670 -188292 -435282 -739274 13320 720931 612975 -259873 -199780
$$ packed form
401D2077k9064K91054M78623n47817p97789L92355M83935Q0152K48458l22412
391C19572J23822k36923j01474K3287l17585o36995k22634Q76846m73275K28332
381d17027M04266O03225l1708m52968l30065J29132k53948J31694J74135l8583
371h1847K12416k55440k7194J39837M26916m69176m7146J88655L28216M56864
361H72101J50678n48598l74678j4153L64851Q0583k59111N75418L27713p45667
351D29137o83387j351L35275l6797o37267j8752P31854j36720o1892p12366k66619
340a058885J195868K85670k21940M59068j16023o39254j02510M3209K78988n0607
330G3584K8110O2069l58433O378k46990l03992P52594P07611j07956q72848O0093
$$ plain form
319 -199780 1177673 1503458 1023637 57396 469706 181777 -107654 667284 542186 122017
309 122017 -98521 -33664 919558 1126256 614549 457742 146048 327744 -576423 -591865
299 -591865 42174 257436 371804 73528 153920 -182460 -104468 -384712 433455 265030
289 265030 39091 576031 13895 321898 -420293 -270881 -58928 -336599 -437227 -589399
279 -589399 -136088 395051 -582387 -490368 -136961 590619 1004143 1049220 801958 485494
269 485494 781653 802700 204108 430264 731909 69172 755911 -64914 -88662 -92587 7339
258 7339 176044 -401005 183053 219919 -229284 -147047 -123192 -33586 195986 -426004 -1025545
247 -1025545 -344435 -104848 -51942 574997 564432 873313 343272 497045 291137 462890
$$ packed form
319a99780J377453L25785m79821r66241M12310k87929k89431P74938j25098m20169
309A22017k20538O4857R53222K06698n11707j56807l11694J81696r04167j5442
299e91865O34039K15262J14368k98276Q0392l36380P7992k80244Q18167j68425
289B65030k25939N36940n62136L08003p42191J49412K11953k77671j00628j52172
279e89399M53311N31139r77438R2019L53407P27580M13524M5077k47262l16464
269D85494K96159K1047n98592K26156L01645o62737O86739q20825k3748l925R9926
258G339J68705n77049N84058L6866m49203Q2237K3855Q9606K29572o21990n99541
247a025545O81110K39587N2906O26939j0565L08881n30041J53773k05908J71753
$$ plain form
237 462890 255327 -145755 -150183 -671006 -524439 5213 476214 594259 1298021 565762
227 565762 381188 475555 -32907 799090 496910 811446 1593332 1167519 551142 59297
217 59297 -286210 -77779 86590 63630 198476 -275777 263290 567051 366347 -533850
207 -533850 -962553 -653461 188514 377652 -360303 -358087 586164 715070 -159926 653637
197 653637 1110419 958492 493310 733260 1083484 862126 52684 -139411 227949 -64657
187 -64657 186 572218 1108758 238486 512993 311310 45919 50377 -178742 589444 632094
176 632094 469303 243159 231377 913704 202584 276794 175036 -58943 -349031 -467464
166 -467464 -87663 446776 200356 -137838 302626 856484 853943 161366 693726 856230
$$ packed form
237D62890k07563m01082m428n20823J46567N29652M71001J18045P03762p32259
227E65762j84574R4367n08462Q31997l02180L14536P81886m25813o16377m91845
217E9297l45507K08431J64369k2960J34846m74253N39067L03761k00704r00197
207e33850m28703L09092Q41975J89138p37955K216R44251J28906q74996Q13563
197F53637M56782j51927m65182K39950L50224k21358q09442j92095L67360k92606
187f4657O4843N72032N36540q70272K74507k01683k65391M458k29119P68186M2650
176F32094j62791k26144j1782O82327p11120P4210j01758k33979k90088j18433
166d67464L79801N34439k46420l38194M40464N53858k541o92577N32360J62504
$$ plain form
156 856230 766573 5932 -63268 168350 -302288 -485788 -311520 -53091 -227045 -924475
146 -924475 -689796 -376279 237014 -828035 130603 868513 515596 516336 -108686 35605
136 35605 227613 487518 -253372 308845 436196 -9302 98620 -31409 -482865 -106653
126 -106653 -471469 -161536 403062 527675 224047 -252265 344649 -10935 -774496 130049
116 130049 426862 -221488 77204 426442 311392 411009 -90080 84302 643166 347853
106 347853 186194 -145131 -527055 -105398 -717958 -617499 -111925 -688564 -281051 -66696
96 -66696 469617 617463 553878 146688 -38325 -279215 -299544 500552 264074 -240039 -13234
85 -13234 -881304 -762316 -399617 -663339 -754574 -667848 -179742 156843 235195 195139 142318
$$ packed form
156H56230q9657p60641o9200K31618m70638j83500J74268K58429j73954o97430
146i24475K34679L13517O13293j065049R58638P37910l52917P40o25022J44291
136C5605J92008K59905p40890N62217J27351m45498J07922j30029m51456L76212
126a06653l64816L09933N64598J24613l03628m76312N96914l55584p63561R04545
116A30049K96813o48350K98692L49238j15050R9617n01089J74382N58864k95313
106C47853j61659l31325l81924M21657o12560J00459N05574n76639M07513K14355
96f6696N36313J47846o3585m07190j85013k40890k0329Q00096k36478n04113K26805
85a3234q68070J18988L62699k63722r1235Q6726M88106L36585P8352m0056n2821
$$ plain form
74 142318 82190 205007 46714 -103810 -403358 182890 76009 -110062 480149 96154
64 96154 63659 -122645 -259446 188081 85669 221938 -181463 -69208 -5808 -292525 335106
53 335106 12873 559472 218673 19590 267871 521722 536592 494702 419875 711503 675599
42 675599 746615 -93625 -15900 361430 180367 -285695 -348139 -375707 -439660 -178411 -403333
31 -403333 -398172 -515247 167297 372370 498771 806510 1042966 158469 360163 673634
21 673634 476538 61384 -216470 -42432 259713 104530 200591 -69401 -360700 463340
11 463340 607956 180944 169508 -133252 -214651 -158557 16765 -67597 -338618 -196301 121729
0 121729
$$ packed form
74A42318o0128J22817j58293j50524k99548N86248j06881j86071N90211l83995
64I6154l2495j86304j36801M47527j02412J36269m03401J12255O3400k86717O27631
53C35106l22233N46599l40799j99083K48281K53851J4870m1890p4827K91628l5904
42F75599P1016q40240P7725L77330j81063m66062o2444k7568o3953K61249k24922
31d03333N161j17075O82544K05073J26401L07739K36456q84497K01694L13471
21F73634j97096m15154k77854J74038L02145j55183R6061k69992k91299Q24040
11D63340J44616m27012j1436l02760q1399N6094J75322q4362k71021J42317L18030
0A21729
$$ Imaginary data points
##PAGE= N=2
##DATA TABLE= (X++(I..I)), XYDATA
$$ plain form
16383 -2269631 -2155723 -2338801 -2641385 -2246184 -2201027 -2644142 -2209173 -2423202 -2331267 -1909155
16373 -1909155 -2116933 -2212778 -2182485 -2061520 -2304470 -2537370 -2163848 -2238673 -2704685 -2858179
16363 -2858179 -2458658 -1635150 -1236844 -1403484 -1711480 -1860419 -1889218 -1624608 -1580901 -1553453
16353 -1553453 -1624144 -1944447 -1339688 -1171258 -1446273 -1730545 -1095261 -766948 -918802 -612335
16343 -612335 -537624 -1408049 -605565 -181070 -766870 -1134725 -1219235 -452270 -72815 -261720
16333 -261720 -72080 -590847 -1032140 -1195895 -716851 -579009 -655515 -929997 -461703 -620134
$$ packed form
16383b269631J13908j83078l02584L95201M5157m43115M34969k14029R1935M22112
16373a909155k07778r5845L0293J20965k42950k32900L73522p4825m66012j53494
16363b858179L99521Q23508L98306j66640l07996j48939k8799K64610M3707K7448
16353a553453p0691l20303O04759J68430k75015k84272O35284L28313j51854L06467
16343f12335P4711q70425Q02484M24495n85800l67855q4510P66965L79455j88905
16333b61720J89640n18767m41293j63755M79044J37842p6506k74482M68294j58431
$$ [...]
##END NTUPLES=NMR SPECTRUM
##END=
