##TITLE=1H_CG-1175-3a
 CDCl3
 8 sc, 
 1.9.2023
##JCAMPDX= 6.0         $$ Bruker NMR JCAMP-DX V2.0
##DATA TYPE= NMR SPECTRUM
##DATA CLASS= NTUPLES
##ORIGIN= UXNMR, Bruker Analytische Messtechnik GmbH
##OWNER= root
$$ XWIN-NMR		Version 3.5
$$ Fri Sep  1 14:26:43 2023 Russian Standard Time (UT+4h)  she@DPX200
##.OBSERVE FREQUENCY= 200.13135
##.OBSERVE NUCLEUS= ^1H
##.ACQUISITION MODE= SIMULTANEOUS
##.ACQUISITION SCHEME= undefined
##.AVERAGES= 8
##.DIGITISER RES= 18
##SPECTROMETER/DATA SYSTEM= spect
##.PULSE SEQUENCE= zg30
##.SOLVENT NAME= CDCl3
##.SHIFT REFERENCE= (INTERNAL, CDCl3, 0, 15.7293)
##AUDIT TRAIL= $$ (NUMBER, WHEN, WHO, WHERE, WHAT)
$$ ##TITLE= Audit trail, XWIN-NMR		Version 3.5
$$ ##JCAMPDX= 5.01
$$ ##ORIGIN= Bruker BioSpin GmbH
$$ ##OWNER= she
$$ F:/spectra/data/she/nmr/H-F/1/pdata/1/auditp.txt
$$ ##AUDIT TRAIL=  $$ (NUMBER, WHEN, WHO, WHERE, WHAT)
(   1,<2023-09-01 14:25:36.82 +0400>,<she>,<DPX200>,
      <created by zg, POWCHK disabled, PULCHK disabled
       configuration hash MD5:
       00 E9 B6 7A A2 85 ED C7 34 08 36 98 17 FE 4E 26
       data hash MD5: 16K
       60 98 9B EA E1 C4 6A AF E2 E4 EF D9 7A CA 20 FD>)
(   2,<2023-09-01 14:25:39.40 +0400>,<she>,<DPX200>,
      <Start of raw data processing
       efp BC_mod = 2 LB = 0.24 FT_mod = 6 PKNL = 1 PHC0 = -21051.24 PHC1 = 14.05272 SI = 16K 
       data hash MD5: 16K
       13 34 3B 69 C0 79 33 CA 8A 7E 7E AD 4D 4C C4 F7>)
(   3,<2023-09-01 14:25:55.34 +0400>,<she>,<DPX200>,
      <pk PHC0 = 1.864416 PHC1 = -1 
       data hash MD5: 16K
       F6 29 63 6F 98 23 A3 33 7A 95 49 B4 FE 90 DE B3>)
(   4,<2023-09-01 14:25:58.98 +0400>,<she>,<DPX200>,
      <abs ABSG = 5 
       data hash MD5: 16K
       C8 E0 33 35 BB 72 05 97 CA 2D BD 5A CB B0 B6 E7>)
$$ ##END=
$$ 
$$ hash MD5
$$ ED 8A 8C 35 EE 77 5E 83 C2 5A D6 9F 75 CF 5A 6A
##$RELAX= 
##$RELAX= 
##$RELAX= 
##$RELAX= 
##$RELAX= 
##$RELAX= 
$$ Bruker specific parameters
$$ --------------------------
##$DU= <F:/spectra>
##$EXPNO= 1
##$NAME= <H-F>
##$PROCNO= 1
##$TYPE= <nmr>
##$USER= <she>
##$AMP= (0..31)
100 100 100 100 100 100 100 100 100 100 100 100 100 100 100 100 100 100 
100 100 100 100 100 100 100 100 100 100 100 100 100 100 
##$AQSEQ= 0
##$AQ_mod= 1
##$AUNM= <au_zg>
##$AUTOPOS= <>
##$BF1= 200.13
##$BF2= 200.13
##$BF3= 200.13
##$BF4= 200.13
##$BF5= 200.13
##$BF6= 200.13
##$BF7= 200.13
##$BF8= 200.13
##$BYTORDA= 1
##$CFDGTYP= 0
##$CFRGTYP= 5
##$CHEMSTR= <none>
##$CNST= (0..31)
1 1 145 1 1 1 1 1 1 1 1 1 1 1 1 1 1 1 1 1 1 1 1 1 1 1 1 1 1 1 1 1 
##$CPDPRG= <>
##$CPDPRG1= <>
##$CPDPRG2= <>
##$CPDPRG3= <>
##$CPDPRG4= <mlev>
##$CPDPRG5= <mlev>
##$CPDPRG6= <mlev>
##$CPDPRG7= <mlev>
##$CPDPRG8= <mlev>
##$CPDPRGB= <>
##$CPDPRGT= <>
##$D= (0..31)
0 1.2 0 0 0 0 0 0 0 0.06 0 0.03 0 0 0 0 0.0002 0 0 0 0 0 0 0 0 0 0 0 0 
0 0 0 
##$DATE= 1693563936
##$DBL= (0..7)
120 120 120 120 120 120 120 120 
##$DBP= (0..7)
150 150 150 150 150 150 150 150 
##$DBP07= 0
##$DBPNAM0= <>
##$DBPNAM1= <>
##$DBPNAM2= <>
##$DBPNAM3= <>
##$DBPNAM4= <>
$$ [...]
##$SUBNAM3= <"">
##$SUBNAM4= <"">
##$SUBNAM5= <"">
##$SUBNAM6= <"">
##$SUBNAM7= <"">
##$SUBNAM8= <"">
##$SUBNAM9= <"">
##$SW= 18.05172834244
##$SWIBOX= (0..15)
0 0 2 0 0 0 0 0 0 0 0 0 0 0 0 0 
##$SW_h= 3612.71676300578
##$TD= 16384
##$TD0= 1
##$TE= 0
##$TE2= 300
##$TE3= 300
##$TEG= 300
##$TL= (0..7)
0 120 120 120 120 120 120 120 
##$TP= (0..7)
150 150 150 150 150 150 150 150 
##$TP07= 0
##$TPNAME0= <>
##$TPNAME1= <>
##$TPNAME2= <>
##$TPNAME3= <>
##$TPNAME4= <>
##$TPNAME5= <>
##$TPNAME6= <>
##$TPNAME7= <>
##$TPOAL= (0..7)
0.5 0.5 0.5 0.5 0.5 0.5 0.5 0.5 
##$TPOFFS= (0..7)
0 0 0 0 0 0 0 0 
##$TUNHIN= 0
##$TUNHOUT= 0
##$TUNXOUT= 0
##$USERA1= <user>
##$USERA2= <user>
##$USERA3= <user>
##$USERA4= <user>
##$USERA5= <user>
##$V9= 5
##$VALIST= <valist>
##$VCLIST= <CCCCCCCCCCCCCCC>
##$VD= 0
##$VDLIST= <DDDDDDDDDDDDDDD>
##$VPLIST= <PPPPPPPPPPPPPPP>
##$VTLIST= <TTTTTTTTTTTTTTT>
##$WBST= 1024
##$WBSW= 4
##$XGAIN= (0..3)
0 0 0 0 
##$XL= 0
##$YL= 0
##$YMAX_a= 158832
##$YMIN_a= -156908
##$ZGOPTNS= <>
##$ZL1= 120
##$ZL2= 120
##$ZL3= 120
##$ZL4= 120
##$ABSF1= 15.73366
##$ABSF2= -2.31819
##$ABSG= 5
##$ABSL= 3
##$ALPHA= 0
##$AQORDER= 0
##$ASSFAC= 0
##$ASSFACI= 0
##$ASSFACX= 0
##$ASSWID= 0
##$AUNMP= <proc_1d>
##$AZFE= 0.1
##$AZFW= 0.1
##$BCFW= 0
##$BC_mod= 2
##$BYTORDP= 0
##$COROFFS= 0
##$CY= -3
##$DATMOD= 1
##$DC= 0
##$DFILT= <>
##$DTYPP= 0
##$F1P= 0
##$F2P= 0
##$FCOR= 1
##$FTSIZE= 16384
##$FT_mod= 6
##$GAMMA= 0
##$GB= 0
##$INTBC= 1
##$INTSCL= 3.70164e-10
##$ISEN= 128
##$LB= 0.24
##$LEV0= 0
##$LPBIN= 0
##$MAXI= 10000
##$MC2= 0
##$MEAN= 0
##$ME_mod= 0
##$MI= 1.114404
##$NCOEF= 0
##$NC_proc= -8
##$NLEV= 6
##$NOISF1= 3.799351
##$NOISF2= 2.8
##$NSP= 0
##$NTH_PI= 0
##$NZP= 0
##$OFFSET= 15.72926
##$PC= 1
##$PHC0= -21049.38
##$PHC1= 13.05272
##$PH_mod= 1
##$PKNL= yes
##$PPARMOD= 0
##$PSCAL= 0
##$PSIGN= 0
##$REVERSE= no
##$SF= 200.13000846056
##$SI= 16384
##$SIGF1= 3
##$SIGF2= 2
##$SINO= 5.538805
##$SIOLD= 16384
##$SREGLST= <1H.CDCl3>
##$SSB= 0
##$STSI= 16384
##$STSR= 0
##$SW_p= 3612.71676300578
##$SYMM= 0
##$S_DEV= 0
##$TDeff= 16384
##$TDoff= 0
##$TI= <>
##$TILT= no
##$TM1= 0
##$TM2= 0
##$TOPLEV= 0
##$USERP1= <user>
##$USERP2= <user>
##$USERP3= <user>
##$USERP4= <user>
##$USERP5= <user>
##$WDW= 1
##$XDIM= 16384
##$YMAX_p= 354451143
##$YMIN_p= -5474558
$$ End of Bruker specific parameters
$$ ---------------------------------
##NTUPLES= NMR SPECTRUM
##VAR_NAME=  FREQUENCY,     SPECTRUM/REAL,   SPECTRUM/IMAG
##SYMBOL=    X,             R,               I
##VAR_TYPE=  INDEPENDENT,   DEPENDENT,       DEPENDENT
##VAR_FORM=  AFFN,          ASDF,            ASDF
##VAR_DIM=   16384,         16384,           16384
##UNITS=     HZ,            ARBITRARY UNITS, ARBITRARY UNITS
##FACTOR=    0.220516191357247, 1,           1
##FIRST=     3147.89702586438, 0,            0
##LAST=      -464.819737141403, 0,           0
##MIN=       -464.819737141403, -5474558,    0
##MAX=       3147.89702586438, 354451143,    0
$$ Real data points
##PAGE= N=1
##DATA TABLE= (X++(R..R)), XYDATA
$$ [...]
6119f02203L24545k68293N3834N174r34K86959J60727L24188k41765K2993k42380
$$ -602203 -277658 -545951 -492117 -486943 -487877 -200918 -40191 283997 42232 65225 -177155
6108a77155L61019J83107m78744j14297M9728K22184k8264k98976K77750N9821
$$ -177155 183864 366971 -111773 -226070 -176342 45842 17578 -281398 -3648 56173
6098E6173m19969l4112L41675K42548k71716m71233L80758k91832j81487L93700
$$ 56173 -363796 -397908 -56233 186315 -85401 -556634 -175876 -467708 -649195 -255495
6088b55495L74898l25662k36874k42360K28749J57858M02688k46154n02868N59205
$$ -255495 119403 -206259 -443133 -685493 -456744 -298886 103802 -142352 -645220 -86015
6078h6015J76017l42833n63145M46920J27604L18287J65519l76252q1636J41434
$$ -86015 90002 -252831 -815976 -369056 -241452 76835 242354 -133898 -215534 -74100
6068g4100j4932j91030M10985r1784j74949n6962K81372J25683l90540J94346
$$ -74100 -89032 -280062 130923 39139 -135810 -192772 88600 214283 -176257 18089
6058A8089o3761J11700q0097m4764r888j8328k42184M53019l1512k67626K46632
$$ 18089 -45672 66028 -14069 -58833 -68721 -87049 -329233 123786 92274 -175352 71280
6047G1280l0597j66460J47442J33047K48429l13569k08068K45426j00782O7467
$$ 71280 40683 -125777 21665 154712 403141 89572 -118496 126930 26148 93615
6037I3615p9311p8953J73022K81389l56587j67822L07905j80001k40002J79248
$$ 93615 14304 -64649 108373 389762 33175 -134647 173258 -6743 -246745 -67497
6027f7497k5705K63088L26921m6085j15812n08791Q4856J84758R176k55524L08627
$$ -67497 -93202 169886 496807 450722 334910 -173881 -89025 95733 104909 -150615 158012
6016A58012k4799k78413R4530J10399L92507j05956m13430O1777J79813n37267
$$ 158012 133213 -145200 -50670 59729 452236 346280 -67150 -5373 174440 -362827
6006c62827J36814R4974M0590r7J2366k35122l32274M89302K87916J70948p6493
$$ -362827 -226013 -131039 -90449 -90546 -78180 -313302 -645576 -156274 131642 302590 226097
5995B26097n4074J08832J53385k46613J77686N0491k94371J20326L89564N71578
$$ 226097 172023 280855 434240 187627 365313 415804 121433 241759 631323 1202901
5985A202901k3990l47894r1082j0847N6144O3624Q479l21939n78433j66987J00256
$$ 1202901 1178911 831017 739935 729088 785232 848856 857335 535396 -43037 -210024 -109768
5974a09768L12609l41572M04838K64186m09607j73424K79783m7110j41722J17939
$$ -109768 202841 -138731 266107 530293 120686 -52738 227045 179935 38213 156152
5964A56152k79097j10829L06180L8102L67202r2885j25071j08373j0497l03045
$$ 156152 -122945 -233774 72406 110508 477710 384825 259754 151381 140884 -162161
5954a62161N05938l5290l68145m7422J00683J63991J00217N60715m61155O3193
$$ -162161 343777 308487 -59658 -107080 -6397 157594 257811 818526 357371 420564
5944D20564k50060r2662K38919N4298K66276k24290j89862r2959K58726m5912
$$ 420564 170504 77842 316761 371059 637335 413045 223183 130224 388950 343038
5934C43038j04052J11914N2437M90j97482J83063k73888L09117j01590l46047
$$ 343038 238986 350900 403337 403827 206345 389408 115520 424637 323047 -23000
5924b3000j6920J29785M17344j07678n09004K02687J84292j24816j14377l2941
$$ -23000 -39920 89865 507209 399531 -109473 93214 277506 152690 38313 5372
5914E372J30951j57757l7980L38346K66187K23247k03366j88071L31271J61124
$$ 5372 136323 -21434 -59414 278932 545119 768366 565000 376929 708200 869324
5904H69324l73275p1161K19166L4173K56355J46190m57515J99220K6044K4014
$$ 869324 496049 424888 644054 678227 934582 1080772 623257 822477 848521 872535
5894H72535K04055J00926l77545m40568j92326l9763M8889K50664K62267m4937
$$ 872535 1076590 1177516 799971 359403 167077 127314 176203 426867 689134 644197
5884F44197p7029l1992J32150l08258L96476K15149K3368J36501k04425J69690
$$ 644197 567168 535176 667326 359068 755544 970693 994061 1130562 926137 1095827
5874A095827p2018l22533L92574P2968j69050K23436L88805M46003R04170L06680
$$ 1095827 1023809 701276 1093850 1166818 997768 1221204 1610009 2056012 2960182 3266862
5864C266862Q7250m05713q10585m00311k17195P52j62922K69908j36314m51631
$$ 3266862 3354112 2948399 2137814 1737503 1520308 1521060 1358138 1628046 1491732 1040101
5854A040101n1569q6944l81871q6629j33283j35082K96879k75893J57733L09993
$$ 1040101 988532 901588 519717 433088 299805 164723 461602 185709 343442 653435
5844F53435M4607L69547K27396l26578m09242M60946M72932k768J71438L59791
$$ 653435 698042 1067589 1294985 968407 559165 1020111 1493043 1490275 1661713 2021504
5834B021504N91260M01570L074o4609m01683m30211k02509l67544l65618j00197
$$ 2021504 2612764 3014334 3017408 2952799 2551116 2120905 1918396 1550852 1185234 1085037
5824A085037q4416j76198K20544n48489N3696K30746m64512L4196P2637k20760
$$ 1085037 1000621 824423 1044967 496478 550174 780920 316408 350604 423241 202481
5814B02481K39844P9729j19204L00651M16467j78487o08763k67375L0524K12802
$$ 202481 442325 522054 402850 703501 1119968 941481 332718 65343 95867 308669
5804C08669K61100J44482p357K73589k41997O6698J37254K07888l83685j60649
$$ 308669 569769 714251 706894 980483 738486 805184 942438 1150326 766641 605992
5794F05992J77170q5292j01698n87986n7471L68018j37583q477M13995j65281
$$ 605992 783162 697870 596172 8186 -49285 318733 181150 172673 586668 421387
5784D21387N8697l19788j90987J21206j85072J29079K12609l12892k0652P48048
$$ 421387 480084 160296 -30691 90515 -94557 34522 247131 -65761 -86413 661635
5774F61635l90232j42614l25572K75257J3115L30771J30906j58240k15468m42172
$$ 661635 271403 128789 -196783 78474 91589 422360 553266 395026 179558 -262614
5764b62614K8520Q0364j0600L1867K05883k25365j3182P99621k9029l45644Q7149
$$ -262614 -234094 -153730 -164330 -132463 73420 -151945 -165127 634494 605465 259821 346970
5753C46970k19508l273L47637L1442m69059K39001p6112L0857o5483J43472j97192
$$ 346970 127462 124189 471826 503268 34209 273210 197098 227955 162472 305944 108752
5742A08752j86675j90437N3035M75852j49911r0592j86744O499j30376q6694K03824
$$ 108752 -77923 -268360 -215325 260527 110616 20024 -166720 -160221 -290597 -377291 -173467
5731a73467j22412K35506j98567J52968l3047J78700j30750k30324k15431l76760
$$ -173467 -295879 -60373 -258940 -105972 -139019 39681 -91069 -321393 -536824 -913584
5721i13584M22578K00604l43142L8774K55503L29990j94564O9977K07226j33242
$$ -913584 -491006 -290402 -633544 -594770 -339267 -9277 -203841 -133864 73362 -59880
5711e9880j38593k23100L08760K00511l45188J64871o3591N2869J83336p3642
$$ -59880 -198473 -421573 -112813 87698 -257490 -92619 -156210 -103341 79995 6353
5701F353j89137O4912M79658J24108k38441p7172n61577n429K75694j36045m8850
$$ 6353 -182784 -117872 361786 485894 247453 170281 -391296 -396725 -121031 -257076 -305926
5690c05926j62035K84728l06041K17773k29570R8963k3292k76047K80287q9093
$$ -305926 -467961 -183233 -489274 -271501 -501071 -402108 -425400 -701447 -421160 -510253
5680e10253k51637J78083R8999L50873J77972k31802o9887q9803j58632m688J14858
$$ -510253 -761890 -583807 -484808 -133935 44037 -187765 -257652 -347455 -506087 -510775 -395917
5669c95917K11966J22979R5493l68016k13552K55563Q2223l55020K37627j06597
$$ -395917 -183951 -60972 34521 -333495 -547047 -291484 -209261 -564281 -326654 -433251
5659d33251K00666K30776j52037j86947j25711L43861q6255K0499K62530l29967
$$ -433251 -232585 -1809 -153846 -340793 -466504 -122643 -208898 -188399 74131 -255836
5649b55836k12157M77927j79189m3115L0809q2437j95931M91865j85855m25306
$$ -255836 -467993 9934 -169255 -212370 -181561 -263998 -459929 31936 -153919 -579225
5639e79225K40416J96214n806N1007j36312j16624K74769J7690P7840K35478o9738
$$ -579225 -338809 -142595 -148401 -97394 -233706 -350330 -75561 -57871 19969 255447 185709
5628A85709l65863j57434K37087J04165l7927k1809L3554K23047k45614j29041
$$ 185709 -180154 -337588 -100501 3664 -34263 -56072 -22518 200529 -45085 -174126
5618a74126k5929q7422O2562n650K03449J41922k94385m2649K15976M53428m7592
$$ -174126 -200055 -287477 -224915 -230565 -27116 114806 -179579 -222228 -6252 447176 399584
5607C99584o76086M15872K42463O4803n36984J20653L60022J410j26254k45092
$$ 399584 -276502 139370 381833 446636 -90348 30305 390327 391737 265483 20391
5597B0391K74344J91333m5421m67450M5348J43000o3384l7114j81529M6400K6363
$$ 20391 294735 486068 440647 -26803 18545 161545 98161 61047 -120482 -74082 -47719
5586d7719N7779j33004m05794k61409L4552J90689p8554K86469K43933K04555
$$ -47719 10060 -122944 -528738 -790147 -755595 -564906 -643460 -356991 -113058 91497
5576I1497j39557K8693k47491o601K70648L16533j74659l56704p1496N55095J88290
$$ 91497 -48060 -19367 -266858 -273459 -2811 313722 139063 -217641 -289137 265958 454248
5565D54248k08369K90607n8127j99043m07189j94118K68745O0310M8999j48191
$$ 454248 245879 536486 478359 279316 -127873 -321991 -53246 7064 56063 -92128
5555i2128J13493j25094J5751J46814j06320j10056K15120m11998M08923J33749
$$ -92128 21365 -103729 -87978 58836 -47484 -157540 57580 -354418 54505 188254
5545A88254m12478o9121K90694L00040j65115l19035K11753R8605L146Q0259l42760
$$ 188254 -224224 -293345 -2651 297389 132274 -186761 24992 123597 126743 207002 -135758
5534a35758r5023j33701J99072N94989K56064m41941r645j19225J91595j40653
$$ -135758 -230781 -364482 -165410 429579 685643 243702 234057 114832 306427 165774
5524A65774L81959n68480j48904r3754J50956J59681M3309J90819K3874Q4580
$$ 165774 547733 -20747 -169651 -263405 -112449 47232 90541 281360 305234 389814
5514C89814M22440R2269k89195l92364Q6037k7191q5637Q0767J88510J65830j67964
$$ 389814 812254 904523 615328 222964 309001 281810 196173 276940 465450 631280 463316
5503D63316j61647j49938q2128j41996m3674J53592J88940o4866K43222J85073
$$ 463316 301669 151731 69603 -72393 -116067 37525 226465 161599 404821 589894
5493E89894l41869j74000L3673R5906K87922k35061k69668L1676n8030K63305
$$ 589894 248025 74025 107698 203604 491526 256465 -13203 18473 -39557 223748
5483B23748M3349O8824K07328J51926o4131l1857M8248J71707j23734J15145J76235
$$ 223748 267097 335921 543249 695175 631044 599187 647435 819142 695408 810553 986788
5472I86788J64014O64398l18094l39829l80444N1127J6182R4613k12332J9478
$$ 986788 1150802 1815200 1497106 1157277 776833 827960 844142 938755 726423 745901
5462G45901J1235j83594j09024P6143j86529M72648J9075k99866K3021l56896
$$ 745901 757136 573542 464518 540661 354132 826780 845855 545989 569010 212114
5452B12114k1943L17564M16096l23272l295J11550N7120j40280r6109r0242J06539
$$ 212114 190171 507735 923831 600559 597264 708814 765934 625654 529545 439303 545842
5441E45842K31567K24855l8764k58621j07875K0681O0159m0021j72021j59917
$$ 545842 777409 1002264 963500 704879 597004 617685 677844 637823 465802 305885
5431C05885K23925J19893j59618J2782J79627p0542P6563L33430m9272l71323
$$ 305885 529810 649703 490085 502867 682494 611952 688515 1021945 972673 601350
5421F01350k40279l55628L29037j35788j92772m1595L80832L72330M8019N534
$$ 601350 361071 5443 334480 198692 5920 -35675 345157 717487 765506 771040
5411G71040N5092k89530j99052L0j16907L52620p0406l77497l5365M42988N1298
$$ 771040 826132 536602 337550 337580 220673 573293 502887 125390 90025 533013 584311
5400E84311j90290o6511j91124L75192K03400n2898j31216n9425N66771j98833
$$ 584311 394021 327510 136386 511578 714978 662080 530864 471439 1038210 839377
5390H39377l75467m46927J79561l3387J47908M26897k09834J26918n4572M9402
$$ 839377 463910 16983 196544 163157 311065 737962 528128 655046 600474 649876
5380F49876p0581J87385m05478J83388L05089j26588k294l3350J87803K00118
$$ 649876 579295 766680 361202 544590 849679 723091 720797 687447 875250 1075368
5370A075368q079l03619k26816p930j05576R152N69349j72616l16708p0870O3682
$$ 1075368 1067289 763670 536854 528924 423348 432500 1001849 829233 512525 441655 505337
5359E05337o0461j74317K91712K00531n62541J42302K42643L03504L1785k65622
$$ 505337 444876 270559 562271 762802 200261 342563 585206 888710 920495 654873
5349F54873k32248Q2957J18470j36550L6939K51935l01419J00734K77620R834
$$ 654873 422625 505582 624052 487502 524441 776376 474957 575691 853311 863145
5339H63145K85635l41185m47651J72737o4566N7055k1134K95485K38130m35995
$$ 863145 1148780 807595 359944 532681 468115 525170 504036 799521 1037651 601656
5329F01656J47027l41735L80092k59348o17029M05194N27682r0316k45113P6701
$$ 601656 748683 406948 787040 527692 -89337 315857 843539 753223 508110 584811
5319E84811K23665k74579K21243k36085j94295K03888j20126O4064r3071L6300
$$ 584811 808476 533897 755140 519055 324760 528648 408522 472586 379515 415815
5309D15815J85117K5391j8604K27586k88565k05261k27518J87285K321j93511
$$ 415815 600932 626323 607719 835305 546740 341479 113961 301246 303567 110056
5299A10056L15015J21253J63544J19323j53627N28852l18390k20112Q4507j15318
$$ 110056 425071 546324 709868 829191 675564 1204416 886026 665914 750421 635103
5289F35103M7343m2438l0717M5340J06808M7250k21137j449l57078K41503K88389
$$ 635103 682446 640008 609291 654631 761439 808689 587552 586103 229025 470528 758917
5278G58917j07154n3371m05150L770K46456n213M2685M41426m26610L4590l34106
$$ 758917 651763 598392 193242 197012 443468 438255 480940 922366 495756 530346 196240
5267A96240K40235J65429l88196K2993L63471L27140k72803l03481k06609M51311
$$ 196240 436475 601904 213708 236701 600172 927312 654509 351028 144419 595730
5257E95730j5777n0432Q2578n82142M83528j6581o1826p1798j28383N23163j26117
$$ 595730 579953 529521 612099 29957 513485 496904 435078 363280 234897 758060 631943
5246F31943K0061K87580k4563k48128K79981j77139k25142J98852J26569j11934
$$ 631943 652004 939584 915021 666893 946874 769735 544593 743445 870014 758080
5236G58080k86618J57974j80108M9557O665l6264K96183j54935j20550L16760
$$ 758080 471462 629436 449328 498885 505550 469286 765469 610534 489984 806744
5226H06744j9708K20015K55349n34331n1546j13198n871K08590P5335l3688j66894
$$ 806744 787036 1007051 1262400 728069 676523 563325 557454 766044 841379 807691 640797
5215F40797k37696K53160M07909M2687q1478k15577l15803L03129O0106L56307
$$ 640797 403101 656261 1064170 1106857 1025379 809802 493999 797128 857234 1213541
5205A213541l97134l20725J18094O4946j9286j74735J6249J4382k3250K8000J94798
$$ 1213541 816407 495682 613776 678722 659436 484701 500950 515332 492082 520082 714880
5194G14880J53826N4399j71673M8350k55104J31195J19853L14354M094j06353
$$ 714880 868706 923105 751432 799782 544678 675873 795726 1110080 1114174 1007821
5184A007821K04099m3508l24934j96164J49625J50846r760K44217l41278k9559
$$ 1007821 1211920 1168412 843478 647314 796939 947785 938025 1182242 840964 811405
5174H11405K55919n04681M3144M41088J11377q177J88848k74174k70152Q0015
$$ 811405 1067324 562643 605787 1046875 1158252 1150075 1338923 1064749 794597 874612
5164H74612J94012O3613J87025j89948l642J82109M0416o7781n2565M7846J9535
$$ 874612 1068624 1132237 1319262 1129314 1125672 1307781 1348197 1280416 1227851 1275697 1295232
5153A295232M21222J37917m9000n02924Q5437M98050J9863j17747L63848K20251
$$ 1295232 1716454 1854371 1805371 1302447 1387884 1885934 1905797 1788050 2151898 2372149
5143B372149N71004l01836P1115K97980n3645m0760J64994P83557K73253J56296
$$ 2372149 2943153 2641317 2712432 3010412 2956767 2916007 3081001 3864558 4137811 4294107
5133D294107N12230j49467k74456j0177l34722J06024j76249L57998J46253J68810
$$ 4294107 4806337 4656870 4382414 4372237 4037515 4143539 3967290 4325288 4471541 4640351
5123D640351K49563N2326J37401O707J51326K60066M27330j26508l25314l19067
$$ 4640351 4889914 4942240 5079641 5086348 5237674 5497740 5925070 5798562 5473248 5154181
5113E154181J6134K0027l50661k20251k23725j05059k28108k4201R9189j26419
$$ 5154181 5170315 5190342 4839681 4619430 4395705 4290646 4062538 4038337 4137526 4011107
5103D011107k45354k62429K49097J55688J39361N7187l2615k86461L97568j36363
$$ 4011107 3765753 3503324 3752421 3908109 4047470 4104657 4072042 3785581 4183149 4046786
5093D046786k41871R44032L73606J22113L44300J40830J24810K08481K25219L18127
$$ 4046786 3804915 4748947 5122553 5244666 5588966 5729796 5854606 6063087 6288306 6606433
5083F606433L14458K62860J45088m61167n41250r3905J88407N37000J30717k37386
$$ 6606433 6920891 7183751 7328839 6867672 6326422 6232517 6420924 6957924 7088641 6851255
5073F851255p5790L91121L18570K94917k45483j77537p1128j38976J31156m49222
$$ 6851255 6775465 7166586 7485156 7780073 7534590 7357053 7285925 7146949 7278105 6828883
5063F828883k4394Q6242k9334m5416k34812K88486Q8312O12609R7232K69128k63683
$$ 6828883 6804489 6890731 6861397 6815981 6581169 6869655 6957967 7570576 7667808 7936936 7673253
5052G673253j87641j43437M7874J83431K88243j11958l54012N3681J31395P796
$$ 7673253 7485612 7342175 7390049 7573480 7861723 7749765 7395753 7449434 7580829 7588625
5042G588625o7544J5033l22159n31718m85053r1742J01720r4253o79428l77825
$$ 7588625 7521081 7536114 7213955 6682237 6197184 6105442 6207162 6112909 5433481 5055656
5032E055656k77028j12752p0986j18115l8008l78158k21557J79224J23876j70086
$$ 5055656 4778628 4665876 4594890 4476775 4438767 4060609 3839052 4018276 4142152 3972066
5022C972066j20470K43402m27329j00228O60500j11749J35855O9796K35475L51691
$$ 3972066 3851596 4094998 3667669 3567441 4227941 4116192 4252047 4321843 4557318 4909009
5012D909009J91731K84134M87926J36949L59795P28789l5320J2434L2115M53712
$$ 4909009 5100740 5384874 5872800 6009749 6369544 7098333 7063013 7075447 7107562 7561274
5002G561274L81064J24814n004J27911k80732l82311j1091l98218l60828m2132
$$ 7561274 7942338 8067152 8062148 8190059 7909327 7527016 7515925 7117707 6756879 6714747
4992F714747n67802m12349k06996j81299p79228m40449j45201l84416N8396p2015
$$ 6714747 6146945 5734596 5527600 5346301 4567073 4126624 3981423 3597007 3655403 3583388
4982C583388l70345l85141l13880m23645O1132J06090n0416k25029j75303K59329
$$ 3583388 3213043 2827902 2514022 2090377 2151509 2257599 2207183 1982154 1806851 2066180
4972B066180l449j863j78430L9829k12733o4202N9406K07205J25085k7400j52307
$$ 2066180 2062731 2060868 1882438 1922267 1709534 1645332 1704738 1911943 2037028 2009628 1857321
4961A857321m5003L40944N9763k18614n71764J97161p1364l06525M28447J30218
$$ 1857321 1812318 2153262 2213025 1994411 1422647 1619808 1548444 1241919 1670366 1800584
4951A800584k71262m53682M41828m715P4959K56735k83179k30515j48805J04906
$$ 1800584 1529322 1075640 1517468 1512753 1587712 1844447 1561268 1330753 1181948 1286854
4941A286854k98148J77653K87710N9115l77815J92757L87018k45615l13207K45916
$$ 1286854 988706 1166359 1454069 1513184 1135369 1328126 1715144 1469529 1156322 1402238
4931A402238l37961k76913M32958K12931K82449K92685Q3729j52931J81843m60138
$$ 1402238 1064277 787364 1220322 1433253 1715702 2008387 2092116 1939185 2121028 1660890
4921A660890m41184n7430Q5719Q1155L80319k35498K10752K81524m15043j54829
$$ 1660890 1219706 1162276 1247995 1329150 1709469 1473971 1684723 1966247 1551204 1396375
4911A396375J17173L25084k09968J58273L64327k43672J45902l29029R1065J12556
$$ 1396375 1513548 1838632 1628664 1786937 2151264 1907592 2053494 1724465 1815530 1928086
4901A928086q1283M14820j03829k86815k44529j39340J22859L13051K5425o8849
$$ 1928086 1846803 2261623 2157794 1870979 1626450 1487110 1609969 1923020 1948445 1879596
4891A879596j14416J06141j28809J85049K78633n9971m456j19820n35262N2330
$$ 1879596 1765180 1871321 1742512 1927561 2206194 2146223 2141767 2021947 1486685 1539015
4881A539015Q2435L3087N92383j50480O5298L06371r5896l40511l01460J00004
$$ 1539015 1621450 1654537 2246920 2096440 2161738 2468109 2372213 2031702 1730242 1830246
4871A830246k4688l41017j58239N14977L10113j37665l4188k85896R5113j66743
$$ 1830246 1805558 1464541 1306302 1821279 2131392 1993727 1959539 1673643 1768756 1602013
4861A602013P7020M84471q3576L15107j67387N3347q5995L85169q5175K76286
$$ 1602013 1679033 2163504 2079928 2395035 2227648 2280995 2195000 2580169 2494994 2771280
4851B771280j96145k84689K67609P7466j5629m1867R8484j67133r0089k14119
$$ 2771280 2575135 2290446 2558055 2635521 2619892 2578025 2676509 2509376 2419287 2205168
4841B205168J48861r7473p2356L19707n6464m00568J90850K3270j76191M65646
$$ 2205168 2354029 2256556 2184200 2503907 2447443 2046875 2237725 2260995 2084804 2550450
4831B550450Q772m29087O48427N6313n3865j60615l52762K05805o270O3278k1349
$$ 2550450 2559222 2130135 2778562 2834875 2781010 2620395 2267633 2473438 2467168 2530446 2509097
4820B509097j33762K50320j65657j81801o6273J86080J06532o9251o9035m16846
$$ 2509097 2375335 2625655 2459998 2278197 2211924 2398004 2504536 2435285 2366250 1949404
4810A949404L47176K00452k62275M46119K13632k28037P0769k34359K07200k32332
$$ 1949404 2296580 2497032 2234757 2680876 2894508 2666471 2737240 2502881 2710081 2477749
4800B477749R3722j48826K49165K56043l60278N6072K47802k17723l7790J18748
$$ 2477749 2571471 2422645 2671810 2927853 2567575 2623647 2871449 2653726 2615936 2734684
4790B734684j23447j04743m21061M64010r9852k33341J68399M3042J87981j53755
$$ 2734684 2611237 2506494 2085433 2549443 2449591 2216250 2384649 2427691 2615672 2461917
4780B461917K33892j15320J38902K00472l69420R3302J18424J8834l282o8P97
$$ 2461917 2695809 2580489 2719391 2919863 2550443 2643745 2762169 2781003 2777721 2777653 2778450
4769B778450K6980m13318j07709n0952l94147m022L83883l65476k08429m8078
$$ 2778450 2805430 2392112 2284403 2233451 1839304 1835282 2219165 1853689 1645260 1597182
4759A597182K88038K80255L07697J01823l55535j21358r0185j80948R7485J69256
$$ 1597182 1885220 2165475 2473172 2574995 2219460 2098102 2007917 1826969 1924454 2093710
4749B093710k03708L49650L9922k8923K23471k39673m09920J83753K36442J63058
$$ 2093710 1890002 2239652 2279574 2250651 2474122 2234449 1824529 2008282 2244724 2407782
4739B407782K41298m76021o7953M63410k02311K7262K92561M76637m51062L7449
$$ 2407782 2649080 2173059 2105106 2568516 2366205 2393467 2686028 3162665 2711603 2749052
4729B749052k03408j66153L76472j14719L13815J79311L08383M8165j36618m87474
$$ 2749052 2545644 2379491 2755963 2641244 2955059 3134370 3442753 3490918 3354300 2866826
4719B866826O9181K2279j66937M33837M00851P0523l15414n02813L27750m374
$$ 2866826 2936007 2958286 2791349 3225186 3626037 3696560 3381146 2878333 3206083 3201709
4709C201709J79321o6260j280k15926j25815K36149K03630j74552l41157k9423
$$ 3201709 3381030 3314770 3313490 3097564 2971749 3207898 3411528 3236976 2895819 2866396
4699B866396J94628J81953L11358l41343j67341K78144j2432l44655n3465Q2019
$$ 2866396 3061024 3242977 3554335 3212992 3045651 3323795 3311363 2966708 2913243 2995262
4689B995262J70011K14942l70319N57013K69383L6929l34340k51524N42257P0979
$$ 2995262 3165273 3380215 3009896 3566909 3836292 3873221 3538881 3287357 3829614 3900593
4679C900593j84606k7455J77842l05961q6827M95587k76348m54267J38972L8126
$$ 3900593 3715987 3688532 3866374 3560413 3473586 3969173 3692825 3238558 3377530 3415656
4669C415656L5973j11775K54616K19012k20188J1029k16473o9444K19801J4276
$$ 3415656 3451629 3339854 3594470 3813482 3593294 3604323 3387850 3318406 3538207 3552483
4659C552483l00152J15425k9315J57774J72384k52779l0356K03043L8190k07282
$$ 3552483 3252331 3367756 3338441 3496215 3668599 3415820 3385464 3588507 3626697 3419415
4649C419415K18221o986q8946P1706l48221J99303J11829n48705M5542k067k34846
$$ 3419415 3637636 3630650 3541704 3613410 3265189 3464492 3576321 3027616 3073158 3071091 2836245
4638B836245N57550L27781o2090N7809P0675j09361Q7440j19589J40606M66865
$$ 2836245 3393795 3721576 3659486 3717295 3787970 3678609 3766049 3646460 3787066 4253931
4628D253931L34182j29466k51922N19133J46946k58623m04864n55976J15562J348
$$ 4253931 4588113 4458647 4206725 4725858 4872804 4614181 4209317 3653341 3768903 3770251
4618C770251N6464J59530j33866j03068j39011l346P67173n52473J42443L09397
$$ 3770251 3826715 3986245 3852379 3749311 3610300 3606954 4374127 3821654 3964097 4273494
4608D273494J56597O1433j68900k91863l3958L9172K06689j11070J70983M23579
$$ 4273494 4430091 4491524 4322624 4030761 3996803 4035975 4242664 4131594 4302577 4726156
4598D726156M6541j22898k08586K17509m65221J19335N2295l80722j93081j94579
$$ 4726156 4772697 4649799 4441213 4658722 4193501 4312836 4365131 3984409 3791328 3596749
4588C596749k63382j14525L56549p7691m17383K15597N59397o9568n04913J74092
$$ 3596749 3333367 3218842 3575391 3497700 3080317 3295914 3855311 3785743 3280830 3454922
4578C454922J46415K41460m00687j17287L923L95141l1485j47724J90637j45739
$$ 3454922 3601337 3842797 3442110 3324823 3328746 3723887 3692402 3544678 3735315 3589576
4568C589576J53746L69694J82680l15061m94742k45974L73284o6990j40105K5109
$$ 3589576 3743322 4113016 4295696 3980635 3485893 3239919 3613203 3546213 3406108 3431217
4558C431217L81513q1387J96038l32031n1767L36934o1657K2227J48907J72484
$$ 3431217 3812730 3731343 3927381 3595350 3543583 3880517 3818860 3841087 3989994 4162478
4548D162478j05676j24099j0181j53501L00334L5971K1864J03925P7230J97493
$$ 4162478 4056802 3932703 3922522 3769021 4069355 4105326 4127190 4231115 4308345 4505838
4538D505838k80672k7200K45703O5687l17450M3666m3055j01282l4404k960k67888
$$ 4505838 4225166 4197966 4443669 4509356 4191906 4235572 4192517 4091235 4056831 4053871 3785983
4527C785983j44899K48107M37045n4311J80035n20714J85372N3892J35473k68750
$$ 3785983 3641084 3889191 4326236 4271925 4451960 3931246 4116618 4170510 4305983 4037233
4517D037233R3009O74288O95317l59343m38983J2088J89348L88313j96357j21925
$$ 4037233 4130242 4804530 5499847 5140504 4701521 4713609 4902957 5291270 5094913 4972988
4507D972988J97113L22046K82922k06099l74001r9185K56695R0706R2847K21980
$$ 4972988 5170101 5492147 5775069 5568970 5194969 5095784 5352479 5443185 5536032 5758012
4497E758012M550k56710r7346R9481j0909K77986K1119M52364M97659m5786J33040
$$ 5758012 5762562 5505852 5408506 5507987 5497078 5775064 5796183 6248547 6746206 6700420 6833460
4486F833460k15101L24599j9579n62030l97055J15669r753j96355k05056L1782
$$ 6833460 6618359 6942958 6923379 6361349 5964294 6079963 6070210 5873855 5668799 5700581
4476E700581R4347l80660k9608L4678L38548K85287m0660k66731Q50P4862L12057
$$ 5700581 5794928 5414268 5384660 5419338 5757886 6043173 6002513 5735782 5736632 5811494 6123551
4465F123551j18469Q1180L49561j70824j78503J85478J94171j6966j59678O822
$$ 6123551 6005082 6086262 6435823 6264999 6086496 6271974 6466145 6449179 6289501 6296323
4455F296323J3586N951j89545m6700j75380Q1791J611K34263J4304r6698l52433
$$ 6296323 6309909 6315860 6126315 6079615 5904235 5986026 5987637 6221900 6236204 6139506 5787073
4444E787073N11535L1681L06860L66655j03379j96508k24274m25960k8400M78043
$$ 5787073 6298608 6330289 6637149 7003804 6900425 6703917 6479643 6053683 6025283 6503326
4434F503326K22530j37832k822M33207l00795l179N2847Q7426k78195J70585K68973
$$ 6503326 6725856 6588024 6585202 7018409 6717614 6714435 6767282 6854708 6576513 6747098 7016071
4423G016071j3539K65374p30141k13439L26005j8038J1853m39499L38996N47680
$$ 7016071 7002532 7267906 6537765 6324326 6650331 6632293 6644146 6204647 6543643 7091323
4413G091323j36901L13324j85026k89038J00201L48479L53285k14581l36350K2980
$$ 7091323 6954422 7267746 7082720 6793682 6893883 7242362 7595647 7381066 7044716 7067696
4403G067696l8941n4228L4602j38178K07746m24558R8918O6600K11277K92577
$$ 7067696 7028755 6974527 7009129 6870951 7078697 6654139 6753057 6819657 7030934 7323511
4393G323511j2657n9172m22287L61137O1180k97565J22026J91867Q2484n57986
$$ 7323511 7310854 7251682 6829395 7190532 7251712 6954147 7076173 7268040 7350524 6792538
4383F792538K83686L4031K33062J43423L39833j16629J84594N03308n10k56979
$$ 6792538 7076224 7110255 7343317 7486740 7826573 7709944 7894538 8397846 8397336 8140357
4373H140357M13274L30365o27550k9213m27027j68803q3034J44779N4788J28932
$$ 8140357 8553631 8883996 8256446 8227233 7800206 7631403 7548369 7693148 7747936 7876868
4363G876868l22491J38872J67244K7632m44781j30550L35017m9590L89923M98013
$$ 7876868 7554377 7693249 7860493 7888125 7443344 7312794 7647811 7598221 7988144 8486157
4353H486157m12588O7909L30410J60213K06444l86110j44225l9908q9899l0418
$$ 8486157 8073569 8141478 8471888 8632101 8838545 8452435 8308210 8268302 8178403 8147985
4343H147985j19792N9967J59915O0593k10999L6602j5235M09499j65630k09765
$$ 8147985 8028193 8088160 8248075 8308668 8097669 8134271 8119036 8528535 8362905 8153140
4333H153140J10042K24389J1783k14784R1339J6056o5555O07731k26178J5096
$$ 8153140 8263182 8487571 8499354 8284570 8375909 8391965 8326410 8934141 8707963 8723059
4323H723059J42634m0096j17088R8551k54318K8003l84794M1632L46285k6860
$$ 8723059 8865693 8825597 8708509 8807060 8552742 8580745 8195951 8237583 8583868 8557008
4313H557008p0890L04335K05874l09360N88381p7979K78673l92410J87047K04336
$$ 8557008 8486118 8790453 8996327 8686967 9275348 9197369 9476042 9083632 9270679 9475015
4303I475015K30709K1555k02249n89338K75738J63833m8219l46141L67842J33632
$$ 9475015 9705724 9727279 9525030 8935692 9211430 9375263 9327044 8980903 9348745 9482377
4293I482377L48267j33830P6369j36977J0689J20892l89133N23596M27798j24306
$$ 9482377 9830644 9696814 9773183 9636206 9646895 9767787 9378654 9902250 10330048 10205742
4283A0205742J71063k82244l32115K57449K07313K26002J76939N74271J97634
$$ 10205742 10376805 10094561 9762446 10019895 10227208 10453210 10630149 11204420 11402054
4274A1402054O8408R63376M81212J34833L68142R23373M32286R9280M73754J42047
$$ 11402054 11470462 12433838 12915050 13049883 13418025 14341398 14773684 14872964 15346718 15488765
4264A5488765O19242K40907j25349o0597k62225k05852L40145m00006k12719L05744
$$ 15488765 16108007 16348914 16223565 16162968 15900743 15694891 16035036 15635030 15422311 15728055
4254A5728055K24179J07003R6923N81600K69739J36119R9983l96982m83568k37982
$$ 15728055 15952234 16059237 16156160 16737760 17007499 17143618 17243601 16846619 16363051 16125069
4244A6125069j76386j13075P7979L29466J61544O56722K84613J35933K79125M35822
$$ 16125069 15948683 15835608 15913587 16243053 16404597 17061319 17345932 17481865 17760990 18196812
4234A8196812R1819R396J06264N7955n08284p62686l26827L29150M2652L3428
$$ 18196812 18288631 18298027 18404291 18462246 17953962 17191276 16864449 17193599 17236251 17269679
4224A7269679J61012j42321L38403M51130J07091L62472K71810M94578J49669
$$ 17269679 17430691 17288370 17626773 18077903 18184994 18547466 18819276 19313854 19463523
4215A9463523k30604J6756n50003L21861M62754K17565m8284J337090R73994J88383
$$ 19463523 19232919 19249675 18699672 19021533 19484287 19701852 19653568 20990658 21964652 22153035
4205B2153035O50613J094038P73440M31224N96101N43277J07164N11457M3643
$$ 22153035 22803648 23897686 24671126 25102350 25698451 26241728 26348892 26860349 26903992
4196B6903992l13623P7884k46167l04669j27005k82744K5703N3136J27972o8035
$$ 26903992 26590369 26668253 26422086 26117417 25990412 25707668 25733371 25786507 25914479 25846444
4186B5846444N39798K95879M34427O84977R03376L4201Q3389j72908J04363m99184
$$ 25846444 26386242 26682121 27116548 27801525 28704901 28739102 28822491 28649583 28753946 28254762
4176B8254762j0779k15553k72590Q4813j12989p65395q11397j148441q62330q29044
$$ 28254762 28243983 28028430 27755840 27840653 27727664 26962269 26150872 25002431 24140101 23311057
4166B3311057k78009k32976l97033j0754Q4374K68318N07969N23905M16628P13054
$$ 23311057 23033048 22800072 22403039 22392285 22476659 22744977 23252946 23776851 24193479 24906533
4156B4906533J175031O39261N42032O60799N15639P48414j90718P47896N90910
$$ 24906533 26081564 26720825 27262857 27923656 28439295 29187709 28996991 29744887 30335797
4147C0335797N35964R32344L66584n06505L14895M31894J53916j21794J66195
$$ 30335797 30871761 31804105 32170689 31664184 31979079 32410973 32564889 32443095 32609290
4138C2609290O10045R11794N04193J333128J349851J571979J084945J060354p10954
$$ 32609290 33219335 34131129 34635322 35968450 37318301 38890280 39975225 41035579 40324625
4129D0324625k302771j828033k009948j578041j596271j326191m28620n19089
$$ 40324625 38021854 36193821 34183873 32605832 31009561 29683370 29254750 28735661
4121B8735661l85521j03967M26891n7920K62380J14438J32151M31607P96262Q46387
$$ 28735661 28350140 28246173 28673064 28615144 28877524 28991962 29124113 29555720 30351982 31198369
4111C1198369L51444j70773O35265L49906J17131j11896K59828N77193Q46746
$$ 31198369 31549813 31379040 32014305 32364211 32481342 32369446 32629274 33206467 34053213
4102C4053213O15186R34710J319566J568198J296748J261729J893526J692326
$$ 34053213 34668399 35603109 36922675 38490873 39787621 41049350 42942876 44635202
4094D4635202K256131K609111K537762L472843M569511M275781O180872P923967
$$ 44635202 46891333 49500444 52038206 55511049 60080560 64356341 70537213 78461180
4086G8461180J0890447J3935079J7411408J9592704K0028448J3806593l001342
$$ 78461180 89351627 103286706 120698114 140290818 160319266 174125859 171124517
4079A71124517j7256413k1873889j9936897j5719212j1322340r212785p329898
$$ 171124517 153868104 131994215 112057318 96338106 85015766 75802981 68473083
4072F8473083n311307l805726k718634j855409j469397j122011j165753j534945
$$ 68473083 63161776 59356050 56637416 54782007 53312610 52190599 51024846 49489901
4064D9489901j472084j756021k086883j868250k253914j433667j363386j412963
$$ 49489901 48017817 46261796 44174913 42306663 40052749 38619082 37255696 35842733
4056C5842733p61453r17275j08922r86617m89064o47755o13422q00699o68897
$$ 35842733 35081280 34164005 34055083 33068466 32579402 31931647 31318225 30517526 29848629
4047B9848629j192382r44964q33661r85231p04267q95324K19100n76003l78994
$$ 29848629 28656247 27711283 26877622 25892391 25188124 24292800 24511900 23935897 23556903
4038B3556903r7474l55615m09921o59782m95522m51266k25526l64433q98416m34569
$$ 23556903 23459429 23103814 22693893 22034111 21538589 21087323 20861797 20497364 19598948 19164379
4028A9164379n00293k37413k9257m66896N2007n5539J26893k94963k74142m04769
$$ 19164379 18664086 18426673 18397416 17930520 17982527 17926988 18053881 17758918 17484776 17080007
4018A7080007j47979k85138j26302j46833j57134k29387r1283k68947j82805N182
$$ 17080007 16932028 16646890 16520588 16373755 16216621 15987234 15895951 15627004 15444199 15449381
4008A5449381l48098r9495L14463m09324k78018J37567o64179k91225j89397K35820
$$ 15449381 15101283 15001788 15316251 14906927 14628909 14766476 14102297 13811072 13621675 13857495
3998A3857495l2099o77039J67840L16156J04504j70592n99773L47893P2686k7503
$$ 13857495 13825396 13148357 13316197 13632353 13736857 13566265 12966492 13314385 13387071 13359568
3988A3359568q1831q56721J34550J23283k1276o9409k56478j57523J53220M79568
$$ 13359568 13277737 12421016 12555566 12678849 12657573 12588164 12331686 12174163 12327383 12806951
3978A2806951L15129K08679K27839J43668M22320L21247Q53660J255183Q51727
$$ 12806951 13122080 13330759 13558598 13702266 14124586 14445833 15299493 16554676 17406403
3969A7406403J896070K148841J814443K95125j531562k423407k239991j708999
$$ 17406403 19302473 21451314 23265757 23560882 22029320 19605913 17365922 15656923
3961A5656923r84503p28499m69781J41100q71393o07370R1035K4536k52466K0859
$$ 15656923 14672420 13943921 13474140 13615240 12743847 12136477 12227512 12252048 11999582 12020441
3951A2020441l95634J2459Q07l18779r1106j34207L37628K48206L18277k07947
$$ 12020441 11624807 11637266 11638073 11319294 11228188 11093981 11431609 11679815 11998092 11790145
3941A1790145N42234J44037l3654N19263J96420K70417L06990L66807M18825P75310
$$ 11790145 12332379 12476416 12442762 12962025 13158445 13428862 13735852 14102659 14521484 15296794
3931A5296794O56969Q67371J141601J167657J167974R03414Q59704j78901q22073
$$ 15296794 15953763 16821134 17962735 19130392 20298366 21201780 22061484 21882583 21060510
3922B1060510j122313j169305q94183q30371o33291q01844o72260n70743o54198
$$ 21060510 19938197 18768892 17874709 17044338 16411047 15609203 14936943 14366200 13712002
3913A3712002k03667K53970p91910l06249K00090j06306J34886q02414p7072K06856
$$ 13712002 13508335 13762305 12970395 12664146 12864236 12757930 12892816 12090402 12013330 12220186
3903A2220186J13924j39273j86813l4866Q3032k82m44684k6359P7594J99959j43005
$$ 12220186 12334110 12194837 12008024 11973158 12056190 12055908 11611224 11584865 11662459 11862418 11719413
3892A1719413l7358K2519J0465K58502n5172k5590K7995r2291k48673J4232K24009
$$ 11719413 11682055 11704574 11715039 11973541 11918369 11892779 11920774 11828483 11579810 11594042 11818051
3881A1818051O46195J35897j80580j91143J31398j17217m5047k7158L62749p9249
$$ 11818051 12464246 12600143 12419563 12228420 12359818 12242601 12197554 12170396 12533145 12453896
3871A2453896k72119J22979k28772R5776K20005M1445k64445J20493K79963K76084
$$ 12453896 12181777 12304756 12075984 12171760 12391765 12433210 12168765 12289258 12569221 12845305
3861A2845305N0216k24575m51075M35248K57260K2402J62951J38752K86669j43649
$$ 12845305 12895521 12670946 12219871 12655119 12912379 12934781 13097732 13236484 13523153 13379504
3851A3379504J87028O0402R9419m4353L21909j01140J82788P79190k25998J55236
$$ 13379504 13566532 13626934 13726353 13682000 14003909 13902769 14085557 14864747 14638749 14793985
3841A4793985M38161K98740k21234J72985J70418j28064J44348L81943J67788
$$ 14793985 15232146 15530886 15309652 15482637 15653055 15524991 15669339 16051282 16219070
3832A6219070J08075J77108J81478p3980j13800K28715K82044m0748J27039J63103
$$ 16219070 16327145 16504253 16685731 16611751 16497951 16726666 17008710 16967962 17095001 17258104
3822A7258104Q731N65922J74265K42884J70241O2860K21818M33716L61224J0270
$$ 17258104 17266835 17832757 18007022 18249906 18420147 18483007 18704825 19138541 19499765 19510035
3812A9510035O8788J88477N33164N03511J87162K84657N75491J02103K73135M14375
$$ 19510035 19578823 19767300 20300464 20803975 20991137 21275794 21851285 21953388 22226523 22640898
3802B2640898N19185P72661Q15554J84372O12943Q51192Q82760J713889J398348
$$ 22640898 23160083 23932744 24748298 24932670 25545613 26396805 27279565 28993454 30391802
3793C0391802J546659J778218J591851J435353J930349K463230K285191K259109
$$ 30391802 31938461 33716679 35308530 36743883 38674232 41137462 43422653 45681762
3785D5681762J954583K050547K372161J325582P97722J032643J094040R99424
$$ 45681762 47636345 49686892 52059053 53384635 54182357 55215000 56309040 57308464
3777E7308464N12332P27686P89504O20201o9978o96k75821n69415p83961j197572
$$ 57308464 57820796 58548482 59337986 59958187 59888209 59887513 59611692 59042277 58258316 57060744
3767E7060744r20431q57092n31662j237997j370536o74167j026385j080724j141325
$$ 57060744 56140313 55283221 54751559 53513562 52143026 51468859 50442474 49361750 48220425
3758D8220425j031674r37991j480026p66119p03661q22689j046592p73207m02949
$$ 48220425 47188751 46250760 44770734 44004615 43300954 42478265 41431673 40658466 40255517
3749D0255517j018440j351071j091081p64625q71994n23934P411n88814m48178
$$ 40255517 39237077 37886006 36794925 36030300 35158306 34634372 34641783 34052969 33604791
3740C3604791K566J33323r9937j27332l85620r55459q54206j22911j18448l11763
$$ 33604791 33607357 33740680 33640743 33513411 33127791 32172332 31318126 31195215 31076767 30765004
3730C0765004k42337Q429j48373J7521L85241l7555J34958L76140M36720o4221
$$ 30765004 30522667 30531096 30382723 30400244 30785485 30747930 30882888 31259028 31695748 31631527
3720C1631527J47717J00100R02438K43605o2382q6079m76916L27646j60029r4994
$$ 31631527 31779244 31879344 32781782 33025387 32963005 32876926 32400010 32727656 32567627 32472633
3710C2472633j416K27656K94066L34201K27713L46118N58520K60206N7555l53494
$$ 32472633 32471217 32698873 32992939 33327140 33554853 33900971 34459491 34719697 34777252 34423758
3700C4423758n6420j2002Q3838l26029M84303P74956Q83110P37085L94622O18061
$$ 34423758 34367338 34355336 34439174 34113145 34597448 35372404 36255514 36992599 37387221 38005282
3690C8005282L88331K89161J172644Q81898O07211K54080j6330K71301j34330
$$ 38005282 38393613 38682774 39855418 40737316 41344527 41598607 41582277 41853578 41719248
3681D1719248j44053N276q0033o17182R0468j40272K51966L56366J59304O5202
$$ 41719248 41575195 41580471 41500438 40883256 40973724 40833452 41085418 41441784 41601088 41666290
3671D1666290J00847j30331K9215j33987n18242o77018p36914j194659l98253
$$ 41666290 41767137 41636806 41666021 41532034 41013792 40336774 39599860 38405201 38006948
3662C8006948j55426j97995l27206o86752j14988k77197M16823k29410J73159
$$ 38006948 37851522 37653527 37326321 36639569 36524581 36247384 36664207 36434797 36607956
3653C6607956k08436N9226M08491r796j84330J84470J94342J16634K63234R6526
$$ 36607956 36399520 36458746 36867237 36857441 36673111 36857581 37051923 37168557 37431791 37528317
3643C7528317O19399L43284N8610L74795N99374L70099N43906N78246N40591L54276
$$ 37528317 38147716 38491000 38549610 38924405 39523779 39893878 40437784 41016030 41556621 41910897
3633D1910897P17739M97359L24440Q29910O89757J345742J185677P44166J197894
$$ 41910897 42628636 43125995 43450435 44280345 44970102 46315844 47501521 48245687 49443581
3624D9443581J805206J386140J461780J883424J951734K669537K602525L130207
$$ 49443581 51248787 52634927 54096707 55980131 57931865 60601402 63203927 66334134
3616F6334134L030864M049334M311048M522045M835420N259912M959787N135283
$$ 66334134 69364998 73414332 77725380 82247425 87082845 92342757 97302544 102437827
3608A02437827N447353M483345M157358M018407L421408J939115J427942L88032
$$ 102437827 107885180 112368525 116525883 120544290 123965698 125904813 127332755 127720787
3600A27720787n12058j474024k781285l502144m251846m627652n087913m619172
$$ 127720787 127208729 125734705 122953420 119451276 115199430 110571778 105483865 100864693
3592A00864693m767165n503222n226993m137501m224296m508466l859579k956633
$$ 100864693 96097528 90594306 85367313 81229812 77005516 72497050 68637471 65680838
3584F5680838k593245k795539k323488k134364j760191j294104j469138j355399
$$ 65680838 63087593 60292054 57968566 55834202 54074011 52779907 51310769 49955370
3576D9955370j035724j283997o19362q55288p49865m19792j74601j49823k40705
$$ 49955370 48919646 47635649 47016287 46160999 45411134 44991342 44816741 44666918 44426213
3567D4426213j84147n06888j61157J04756O9650m96417j50003l91245J26901j26023
$$ 44426213 44242066 43735178 43574021 43678777 43748427 43252010 43102007 42710762 42837663 42711640
3557D2711640p1243P6182o11822r5290R0817k38279l89544Q0070j51203m5782
$$ 42711640 42640397 42716579 42104757 42009467 42100284 41862005 41472461 41552531 41401328 41355546
3547D1355546o2958n47154l41543m62917k29427m7863m14342m95240j70897K410
$$ 41355546 41292588 40745434 40403891 39940974 39711547 39663684 39249342 38754102 38583205 38585615
3537C8585615m51382m3112l3495K21295m95066L70375L67413K15775K89468k84499
$$ 38585615 38134233 38091121 38057626 38278921 37783855 38154230 38521643 38737418 39026886 38742387
3527C8742387M75214P52948J333545J000209J050283J763490J260497J427782
$$ 38742387 39217601 39970549 41304094 42304303 43354586 45118076 46378573 47806355
3519D7806355J629807J531222J904818J131011J343972J306470K07379N77527
$$ 47806355 49436162 50967384 52872202 54003213 55347185 56653655 56861034 57438561
3511E7438561K39025n62086j225560j065619j463183j709617j620443k445533
$$ 57438561 57677586 57115500 55889940 54824321 53361138 51651521 50031078 47585545
3503D7585545j498141j651317j783193j264883q38083r36543j074320m97517q06191
$$ 47585545 46087404 44436087 42652894 41388011 40549928 39613385 38539065 38041548 37235357
3494C7235357m85769m40305o90131o12750q59968m80507j26682j55838m97637
$$ 37235357 36749588 36309283 35619152 35006402 34146434 33665927 33539245 33383407 32885770
3485C2885770q14359j40997L5025k79014o59608j31532m57395l15675j27834L517
$$ 32885770 32071411 31930414 31965439 31686425 31026817 30895285 30437890 30122215 29994381 29997898
3475B9997898j02983j21818j47645l71860k51701k35396J43086L51717n8966p8590
$$ 29997898 29894915 29773097 29625452 29253592 29001891 28766495 28909581 29261298 29202332 29123742
3465B9123742K81970k04392l26647m03735l70338K92353k6593L09936n0153k19519
$$ 29123742 29405712 29201320 28874673 28470938 28100600 28392953 28366360 28676296 28626143 28406624
3455B8406624N43742p8016L21370k92967j75316M0398L09104K60796K53030q4937
$$ 28406624 28950366 28872350 29193720 28900753 28725437 28765835 29074939 29335735 29588765 29503828
3445B9503828K11687N04993k83237k01853J57211J00586l4092j1941L0220L84428
$$ 29503828 29715515 30220508 29937271 29735418 29892629 29993215 29959123 29947182 29977402 30361830
3435C0361830M9462J86890M7833J64394M82296l576j26368K33568N60707r7931
$$ 30361830 30411292 30598182 30646015 30810409 31292705 31289129 31162761 31396329 31957036 31859105
3425C1859105M7099L8950J93693O48783J7059J90749L91237J08063J1732K48511
$$ 31859105 31906204 31945154 32138847 32787630 32804689 32995438 33386675 33494738 33506470 33754981
3415C3754981J11627P97567Q08192M79354O58938K74708N48239N92806R04729
$$ 33754981 33866608 34664175 35472367 35951721 36610659 36885367 37433606 38026412 38931141
3406C8931141K96937L05318M56688L71744M21081K38222M38343K04173K33324
$$ 38931141 39228078 39533396 39990084 40361828 40782909 41021131 41459474 41663647 41896971
3397D1896971O54671K09915J94043L80167M55828l6132N02177L75271n4373J74791
$$ 41896971 42551642 42761557 42955600 43335767 43791595 43755463 44257640 44632911 44578538 44753329
3387D4753329J36640M9329M59608j6676r9109J33727J80034L12387k66528L97008
$$ 44753329 44889969 44939298 45398906 45382230 45283121 45416848 45596882 45909269 45642741 46039749
3377D6039749K72515l319n777K16209P79486M50882P34590P44621L33430Q39262
$$ 46039749 46312264 46308945 46303168 46519377 47298863 47749745 48484335 49228956 49562386 50401648
3367E0401648R42313R32217J063506R95802Q44542J477384J021111J951735J695893
$$ 50401648 51343961 52276178 53339684 54335486 55180028 56657412 57678523 59630258 61326151
3358F1326151J938792K211789J503901K190177K653911K699006K382436J965292
$$ 61326151 63264943 65476732 66980633 69170810 71824721 74523727 76906163 78871455
3350G8871455J609777K138598K027388K094467J311731J315888J060546Q06605
$$ 78871455 80481232 82619830 84647218 86741685 88053416 89369304 90429850 91236455
3342I1236455P57602P11896J125452R64886M85641M55406J036448L68130P61341
$$ 91236455 91994057 92705953 93831405 94796291 95281932 95737338 96773786 97141916 97903257
3333I7903257M09088M88730J29002L04143l01277m57301N01211n7056M45878O74871
$$ 97903257 98312345 98801075 98930077 99234220 98932943 98475642 98976853 98919797 99365675 100040546
3323A00040546N64684P16333J208243J684914J672353J840619K098080K350744
$$ 100040546 100605230 101321563 102529806 104214720 105887073 107727692 109825772 112176516
3315A12176516J825296J646153K121046J689572J300458J517775J271791J202902
$$ 112176516 114001812 115647965 117769011 119458583 120759041 122276816 123548607 124751509
3307A24751509Q47702J344313J408588J393878J389604Q58198P81160O42724N87696
$$ 124751509 125599211 126943524 128352112 129745990 131135594 131993792 132774952 133417676 134005372
3298A34005372N39957O2846l12556j38571p70468m45991j67159N1625k30553k6506
$$ 134005372 134545329 134608175 134295619 134157048 133386580 132940589 132773430 132825055 132594502 132567996
3288A32567996K13643N80770M63067J092313O92131O89484J284890J312486R15830
$$ 132567996 132781639 133362409 133825476 134917789 135609920 136299404 137584294 138896780 139812610
3279A39812610J422238J490994J746563J759408J697150K182221J705855K495042
$$ 139812610 141234848 142725842 144472405 146231813 147928963 150111184 151817039 154312081
3271A54312081K367572K390071K687596L493160L794924M135554M445095N021182
$$ 154312081 156679653 159069724 161757320 165250480 169045404 173180958 177626053 182647235
3263A82647235N538945O063015O783736P838531P962594Q654455R918125J0636885
$$ 182647235 188186180 194249195 201032931 208871462 216834056 225488511 235406636 246043521
3255B46043521J1907095J2690233J3884369J4216820J4285675J3430189J1657379
$$ 246043521 257950616 270640849 284525218 298742038 313027713 326457902 338115281
3248C38115281R833043N494083J008736o585605j4062469j8809416k2164005k2398593
$$ 338115281 347948324 353442407 354451143 347865538 333803069 314993653 292829648 270431055
3240B70431055k0227826j8353291j6224664j3817451j2267820j0531399q928515
$$ 270431055 250203229 231849938 215625274 201807823 189540003 179008604 170080089
3233A70080089p962824o741854o760187n840928m457912l771590l429664l700612
$$ 170080089 162117265 155375411 148615224 142774296 138316384 134544794 131115130 127414518
3225A27414518l512942l069640k193851k246905k573327j983983k047564k210413
$$ 127414518 123901576 120831936 118638085 116391180 113817853 111833870 109786306 107575893
3217A07575893k062799k687765k594604j749527k136101k105897j532279k010852
$$ 107575893 105513094 102825329 100230725 98481198 96345097 94239200 92706921 90696069
3209I0696069j961666j661547j227472j484038j050048j663514r84760j039042
$$ 90696069 88734403 87072856 85845384 84361346 83311298 81647784 80663024 79623982
3201G9623982j307415j223646j414090o43041n30575j098585r03217o21085o01300
$$ 79623982 78316567 77092921 75678831 75035790 74505215 73406630 72503413 71882328 71281028
3192G1281028l35680n60655n64755k28935l71415M5997m52572j19066M11854m9929
$$ 71281028 70945348 70384693 69819938 69591003 69219588 69265585 68813013 68693947 69105801 69055872
3182F9055872K23117Q96771N38398P32114J145163J188787J317362J963997J733134
$$ 69055872 69278989 70175760 70714158 71446272 72591435 73780222 75097584 77061581 78794715
3173G8794715K135076J919465J984766K209818K153552J671272J787077K323820
$$ 78794715 80929791 82849256 84834022 87043840 89197392 90868664 92655741 94979561
3165I4979561J476000J211531L14173L10168L7548m45514j252202j378876k450029
$$ 94979561 96455561 97667092 97981265 98291433 98328981 97883467 96631265 95252389 92802360
3156I2802360k950340k986539l381432l707518k687720l200341l212396k707115
$$ 92802360 89852020 86865481 83484049 79776531 77088811 73888470 70676074 67968959
3148F7968959k556113j991858j739313j586399j601370j215310q80275q37848
$$ 67968959 65412846 63420988 61681675 60095276 58493906 57278596 56398321 55560473
3140E5560473n98874o90341l40648k73868o19232m15427R793k18078J60512r1776
$$ 55560473 54961599 54271258 53930610 53656742 53037510 52622083 52631876 52413798 52574310 52482534
3130E2482534j10279J88030K50819K93521K96093J34100j25223J0784q6823M51270
$$ 52482534 52372255 52560285 52811104 53104625 53400718 53534818 53409595 53420379 53333556 53784826
3120E3784826o46077o79174m39974k45644q87486q22208n63196j582376j038288
$$ 53784826 53138749 52459575 52019601 51773957 50886471 50064263 49501067 47918691 46880403
3111D6880403o76974o69948j049996j062364p73429r39377p47041o10950m26592
$$ 46880403 46203429 45533481 44483485 43421121 42647692 41708315 40961274 40350324 39923732
3102C9923732o38912l75036p60499m57570k20671m50865k74432q16281n05068
$$ 39923732 39284820 38909784 38149285 37691715 37471044 37020179 36745747 35929466 35424398
3093C5424398k84034k68002j33830n60766m65364l90513k44272L2433j08798l04066
$$ 35424398 35140364 34872362 34738532 34177766 33712402 33321889 33077617 33110050 33001252 32697186
3083C2697186l52032r8835m4702l94266m56531q4307M61473n31431m65532K1783
$$ 32697186 32345154 32246319 32201617 31807351 31350820 31266513 31727986 31196555 30731023 30752806
3073C0752806m05969j23568O8629j77815j77968J21826Q7585O1964l36467l89981
$$ 30752806 30346837 30223269 30291898 30114083 29936115 30057941 30145526 30207490 29871023 29481042
3063B9481042l8040j00029J54630p5948m16519j74731l49235J95795n26J87668
$$ 29481042 29443002 29342973 29497603 29421655 29005136 28830405 28481170 28676965 28676439 28864107
3053B8864107m23814n93363M9712K55508J95238Q6716k65453j38321l15043J40589
$$ 28864107 28440293 27846930 27896642 28152150 28347388 28434104 28168651 28030330 27715287 27855876
3043B7855876m98659l62253J65265m176J73068k62793j40348K70457q264j14484
$$ 27855876 27357217 26994964 27160229 27156053 27329121 27066328 26925980 27196437 27188173 27073689
3033B7073689J21765O4325o4248j19068P39183k36265M26376l5390J5100q9135
$$ 27073689 27195454 27259779 27195531 27076463 27815646 27579381 28005757 27970367 27985467 27896332
3023B7896332m23363j279J84653Q3822J58170K93902j1490J56468L69071J44124
$$ 27896332 27472969 27471690 27656343 27740165 27898335 28192237 28180747 28337215 28706286 28850410
3013B8850410J61958J10602j7O7506J94722N64078N19918K44387l05874J48339
$$ 28850410 29012368 29122970 29122953 29190459 29385181 29949259 30469177 30713564 30407690 30556029
3003C0556029M311N04574N31422M27458K02101M72415M50633L39044L4154K63610
$$ 30556029 30560340 31064914 31596336 32023794 32225895 32698310 33148943 33487987 33522141 33785751
2993C3785751J54076j60908j01820N49619J048002K58707L87511M02017N90943
$$ 33785751 33939827 33778919 33677099 34226718 35274720 35533427 35920938 36322955 36913898
2984C6913898L66562O17398N82877L91470M28400O82362N20546J21076J30846
$$ 36913898 37280460 37897858 38480735 38872205 39300605 39982967 40503513 40624589 40755435
2975D0755435K96057N47832K99104O81028K14969O76963P64661N17424L53896
$$ 40755435 41051492 41599324 41898428 42579456 42794425 43471388 44236049 44753473 45107369
2966D5107369M76685O85005R48909M95003J18802M72499P69859J151543P44328
$$ 45107369 45584054 46269059 47217968 47712971 47831773 48304272 49074131 50225674 50970002
2957E0970002P31560P36166R51006R81359Q61735O18057J031371R60028R62803
$$ 50970002 51701562 52437728 53388734 54370093 55231828 55849885 56881256 57841284 58804087
2948E8804087J250467J375767R32240J557283J503092J208256J513495K258278
$$ 58804087 60054554 61430321 62362561 63919844 65422936 66631192 68144687 70402965
2940G0402965J583282J453320K025188J887107J007964J499443J479909P41461
$$ 70402965 71986247 73439567 75464755 77351862 78359826 79859269 81339178 82080639
2932H2080639J322194R90584O24158J170159J331254J481238J074657J373538
$$ 82080639 83402833 84393417 85017575 86187734 87518988 89000226 90074883 91448421
2924I1448421J780026J725880J486005J955713K490462K138925L075093K715174
$$ 91448421 93228447 94954327 96440332 98396045 100886507 103025432 106100525 108815699
2916A08815699L383425L625054L773715M439644M928537N483145N830011N948907
$$ 108815699 112199124 115824178 119597893 124037537 128966074 134449219 140279230 146228137
2908A46228137N463173M243184K752333J391055P82627l4207l27084Q12752L017824
$$ 146228137 151691310 155934494 158686827 160077882 160860509 160826302 160499218 161311970 164329794
2899A64329794M128087N424964P513988R577858J2119706J5585613J9596458K3651868
$$ 164329794 168457881 173882845 181396833 190974691 203094397 218680010 238276468 261928336
2891B61928336K6869602K6701678K1536844J0257982n359557j8439860k4415444
$$ 261928336 288797938 315499616 337036460 347294442 341934885 323495025 299079581
2884B99079581k4571805k1617854j7600711j4361637j2059927j0133267r242999
$$ 299079581 274507776 252889922 235289211 220927574 208867647 198734380 189491381
2877A89491381q937767q473929p712850o957890o629887o261691n490329m469590
$$ 189491381 180553614 172079685 164366835 157408945 150779058 144517367 139027038 134557448
2869A34557448l630500l364143k472523j747497j619426r07767p29931M44317
$$ 134557448 130926948 127562805 125090282 123342785 121723359 120815592 120085661 120529978
2861A20529978N50284N85824J418271J635012J405930K020131K444150K408960
$$ 120529978 121080262 121666086 123084357 124719369 126125299 128145430 130589580 132998540
2853A32998540J803778K76645j268659k879822l511009m846388o212812p056826
$$ 132998540 134802318 135078963 133810304 130930482 127419473 122573085 116360273 109303447
2845A09303447p078336o673595o017524n142161m810935m041581l745952l446892
$$ 109303447 102225111 95551516 89533992 84391831 79580896 75539315 71793363 68346471
2837F8346471k084610k162631k115383k016519j335904j676935j828769j173463
$$ 68346471 66261861 64099230 61983847 59967328 58631424 56954489 55125720 53952257
2829E3952257j660903j392791j245570j475468j069562j358082j299692j450367
$$ 53952257 52291354 50898563 49652993 48177525 47107963 45749881 44450189 42999822
2821D2999822j182816r59976j037071j164404q61976l88752r81543m29608r66401
$$ 42999822 41817006 40857030 39819959 38655555 37793579 37404827 36423284 35993676 35027275
2812C5027275j096580o56283n80416q32856q46378m87088o70979o31848m64490
$$ 35027275 33930695 33274412 32693996 31861140 31014762 30527674 29856695 29224847 28760357
2803B8760357o91294n92723n41281m31320r600m77275l98129q06037j92415j98690
$$ 28760357 28069063 27476340 26935059 26503739 26494139 26016864 25618735 24812698 24620283 24421593
2793B4421593n24467l56813j21446l53841j48532p99128j87314m72568r89521
$$ 24421593 23897126 23540313 23418867 23065026 22916494 22117366 21930052 21457484 20467963
2784B0467963k75697j93915m23248m36308k14533m53041k0141m34218l08253Q7011
$$ 20467963 20192266 19998351 19575103 19138795 18924262 18471221 18451080 18016862 17708609 17795620
2774A7795620k5310o58110n39164l00120m36879m75497N3113j1268l45575j50876
$$ 17795620 17770310 17112200 16573036 16272916 15836037 15360540 15413653 15402385 15056810 14905934
2764A4905934L9628l21032L31771l84176m23907J53342l6013k19450n32349m62614
$$ 14905934 14945562 14624530 14956301 14572125 14148218 14301560 14265547 14046097 13513748 13051134
2754A3051134m65382j92979j02177j30087J08664m17376m2178l92461k75821j6619
$$ 13051134 12585752 12392773 12290596 12160509 12269173 11851797 11809619 11417158 11141337 11124718
2744A1124718k50808r3631P2372K8162k49901m63030k85410J34615M59456k4694
$$ 11124718 10873910 10780279 10852651 10880813 10630912 10167882 9882472 10017087 10476543 10451849
2734A0451849j31033n2184n58686k17094k57738j50098K32584l36247q0235J24320
$$ 10451849 10320816 10268632 9709946 9492852 9235114 9085016 9317600 8981353 8901118 9025438
2724I025438m22548J49900n28391n72047J40728M05449R4586l22064q5878n77160
$$ 9025438 8602890 8752790 8224399 7652352 7793080 8198529 8293115 7971051 7885173 7308013
2714G308013k69396r4177l62089K213J80865j12190j48823K1046K25526j427J3304
$$ 7308013 7038617 6944440 6582351 6584564 6765429 6653239 6504416 6525462 6750988 6749561 6762865
2703F762865K70577n66691j39956j1057m4044N3926r4172k2049m5373q6531J350
$$ 6762865 7033442 6466751 6326795 6315738 6271694 6325620 6231448 6209399 6164026 6077495 6078845
2692F078845K6976k83218R1162l34900k65200L30478q7516j57384o8143K23618
$$ 6078845 6105821 5822603 5913765 5578865 5313665 5644143 5556627 5399243 5331100 5554718
2682E554718L0572j34675k67930L3408N7458K4808l02010j03260L3389j35283
$$ 5554718 5585290 5450615 5182685 5216093 5273551 5298359 4996349 4893089 4926478 4791195
2672D791195p1244J251l74220j82114J45327L50379N52274l5375j65269n16012
$$ 4791195 4719951 4721202 4346982 4164868 4310195 4660574 5212848 5177473 5012204 4496192
2662D496192N0586r947j28574P8630j91543M23900l76791o3559K46867j8545j39694
$$ 4496192 4546778 4536831 4408257 4486887 4295344 4719244 4342453 4278894 4525761 4507216 4367522
2651D367522j3946j1727k32832K6964r8528k68721k32277j21630L98341N6046
$$ 4367522 4353576 4341849 4109017 4135981 4037453 3768732 3536455 3414825 3813166 3869212
2641C869212j09894K43971l08480r6283K5719J65431j10497K55960J0292k23821
$$ 3869212 3759318 4003289 3694809 3598526 3624245 3789676 3679179 3935139 3945431 3721610
2631C721610J15024K80158q3621k18919j54170j4640K63866J40982K0283k46744
$$ 3721610 3836634 4116792 4033171 3814252 3660082 3645442 3909308 4050290 4070573 3823829
2621C823829o45824m2479L99038q1390P1396J64707l20512j16655L25188L36932
$$ 3823829 3178005 3135526 3534564 3453174 3524570 3689277 3368765 3252110 3577298 3914230
2611C914230k92150k16820j95046Q849O81467j7553j53511j45373j07388K66348
$$ 3914230 3622080 3405260 3210214 3219063 3900530 3882977 3729466 3584093 3476705 3743053
2601C743053j62878j02310P064j92477N4591K18166l79023L8792M98533l45607
$$ 3743053 3580175 3477865 3484929 3292452 3347043 3565209 3186186 3224978 3723511 3377904
2591C377904n16806j10614q0268q6923L01096k37366k88674m3555J76547l68861
$$ 3377904 2861098 2750484 2670216 2583293 2884389 2647023 2358349 2314794 2491341 2122480
2581B122480L49165l07090j72712K51005J22345K80866l3783n5261J76189l31923
$$ 2122480 2471645 2164555 1991843 2242848 2365193 2646059 2612276 2557015 2733204 2401281
2571B401281m27011p2145J81847P51372j15606m61142o6486K08178k77203j56360
$$ 2401281 1974270 1902125 2083972 2835344 2719738 2258596 2192110 2400288 2123085 1966725
2561A966725q8211k40021K05612K47051m39592K00022J57277M9267K30469L50547
$$ 1966725 1878514 1638493 1844105 2091156 1651564 1851586 2008863 2058130 2288599 2639146
2551B639146m40650l71100L97870n4885n11905N3600K00693j23045j28288l36099
$$ 2639146 2198496 1827396 2225266 2170381 1658476 1712076 1912769 1789724 1661436 1325337
2541A325337K87510K65128J29539m24422J65931q4742N3583P1692m15826J81876
$$ 1325337 1612847 1877975 2007514 1583092 1749023 1664281 1717864 1789556 1373730 1555606
2531A555606m0789j60576j16199N2244p6046L6286R7314k03670k85968L33346
$$ 1555606 1514817 1354241 1238042 1290286 1214240 1250526 1347840 1144170 858202 1191548
2521A191548J09322o6568k60579M15457P0334j17632N58083m70419l85184K80455
$$ 1191548 1300870 1234302 973723 1389180 1459514 1341882 1899965 1429546 1044362 1324817
2511A324817r0717K30354L77586l30170m70593j29561j31502j7523j23041P02012
$$ 1324817 1234100 1464454 1842040 1511870 1041277 911716 780214 762691 639650 1341662
2501A341662N5901j05327j7137O7780l16095k45669k85390j03088J87895J34079
$$ 1341662 1397563 1292236 1275099 1342879 1026784 781115 495725 392637 580532 714611
2491G14611k757N27167M0686l89715j91038J03848J3919J06343q7049J06746r479
$$ 714611 711854 1239021 1279707 889992 698954 802802 816721 923064 836015 942761 933282
2480I33282j08623J0352Q415K31951k11459p5439L6419J70324j94332k44787o83818
$$ 933282 824659 835011 843426 1075377 863918 788479 824898 995222 800890 556103 -127715
2469a27715J00478K39937Q0087j02832L15012N3092J73342j7911L00207R1211
$$ -127715 -27237 212700 292787 189955 504967 558059 731401 713490 1013697 1104908
2459A104908J80841n7368j6795O8046l68714r9404P3467N9730K05452k78164l73992
$$ 1104908 1285749 1228381 1211586 1279632 910918 811514 884981 944711 1150163 871999 498007
2448D98007R9769j43520L3908L58007l4844Q4561l53272J33066l65068L45571
$$ 498007 597776 454256 488164 846171 811327 895888 542616 675682 310614 656185
2438F56185M5052j04747J77404N3845j73081r3745l06680R38l9987k09127M72644
$$ 656185 701237 596490 773894 827739 654658 560913 254233 255171 215184 6057 478701
2427D78701K19471J15211o6893J95848J65007o16461k88360Q077J73052Q0143
$$ 478701 698172 813383 746490 942338 1107345 490884 202524 210601 383653 463796
2417D63796j37079M49056L9754p9659J6171j08527l3401l17590j91779N42803
$$ 463796 326717 775773 815527 735868 752039 643512 610111 292521 100742 643545
2407F43545o6920n3873o1582j21756l70242P7505L48584m4333J52198K80156j15928
$$ 643545 576625 522752 461170 339414 -30828 46677 395261 350928 503126 783282 667354
2396F67354j08728J55400M26832k54829l30443k35146j12059P7408N8745j51272
$$ 667354 558626 714026 1140858 886029 555586 320440 208381 285789 344534 193262
2386A93262j49031N0661K7384L87913K18461J8808j2413M0939q0189K83900o437
$$ 193262 44231 94892 122276 510189 728650 747458 735045 775984 695795 979695 973258
2375I73258j79363N35446p222L2503l16653j20205l53567l91623K16319K98884
$$ 973258 793895 1329341 1322119 1354622 1037969 917764 564197 172574 388893 687777
2365F87777J05449n23728m67773M34274J14254L7509K37710L60506l45555J06642
$$ 687777 793226 269498 -198275 235999 350253 387762 625472 985978 640423 747065
2355G47065K6764Q962k17162j11470N10724j71530J8841r6971R1765j10259l29297
$$ 747065 773829 782791 565629 454159 964883 793353 812194 715223 806988 696729 367432
2344C67432L1743K96272K2573j12641m8504k93255J98105k4953J6306P4089k76915
$$ 367432 399175 695447 718020 605379 556875 263620 461725 436772 453078 527167 250252
2333B50252M8794m32630J88465M34944k67088L2942L19933Q2059l34540k09413
$$ 250252 299046 -133584 54881 489825 222737 255679 575612 657671 323131 113718
2323A13718k64932l0010L33710K5937K02796m3140k66620L0125J86537k30188
$$ 113718 -151214 -181224 152486 178423 381219 338079 71459 101584 288121 57933
2313E7933j54969j65370l2514K36020N6303K62837N8817r4624O3611J50450L11964
$$ 57933 -97036 -262406 -294920 -58900 -2597 260240 319057 224433 288044 438494 750458
2302G50458l54816l00121j65678K69309L0939j58275L315j97071L05887j20869
$$ 750458 395642 95521 -70157 199152 230091 71816 75131 -121940 183947 63078
2292F3078J83146L06015J9604k88008K13941N0413J76498m01829K94624K22932
$$ 63078 246224 552239 571843 283835 497776 548189 724687 322858 617482 840414
2282H40414j50458k31775m56462M92462K27892P7820l7650j49019n5316k88040
$$ 840414 689956 458181 1719 494181 722073 799893 762243 613224 557908 269868
2272B69868k53492j88057L04739J98020p3560K67948P9885j76973j71859K56170
$$ 269868 16376 -171681 133058 331078 257518 525466 605351 428378 256519 512689
2262E12689K32393j62453k88939j79451j11593N81348J5220j9270l73147K30788
$$ 512689 745082 582629 293690 114239 2646 583994 599214 579944 206797 437585
2252D37585N21578J5546k48787L02963K2015J45072o0043n64430j34513N6284
$$ 437585 959163 974709 725922 1028885 1050900 1195972 1135929 571499 436986 493270
2242D93270J25339R9254p6810k43180R9624K24675P6929M70601J5700K05490j2216
$$ 493270 618609 717863 641053 397873 497497 722172 799101 1269702 1285402 1490892 1478676
2231A478676m00383j52319O9116M4147k03806j62973O1344O6904o9170K30820
$$ 1478676 1078293 925974 995090 1039237 835431 672458 733802 800706 731536 962356
2221I62356Q2412j66161K85239k08367k20907K64287J05554Q355l12897M57193
$$ 962356 1044768 878607 1163846 955479 734572 998859 1104413 1112768 799871 1257064
2211A257064k11181j06356K99746J13169K41436p6879J74779K5789k93315J33261
$$ 1257064 1045883 939527 1239273 1352442 1593878 1516999 1691778 1717567 1424252 1557513
2201A557513Q8794o0889J80970j6528n2674L01951N48283j25882R5557K37146
$$ 1557513 1646307 1585418 1766388 1749860 1697186 1999137 2547420 2421538 2517095 2754241
2191B754241k19765N8005O5600J46768n10518J5269K26482K86039K07682j06769
$$ 2754241 2534476 2592481 2658081 2804849 2294331 2309600 2536082 2822121 3029803 2923034
2181B923034K53484k31948K74975j67311N8127K13010N06552K26223j2245j09009
$$ 2923034 3176518 2944570 3219545 3052234 3110361 3323371 3829923 4056146 4043901 3934892
2171C934892L3284J83930j94902k08130M24970J63242n3053K0517Q7926N89485
$$ 3934892 3968176 4152106 3957204 3749074 4174044 4337286 4284233 4304750 4392676 4982161
2161D982161q9449M48658J88064q0587l4814J65099Q6231M96609L42458K70408
$$ 4982161 4892712 5341370 5529434 5448847 5414033 5579132 5665363 6161972 6504430 6774838
2151F774838L31160J88050J08233M88428K98053N27272M73951m958M59457L00495
$$ 6774838 7105998 7294048 7402281 7890709 8188762 8716034 9189985 9185027 9644484 9944979
2141I944979P18293M99224J0508o4834M59123N90409Q3522J74812Q58669M15928
$$ 9944979 10663272 11162496 11173004 11108170 11567293 12157702 12241224 12416036 13274705 13690633
2131A3690633J009956O55014O14271J027233J037269J682885J783682J725283
$$ 13690633 14700589 15355603 15969874 16997107 18034376 19717261 21500943 23226226
2123B3226226K754164J556532R64758J508098J979151L603024L604353M762680
$$ 23226226 25980390 27536922 28501680 30009778 31988929 35591953 39196306 43958986
2115D3958986N619069Q266550J1791681J5553503K1112193K8838463L0768972
$$ 43958986 49578055 57844605 69636286 85189789 106301982 135140445 165909417
2108A65909417K9689796k218613l3055612l5865419k9076392j8686564j3291609
$$ 165909417 195599213 193380600 160324988 124459569 95383177 76696613 63405004
2101F3405004r412608q129356o597657n108049k898115k523455j710814j140209
$$ 63405004 53992396 45863040 39265383 34157334 31259219 28735764 27024950 25884741
2093B5884741q70774j661950j608990j942478j752811j335257r84596p07793q55205
$$ 25884741 25013967 23352017 21743027 19800549 18047738 16712481 15727885 15020092 14164887
2084A4164887j237417n56612o06384n28284p61425j056392m84790k74008r0671
$$ 14164887 12927470 12370858 11764474 11236190 10474765 9418373 8933583 8659575 8568904
2075H568904n30666q1359l35721o21482q08565k38918K12757j1548n92093j38546
$$ 8568904 8038238 7956879 7621158 6999676 6191111 5952193 6164950 6153402 5561309 5422763
2065E422763p0274j23334k84039j75007k83976k93903J15533m09266j10109M1111
$$ 5422763 5352489 5229155 4945116 4770109 4486133 4192230 4307763 3898497 3788388 3829499
2055C829499k70326j65565l51714j95116Q0112K1171J07463j13730l0173k41230
$$ 3829499 3559173 3393608 3041894 2846778 2926890 2948061 3055524 2941794 2911621 2670391
2045B670391j32578K32511k5572l48602Q1534j69701k25237p9988l1085j4787
$$ 2670391 2537813 2770324 2744752 2396150 2477684 2307983 2082746 2002758 1971673 1956886
2035A956886M21042j35271p1886j01836j14347p9145m8719l48272M4408j42114
$$ 1956886 2377928 2242657 2170771 2068935 1954588 1875443 1826724 1478452 1522860 1380746
2025A380746J16022k58437J38185p3028k62611M10540k4695p8000o4479k02540
$$ 1380746 1496768 1238331 1376516 1303488 1040877 1451417 1426722 1348722 1284243 1081703
2015A081703L83396j52008k60613L51006K76568L10845j91093j75262O6250m10854
$$ 1081703 1465099 1313091 1052478 1403484 1680052 1990897 1799804 1624542 1690792 1279938
2005A279938J17855r8450N2360o4136J08948k03854m32427M35434O319k57559
$$ 1279938 1397793 1299343 1351703 1287567 1396515 1192661 760234 1195668 1201987 944428
1995I44428j87969k492K76492k8921k1729J88973O5170o2503k31931m11597k30480
$$ 944428 756459 753967 1030459 1001538 979809 1168782 1233952 1171449 939518 527921 297441
1984B97441J30878N05017M4558j84377j96188j22067J36840l229K35867J37819
$$ 297441 428319 933336 977894 793517 597329 475262 612102 608873 844740 982559
1974I82559l31006L0554q3833n7269K77799k66434K10889j24830K29037l5520
$$ 982559 651553 682107 598274 541005 818804 552370 763259 638429 867466 831946
1964H31946m41692J18470K95769J23696J94073n24879k93978J77651J50203j68596
$$ 831946 390254 508724 804493 928189 1122262 597383 303405 481056 631259 462663
1954D62663p831k02224J29544J10683J10636L92155k16279O5167k66368M503l6455
$$ 462663 454832 252608 382152 492835 603471 995626 779347 844514 578146 582649 546194
1943E46194q1297M28659m93914k30911K6939L70282j14140j61947J3022N2030
$$ 546194 464897 893556 399642 168731 195670 565952 451812 289865 302887 354917
1933C54917r1893M7209K48653j20387m04176j5982J25923M69131n04502L41378
$$ 354917 263024 310233 558886 438499 34323 18341 144264 613395 108893 450271
1923D50271J96396k02794j07863j03142J31760k75334O8398j01584n03884M30454
$$ 450271 646667 443873 336010 232868 364628 89294 157692 56108 -447776 -17322
1913a7322N91781l7482j12846j73822l59653P418M95033Q6383k2188j14856m38915
$$ -17322 574459 536977 424131 250309 -109344 -101926 393107 479490 457302 342446 -96469
1902i6469O6239J50261p1381j2770j60455K04458r3946L06057J57282k98624o429
$$ -96469 -30230 120031 48650 35880 -124575 79883 -14063 291994 449276 150652 144223
1891A44223L17554K19681n55766k80153K63408k03206j49161J44314j04480J66693
$$ 144223 461777 681458 125692 -154461 108947 -94259 -243420 -99106 -203586 -36893
1881c6893k3791k68418k78467K80036J406M08416M28865m0630k20246j45261J3317
$$ -36893 -60684 -329102 -607569 -327533 -326127 82289 511154 470524 250278 105017 118334
1870A18334J002l4446k73220J38278l06672J57128m06122M22723J44184j23520
$$ 118334 119336 84890 -188330 -50052 -356724 -199596 -605718 -182995 -38811 -162331
1860a62331K06868r1728R7966L69001k41793m4759O35289q5082m03333o2270L94226
$$ -162331 44537 -47191 50775 419776 177983 133224 768513 683431 280098 217828 612054
1849F12054L62603J48341k44419m89429M6046m00432J06331O61606P8346m721
$$ 612054 974657 1122998 878579 389150 435196 34764 141095 802701 881047 876326
1839H76326m4156k05035j96522j87156K74826m31353J23753L326K71595j21015
$$ 876326 832170 627135 430613 243457 518283 86930 210683 214009 485604 364589
1829C64589n0801k80870P7598M6845K56899m40120J38044J26927j0786K92477
$$ 364589 313788 32918 110516 157361 414260 -25860 112184 239111 228325 520802
1819E20802l31437J90886j54468j8053Q3704R0555J4028n2710j83451M5253K4934
$$ 520802 189365 380251 225783 207730 291434 381989 396017 343307 159856 205109 230043
1808B30043j8582j5567J72093J0973o9593J75301M3970n34576K619l93493K82892
$$ 230043 211461 195894 367987 378960 309367 484668 528638 -5938 -3319 -396812 -113920
1797a13920L43107J70712l76125K67016M7875j24325J50974k38367j38433q5715
$$ -113920 229187 399899 23774 290790 338665 214340 365314 126947 -11486 -97201
1787i7201Q3208k53635N80694q4666l28466K6340j96058K29919n1037N28264m4925
$$ -97201 -13993 -267628 313066 228400 -100066 -73726 -269784 -39865 -90902 437362 392437
1776C92437l48176N1059j30633Q3318l9667j68881K27278K82119j17423m87222
$$ 392437 44261 95320 -35313 48005 8338 -160543 66735 348854 231431 -255791
1766b55791R0128O29981m14769l59535K68930L0078l9169j74616J05892L13475
$$ -255791 -165663 464318 49549 -309986 -41056 -10978 -50147 -224763 -118871 194604
1756A94604J74292p4748L91036j22795r7053j81871m53236j62807k46321R791
$$ 194604 368896 294148 685184 562389 465336 283465 -169771 -332578 -578899 -569108
1746e69108L11791j2153r8574Q5431K23301K84889p3507k65468K21964r8188l2810
$$ -569108 -257317 -269470 -368044 -282613 -59312 225577 152070 -113398 108566 10378 -22432
1735b2432K09076k93008R1818M0238o5304q942j19503o712J69703J56277j75903
$$ -22432 186644 -106364 -14546 25692 -39612 -48554 -168057 -174769 -5066 151211 -24692
1724b4692j75610K75904J03593l50211o43916K15244J86599J5619M8907j3513
$$ -24692 -200302 75602 179195 -171016 -814932 -599688 -413089 -397470 -348563 -362076
1714c62076P0598k04135J54093J64925J03850J17514j3689J25644R841O5376j54457
$$ -362076 -291478 -495613 -341520 -176595 -72745 44769 31080 156724 166565 231941 77484
1703G7484p2481j77123k36962K56554k12112J8150J82144K08472q9954r6435p2000
$$ 77484 5003 -172120 -409082 -152528 -364640 -346490 -164346 44126 -45828 -142263 -214263
1692b14263j3643M92585k33187M8057j4308J80733q009j64213J25533j02006j20725
$$ -214263 -227906 264679 31492 79549 65241 245974 237965 73752 199285 97279 -23446
1681b3446j26399K7722j76090R4340k8001L6062J15955l15816M61678M69492j5579
$$ -23446 -149845 -122123 -298213 -203873 -231874 -195812 -79857 -395673 66005 535497 519918
1670E19918j08319n98937j47387l73872k2902K44044M29989L10429J80264j42563
$$ 519918 411599 -187338 -334725 -708597 -731499 -487455 -57466 252963 433227 290664
1660B90664l22700j13320P9682j78617K74792k68201j69734k07309m1L64718J37368
$$ 290664 -32036 -145356 -65674 -244291 30501 -237700 -407434 -614743 -614784 -250066 -112698
1649a12698K40106n7248j17404q1746N183m8643k36339P8762L90256J99576k76279
$$ -112698 127408 70160 -47244 -128990 -123807 -172450 -408789 -330027 60229 259805 -16474
1638a6474k22188K30832l22947K28314J98599N400k84174j1320J39197K34850
$$ -16474 -238662 -7830 -330777 -102463 96136 101536 -182638 -193958 -54761 180089
1628A80089l75643K27778j27986k83046J97253k05237N5047j41036p6909L30800
$$ 180089 -195554 32224 -95762 -378808 -181555 -386792 -331745 -472781 -549690 -218890
1618b18890K30375M4365j76631J87279l858j93514j89607J68712L96692j83112
$$ -218890 11485 55850 -120781 66498 62640 -130874 -320481 -151769 244923 61811
1608F1811j60142j93962K46727J04963j53972l8405j21562q0529R1166K68807
$$ 61811 -98331 -292293 -45566 59397 -94575 -132980 -254542 -335071 -243905 24902
1598B4902j44848P7010p7734L95969K63746l14309m09709J63760K09864l66412
$$ 24902 -119946 -42936 -120670 275299 539045 224736 -184973 -21213 188651 -177761
1588a77761l85738N25383K25424k01191L1653R0360j18578k85178P2149L03501
$$ -177761 -563499 -38116 187308 -13883 17770 108130 -10448 -295626 -223477 80024
1578H0024r1381j71158j11938J95575K15866j12947j28119k43897L35872j01402
$$ 80024 -11357 -182515 -294453 -98878 116988 4041 -124078 -367975 -32103 -133505
1568a33505m74518n0958K90774L47817j39173n910k3205M04493k11562k19334
$$ -133505 -608023 -658981 -368207 -20390 -159563 -165473 -188678 215815 4253 -215081
1558b15081k73150O9413L22499K3921K56267J02199j16548J22398R5994j93071
$$ -215081 -488231 -418818 -96319 -72398 183869 286068 169520 291918 387912 194841
1548A94841m5077m22397L01342K2137J30312J608j54637k91452J13550J15611
$$ 194841 149764 -272633 28709 50846 181158 182766 28129 -263323 -149773 -34162
1538c4162K8965k67795K78004j21025K87710Q6619Q4058J94446l41772K63383
$$ -34162 -5197 -272992 5012 -116013 171697 258316 342374 536820 195048 458431
1528D58431L4145p00994K72143k90604j67179n8284N9628K20154O7758k22200
$$ 458431 492576 -208418 63725 -226879 -394058 -452342 -392714 -172560 -104802 -327002
1518c27002K59963k40492l35987L40032K09161J07837k55236J58522J60340k24111
$$ -327002 -67039 -307531 -643518 -303486 -94325 13512 -241724 -83202 77138 -146973
1508a46973j02972J58178J31621p8644J24692J02664k4061j06965q9586L76627
$$ -146973 -249945 -91767 39854 -38790 85902 188566 164505 57540 -32046 344581
1498C44581o16879o5354k55824J01207L10013M89685K02034k56311j53987Q7283
$$ 344581 -272298 -337652 -593476 -492269 -182256 307429 509463 253152 99165 186448
1488A86448p9885j8778m0622j508k19415r0558K26810k62135M80216l15300n3380
$$ 186448 106563 87785 47163 45655 -173760 -264318 -37508 -299643 180573 -134727 -188107
1477a88107L093k89535N66523j26145l6011R0500m61861p7792K61837j00786J55937
$$ -188107 -185014 -474549 91974 -34171 -70182 20318 -441543 -519335 -257498 -358284 -202347
1466b02347J84001o9348n60097L76424J49090k08864J18162k09638k4902j6787
$$ -202347 -18346 -87694 -647791 -271367 -122277 -331141 -212979 -422617 -447519 -464306
1456d64306P7451L26560J02522j89323M0543N677j60204j96182k67665J83318
$$ -464306 -386855 -60295 42227 -147096 -106553 -100876 -261080 -457262 -724927 -541609
1446e41609k2002K58369K21341J76682m8202J24052l1622l75340j62390K92825
$$ -541609 -563611 -305242 -83901 92781 44579 168631 137009 -238331 -400721 -107896
1436a07896K21004p0894K78413J80174j78988n45625P6293J15332o0652j9075
$$ -107896 113108 42214 320627 500801 321813 -223812 -147519 -32187 -92839 -111914
1426a11914J66755J97237P945k92108o9582l25423L72588j21022k07271M8373
$$ -111914 54841 252078 260023 -32085 -101667 -427090 -54502 -175524 -382795 -334422
1416c34422N09271j69250K09144j1768m13127j09176j57130K61983k06724L06002
$$ -334422 174849 5599 214743 202975 -210152 -319328 -476458 -214475 -421199 -115197
1406a15197k7791L20833K70203J38093k46206j71075J70556k35134j77647J94099
$$ -115197 -142988 177845 448048 586141 339935 168860 339416 104282 -73365 120734
1396A20734j15362q3494J14452K63983l30363j24244j44532m46347K57203J46361
$$ 120734 5372 -78122 36330 300313 -30050 -154294 -298826 -745173 -487970 -341609
1386c41609J94135J37414l53694K54422O6548n0591j46483M19195K51089l72250
$$ -341609 -147474 -10060 -363754 -109332 -42784 -93375 -239858 179337 430426 58176
1376E8176J86514r5331o26939J69347L24539p0624j05790J44269J04172l19172
$$ 58176 244690 149359 -477580 -308233 16306 -54318 -160108 -15839 88333 -230839
1366b30839j8346K145m4633j61018K50038K86744J26065k6739j10556m23426J9991
$$ -230839 -249185 -247040 -291673 -452691 -202653 84091 210156 183417 72861 -350565 -330574
1355c30574L102J6179M78507K416J6042J3451k55737J10169r3488r5351Q625J31393
$$ -330574 -327472 -311293 167214 169630 185672 199123 -56614 53555 -39933 -135284 -126659 4734
1343D734j41285M3569n4117J35334M05945l61460m67186o2411M65054K35009k11302
$$ 4734 -136551 -92982 -147099 -11765 394180 32720 -434466 -496877 -31823 203186 -8116
1332h116j4425P27J53901J49015k18544j0725J18004J33095K7322l3262q2658
$$ -8116 -22541 -21814 132087 281102 62558 51833 169837 302932 330254 296992 214334
1321B14334P0304k54652k35304J80746L08519R1457l6216Q9705k37705l12391
$$ 214334 284638 29986 -205318 -24572 283947 375404 339188 428893 191188 -121203
1311a21203J06842N2209r933l76340P2776P783l59642J22710M26848l4788l93575
$$ -121203 -14361 37848 27915 -348425 -275649 -267866 -627508 -504798 -77950 -112738 -506313
1300e06313O16523K32002j94839j67644J32559j27285l32107l01883q118r9604
$$ -506313 110210 342212 147373 -20271 112288 -14997 -347104 -648987 -657105 -756709
1290g56709K05525K83934J67367L62162j95004r4647n2467J9336j94253j38258
$$ -756709 -551184 -267250 -99883 262279 67275 -27372 -79839 -60503 -254756 -393014
1280c93014R5806J09259j40202Q4403K95437k66423K8888L33884j26755k80336
$$ -393014 -297208 -187949 -328151 -243748 51689 -214734 -185846 148038 21283 -259053
1270b59053K01284M1040K02944P5647k17826l52610J84934J78371n14109l33766
$$ -259053 -57769 -16729 186215 261862 44036 -308574 -123640 54731 -459378 -793144
1260g93144O08206J62482k11630j55441k14300J15749N79944L7358l58926J00964
$$ -793144 -184938 -22456 -234086 -389527 -603827 -488078 91866 129224 -229702 -128738
1250a28738k93284j43899N4212J48966J14396k27386N2087J88182m99316J34116
$$ -128738 -422022 -565921 -511709 -362743 -248347 -475733 -423646 -235464 -734780 -600664
1240f00664N17921J23439j08738q7146r4828L33940k44133j54755J84516j22318
$$ -600664 -82743 40696 -68042 -155188 -250016 83924 -160209 -314964 -130448 -252766
1230b52766L2567L13801M34380o33555k75307Q2796N3652j67417J15227N01569
$$ -252766 -220199 93602 527982 -105573 -380880 -298084 -244432 -411849 -296622 204947
1220B04947n30584q5856M89508j37906j00991M88207k61124K0898J27524J44180
$$ 204947 -325637 -411493 78015 -59891 -160882 327325 66201 87099 214623 358803
1210C58803O3190l19805m31852J77692O169j15862J41434N6456R506m0643k10405
$$ 358803 421993 102188 -329664 -151972 -145803 -261665 -120231 -63775 -54269 -94912 -305317
1199c05317K02832J32747K14694J22946j30796J89992k92741L19606l06171j84777
$$ -305317 -102485 30262 244956 367902 237106 427098 134357 453963 147792 -36985
1189c6985L30881j97520K61257k02938O5400k0551k94689J88743j38264J76553
$$ -36985 293896 96376 357633 154695 220095 199544 -95145 93598 -44666 131887
1179A31887j81177J51629K6633j63858M52822J18567k76455k16911K2852J52489
$$ 131887 -49290 102339 128972 -34886 417936 536503 260048 43137 65989 218478
1169B18478l71874p6129J22818m08283j68856M63979L91647N5223K54572p2749
$$ 218478 -153396 -229525 -106707 -514990 -683846 -219867 171780 227003 481575 408826
1159D08826k08817o01685m2319O32355J17803j97136N5506L9650L04124l1155
$$ 408826 200009 -401676 -443995 188360 306163 109027 164533 204183 508307 477152
1149D77152m09538j03494l89621n1405M94579p2414k2166l1720O6891j26613p0553
$$ 477152 67614 -35880 -425501 -476906 17673 -54741 -76907 -108627 -41736 -168349 -238902
1138b38902J3998m23411j0843M71822J78124k11099m6716L4454j08365r7629P1396
$$ -238902 -224904 -648315 -659158 -187336 -9212 -220311 -267027 -232573 -340938 -438567 -367171
1127c67171J71378P6789J05870K31206k4232l17029K7095J72911k79922M31012
$$ -367171 -195793 -119004 -13134 218072 193840 -123189 -96094 76817 -203105 227907
1117B27907k31290p6532j18807k45676L4001P5957n3770N2437J4195J47167j71581
$$ 227907 -3383 -79915 -198722 -444398 -410397 -334440 -388210 -335773 -321578 -174411 -345992
1106c45992P6100J0542K43331N9190p1985L4421k82364j55993j18531L88647P09881
$$ -345992 -269892 -259350 -16019 43171 -28814 5607 -276757 -432750 -551281 -162634 547247
1095E47247m08003m43405j4753p6329K14226J99908j09113k85091K22947l5147
$$ 547247 139244 -304161 -318914 -395243 -181017 18891 -90222 -375313 -152366 -187513
1085a87513l04279J45249K69554j91399M25328r2376k42867J97885K60827n490
$$ -187513 -491792 -346543 -76989 -268388 156940 64564 -178303 19582 280409 274919
1075B74919j70633l07026J53983L43123J27588m10991p7526k4499J73539k31078
$$ 274919 104286 -202740 -48757 294366 421954 10963 -66563 -91062 82477 -148601
1065a48601k00967J18822l51381N03254J03525j85847J21426J31737q3171J31950
$$ -148601 -349568 -230746 -582127 -78873 24652 -161195 -39769 91968 8797 140747
1055A40747k36080o406K22580J01338m42276l18015K98178L9793J52496M0033
$$ 140747 -95333 -101739 120841 222179 -220097 -538112 -239934 -200141 -47645 -7612
1045g612k35957K8603K27730J19445o3955K08551K92222k1214o18601J61558m2209
$$ -7612 -243569 -214966 12764 132209 68254 276805 569027 547813 -70788 90770 48561
1034D8561j31665k46563r9589M13780J2735p1781J09474Q990k77818m2258N34
$$ 48561 -83104 -329667 -429256 -15476 -2741 -74522 34952 43942 -233876 -276134 -275600
1023b75600j95149K71913J92446k37912K12940j49345J00881Q2660N63777k14479
$$ -275600 -470749 -198836 -6390 -244302 -31362 -180707 -79826 2834 566611 352132
1013C52132k14139j99298O3572P1130K43940o00863K17736J94449q7350j45556
$$ 352132 137993 -61305 2267 73397 317337 -283526 -65790 128659 41309 -104247
1003a04247j47905K00638j73037l5373J03524k30131O6369Q5386M9887N7611l85547
$$ -104247 -252152 -51514 -224551 -259924 -156400 -386531 -320162 -234776 -184889 -127278 -512825
992e12825j6245k44660M61377M44555l49962r7000l13775K66705N70590m68789
$$ -512825 -529070 -773730 -312353 132202 -217760 -314760 -628535 -361830 208760 -260029
982b60029J00101J49919J69331q0812j43563k86508L7607J91501N6584l14275
$$ -260029 -159928 -10009 159322 78510 -65053 -351561 -313954 -122453 -65869 -380144
972c80144J82345K65486n518J59668j98712j09128j37587M00025K06458r4053
$$ -380144 -197799 67687 62169 221837 23125 -86003 -223590 176435 382893 288840
962B88840l63444J17706J86833k9301o4099J96162O2133k29815j26753k13185
$$ 288840 -74604 43102 229935 200634 136535 332697 394830 165015 38262 -174923
952a74923k86024J29559L94799l86810l33086L30679J02389l47807P00894K30583
$$ -174923 -460947 -331388 63411 -323399 -656485 -325806 -223417 -571224 129670 360253
942C60253j75225j11539l80656P0876N5992k2474L11966K9471m1209k06674k5573
$$ 360253 185028 73489 -307167 -236291 -180299 -202773 109193 138664 97455 -109219 -134792
931a34792R0320J90483k47022J90486k21827K90429q9014M0548J97660n81586
$$ -134792 -44472 146011 -101011 89475 -132352 158077 69063 109611 307271 -274315
921b74315J50438J8842k6206K07196O5730m0458N5637J06064M7593o316Q198J12579
$$ -274315 -123877 -105035 -131241 75955 141685 101227 156864 262928 310521 304205 312403 424982
909D24982p1118n39720j99527J55342j01710J36351K57848M1036k62695p8531
$$ 424982 353864 -185856 -385383 -230041 -331751 -195400 62448 103484 -159211 -237742
899b37742P163M71631j5832l10822j55156K26460k4868o9666J23608l93911o2721
$$ -237742 -230579 241052 225220 -85602 -240758 -14298 -39166 -108832 14776 -379135 -441856
888d41856J63340K30480L3258m5583K6072q7403Q1570K98510q5622L4001l61305
$$ -441856 -278516 -48036 -14778 -60361 -34289 -121692 -40122 258388 172766 206767 -154538
877a54538n49030P890K33376J96737J46070k69372J7387r2192J61346L0534k86443
$$ -154538 -703568 -695678 -462302 -265565 -119495 -388867 -371480 -463672 -302326 -271792 -558235
866e58235J01157J27153j34312j58444k48092K82132M56230j57393Q1359M65244
$$ -558235 -457078 -329925 -464237 -622681 -870773 -588641 -132411 -289804 -208445 256799
856B56799k51939k41807K54447K83248k35633k57275J19405o2381R0616J95789
$$ 256799 4860 -236947 17500 300748 65115 -192160 -72755 -135136 -44520 151269
846A51269k08534n25246j0566K57655j84248L21891K52971J1253j02371Q982K06548
$$ 151269 -57265 -582511 -593077 -335422 -519670 -197779 55192 66445 -35926 -26944 179604
835A79604L36939k49532k30937l05697k30733J91277n2915L11805J05952j06022
$$ 179604 516543 267011 36074 -269623 -500356 -309079 -361994 -50189 55763 -50259
825e0259J51938o02945L11580o5769j08473N58095l2246l53044j820K0391J36338
$$ -50259 101679 -501266 -189686 -255455 -363928 194167 161921 -191123 -192943 -172552 -36214
814c6214N5916j97308j41955J24484J28004L47888j03566l79155J88284K14925
$$ -36214 19702 -177606 -319561 -195077 -67073 280815 177249 -201906 -13622 201303
804B01303k7342j78230j57028J55597K58818k98956J7258M2734M42075j70646
$$ 201303 173961 -4269 -161297 -5700 253118 -45838 -28580 14154 456229 285583
794B85583l22960j30893K83368l98187J61K9012K69304O0251Q0955M43007j99806
$$ 285583 -37377 -168270 115098 -283089 -282928 -253916 15388 75639 156594 599601 399795
783C99795m60001l55042l182K23366N6685M7761L85461l23046K0900r7717j3177
$$ 399795 -60206 -415248 -418430 -195064 -138379 -90618 294843 -28203 -7303 -105020 -118197
772a18197n9926j16371J28717N4087J19404L46795R5648m23393K16748l90971
$$ -118197 -178123 -294494 -165777 -111690 7714 354509 450157 26764 243512 -147459
762a47459J55450k79912r1062L91828K07347L11649r8144k81514l5207L8310j919
$$ -147459 7991 -271921 -362983 28845 236192 547841 449697 168183 132976 171286 169367
751A69367M7003l95547Q1883M4608j31899K58945j8668m55080J14226K7847N7950
$$ 169367 216370 -179177 -97294 -52686 -184585 74360 55692 -399388 -285162 -257315 -199365
740a99365O1285Q8553k75297L314K84478j51372L47464K14098l70765K0388j39959
$$ -199365 -138080 -49527 -324824 -321510 -37032 -188404 159060 373158 2393 22781 -117178
729a17178L58592J72282k16007N249k9681O1794l2691J14489m93751p6443j00134
$$ -117178 241414 413696 197689 202938 173257 235051 202360 316849 -176902 -253345 -353479
718c53479J64799J94150j06371l2384j04716J60629P6179J55348n3820J46755
$$ -353479 -188680 5470 -100901 -133285 -238001 -77372 -1193 154155 100335 247090
708B47090l66348j86928q6626J17059O33146J00284j76751j12537J23952m41825
$$ 247090 -119258 -306186 -392812 -275753 357393 457677 280926 168389 292341 -149484
698a49484K19565J70479l53798m42777J84961K74036n00124m0596O21240K73831
$$ -149484 70081 240560 -113238 -556015 -371054 -97018 -597142 -637738 -16498 257333
688B57333M3298k46764o1897J51496j36203k26097k03445j3093M08959J44675
$$ 257333 300631 53867 -8030 143466 7263 -218834 -422279 -435372 -26413 118262
678A18262p3299J09602P5752N3393j09581k99545L03398k95707k35133m9905J50415
$$ 118262 44963 154565 230317 283710 174129 -125416 177982 -117725 -352858 -402763 -252348
667b52348N96247l28485l05967n1640M941j44165K93146L63537j28505m9937K23516
$$ -252348 343899 15414 -290553 -342193 -337252 -481417 -188271 175266 46761 -3176 220340
656B20340j32375K57117J31674k63690J56718k03933n36304K00502J47473L8409
$$ 220340 87965 345082 476756 213066 369784 165851 -370453 -169951 -22478 15931
646A5931K60445l1562Q4622m95441j41436N83539M3936j55952J02673J10092j45082
$$ 15931 276376 244814 329436 -166005 -307441 276098 320034 164082 266755 376847 231765
635B31765J6153n99041j88900L96990P7712j5476J68954Q0302j41406k2473L08061
$$ 231765 247918 -351123 -540023 -143033 -65321 -80797 88157 168459 27053 4580 312641
624C12641K30908L00156M9094j35094l98161o9828L55895j38444N1866J54034
$$ 312641 543549 843705 892799 757705 359544 289716 645611 507167 559033 713067
614G13067n17371k52446j45376K95758j456L9442K76473J52571l44996P0075Q1958
$$ 713067 195696 -56750 -202126 93632 92176 131618 408091 560662 215666 285741 367699
603C67699j16044L13391j94552M448J71685m27085j72127L8379M35772r1199k81654
$$ 367699 251655 565046 370494 374942 546627 119542 -52585 -14206 421566 330367 48713
592D8713K68097l01264O8852J39781J17048J31589l66297j83753J00026L12713
$$ 48713 316810 15546 84398 224179 341227 472816 106519 -77234 22792 335505
582C35505j38611j83300J91019m253J25810n9189j90542r408p8916Q8037J42087
$$ 335505 196894 13594 204613 200360 326170 266981 76439 67031 -11885 76152 218239
571B18239j89582n1135L23262L19702j12926j52380o342k19609o3956J05103p2165
$$ 218239 28657 -22478 300784 620486 507560 355180 348838 129229 65273 170376 98211
560I8211R3642j96490l45744J79209L03991r5109N3113O5873J44736r2804L62864
$$ 98211 191853 -4637 -350381 -171172 132819 37710 90823 156696 301432 208628 571492
549E71492Q4908o79656j78458K83143j89830N0837q7268Q3843M2309J1086L16456
$$ 571492 656400 -23256 -201714 81429 -108401 -57564 -144832 -60989 -18680 -7594 308862
538C08862m5568l2152M97837m93463P1187j78509m44671k61555O07456N33078
$$ 308862 263294 231142 728979 235516 306703 128194 -316477 -578032 29424 562502
528E62502j85700J62819K82927l02199l05369j07585K63012J18352m84500j05064
$$ 562502 376802 539621 822548 520349 214980 107395 370407 488759 4259 -100805
518a00805K18332M43508n2048l51532r8747J61700J35788m56926J84373l24425
$$ -100805 117527 561035 508987 157455 58708 220408 356196 -100730 83643 -240782
508b40782M3924N73274j60128P2795J92339q7258l29169K27130m66636O18528
$$ -240782 -196858 376416 216288 289083 481422 394164 64995 292125 -174511 444017
498D44017P7626j36571k54004N0574k10190Q5913J34431J72355j69433j60075
$$ 444017 521643 385072 131068 181642 -28548 57365 191796 364151 194718 34643
488C4643K60373k25539k52124l1168K3033N91151O2734m01649K37244M7411j38923
$$ 34643 295016 69477 -182647 -213815 -190782 400369 463103 61454 298698 346109 207186
477B07186R2416p8832j97794j66246L9794o0050O7708J27737m70075k2557J41545
$$ 207186 299602 220770 22976 -143270 -103476 -163526 -95818 31919 -438156 -460713 -319168
466c19168J12366j84724p0070j6684L04536m8714K59877l00828k62060J65880
$$ -319168 -206802 -391526 -461596 -478280 -173744 -222458 37419 -263409 -525469 -359589
456c59589M7850k21425P6544J58857L30324j8468L92459Q459j80700k1843j1496
$$ -359589 -311739 -533164 -456620 -297763 32561 14093 406552 415011 234311 212468 200972
445B00972m4718o9630K72662j09962K46360j7610l62085n20185r5683K62359N2766
$$ 200972 156254 86624 359286 249324 495684 478074 115989 -404196 -499879 -237520 -184754
434a84754J09213N51595m6637l45786K84989L0075j74613k75211j1701J52944
$$ -184754 -75541 476054 429417 83631 368620 398695 224082 -51129 -62830 90114
424I0114l91221N29778m587J26022J12482j58459O5722L01660m3909l20626k80278
$$ 90114 -301107 228671 224084 350106 462588 304129 369851 671511 627602 306976 26698
413B6698p0552j86088K19081k79126Q8112O9130k06357L17880K48915l71862j0560
$$ 26698 -43854 -229942 -10861 -289987 -201875 -132745 -339102 -21222 227693 -144169 -154729
402a54729J15368J60944J90892m52439j82778L35887J07926n975R6728m03438
$$ -154729 -39361 121583 312475 -139964 -322742 13145 121071 115096 211824 -191614
392a91614K50461j37393j56404P10526k0835j37356L1006j74358l06939P1667
$$ -191614 58847 -78546 -234950 475576 454741 317385 348391 174033 -132906 -61239
382f1239K52922j99745J6326L36323k56794N9248p9260o0121P04923j48549j20421
$$ -61239 191683 -8062 8264 344587 87793 147041 67781 7660 712583 564034 443613
371D43613k06230j49028l13460K6654M7889o3607l05641L50289J06231j2254J7184
$$ 443613 237383 88355 -225105 -198451 -150562 -214169 -519810 -169521 -63290 -75544 -58360
360e8360m28306J62319N79490k83332M49637j92631j70643N80634q9908k56102
$$ -58360 -486666 -324347 255143 -28189 421448 228817 58174 638808 548900 292798
350B92798K0310q418n38415J30213M44864m27785j58628J16862q3137L83222k27210
$$ 292798 313108 304690 -233725 -103512 341352 -86433 -245061 -128199 -211336 171886 -55324
339e5324j82829j7910J0105r443J34167J06977K7071J1859k59920k70023J40420
$$ -55324 -238153 -256063 -245958 -255401 -121234 -14257 12814 24673 -235247 -505270 -364850
328c64850J96900n4553L20710N8845l53652k1246J22013L40141m76657J82393
$$ -364850 -167950 -222503 98207 157052 -196600 -217846 -95833 244308 -232349 -49956
318d9956P0176j45805J62610p0731L13496J4832j2359l5926j98300j64893o1539
$$ -49956 20220 -125585 37025 -33706 279790 294622 282263 246337 48037 -116856 -178395
$$ [...]
##END NTUPLES=NMR SPECTRUM
##END=
