##TITLE=1H_CG-1175-3
 CDCl3
 8 sc, 
 31.8.2023
##JCAMPDX= 6.0         $$ Bruker NMR JCAMP-DX V2.0
##DATA TYPE= NMR SPECTRUM
##DATA CLASS= NTUPLES
##ORIGIN= UXNMR, Bruker Analytische Messtechnik GmbH
##OWNER= root
$$ XWIN-NMR		Version 3.5
$$ Thu Aug 31 14:06:51 2023 Russian Standard Time (UT+4h)  she@DPX200
##.OBSERVE FREQUENCY= 200.13135
##.OBSERVE NUCLEUS= ^1H
##.ACQUISITION MODE= SIMULTANEOUS
##.ACQUISITION SCHEME= undefined
##.AVERAGES= 8
##.DIGITISER RES= 18
##SPECTROMETER/DATA SYSTEM= spect
##.PULSE SEQUENCE= zg30
##.SOLVENT NAME= CDCl3
##.SHIFT REFERENCE= (INTERNAL, CDCl3, 0, 15.748)
##AUDIT TRAIL= $$ (NUMBER, WHEN, WHO, WHERE, WHAT)
$$ ##TITLE= Audit trail, XWIN-NMR		Version 3.5
$$ ##JCAMPDX= 5.01
$$ ##ORIGIN= Bruker BioSpin GmbH
$$ ##OWNER= she
$$ F:/spectra/data/she/nmr/H-F/1/pdata/1/auditp.txt
$$ ##AUDIT TRAIL=  $$ (NUMBER, WHEN, WHO, WHERE, WHAT)
(   1,<2023-08-31 14:05:49.09 +0400>,<she>,<DPX200>,
      <created by zg, POWCHK disabled, PULCHK disabled
       configuration hash MD5:
       00 E9 B6 7A A2 85 ED C7 34 08 36 98 17 FE 4E 26
       data hash MD5: 16K
       0A 20 6B 07 89 B7 0A 4A 11 0D CC EB EA 9E EA C7>)
(   2,<2023-08-31 14:05:51.96 +0400>,<she>,<DPX200>,
      <Start of raw data processing
       efp BC_mod = 2 LB = 0.24 FT_mod = 6 PKNL = 1 PHC0 = -21050.67 PHC1 = 15.85272 SI = 16K 
       data hash MD5: 16K
       AA 69 58 C2 4F 89 7C 24 72 FE F9 C0 0A 74 76 64>)
(   3,<2023-08-31 14:06:08.07 +0400>,<she>,<DPX200>,
      <pk PHC0 = 4.099537 PHC1 = -6 
       data hash MD5: 16K
       8D FE 7B 5B 3A 09 E3 64 31 D8 A1 9B 1D 5F FF 00>)
(   4,<2023-08-31 14:06:11.82 +0400>,<she>,<DPX200>,
      <abs ABSG = 5 
       data hash MD5: 16K
       BB 6C 7B 2F AF C9 D3 D7 A0 49 28 3A D1 90 D2 4B>)
$$ ##END=
$$ 
$$ hash MD5
$$ 73 E5 5A 42 6B AD 41 CC 71 06 CA 48 25 15 25 41
##$RELAX= 
##$RELAX= 
##$RELAX= 
##$RELAX= 
##$RELAX= 
##$RELAX= 
$$ Bruker specific parameters
$$ --------------------------
##$DU= <F:/spectra>
##$EXPNO= 1
##$NAME= <H-F>
##$PROCNO= 1
##$TYPE= <nmr>
##$USER= <she>
##$AMP= (0..31)
100 100 100 100 100 100 100 100 100 100 100 100 100 100 100 100 100 100 
100 100 100 100 100 100 100 100 100 100 100 100 100 100 
##$AQSEQ= 0
##$AQ_mod= 1
##$AUNM= <au_zg>
##$AUTOPOS= <>
##$BF1= 200.13
##$BF2= 200.13
##$BF3= 200.13
##$BF4= 200.13
##$BF5= 200.13
##$BF6= 200.13
##$BF7= 200.13
##$BF8= 200.13
##$BYTORDA= 1
##$CFDGTYP= 0
##$CFRGTYP= 5
##$CHEMSTR= <none>
##$CNST= (0..31)
1 1 145 1 1 1 1 1 1 1 1 1 1 1 1 1 1 1 1 1 1 1 1 1 1 1 1 1 1 1 1 1 
##$CPDPRG= <>
##$CPDPRG1= <>
##$CPDPRG2= <>
##$CPDPRG3= <>
##$CPDPRG4= <mlev>
##$CPDPRG5= <mlev>
##$CPDPRG6= <mlev>
##$CPDPRG7= <mlev>
##$CPDPRG8= <mlev>
##$CPDPRGB= <>
##$CPDPRGT= <>
##$D= (0..31)
0 1.2 0 0 0 0 0 0 0 0.06 0 0.03 0 0 0 0 0.0002 0 0 0 0 0 0 0 0 0 0 0 0 
0 0 0 
##$DATE= 1693476348
##$DBL= (0..7)
120 120 120 120 120 120 120 120 
##$DBP= (0..7)
150 150 150 150 150 150 150 150 
##$DBP07= 0
##$DBPNAM0= <>
##$DBPNAM1= <>
##$DBPNAM2= <>
##$DBPNAM3= <>
##$DBPNAM4= <>
##$DBPNAM5= <>
$$ [...]
##$SUBNAM3= <"">
##$SUBNAM4= <"">
##$SUBNAM5= <"">
##$SUBNAM6= <"">
##$SUBNAM7= <"">
##$SUBNAM8= <"">
##$SUBNAM9= <"">
##$SW= 18.05172834244
##$SWIBOX= (0..15)
0 0 2 0 0 0 0 0 0 0 0 0 0 0 0 0 
##$SW_h= 3612.71676300578
##$TD= 16384
##$TD0= 1
##$TE= 0
##$TE2= 300
##$TE3= 300
##$TEG= 300
##$TL= (0..7)
0 120 120 120 120 120 120 120 
##$TP= (0..7)
150 150 150 150 150 150 150 150 
##$TP07= 0
##$TPNAME0= <>
##$TPNAME1= <>
##$TPNAME2= <>
##$TPNAME3= <>
##$TPNAME4= <>
##$TPNAME5= <>
##$TPNAME6= <>
##$TPNAME7= <>
##$TPOAL= (0..7)
0.5 0.5 0.5 0.5 0.5 0.5 0.5 0.5 
##$TPOFFS= (0..7)
0 0 0 0 0 0 0 0 
##$TUNHIN= 0
##$TUNHOUT= 0
##$TUNXOUT= 0
##$USERA1= <user>
##$USERA2= <user>
##$USERA3= <user>
##$USERA4= <user>
##$USERA5= <user>
##$V9= 5
##$VALIST= <valist>
##$VCLIST= <CCCCCCCCCCCCCCC>
##$VD= 0
##$VDLIST= <DDDDDDDDDDDDDDD>
##$VPLIST= <PPPPPPPPPPPPPPP>
##$VTLIST= <TTTTTTTTTTTTTTT>
##$WBST= 1024
##$WBSW= 4
##$XGAIN= (0..3)
0 0 0 0 
##$XL= 0
##$YL= 0
##$YMAX_a= 429836
##$YMIN_a= -473134
##$ZGOPTNS= <>
##$ZL1= 120
##$ZL2= 120
##$ZL3= 120
##$ZL4= 120
##$ABSF1= 15.73036
##$ABSF2= -2.321489
##$ABSG= 5
##$ABSL= 3
##$ALPHA= 0
##$AQORDER= 0
##$ASSFAC= 0
##$ASSFACI= 0
##$ASSFACX= 0
##$ASSWID= 0
##$AUNMP= <proc_1d>
##$AZFE= 0.1
##$AZFW= 0.1
##$BCFW= 0
##$BC_mod= 2
##$BYTORDP= 0
##$COROFFS= 0
##$CY= -3
##$DATMOD= 1
##$DC= 0
##$DFILT= <>
##$DTYPP= 0
##$F1P= 0
##$F2P= 0
##$FCOR= 1
##$FTSIZE= 16384
##$FT_mod= 6
##$GAMMA= 0
##$GB= 0
##$INTBC= 1
##$INTSCL= 3.70164e-10
##$ISEN= 128
##$LB= 0.24
##$LEV0= 0
##$LPBIN= 0
##$MAXI= 10000
##$MC2= 0
##$MEAN= 0
##$ME_mod= 0
##$MI= 1.114404
##$NCOEF= 0
##$NC_proc= -7
##$NLEV= 6
##$NOISF1= 3.799351
##$NOISF2= 2.8
##$NSP= 0
##$NTH_PI= 0
##$NZP= 0
##$OFFSET= 15.74799
##$PC= 1
##$PHC0= -21046.57
##$PHC1= 9.85272
##$PH_mod= 1
##$PKNL= yes
##$PPARMOD= 0
##$PSCAL= 0
##$PSIGN= 0
##$REVERSE= no
##$SF= 200.130004713062
##$SI= 16384
##$SIGF1= 3
##$SIGF2= 2
##$SINO= 5.538805
##$SIOLD= 16384
##$SREGLST= <1H.CDCl3>
##$SSB= 0
##$STSI= 16384
##$STSR= 0
##$SW_p= 3612.71676300578
##$SYMM= 0
##$S_DEV= 0
##$TDeff= 16384
##$TDoff= 0
##$TI= <>
##$TILT= no
##$TM1= 0
##$TM2= 0
##$TOPLEV= 0
##$USERP1= <user>
##$USERP2= <user>
##$USERP3= <user>
##$USERP4= <user>
##$USERP5= <user>
##$WDW= 1
##$XDIM= 16384
##$YMAX_p= 417841084
##$YMIN_p= -1008477
$$ End of Bruker specific parameters
$$ ---------------------------------
##NTUPLES= NMR SPECTRUM
##VAR_NAME=  FREQUENCY,     SPECTRUM/REAL,   SPECTRUM/IMAG
##SYMBOL=    X,             R,               I
##VAR_TYPE=  INDEPENDENT,   DEPENDENT,       DEPENDENT
##VAR_FORM=  AFFN,          ASDF,            ASDF
##VAR_DIM=   16384,         16384,           16384
##UNITS=     HZ,            ARBITRARY UNITS, ARBITRARY UNITS
##FACTOR=    0.220516191357247, 1,           1
##FIRST=     3151.64524378455, 0,            0
##LAST=      -461.071519221235, 0,           0
##MIN=       -461.071519221235, -1008477,    0
##MAX=       3151.64524378455, 417841084,    0
$$ Real data points
##PAGE= N=1
##DATA TABLE= (X++(R..R)), XYDATA
$$ [...]
7863 -608755 -524623 -350638 -505327 -668717 -727640 -565926 -520907 -721198 -694101 -760305 -748971
7852 -748971 -596676 -744233 -778915 -500861 -555177 -546449 -491268 -707874 -448894 -560268 -728280
7841 -728280 -723481 -567838 -629309 -442512 -406657 -394381 -355543 -512056 -617586 -469129 -332580
7830 -332580 -573474 -613147 -657255 -888521 -830508 -828264 -512963 -501247 -491811 -617948 -505921
7819 -505921 -720325 -516195 -507165 -640845 -566750 -531948 -685997 -764743 -720302 -841127 -780541
7808 -780541 -473360 -381973 -881486 -591315 -607882 -634217 -592597 -635723 -699654 -872568 -675539
7797 -675539 -410871 -564125 -762110 -540708 -614189 -437656 -250090 -534091 -529819 -397573
7787 -397573 -477103 -583145 -653339 -741403 -760386 -795451 -737664 -548180 -658578 -611745 -759191
7776 -759191 -578954 -266082 -428051 -584391 -636661 -443062 -457975 -578004 -494184 -580299
7766 -580299 -528553 -510491 -616734 -608415 -469148 -402943 -306734 -241518 -473645 -555743 -513093
7755 -513093 -551014 -471084 -716941 -583568 -621386 -609176 -303077 -268427 -75807 -311354 -552704
7744 -552704 -699084 -543164 -507015 -404120 -484747 -496738 -589237 -735378 -641744 -555369 -619624
7733 -619624 -823562 -953120 -771889 -491595 -412211 -348459 -360100 -420886 -78503 -422754
7723 -422754 -443218 -347771 -456602 -572419 -808985 -605647 -585828 -355255 -266875 -470042
7713 -470042 -631110 -361242 -348913 -614297 -461076 -531363 -549548 -368863 -521697 -430429
7703 -430429 -409791 -677293 -640719 -654984 -430528 -323255 -430651 -258992 -465899 -565344
7693 -565344 -468753 -533117 -301304 -231104 -253183 -156048 -468709 -408317 -269863 -492341 -355942
7682 -355942 -258610 -332939 -279346 -110258 -167489 -123418 -159917 -293282 -47689 -269029 -223560
7671 -223560 -77120 -387479 -432793 -377894 -148220 -104946 -6776 295232 122633 -113159
7661 -113159 -314484 -487970 -228592 -237333 -31595 -70970 -294623 -330071 -132109 -145577 -152059
7650 -152059 -188199 -292823 148447 310558 196076 -194241 -199922 -184646 -371700 -135492
7640 -135492 -8351 56461 120716 188690 105837 22502 92174 362922 164605 119939 16453
7629 16453 -38880 157798 351328 348045 240193 471665 345001 203135 197269 352863 242974
7618 242974 422497 509995 725315 598561 490009 380119 196217 251340 417079 425932
7608 425932 290202 319336 295894 372100 271252 449893 274423 194449 590837 788145
7598 788145 789585 704799 592481 473302 506648 441533 734649 997339 1147203 1048546 809586
7587 809586 818271 938419 776558 866156 1092501 869729 1151890 1441856 1226270 1140494
7577 1140494 1173898 1032036 1229418 1334420 1382464 1338293 1321335 1403597 1475716 1440740 1593718
7566 1593718 1414601 1407809 1760238 1810282 1805148 1709776 2097499 1948555 1593609 1799661 1907431
7555 1907431 1732711 1813254 2036523 2253300 2382226 2435130 2648589 2534938 2734102 2930505
7545 2930505 2794204 3048344 3253166 3094653 3072806 3135378 3448434 3485833 3297483 3473575
7535 3473575 3498751 3843151 3824501 4275220 4273820 4142133 4235151 4376339 4792537 4953854
7525 4953854 5222594 5482065 5303971 5795030 5744139 5903690 6341261 6747266 7136038 7282940
7515 7282940 7385207 7580236 7937056 8370021 8602073 8776699 9095379 8990988 9010827 9138041
7505 9138041 9702061 9930289 10015191 9994476 10251007 10656401 10815046 10917961 11120862 11116801
7495 11116801 11048947 10997823 11101227 11123960 10980199 10912200 11162602 11201610 10756396 10576564
7485 10576564 10461434 10303439 10252025 10014869 10147515 10152349 9955553 9772223 9241596 8997633
7475 8997633 8939935 8658398 8430468 7979655 7967274 7492435 7271348 6742353 6574245 6267283
7465 6267283 6078816 6011418 5474740 5202759 5099047 5001450 5041357 4755071 4450798 3951498
7455 3951498 3736962 3842846 3723499 3525109 3516192 3232892 3000153 2795706 2659118 2740845
7445 2740845 2744155 2707176 2688437 2704181 2391811 2440729 2318062 2215794 2112068 2191629 2020693
7434 2020693 2001763 1933982 1778998 1625177 1586571 1347248 1417015 1598932 1610036 1515666 1326553
7423 1326553 1528414 1653484 1652013 1608786 1513634 1545081 1224087 1190665 1219742 1193820 1101660
7412 1101660 1220050 940515 907897 888251 873535 877024 1009589 893453 667041 682039 753977
7401 753977 837925 694235 490456 350497 237452 212592 322425 690984 472868 466465
7391 466465 554442 339370 348667 430899 612577 347455 280487 304043 335144 338858 372390
7380 372390 46718 40340 328803 196502 262935 174357 176055 271194 403257 206951 -64115
7369 -64115 -17215 -192941 161452 290083 30299 -8849 -9207 -302244 -47844 208513 -34151
7358 -34151 -159749 53174 -80083 -111664 -139465 -134860 -125880 116838 -4464 -17507 72536
7347 72536 -7174 -304825 -370347 -52678 70238 8906 -28122 55339 144250 -21637 85794
7336 85794 228614 -179128 -163722 -181487 -473374 -292789 -51603 -108386 -331618 -384572 -411479
7325 -411479 -368459 5985 -62236 -170368 -195075 -45781 -82329 -237418 -285844 60631 11509
7314 11509 6607 -43133 -138833 -335798 -245136 -285103 -316783 -144080 -41961 -286386 -366600
7303 -366600 -143457 -390237 -348790 -351970 -354865 -265074 -257910 -50772 -234392 -249413 -104060
7292 -104060 -391116 -523037 -285595 -102134 -150548 -138168 -76470 67288 84178 -24703
7282 -24703 -50515 -48842 -318462 -228594 38701 -213663 -405180 -293618 -172104 -26364 21376
7271 21376 -133950 76240 28434 -184361 -18417 132411 46607 -175614 -83837 -178677 74927
7260 74927 173894 38983 -49709 -75373 219639 249247 138886 44536 305406 324170 -38624
7249 -38624 150764 268370 158733 94730 127875 223592 305047 340607 472164 530122 342134
7238 342134 202252 265650 210910 104081 260664 358925 190622 420182 225472 167873
7228 167873 454473 446970 388440 173818 30946 92172 258522 224513 41597 197295 553610
7217 553610 418016 183364 358656 223294 -26908 40588 248324 123433 122150 1137
7207 1137 129188 314862 57089 -33984 10436 183607 402432 411951 184565 52758 -80059
7196 -80059 213034 203125 497113 699943 498665 351849 198951 547690 560161 556154 628842
7185 628842 741947 761836 646545 617728 619224 668869 726240 690729 758728 697071 574278
7174 574278 451121 383022 555941 705057 721505 380516 380836 423114 488130 300429 426508
7163 426508 275814 416589 499039 377808 268002 116620 215012 249378 226129 102743
7153 102743 53089 -86013 -112323 4325 28119 45850 256022 437145 311695 139988
7143 139988 143917 108339 162288 14120 359173 456642 194553 25654 120303 114935 -94502
7132 -94502 168167 171852 97531 57734 71449 203624 436828 220527 -120492 -289646 486
7121 486 226370 140025 -49927 -105304 197483 -89952 -42231 53813 142914 151572 139156 -101316
7109 -101316 -302029 -268886 -245950 -131827 -90041 -133678 35144 238836 53344 36823 99603
7098 99603 -48326 -137518 -64395 -89848 187545 8780 -17139 67921 -38608 -11812 74706
7087 74706 -49332 -92133 -243178 -139361 7108 97573 174181 66764 88928 44302 41911
7076 41911 33633 149969 34897 32200 -91217 97941 309075 377887 371794 234684 268192
7065 268192 54005 -175995 -181822 115044 484380 415616 314214 225364 292207 309047 208280
7054 208280 161972 59544 13546 61200 124893 285172 126697 220545 349876 -157363 -212305
7043 -212305 -144347 -309175 -280127 -285553 -391675 49211 188725 88149 202332 69983
7033 69983 292090 406383 424513 237236 44495 204725 32443 -24311 -115215 -116616 383897
7022 383897 159947 -48908 61730 248886 303122 262021 239563 328447 268126 74659 239617
7011 239617 237731 381923 502264 532927 450707 579552 608866 297040 345762 481433 435294
7000 435294 481467 514643 532626 506966 514214 318814 361398 473988 636623 613962 689599
6989 689599 948316 780238 775302 1005583 885452 690617 691942 905633 758160 697081 635813
6978 635813 601852 842282 778346 1105704 1151614 936122 888129 1094902 971053 897852 856707
6967 856707 725240 818603 834206 919197 888870 825495 810388 778587 854693 879655 962134
6956 962134 731627 366233 522066 919151 741277 635144 643555 485504 482694 820906
6946 820906 1047434 856506 709001 515876 474682 545840 516561 459325 397283 519703 388012
6935 388012 381613 352485 84692 280158 255612 293710 562493 626226 788405 723350 369925
6924 369925 224170 423381 592944 615369 554591 585251 609355 552530 580946 394685 585201
6913 585201 648116 572957 557435 809795 951178 721251 528804 703598 853729 837801
6903 837801 930935 1040021 998728 1067482 1218603 1330860 1500534 1656173 1624795 1318207
6893 1318207 1559707 1716744 1603378 1873462 2233657 2051303 1961154 2051744 1941293 1759781
6883 1759781 1902924 1944356 1847801 1859809 1818430 1805245 1882771 2110000 1957447 1904866 1703259
6872 1703259 1555220 1614250 1527264 1291857 1102308 1171952 1376798 990451 1046841 1233978
6862 1233978 1163402 921749 892193 1002440 1036268 997166 837668 705290 629380 496344
6852 496344 629738 753446 634773 798593 645910 617242 688658 852129 536116 509751
6842 509751 625774 571153 249475 377770 503981 550621 455641 163505 339524 267514
6832 267514 236500 397873 530513 508666 432938 531546 625451 615061 522230 658219 755069
6821 755069 497006 475973 496950 625084 612844 634523 411647 532431 654884 696918 770250
6810 770250 664254 627530 471891 279159 587468 598196 387126 389668 271748 363521 53307
6799 53307 38018 -33704 -22358 208091 -122519 -92628 136704 44626 -82917 -255264 44416
6788 44416 52610 41205 -89711 -211680 -61367 239854 83642 -40377 -101785 -439577 -388261
6777 -388261 -155124 -208849 -25161 32062 -279303 -256832 -534271 -535488 -342174 -368856 -397610
6766 -397610 -378635 -142154 -195120 -172723 -296765 -267161 -99875 -385168 -331677 -394268 -286040
6755 -286040 -12491 -44491 -177776 -14972 -171866 -157215 -228406 -204330 -106606 -266152 -145925
6744 -145925 -242025 -283295 -238171 -251018 -597585 -515885 -248777 -229177 -207007 -362278 -602129
6733 -602129 -465029 -610624 -454453 -257534 -292463 -240983 -78081 -122889 -215231 -603626
6723 -603626 -650052 -412972 -448969 -360070 -336698 -585353 -457931 -219078 -443448 -362695 -581213
6712 -581213 -424145 -327894 -337253 -514391 -383032 -151796 -193246 -491719 -528702 -510266 -387436
6701 -387436 -551491 -488675 -604915 -534058 -343364 -91543 105092 145398 -163917 -305715
6691 -305715 -16257 -369122 -462560 -505243 -625270 -374853 -460635 -481421 -341691 -334854 -379412
6680 -379412 -390419 -341110 -562269 -369768 -340925 -484154 -643414 -612029 -534027 -389917 -621432
6669 -621432 -340894 -336085 -572941 -564600 -542884 -490229 -473532 -598786 -413602 -386163 -106364
6658 -106364 10014 -116293 -198169 -259612 -391626 -393798 -336079 -265556 -146570 -202661 -91778
6647 -91778 -267852 -301129 -340622 -292205 -243032 -249715 -288776 -318571 -472928 -553400 -752835
6636 -752835 -494036 -431039 -361071 -415838 -434851 -370145 -206538 -190802 -173392 -151722 -368666
6625 -368666 -308262 -186519 -255969 -61783 141693 -47196 47553 -160836 -298620 -123092
6615 -123092 -135981 -34636 -218812 -137347 -72819 -256465 -372802 -675070 -605107 -412106
6605 -412106 -549925 -410806 -419344 -389396 -350669 -406953 -169859 -309430 -157975 -32235 -209869
6594 -209869 -121402 3346 -263266 -227705 -244998 -441925 -392520 -192958 -80997 2921 23538
6583 23538 63349 137151 -103454 49180 153582 -270331 -327124 -88029 -174583 29477 90711
6572 90711 -121936 -200350 -368581 -230741 -119045 55333 -59276 -261044 -191436 -105890
6562 -105890 -216045 -183857 -434550 -375846 -225853 -259251 -225191 -67150 -269765 -335988 -1581
6551 -1581 -16281 -84083 110854 150734 91866 320076 137611 -49988 -149333 -50116 149374
6540 149374 168130 -29919 -166334 66635 -42757 -135471 55820 -95875 9691 -39399
6530 -39399 38775 62748 77134 147196 209478 112976 99052 232837 175724 293341 417356
6519 417356 351568 348519 222981 53296 247409 297537 512743 575955 272197 105999 231683
6508 231683 492807 644127 552533 461041 255364 319097 510257 305890 279784 559269
6498 559269 446489 319016 420847 357484 55081 229276 514454 335528 226112 322846
6488 322846 308557 101053 291956 296540 251476 374576 567477 571939 664090 933216 711244
6477 711244 698496 850914 763881 554011 518032 739206 660569 832075 735081 632601 812878
6466 812878 511110 620391 644801 866647 1010430 868744 1124734 1133691 1108617 947210
6456 947210 692669 679230 791812 754232 770412 831021 798014 660386 836174 959094 868623
6445 868623 1022647 1133739 979292 1091436 1197093 1009006 1036325 1155458 1267001 1304501
6435 1304501 1318971 1081839 1029851 924096 1015407 918922 1084829 973080 938887 1078465
6425 1078465 1196639 1213147 1126866 1309761 1267909 1172486 1316321 1406238 1382584 1342717 1251055
6414 1251055 1373527 1217320 1240250 1193226 1170746 1288111 1441742 1340721 1408196 1263598
6404 1263598 1102661 1232785 1260423 1534774 1526011 1468891 1620159 1520531 1738964 1518984
6394 1518984 1522616 1449009 1365998 1347981 1346165 1309146 1234099 1365883 1565616 1407135 1568352
6383 1568352 1598510 1641631 1564600 1578835 1726698 1708938 1506898 1443573 1264990 974369 1255182
6372 1255182 1324183 1327570 1165553 1306618 1475826 1441508 1408730 1170602 1204477 1393057 1274085
6361 1274085 1223155 1388664 1618697 1467111 1526640 1586282 1430278 1346812 1112148 1202441
6351 1202441 1174126 1100566 1182295 1151580 1277221 1111822 1102903 1049521 1334376 1195173 1169447
6340 1169447 1208074 1256460 1103642 918108 781302 1000505 1007219 980693 945084 988671 1221747
6329 1221747 1101356 1001641 747005 509976 528954 647493 862247 1079228 774578 754437
6319 754437 922167 892820 830143 798275 951835 969840 792714 578553 504400 623142 572788
6308 572788 546685 676401 841345 667470 648284 675489 661257 801278 708086 830153 802664
6297 802664 603174 357015 491286 542919 717581 727551 540161 710604 745710 519117
6287 519117 684345 530028 570444 765296 706319 905770 908921 677688 614677 893733 998339
6276 998339 744734 462688 538019 534531 501680 435410 383028 419562 420543 477007 546944 298787
6264 298787 468297 503721 223305 410878 551948 427252 421542 380683 304484 382232 402629
6253 402629 306710 286814 328314 168246 28475 91590 46538 -100924 -81165 148125 124636
6242 124636 185318 158664 222032 165655 229742 271908 221200 281444 283115 256549 321383 285374
6230 285374 429368 281025 352092 443405 234691 74989 312867 297437 101061 105470 508
6219 508 -35008 31313 -4291 151362 111128 113980 -25091 -203189 -196465 -189807 258362 362371
6207 362371 62121 -58384 -95177 -255304 -115483 27892 -130476 -167476 -110497 -83754
6197 -83754 -20737 32419 98214 -56531 -155518 -18268 -30931 -233170 -358199 -404423 42227
6186 42227 2004 -19145 155764 -9554 -260297 -144672 -48951 289670 334673 117731 -21826
6175 -21826 -15668 -26534 -106350 -207936 -179576 -221453 -56504 -31724 -219255 -307084 -254824
6164 -254824 -138845 -127188 50622 -54770 36598 -78584 -140269 89371 130742 90179 -118767
6153 -118767 -354438 -183506 -295530 -139756 127570 165323 -117968 -14238 -37897 -98775
6143 -98775 -74297 -76933 -92187 24098 -156282 -225153 -253001 -257168 -27465 -85291 -83604 -46558
6131 -46558 -258472 -80126 -28292 -354090 -207113 -294878 -341427 -214056 -378365 -397578 -158290
6120 -158290 -376137 -445192 -576345 -422881 -156547 -91010 -123283 -218641 -276083 -88028 -1455
6109 -1455 -38953 -100367 -62566 -47462 -195458 -471007 -263623 -217394 -217378 -253929 -217643 -555638
6097 -555638 -397690 -380886 -348569 -173277 -183717 -106431 -277584 -135782 -326580 -345820 -445041
6086 -445041 -703020 -584193 -281041 -237119 -349853 -157141 -427077 -318309 92801 -44304
6076 -44304 -288653 -382584 -227154 -359578 -341138 -50322 -286826 -337858 -224626 -488999
6066 -488999 -731975 -552820 -299161 -325211 -377028 -305696 -427269 -379445 -358378 -398569 -330527
6055 -330527 -450936 -445522 -331773 11886 -119613 -372110 -242557 -188907 -377523 -594703
6045 -594703 -304550 76316 -56213 67282 -231776 -372979 -234146 -195328 -460306 -525044
6035 -525044 -357757 -324169 -333756 -195569 -271266 -269286 -173076 -451277 -496181 -587986 -358705
6024 -358705 -197304 -320962 -341356 -285870 -291403 -225959 -390423 -478509 -336879 -542403 -417815
6013 -417815 -483077 -353246 -330242 -610760 -552327 -421026 -430002 -14429 -112395 -163601 -54785
6002 -54785 -245950 -340806 -369035 -268914 -241650 -134242 -57125 -301226 -132572 -67135 -152904
5991 -152904 -155955 -215301 -253807 -389090 -279291 -145854 -104708 -113553 -347896 -493448 -114245
5980 -114245 -259510 -365264 -140230 -237980 -176194 -175577 -184870 -2362 -76414 -263198 -426336
5969 -426336 -279211 -81367 -194744 -8195 -30559 77221 64320 -131696 -213578 -22039
5959 -22039 144016 -68336 -353552 -369246 -330473 -327934 -372735 -53071 122926 -171066 -231791
5948 -231791 -292187 -111499 -357571 -426094 -245846 -307044 -381448 -229630 -288264 -202562 -76209
5937 -76209 -158933 -134636 -48473 -168367 -300223 -382944 -150430 -157171 -66660 -109917 -253830
5926 -253830 -154067 -163238 -63994 43162 84247 125221 29411 97490 -53654 -104331 -104211 -70389
5914 -70389 -75892 -132542 -158504 -165658 -62605 -6801 -75951 80877 92519 44344 -21309 -273900
5902 -273900 -101976 -191633 -330030 -265277 -97217 -230065 -152008 -61837 -203151 -375376
5892 -375376 -393557 -485316 -454830 -605808 -466402 -359843 -477900 -449503 -164141 -172592 -293314
5881 -293314 -317451 -290290 23377 -65566 -206914 -105281 29176 -363037 -136528 -132341 -212916
5870 -212916 -328242 -427211 -548472 -401098 -291642 -323348 -249945 -239138 -96292 -62621 -248091
5859 -248091 -391469 -378229 -226765 -219287 -247765 -226378 -38765 -76959 -261719 -332366 -117032
5848 -117032 -193133 -199296 -141885 -207094 -311360 -128943 -182714 -256043 -321243 -269438 -108070
5837 -108070 -175510 -197645 -34961 25024 -109638 -112300 -132737 -32518 -183510 -196711 -284351
5826 -284351 -191390 -458831 -279732 -98021 -122626 -98929 -105721 -87388 -50223 -36210 149611
5815 149611 102057 299731 -99973 16561 168387 217067 531265 317495 168299 117428
5805 117428 17739 32655 63724 246846 296021 357639 19708 23146 297855 319843 384574
5794 384574 562638 566975 689351 842752 607368 353904 405785 85274 261841 468198
5784 468198 249161 129811 157943 351468 376917 502728 519049 369670 329928 131016
5774 131016 252137 166310 86201 53416 -129284 -30877 -199611 124540 295727 180024
5764 180024 -49823 126444 260166 103785 166245 174615 -146523 44631 90086 133874 -93753
5753 -93753 -128170 -93361 -135585 -94744 -204309 -180409 -137302 -34053 154269 50677 12573
5742 12573 6123 -43886 -203300 -119030 -103641 -162065 125295 138805 -18364 -28232 -108277 -156346
5730 -156346 33842 -119060 25205 94729 -110579 -58717 -69484 4532 -26786 -6101 61592
5719 61592 48141 45559 -83386 -160758 -285059 -327642 -76624 -163972 -239923 -83400 127666
5708 127666 90178 -61544 -110802 46097 -213833 -24179 65852 255966 203935 -102976
5698 -102976 140445 35592 45673 -13237 54943 -133478 -570265 -307959 29851 167524
5688 167524 2934 27894 119033 39502 -140458 21429 54748 185861 251446 64354 201298
5677 201298 185026 211883 131269 15815 -42713 102807 315086 272843 74042 -63540 -144336
5666 -144336 -82445 -138272 -43639 110879 -1759 7758 232809 504239 300620 323795 352552
5655 352552 216542 318444 365598 179809 133682 241215 287966 97460 -107159 76265
5645 76265 161588 445159 367302 379014 120916 140873 94433 392341 408802 352648 220843
5634 220843 127302 64479 49750 35505 58870 -68966 202993 198717 270633 398000 179564
5623 179564 283670 266608 230958 377953 252547 307545 13545 -9202 139196 149660 369347
5612 369347 166438 348939 256509 235247 220088 410651 444812 266057 413439 446197 423902
5601 423902 260530 117136 336450 479870 432849 134189 -12459 -4410 75145 103872 179169
5590 179169 173638 467323 345426 544349 471268 246126 447431 827072 940114 738967
5580 738967 264849 214099 356520 627096 725949 617675 720204 815428 748254 812675 877565
5569 877565 971242 989301 835236 576996 539692 766825 855200 807563 859375 866128 1166924
5558 1166924 1098752 776494 614410 666035 784377 780005 1024207 905434 1040472 847772
5548 847772 900029 932522 1072933 1370214 1702908 1975475 2076126 2012045 2267776 2308709
5538 2308709 2180610 2353267 2377259 2217718 2310834 2167767 1958350 1876975 1784567 1845216
5528 1845216 1715684 1638514 1863204 1614921 1684362 1714003 1993739 1970644 1751281 1636975
5518 1636975 1669549 1903843 1656021 1898406 1664169 1569743 1905035 2138630 2142384 1876697
5508 1876697 1633099 1675323 1866421 1963459 1898864 1796997 1700635 1757502 1879374 2034748
5498 2034748 2131709 2275587 2178540 1989685 2172391 2285994 2357967 2559344 2800903 2999718
5488 2999718 2802385 2766202 2823602 2528184 2192806 2287481 2212417 2253222 2381079 2634171
5478 2634171 2581516 2247394 2217328 2306285 2376909 2323295 2072950 1801483 1720878 1533540 1585073
5467 1585073 1731998 1654996 1735092 1669251 1596755 1774504 1617730 1834119 1799931 1731693 1648825
5456 1648825 1622231 1449911 1378555 1537233 1321357 1066220 1096073 1126857 1140611 1245703
5446 1245703 1200539 981364 1121473 1210045 1231110 1177449 1185680 1266045 1147932 1109635 1138776
5435 1138776 1344097 1385997 1449346 1402877 1605650 1530788 1392888 1417984 1419198 1501719 1585847
5424 1585847 1544473 1631662 2040329 2090430 2064853 2109956 1980029 1833334 1781826 1995026 2038653
5413 2038653 1963104 2128688 1775318 1783136 1946857 2007157 1755763 1524291 1598880 1761907
5403 1761907 1794246 1883803 1709881 1558196 1619854 1359849 1320388 1236337 1269596 1394245 1524425
5392 1524425 1345958 1280717 1332844 1246565 1101242 1072882 797028 842329 988372 1087455 1072498
5381 1072498 1134624 1100086 1234339 1306774 1186354 874345 1189187 1089172 756266 989987
5371 989987 1043286 994025 1195711 1369910 1275373 1192895 1207672 1237161 1197660 1176399 938509
5360 938509 648082 791813 993715 780102 892397 912444 873386 1050895 1072563 1010425
5350 1010425 815572 1031768 1035132 967349 1152601 999172 952478 892845 1017869 1135094
5340 1135094 902419 730388 1103858 1267548 1200564 1196162 1090250 870253 911853 992674
5330 992674 1230497 968058 760660 968503 1197465 1045086 817240 957569 914287 668639
5320 668639 778570 1021875 1171599 929559 991167 1090760 887992 838376 775410 952738
5310 952738 827755 914309 795394 818578 993184 873919 1025080 1128157 1095490 1116321
5300 1116321 1014151 798598 872520 833994 924911 840863 752072 957459 1107070 707969
5290 707969 543267 772218 837448 798942 780284 807759 833544 1028384 880147 878908 1057921
5279 1057921 967331 777735 601731 666955 711562 733642 766438 870738 527718 617000 711769
5268 711769 736446 778541 749879 772964 1010969 1007808 946422 831642 669318 463705 493142
5257 493142 903406 965727 779905 585087 767748 915254 1150526 981068 898464 1062730
5247 1062730 836983 904600 846193 750105 998876 956227 668724 641517 712864 966754 1159642
5236 1159642 759476 945567 969258 926441 910187 1040862 1101890 994893 931730 889651 943484
5225 943484 1015313 978467 1137492 1298709 1255556 1311373 1241308 978712 875517 1233823 1414594
5214 1414594 1212183 1365027 1122190 1198975 1234974 1020668 993067 1197180 1084372 990570
5204 990570 982183 864597 1093175 1176524 931851 1057114 906353 1009080 1193089 1036937
5194 1036937 1165524 1144448 1165560 1251689 1075208 1099862 1157203 1126447 945121 990930 1266668
5183 1266668 1140640 1086278 972231 977549 1108137 1176129 1228225 1382230 1356345 1456036 1676835
5172 1676835 1307419 1234372 1087292 1219438 1181349 1125995 1403601 1656973 1617225 1373140
5162 1373140 1541865 1591105 1723008 1548046 1624198 1610310 1528037 1496598 1573526 1738059 1725303
5151 1725303 1639483 1652093 1614328 1589104 1597606 1432863 1554555 1528934 1486331 1576125 1531548
5140 1531548 1513443 1280124 1386406 1360354 1399354 1315710 1204323 1405051 1490208 1668442
5130 1668442 1717592 1480424 1543225 1565981 1572616 1481875 1469924 1538028 1674942 1704928 1694891
5119 1694891 1760580 1767840 1643998 1544602 1403591 1555633 1532821 1433658 1390659 1579416 1676216
5108 1676216 1460428 1562236 1606564 1581647 1620014 1671162 1442023 1475381 1447883 1444433 1386195
5097 1386195 1364710 1323636 1281991 1567470 1513774 1634059 1587421 1436354 1281500 1298333 1384062
5086 1384062 1507130 1454701 1645917 1527355 1587001 1511093 1136405 1209930 1511397 1769555
5076 1769555 1867726 1775409 1661596 1652956 1631622 1656584 1519746 1472334 1643757 1931373 1926824
5065 1926824 1701734 1378692 1483307 1611131 1456224 1473065 1373635 1405400 1552403 1631113
5055 1631113 1724089 1521896 1422604 1322024 1258027 1499811 1495517 1540706 1467452 1548657 1678318
5044 1678318 1713387 1744787 1857514 1852174 1765404 1641058 1321964 1528502 1586607 1758137 1660127
5033 1660127 1831193 1650332 1704573 1788709 1790789 1888779 1876219 1853249 1718715 1780143 1795492
5022 1795492 1701949 1775134 1865135 1978379 1848039 1870708 1921694 1925813 2158075 1997667 2118976
5011 2118976 2259100 2158840 2167468 2103709 2190915 2316883 2347021 2565508 2642412 2460939 2838086
5000 2838086 2566184 2731003 2831187 2870428 2862674 2846274 2927835 3156026 2898578 2721816
4990 2721816 3051828 3022819 3112701 3169049 3221037 3532636 3611113 3881005 4188832 4110628 4083276
4979 4083276 4069089 4335316 4486614 4594526 4872761 4999923 4766153 4865082 5091835 5260327
4969 5260327 5646182 5842347 5718184 5913483 5967867 6126887 6260504 6207660 6252143 6261372
4959 6261372 6341052 6345536 6275605 6381042 6570125 6638538 6612156 6600764 6504639 6622532 6727717
4948 6727717 6763655 6577044 6577499 6715934 6565884 6463963 6557785 6405748 6730856 6947768
4938 6947768 6801958 6825305 7077384 7174102 7308978 7558793 7765601 7924170 7977318 7833476
4928 7833476 7843603 7845296 7973694 7983770 8229172 8429414 8464576 8567555 8524737 8395995 8722825
4917 8722825 8720551 8729940 8740597 8758585 8843909 8940772 9068968 9374784 9420113 9238312 9416622
4906 9416622 9607361 9724777 9681504 9436581 9550314 9630460 9668195 9435592 9436586 9663762 9745426
4895 9745426 9606773 9572914 9761277 9833147 9796228 9672509 10073586 10131566 9997865 9647123
4885 9647123 9607827 9647619 9656561 9518291 9626964 9504157 9527177 9783765 9722318 9631933 9511464
4874 9511464 9544571 9325412 9081072 9180147 9003831 9390020 9358027 9163244 9265099 9319413
4864 9319413 9153177 8993111 8975703 9042625 9068700 9029084 9150756 9150900 9215037 9187332 9232365
4853 9232365 9307958 9314806 9319316 9155227 9172339 8838278 8804377 8869211 8675706 8427355 8464564
4842 8464564 8655051 8801294 8708992 8396789 8206567 8446280 8633338 8499357 8178218 8067167
4832 8067167 8166696 7986648 8156610 7970892 7685308 7693191 7501257 7570211 7565894 7406763 7371080
4821 7371080 7201045 7173750 6994122 6918166 6758176 6563813 6715710 6676222 6680413 6451404
4811 6451404 6503574 6438891 6187372 6539321 6367862 6277407 6033899 6025587 5853251 5830672 6033142
4800 6033142 6078682 5960864 5802372 5852009 5887462 5786485 5622801 5603079 5626811 5667260 5676795
4789 5676795 5560293 5620005 5834416 5732542 5458753 5550325 5514185 5416747 5634684 5683936
4779 5683936 5771243 5536061 5539287 5757618 5706514 5946949 6160175 6103394 6103104 6020326 6173331
4768 6173331 6302675 6711306 6957460 6944426 6834343 6801760 7031196 6917400 6623984 6552232
4758 6552232 6382338 6218806 6401166 6658676 6532345 6597081 6514293 6392526 6523492 6531668
4748 6531668 6482051 6424759 6425296 6489093 6500418 6778257 6812187 6633721 6817640 6812605 6784890
4737 6784890 6470891 6657400 6837152 6933077 7003282 6996192 6951016 7007798 7107171 6933638 7008821
4726 7008821 7169370 7130476 7318437 7453236 7565917 7717444 7754345 7843992 7948595 7990232
4716 7990232 8063418 8239569 8478499 8804623 8783456 8803636 9023960 9180894 9212212 9387629
4706 9387629 9864810 9930602 10156998 10282139 10225173 10258845 10108914 10154561 10332793 10600974
4696 10600974 10626545 10754433 11432981 11323091 11135179 11131961 11180196 11266391 11396090 11373002
4686 11373002 11331948 11495261 11403366 11608183 11946647 12110496 11992656 11940378 11815932 11756472
4676 11756472 11886214 11872698 11592409 11788096 11959902 12161778 12497467 12452658 12525171 12613200
4666 12613200 12755297 12921079 13101175 13065740 12952979 13164205 13316485 13358136 13480810 13512776
4656 13512776 13571183 14033837 13923930 13986907 14296693 14291279 14456424 14778744 14998254 15274509
4646 15274509 15259156 15304209 15581587 15492442 15672215 15841501 15955577 16328306 16518017 16751240
4636 16751240 16800491 16995252 17297372 17302608 17600623 17690396 17831550 17957795 18004557 18198791
4626 18198791 18453190 18766343 19064355 19178894 19273262 19431279 19449558 19508530 19768316 19865009
4616 19865009 19951161 20001948 20004683 20394395 20538659 20854416 21185665 21099577 21198346 21421869
4606 21421869 21656347 21743023 21734757 21572878 21721798 22060271 22267714 22237452 22493976 22488638
4596 22488638 22354287 22517490 22342665 22551181 22854140 22943260 22900017 22675817 22431291 22530724
4586 22530724 22477294 22561636 22550352 22378960 22442761 22572374 22544040 22589909 22503838 22433378 22353040
4575 22353040 22129151 21971525 21919059 21965887 21658578 21704523 21618604 21649713 21845422 21650563
4565 21650563 21421085 21353583 21117934 21143947 21308593 21022941 20853975 20820251 20725796 20518452
4555 20518452 20572815 20713634 20704723 20379107 20210556 20254402 20165137 20032680 19954693 19711706
4545 19711706 19473736 19425986 19390951 19456503 19393396 19256166 19015501 19061372 18923108 18726265
4535 18726265 18750219 18410680 18425058 18307930 18251178 18321537 18278353 18199766 18224535 18161372 18165774
4524 18165774 18326722 18396541 18144698 17980736 18156277 18042928 18176496 18120558 18175843 18131394
4514 18131394 18432302 18365949 18134668 18287133 18365709 18446345 18603013 18258005 18230884 18235475
4504 18235475 18303837 18488289 18329451 18257920 18528992 18764787 18854021 18886456 18875598 19033549
4494 19033549 19252533 19049769 19169950 19465084 19558440 19633763 19754423 19993732 19868896 19891992
4484 19891992 19927946 20018822 20363431 20692205 20773845 20912339 20696610 20713854 21183082 21547206
4474 21547206 21458516 21580909 21544849 21964141 22081930 22190331 22641365 22626889 22371264 22791712
4464 22791712 23034959 23169032 23625520 24266531 24553422 24571047 24725058 24954895 25392676 25796009
4454 25796009 25819926 25904438 26289771 26485080 26863025 27309579 27513641 27812245 28199459 28308601
4444 28308601 28771459 29031804 28981443 29210320 29771584 30036118 30270504 30784346 31088184 31262478
4434 31262478 31298806 31450810 31843996 32290297 32503816 32676764 32831067 33220328 33378747 33233902
4424 33233902 33512013 33519218 33557988 34048304 34224704 34171923 34184487 34012795 33844794 33748975
4414 33748975 33788592 33767094 33643155 33565808 33629459 33295784 32777406 32460475 32279636 32018171
4404 32018171 31699507 31677307 31630275 31209263 30454316 29975398 29948671 29532257 28851976 28526866
4394 28526866 28329626 27834384 27444839 27010451 26783759 26584698 26190942 25466807 25138073
4385 25138073 24731357 24315342 23857592 23692269 23403774 23074088 22912388 22648946 22287227
4376 22287227 21896269 21714878 21330730 21045987 21063612 20897801 20623800 20484017 20256321 20182083
4366 20182083 20017577 20001712 19913491 19611260 19323145 19746493 19632497 19306790 19494817 19377257
4356 19377257 19326752 19214380 19238525 19487859 19508827 19601809 19428676 19569042 19692748 19611335
4346 19611335 19736031 19780674 19945236 20196389 20300688 20600460 20567820 20569166 20782189 20822764
4336 20822764 20818765 20858728 21008754 21072206 21008178 21145812 21505898 21668647 21589324 21585850 21819535
4325 21819535 22136387 22577926 22684521 23003159 22994754 23090558 23365878 23810846 24249422 24728165
4315 24728165 25185296 25733012 25927220 26264737 26632859 27081269 27721294 27618898 27551253 27776965
4305 27776965 27759198 27595680 27652988 27833301 28103475 28288588 28481975 28810600 29147308 29467339
4295 29467339 29886539 30139714 30775102 31439752 31992831 32342450 32833262 33548893 34028362
4286 34028362 34682419 35403210 36257986 36923250 37519603 38424866 39272559 40127149 41054204
4277 41054204 42552666 43469920 44475478 45897320 47041728 48262752 49757748 51103355
4269 51103355 52703903 54334286 56325019 58030616 60026589 61891545 63781900 65925775
4261 65925775 68098801 70197512 72177261 74390969 76235017 78085754 79868606 81222321
4253 81222321 82476278 83361175 83733355 84127609 83896493 83104114 82327704 81432161 80200441
4244 80200441 78942163 77384680 75779538 73839111 72171693 70668709 68833783 67159681
4236 67159681 65372337 63743250 62381966 60998324 59788978 58596113 57643592 56778525
4228 56778525 55885163 55031639 54364856 54118328 53785742 53176248 52552959 52244503 51821208
4219 51821208 50993249 50482438 49916081 49297583 48838363 48340444 48060104 47830837 47355167
4210 47355167 46684732 46418211 46091560 45672922 45586607 45270537 44973565 44709241 44435424 44137685
4200 44137685 44091668 44100936 44021748 43878493 43878283 43902502 44181854 44544901 44732777 45090351 45354561
4189 45354561 45641606 45834048 45631354 45412885 45147857 44609119 43810569 43028442 42241672
4180 42241672 41508448 41030110 40335574 39733857 39485395 39107172 38633948 38366599 38155941
4171 38155941 37891136 37838046 37801097 37998550 38042152 37950892 37735565 37814513 38106138 38335497
4161 38335497 38815151 39616787 40045774 40488079 41070213 41593091 42135659 42338267 42490189
4152 42490189 42690758 42946269 42723124 42307372 42409378 42336444 42371873 42516291 42269257 42000249
4142 42000249 41957311 41875697 41858696 41720884 41707937 41515393 41616320 41714672 41547693 41613968
4132 41613968 41304881 41401801 41368047 41500461 41742944 41827064 41872932 41842358 41961105 41925870
4122 41925870 42098827 42169777 42499596 42825046 43172075 43492954 44047181 44537792 44419533 44185877
4112 44185877 43735832 43153407 42271208 41523758 40743475 39951291 39332323 38848684 38468784
4103 38468784 38381440 38428618 38456762 38234623 38316800 38588349 38428626 38588009 38985163 39498124
4093 39498124 39819153 40163942 40616658 41168270 41690866 42139498 42896358 43345653 43745589
4084 43745589 44108932 44891150 45453276 46450685 47220291 47715711 48380120 49044963 49887816
4075 49887816 50838489 51673603 52276717 53061408 53953383 54871121 55989440 56779857 58193749
4066 58193749 59642638 60998407 62771663 64914879 67466024 70649528 74503108 78876479
4058 78876479 84314406 90776768 97989794 106695259 117067684 129133017 142165138 154745878
4050 154745878 165138275 171524416 171365329 164320049 153107394 139944329 126764504 115322260
4042 115322260 106307292 98908056 92863526 87996099 84093221 80986790 78338496 75938288
4034 75938288 73912029 72424497 71271393 70088347 69347218 68637914 68201144 67977265 67796265
4025 67796265 67652070 67617887 67562616 67416588 67301455 67231553 67408533 67493044 67853475 67840041
4015 67840041 67752968 67779567 67872034 67645551 67253448 66930054 66465336 66253183 65589166 64673233
4005 64673233 64029872 63537127 63216246 62860921 62268478 61460447 60970682 60086483 58888408
3996 58888408 58325664 57337166 56628919 55515519 54412365 53391801 52013671 50999716 50084634
3987 50084634 49035047 48030804 46878533 45837575 44845254 44072001 43141740 42255622 41414138
3978 41414138 40559319 39748411 38676137 37575026 36834547 36375660 35653726 34809648 34037038
3969 34037038 33024429 32331082 31437310 30934321 30246784 29472560 29148181 28625899 28061743
3960 28061743 27611217 26689389 26059779 25980907 25642742 25322365 25220756 24553844 24190533 23880802
3950 23880802 23738360 23265650 22855658 22852465 22870100 22777892 22685872 22292034 22029246 21985960
3940 21985960 21967795 21631493 21423551 21700628 21442474 21435123 21374777 21276377 21008366 20639191
3930 20639191 20468593 20596606 20510983 20314375 20203266 20220779 20267570 20077409 20007752 20096768
3920 20096768 19931439 20041118 19768201 19791078 19794330 19622767 19574036 19572803 19381022 19412374 19195325
3909 19195325 19258923 19257748 19430747 19511858 19760959 19928265 20060732 20141567 19994287 19970664
3899 19970664 20008152 20343033 20536829 20771631 21095827 21370019 21362626 21404731 21574551 21528912
3889 21528912 21724415 21781810 21633819 21268519 20999234 20359449 20031983 19747706 19570335 19575143
3879 19575143 19328933 19487577 19316518 19312990 19288774 19049264 18915208 19024704 19143123 19248826
3869 19248826 19292551 19105784 19312485 19127990 19202552 19256465 19243360 19476637 19578015 19687014
3859 19687014 19779898 19989992 19893777 19735755 20012272 20304764 20113721 20119315 20177452 20325828
3849 20325828 20462468 20504461 20499408 20781041 20905261 21012553 21210981 21442529 21613246 21434416
3839 21434416 21590620 21902514 22215867 22614120 22733804 22883127 23105019 23413760 23537897
3830 23537897 23587318 23935451 24186260 24171848 24541178 24896639 25085504 25630629 26019434 26136469
3820 26136469 26496325 26987473 27269830 27851198 28494080 28898191 29313175 29852129 30393497
3811 30393497 31126117 31759755 32221592 32931095 33333453 33958778 34988219 35615586 36217614
3802 36217614 37238383 38091490 39005283 39689523 40618966 41523106 42549709 43813300 44931811
3793 44931811 46050416 47262647 48548572 49845426 51272717 52886271 54533632 56183607
3785 56183607 57880067 59551184 61325469 63268615 65111228 66926696 68554833 70202779
3777 70202779 71910784 73470189 74915639 76204289 77841231 78998559 79848467 80834978
3769 80834978 81796173 82345148 82789044 83359741 83882815 84181682 84342101 84865607 85341209
3760 85341209 85872668 86338829 86588454 87213496 87384705 87851143 88302870 88548432 89279997
3751 89279997 89391711 89863661 90297264 90764035 90989323 91122383 91123756 90875460 90634917 90021796
3741 90021796 89574590 88981358 88343622 87779044 86684805 85549049 84823804 83809522 82748370
3732 82748370 81513292 80232507 78828835 77270483 75800390 73825729 72151607 70263737
3724 70263737 68296657 66428870 64703646 62864896 61088072 59416577 58147386 56623982
3716 56623982 55307512 54385343 53440450 52506370 51851710 51336574 50667135 50282909 49894129
3707 49894129 49672157 49050804 48626966 48531664 48254003 48241253 48321900 48312950 48402630 48311064 48330128
3696 48330128 48695073 48712073 48882045 49157437 49144660 49496709 49602637 49727634 49946887 49932995
3686 49932995 50137912 50412981 50425388 50631967 50785307 50948817 50962726 51511817 51496019 51811056
3676 51811056 52109788 52534833 52834967 53406526 54099541 54319766 54810432 55042337 55549777
3667 55549777 55998792 56409344 56784266 57064770 57454297 57858601 57963566 58135061 58492748
3658 58492748 58551772 58655686 58617180 58716425 58900999 59248157 59231069 59262547 59686234 60123241
3648 60123241 60091564 60347713 60496214 60387178 60696698 61154518 61423995 61607647 62331817 62793003
3638 62793003 63271035 64044014 64874496 65588131 66618494 67614046 68620135 69755881 71066557
3629 71066557 72448848 74113266 75917231 77750404 79556608 81578826 83838132 86205492
3621 86205492 88456592 91001903 93771924 96731788 99896348 102934286 106175169 109205379
3613 109205379 112572386 115877631 118942575 121952329 124819272 127455744 129699160 131818779
3605 131818779 133440793 134813458 135628529 135849060 135698335 135524255 134931387 133854956 132861755
3596 132861755 131838754 130741459 129475930 128224975 127186586 126180235 125819994 125858119
3588 125858119 125908370 126505622 127454367 128877836 130882859 133554655 136688318 140367528 144206925
3579 144206925 148195107 152588889 156651376 160860249 164673415 167592895 169647125 170678792
3571 170678792 170507535 169100954 166450852 162700266 158330596 153002468 147081650 140956029
3563 140956029 134627259 128721860 122942494 117207637 111973707 106747168 102059293 97837497
3555 97837497 94242453 90878673 87829287 85012111 82446840 80253829 77928306 76146108
3547 76146108 74656178 73028019 71849085 70817360 69354036 68394069 67134749 66090743
3539 66090743 64829348 63790891 62925992 62228127 61690295 61405289 61223656 60717987 60496923
3530 60496923 60248516 59869537 59795994 59819336 59905681 59798890 59467878 59050398 58847761 58597456
3520 58597456 58500983 57977348 57533907 57313036 56681793 56205650 55818950 55144347 54432078 54077928
3510 54077928 53752556 53240667 52823525 53050745 53010749 52983398 52985461 52903468 53085164 53462696
3500 53462696 53791221 54249688 54738705 54924498 55212403 55775384 56010029 56123821 56334896
3491 56334896 56159982 56214525 55999451 55370011 54766495 53612511 52582513 51752286 51046191
3482 51046191 50108287 48831775 47756587 46663002 45727306 44709380 43586640 42916037 41935905
3473 41935905 40983319 39921678 39278274 38469929 37778551 36969167 36456338 35870134 35151787
3464 35151787 34616612 34405835 34189400 33626717 33144476 32821333 32471541 31938194 31878104 31631091
3454 31631091 31256793 31044420 30865737 30725519 30351296 30500487 30414754 30123027 29849642 29490346
3444 29490346 29413012 29190564 28908773 28704930 28395408 28406221 28079563 28047167 27971387 27912764
3434 27912764 27714346 27499636 27701037 27668734 27518728 27369960 27135215 27067570 27209612 26892660
3424 26892660 26840370 26775915 26817284 26803377 27002658 26992185 27106842 27014496 26889360 27048892
3414 27048892 26992454 26758358 26954345 27162057 27161703 27665776 27851080 27682322 27873398 28030462
3404 28030462 28008100 28143167 28447324 28808293 29052639 28947784 29235922 29499477 29912693 30114104
3394 30114104 30485840 30874624 31124931 31181420 31597568 31897343 32053368 32275315 32608225 33041295
3384 33041295 33570930 33692561 33919370 34499733 35001900 35636448 36163453 36711298 37291666
3375 37291666 38128657 39030374 39732615 40535917 41367070 42087904 42806328 43543135 44378390
3366 44378390 45028950 45672449 46456592 47310452 47655370 48432660 48901974 49365027 50324172
3357 50324172 51234744 51730304 52583687 53445046 54008454 54803709 55596119 56181253 56938910
3348 56938910 57755430 58396580 59130900 59639884 60351766 60894493 61715503 62557933 63192605
3339 63192605 64076036 64688483 65415251 66316117 67074979 67844155 68935636 70326707 71473821
3330 71473821 72246619 73545838 74642435 75773914 77128715 78454479 79825876 81263308
3322 81263308 83228010 85434344 87619956 89965312 92738855 95462373 98376905 101695873
3314 101695873 104516882 107277606 109992262 112586291 115110377 117609497 119950129 121997638
3306 121997638 124246814 126500235 128490493 130592563 133198861 135877481 138250801 140631183
3298 140631183 143202049 145705719 148649671 151331778 154037605 156941962 159637120 162543034
3290 162543034 165192150 168094088 170661595 173573811 176547547 179280195 182344623 185211201
3282 185211201 188105907 190934652 193529414 195767384 198100448 200072755 201994576 203618695
3274 203618695 204989794 206294276 207790183 208655980 209587379 210724171 211741153 212541320
3266 212541320 213140790 213489528 213350177 213362719 213101686 212671816 211847803 210858246 209831791
3257 209831791 208756898 207572882 206727064 205822214 205022320 204562423 204300856 204332995 204570657
3248 204570657 205059437 205454865 205951193 206695232 207830882 209547875 211322974 213518641 216713904
3239 216713904 220652381 225221189 230578426 236936303 243772071 251309392 259402550 266794930
3231 266794930 273097578 277558729 279362487 277534329 271537104 261363952 247820104 232673216
3223 232673216 217010508 201815132 188040227 175831219 165043671 155501131 147319678
3216 147319678 139952983 133473582 128003583 123058319 118896941 115246786 111850362 108698337
3208 108698337 106095721 103583900 101198364 98838507 97159747 95095444 92958478 91213390
3200 91213390 89463953 87883528 86265195 84794483 83140027 81717626 80653873 79395530
3192 79395530 77904563 76647831 75539939 74160096 72832394 71293384 69716312 68553702
3184 68553702 67441038 66283081 65261881 64165404 63195603 62317156 61436974 60638491 59984444
3175 59984444 59665000 59064404 58369716 57841629 57570507 57222322 56744575 56348514 56339492 56202024
3165 56202024 56090938 55926383 56023984 56074162 55886524 55857958 56061525 56214946 56432356 56618716
3155 56618716 57180060 57504924 57682746 58373474 59182419 59852433 61020652 62016495 62819729
3146 62819729 64089957 65341794 66956836 68798771 70615280 72930045 75189306 77690356
3138 77690356 80545636 83760550 86784739 90072078 93661729 96940521 99815390 103180230
3130 103180230 106708033 109615547 112382616 114783893 116689540 118175686 119124008 119615747
3122 119615747 119868247 119407878 119028590 118525969 118046039 117684542 117741816 118230899 118977843
3113 118977843 119951326 121252417 122674383 124070879 125403629 126576112 127127522 127152046 126570072
3104 126570072 125216893 123464522 120932388 117617410 114217198 110540604 106773812 102573197
3096 102573197 98447495 94430986 90674091 87092566 83646923 80194332 76929226 73817639
3088 73817639 71036137 68304157 65707827 63311158 61071604 58827754 56876999 54904699
3080 54904699 53006615 51395111 49947309 48398594 47183658 45849658 44466536 43701965
3072 43701965 42680191 41915724 41048459 40232693 39426174 38792697 38143362 37370369 36532361
3063 36532361 35648019 35029503 34638738 34146365 33535762 32769201 32363483 32051026 31479217
3054 31479217 31032684 30641175 30388713 30036887 29847836 29479086 29096015 28480844 28160133
3045 28160133 28245480 27815315 27488697 27231683 27084199 26803066 26307610 26358660 26063885 25551253
3035 25551253 25641393 25518669 25371541 24998345 24755141 24481133 24472222 24293894 24170270 23795304
3025 23795304 23536220 23567094 23567529 23493803 23398277 23305741 23146396 22932265 22833725 22940899 22884990
3014 22884990 22863559 22817672 22881590 22723741 22645946 22627529 22555863 22488653 22388586 22359191 22754605
3003 22754605 22815248 22798647 22758935 23021429 23107004 23090011 23406694 23273309 23299394 23310063 23351035
2992 23351035 23611593 23660825 23631730 24075089 24239013 24258898 24230668 24432178 24569650 24785701
2982 24785701 25111386 25127179 25217991 25564505 25695613 25677321 25805975 25858448 26132785 26262641
2972 26262641 26540027 26648755 26973566 27353110 27660362 27919486 28065497 28179047 28754667
2963 28754667 29257011 29309712 29612470 29972199 30209437 30542221 31079096 31614383 31831459 32253001
2953 32253001 32681884 32941681 33105631 33574416 34118501 34326409 34833788 35376825 35707447
2944 35707447 36292510 36933865 37419386 38021373 38964080 39858726 40375406 41191233 42057558
2935 42057558 43019198 43620556 44387880 45234085 46306017 47449929 48559115 49259953 50486548
2926 50486548 51679318 52931218 54241665 55402977 56801038 58157733 59572409 61169622
2918 61169622 62615054 63986315 65127144 65893155 66574501 67408608 68292666 69146085 69881314
2909 69881314 70524787 71413354 72492250 73468323 74564261 75829592 77151101 78609772 80122491
2900 80122491 82011003 84182191 86234701 88469427 90831142 93683611 96643246 99674697
2892 99674697 102796944 105758969 108560610 110919009 112407954 113148849 113335409 113396186 113965816
2883 113965816 114612427 116106872 117827444 119812952 121941291 124543983 127198687 130474059
2875 130474059 134040395 138150774 142665370 147636570 153160174 158972694 165452401 172924903
2867 172924903 180937969 189588847 199232464 209938385 221894340 235594142 251045667
2860 251045667 268770697 288953315 311271613 334688491 356482765 374157077 384775228
2853 384775228 386034633 378489605 364446252 347916638 331719670 317861559 307703444
2846 307703444 301475802 298793436 298975924 302305229 308451331 317616260 329541809 344037376
2838 344037376 360622957 378075422 395042660 408695086 416936220 417841084 411215487 397754716
2830 397754716 379076757 357784220 335298782 312968100 292296850 273186575 255513937
2823 255513937 239511810 225339893 212251936 200320003 189720725 180002067 170357199
2816 170357199 160938826 152110479 144187966 136315026 128833383 122368741 116564542 110867297
2808 110867297 105586131 100822847 96217571 92004377 87969359 84399897 80898197 77871293
2800 77871293 74763362 72257909 69728235 67113016 64587727 62547110 60713252 59031346
2792 59031346 57183753 55201937 53549677 52024894 50538871 49172546 48016742 47119406
2784 47119406 45753624 44860604 43872818 42688514 41377349 40242964 39386195 38445870 37489634
2775 37489634 36524742 35471276 34458511 33502514 32657678 31965427 31320506 30720259 30006366
2766 30006366 29039309 28471003 27979442 27202567 26597757 26168182 25753383 25001386 24358349
2757 24358349 23929872 23580913 23303205 22753440 22304292 21874325 21439433 20866924 20569732
2748 20569732 20192855 20045124 19557216 19106157 18863597 18254492 18095997 18007946 17675835 17234047
2738 17234047 17129833 16888986 16781501 16323269 16043074 15726236 15251555 15155383 14890487 14556612
2728 14556612 14555373 14406357 14102348 14067401 13944725 13641659 13341570 13172673 13221658 13064415
2718 13064415 12724673 12588600 12522126 12490404 12283446 12136794 12172529 12115351 12015899 11615093
2708 11615093 11169268 10656839 10433212 10511712 10422519 10231376 10032597 10098569 9998179 9724122
2698 9724122 9502768 9576151 9610833 9511134 9453884 9073925 8829829 8817205 8660358 8417506
2688 8417506 8548761 8197794 8162452 7947300 7830192 7755127 7716419 7646315 7273422 7196526
2678 7196526 7161501 7341740 7467407 7040329 6742590 6716253 6675456 6538776 6366932 6427658
2668 6427658 6528894 6339536 6521557 6549199 6303352 6295829 6120575 5876055 5531998 5545533
2658 5545533 5860827 6037198 5972233 5594843 5773744 5805694 5567435 5548862 5593638 5595652 5517725
2647 5517725 5324842 5229208 5200910 5068976 5030770 4959180 4928361 5089886 5011437 4866865 4516993
2636 4516993 4714277 4771723 4865964 4930155 4664889 4531376 4557553 4633575 4326853 4319864 4176324
2625 4176324 4447465 4474208 4505734 4416175 4409179 4458092 4499889 4535277 4340214 4074316 4120854
2614 4120854 4162170 4301818 4150927 3916847 3797420 3887143 4013454 3857598 3798652 3899741
2604 3899741 3930170 3895303 3955363 3969808 4050799 3875603 3649054 3700085 3687482 3915775 4042848
2593 4042848 3653589 3709908 3805572 3717050 3812492 3969550 3849762 3674087 3543184 3720719
2583 3720719 4012584 3977737 4074460 4024209 4123426 4151058 3990022 4224728 4442030 4377025 4144814
2572 4144814 4300724 4566814 4796641 4523441 4138134 4485222 4293168 4193649 3852816 3854673
2562 3854673 3861473 3923177 3990071 4090199 4089089 3968855 3836096 3911229 4079872 3939491 4021686
2551 4021686 4171952 4276547 4299679 4314812 4112202 3665369 3410759 3494314 3644829 3496202
2541 3496202 3326318 3385918 3172643 3080911 3235148 3362953 3045460 2928752 2743466 2793721
2531 2793721 2774514 2473755 2379884 2310695 2342496 2395685 2234208 2160166 2014812 2168503 1974655
2520 1974655 2110310 2194918 2157380 2137180 1913341 1901927 1740316 1813455 1824251 1862677 2007035
2509 2007035 1853174 1818466 1973763 1943052 1850634 1868544 2002560 1986624 1839434 1451257
2499 1451257 1424407 1561543 1575364 1517757 1412579 1612112 1811960 1599939 1450859 1357995
2489 1357995 1506905 1419587 1228590 1157873 1203917 1080652 1103970 1399385 1639645 1747368
2479 1747368 1505986 1342245 1303032 1307854 1262230 1310778 1268948 1172365 1114712 1235353 1367924
2468 1367924 1422431 1393013 1539260 1543149 1346611 1169247 1220169 1293212 1317740 1343029 1252998
2457 1252998 1247228 1270537 1316617 1218195 1168446 1201731 1300436 1379808 1345806 1360668 1081082
2446 1081082 1277594 1303025 1391192 1272792 1091855 945187 735358 991281 1104446 1229325
2436 1229325 1220610 958805 1167546 1070950 882792 998404 934668 845008 975586 909782 966543
2425 966543 1202037 1074161 749173 800552 1150195 969487 1021067 1068939 1019930 881365
2415 881365 1052412 912229 904330 935010 797209 794500 848446 784244 899138 1078293 827085
2404 827085 724853 770451 829468 480341 923516 1170870 916087 1050149 975160 1118855
2394 1118855 927924 899669 1098830 1323458 1208616 1253193 1197040 1128347 1127296 927308 906011
2383 906011 673260 701113 664612 600375 688893 642550 725172 689767 855096 746972 632945
2372 632945 744969 766023 759493 743200 1017954 900031 742193 824357 896592 1009680 883206
2361 883206 972717 1036599 1258749 1189123 1237438 1084961 1011330 895920 761181 712773 666585
2350 666585 775245 749390 651895 705061 788735 488448 498420 597802 823205 685454 984820
2339 984820 832647 498656 633304 735760 582565 741648 751884 547890 603916 812901
2329 812901 675708 714106 632564 635820 740145 715897 595210 300992 546084 699712 575800
2318 575800 722679 954770 877601 670931 385603 529743 680429 604514 558896 701263
2308 701263 845717 633970 778502 723606 592675 559561 484142 611650 663918 654848 587244
2297 587244 686542 862266 968860 816750 591354 559941 353498 450195 368910 340595 475204
2286 475204 678767 804555 628983 531240 421027 569709 551536 561586 600066 517582 774029
2275 774029 860658 762990 604559 557596 741603 714979 523950 495490 778616 645771 702837
2264 702837 617429 654329 758105 779191 924133 986580 837151 838012 810253 631305 767483
2253 767483 931067 804486 879891 524668 365588 326636 561684 811332 622947 565003
2243 565003 577508 454394 563531 403356 398612 478778 783406 787013 789238 806126 528274
2232 528274 642423 450667 633215 645008 587939 598969 497892 717892 836845 655727
2222 655727 795224 742530 664428 699130 952899 837068 819100 722310 798761 764269 839584
2211 839584 1154411 1301277 1015327 817142 994896 939761 916682 829857 980689 1109031
2201 1109031 925479 900919 936425 878598 831184 829654 921059 1118111 976717 945678 1194480
2190 1194480 1297502 1136262 989710 1442189 1586827 1457668 1511901 1431883 1307970 1257680
2180 1257680 1159976 1184321 1232573 1396333 1316401 1330096 1426614 1476617 1641723 1620993 1513842
2169 1513842 1361512 1781380 1770351 1776340 1896538 2121194 2110183 2024989 2068000 1890971 1975357
2158 1975357 2070024 2077576 2070944 2015144 2056615 2311642 2305372 2323846 2274737 2088438 2335482
2147 2335482 2288929 2397589 2507595 2411087 2695451 2732214 3113978 3016022 2905404 3157868
2137 3157868 3426940 3610821 3729774 3737512 3626965 3587130 3826653 4112784 4402197 4356041
2127 4356041 4624888 4876111 4924840 4981913 5279090 5755343 6064206 6390311 6403963 6727151
2117 6727151 6930550 7187682 7629184 8168571 8390383 9047608 9684939 10134020 10939217 11861217
2107 11861217 12486809 13334301 13865509 14256365 15114855 16232148 17711395 19857639 22487985
2098 22487985 26027716 30813000 36885660 44926619 57069062 71457061 85829152 93107304
2090 93107304 86996962 72097741 55495514 43297052 34690423 29069309 24422882 21492149
2082 21492149 19008281 16936194 15232590 14025804 13398670 12510436 11855507 10992571 9918191
2073 9918191 8872450 8043885 7526648 6852956 6370577 6273602 5715289 5256291 4982242 4930348
2063 4930348 4608347 4384939 4116299 3923589 3595082 3566403 3475649 3405614 3324488 3260183
2053 3260183 2981031 2979068 2975994 2936006 2909526 2750589 2522567 2377585 2554979 2358305 2271944
2042 2271944 2328241 2401657 2139485 1787857 1622966 1631686 1727896 1792297 1913086 1697880 1490698
2031 1490698 1331707 1528632 1600972 1461105 1277251 1170073 1301240 1423417 1279541 1065379
2021 1065379 1390833 1259535 1287732 941119 765014 751978 891020 795821 651677 675877
2011 675877 559965 799512 853718 846430 950022 1326840 1162708 835570 847685 802222 951155
2000 951155 788213 648137 730105 434887 328153 647799 803497 649088 659603 513041
1990 513041 419980 248576 262398 386028 301181 420091 649972 335514 643597 860579
1980 860579 602793 628963 360723 630541 584484 397726 410986 642845 581916 518658 517389
1969 517389 257884 313799 267913 243253 394696 520346 578604 381209 171432 196819 506574
1958 506574 489805 458341 534802 456523 399274 256787 435366 563574 792700 678936 671711
1947 671711 434371 345790 524737 709316 475463 399639 410530 667484 602754 347723
1937 347723 341044 219610 266394 143748 141603 171893 102306 78813 228614 337316 176245
1926 176245 67242 81602 230187 33331 -67239 101483 115062 159498 104784 411215
1916 411215 492839 316595 189400 301105 104695 -6820 175769 349674 456261 295886
1906 295886 329293 546772 347334 122428 178927 302864 284716 308245 360285 501196 308239
1895 308239 412029 186575 -250772 79225 361199 360156 321926 427274 323004 176394
1885 176394 237298 404608 139930 95826 134678 188031 310944 197382 228635 534083 467706
1874 467706 210097 -51061 -43457 151248 198140 152890 -27461 58597 27291 -48115 -71588
1863 -71588 -31833 224762 351672 339378 331371 312930 263501 458937 422701 403925 295775
1852 295775 136904 201030 -92460 3342 -61469 -97535 -25799 407669 167888 149108 -41009
1841 -41009 -138951 -80410 43383 281104 207210 109059 177937 188040 117332 61191 111643
1830 111643 349415 434086 568408 409574 488066 495000 551115 789125 665099 642224 657831
1819 657831 710533 589201 306995 227515 48752 193630 87208 24573 145749 197336
1809 197336 223001 245225 137947 138239 -89265 -155674 74062 252171 -21199 80006 113395
1798 113395 335373 243194 76124 175002 22043 45923 240776 170903 526994 496544 30829
1787 30829 150794 -62900 104124 89955 163249 345247 192632 221624 377166 400083 480108
1776 480108 75446 -160044 -162162 -49457 -261607 -239968 164097 -33560 -13373 -9631 -8277
1765 -8277 106878 165821 216143 311677 203099 143238 22526 29998 75135 -151393 34776
1754 34776 305672 84788 -219223 -11951 -90654 -87590 22100 52250 89940 -14148 -86586
1743 -86586 -27206 -102611 125590 418539 152323 244146 15465 -84337 -241533 -116332 162152
1732 162152 10932 -27954 22377 -5275 42567 -11428 -58530 -33555 -273215 -197823 -32090
1721 -32090 109606 122939 99485 -1134 64810 -44293 -132767 9042 243875 32406 -44796
1710 -44796 -113927 -134582 -146576 -62721 255357 178909 191372 23852 104167 145041 127195
1699 127195 78461 105591 -16581 -154244 -232046 -71405 -109584 154116 -53279 -18680 192979
1688 192979 196807 375088 45368 -96937 -53295 -100207 185415 205167 298154 417971 55013
1677 55013 -87616 -42714 -135081 -99890 44498 -45200 121410 199770 -662 -165309 -148765
1666 -148765 9594 411 -34923 -69713 -62342 -80450 -35932 290962 285440 148612 -10349
1655 -10349 292619 117904 153677 97964 30541 111249 162063 164583 68539 -45772 -102465
1644 -102465 -61528 -31850 76588 77485 9223 -64860 -320524 -27162 -9889 187889 191988
1633 191988 35590 76310 110370 194388 20440 254323 106870 258992 138828 -24888
1623 -24888 76923 151766 131631 61127 16260 -86326 27726 15186 4509 33294 147254
1612 147254 68130 5619 -94091 -7812 -166889 -988 28008 161472 201572 25783 290680
1601 290680 181858 257601 17604 -233306 53428 108190 -19410 -53716 -26302 102462
1591 102462 14963 56300 42743 -25519 -72535 -198584 16851 108195 40769 124289 126202
1580 126202 63398 -37389 214822 228700 112909 -141927 -164976 138880 317765 -125754
1570 -125754 -22608 -22064 134572 333733 195717 170116 242248 203234 -74698 -133596 52453
1559 52453 -13876 -223066 -33058 228732 181966 224784 354384 321565 221531 85500 43801
1548 43801 -41046 53663 77916 5858 -217175 -221318 -198452 -225694 -148420 -310465 -181833
1537 -181833 -36315 -76446 -265651 -212570 -10408 13268 84951 -74748 -276381 -108690
1527 -108690 91750 65642 -101474 -251765 -57441 38147 13012 92464 252458 213196 342952
1516 342952 267696 68234 100201 138091 210458 185071 195493 200005 213914 110205 -182829
1505 -182829 -46472 195499 303719 -18879 104694 64316 60701 -64057 -98122 110916
1495 110916 155571 62222 1009 196651 -107572 87776 48866 -833 145167 155606 146515
1484 146515 18768 -56173 -177259 -235375 -48635 -201306 -178004 -136059 -43376 27217 -45757
1473 -45757 95987 -66527 8240 79890 -105467 -131218 14039 -284310 -62697 -18580 -131967
1462 -131967 156621 310784 294543 19447 17870 102619 64754 61827 -122286 -20337 127605
1451 127605 -67351 -101880 -73993 -91718 -56599 153830 175779 4766 90535 251856 296032
1440 296032 368505 83309 52638 -146352 866 93359 55471 25490 59383 184502 -5620
1429 -5620 23306 -113448 25381 55480 -158944 -41683 -118410 -220544 -124272 122451 68714
1418 68714 45751 -29657 16146 -13866 52855 -50929 -107078 130915 43335 -30411 -107827
1407 -107827 -18298 108872 67347 -184973 -74421 -15458 -52388 -218442 -88215 39784
1397 39784 110119 159540 -50954 -244360 -289836 -395839 -7113 132149 -96572 12158
1387 12158 15868 122380 141129 32781 -8063 -68487 20320 -49951 18043 -70611 -261747
1376 -261747 -325973 -182736 -115044 -230205 -119778 -133579 3480 7236 -88599 141340 74783
1365 74783 -57673 82645 222356 333140 370120 246073 102717 22567 89141 -78283
1355 -78283 -17816 41409 -135046 41747 -13547 -164421 -189966 -172860 -321907 -197160 -51260
1344 -51260 4780 157182 -71331 10145 -176029 -316803 -187164 -53680 -44378 136035 -49609
1333 -49609 -174414 -107057 -174107 -279192 -223760 -211156 -152780 27935 -115326 -105324 -345408
1322 -345408 -128810 -56128 -201639 -176805 -98642 -143165 83948 167558 183813 146444 292693
1311 292693 112000 214796 231719 201376 -47798 -222872 54278 -87908 -281628 -191923
1301 -191923 -218479 -115788 -64782 -40843 23478 -110006 -51080 38581 -130184 -164244 -244613
1290 -244613 -264194 -221117 -54837 -29798 126301 -1941 -119473 -94302 69302 221637
1280 221637 73559 -2070 239813 91459 -256785 -165531 -125293 -138683 39467 58922 58476
1269 58476 -29485 -285199 -164786 -192385 -180488 -274718 -211737 -159316 -16611 47785 21999
1258 21999 -75146 -32016 -116225 238188 331742 154809 17352 81800 -20337 -31384 134152
1247 134152 41113 -185209 51235 -212282 -90688 40414 -146219 -75356 -77683 -53582 -112104
1236 -112104 -73664 -59597 -12258 -11248 -83715 81666 61574 126942 176869 58812 132032
1225 132032 -79330 -153430 -44123 77062 108089 -23113 -24382 34659 14838 -74548 36603
1214 36603 1888 -11351 -145492 -284770 -201297 -137700 -26755 187795 227091 269551 341460
1203 341460 314562 321131 385640 51800 -284169 -215193 -123873 113768 131743 39874 104321
1192 104321 86733 -267834 -305758 -357823 -495875 -391844 -365315 -419340 -73049 -26772 -65633
1181 -65633 -68426 68137 53729 90516 62119 96341 34864 -112056 -175548 -16683 9036
1170 9036 -215443 -217791 -109714 -170788 -111486 -211063 -21981 -125557 -283904 -489465 -345589
1159 -345589 -26556 -100888 63570 45181 85139 -198433 -330196 -177280 185887 309140
1149 309140 274378 214941 66783 -82292 -32683 -28613 -73738 152521 373992 378630 -2229
1138 -2229 -337643 -227622 -249238 -176709 129470 214628 -80579 -177332 -295188 -100737 -7277
1127 -7277 -79864 100650 132991 -8033 -141145 -45746 -228212 -37880 -120212 -109401 -213192
1116 -213192 -230456 -156536 -75682 -174362 -185489 50190 -16033 -191757 -440051 -57698 175281
1105 175281 375120 400864 32059 -105577 -121179 -203989 -239827 -102384 -173613 -218470 -165962
1094 -165962 322 -111287 93653 97248 36243 75573 -63385 27189 -154006 102235 192228
1083 192228 155326 -211191 -149245 -141233 -131911 -85609 37100 -100090 -163186 44881 -69075
1072 -69075 92712 87398 -148893 -38269 122650 176292 160480 10468 -174938 -259377 -184161
1061 -184161 -63241 20409 -167011 -383872 -69373 64800 9784 -54387 104945 -277877
1051 -277877 -457487 -242151 -152995 -127085 -412514 -152948 -65665 -251389 30626 168622
1041 168622 -34436 -110255 -175339 -113555 -82616 -219868 -224663 -220908 -191063 49115 -34037
1030 -34037 192237 -6583 -292707 -275501 -225516 -105334 -75785 -380751 -137370 -98174 -15465
1019 -15465 180269 170059 -6887 -57817 19068 -173136 -247062 -155911 64330 78633 83276
1008 83276 -291225 17871 98788 -178242 -120048 69335 148071 122591 22887 -56916 90297
997 90297 117006 216546 99267 -167335 -128527 71744 -42549 -52111 56219 9166 154393
986 154393 14211 -114969 -96383 -94049 -12018 -190163 -118464 -68105 -331864 -205921 116572
975 116572 -41607 -11622 75121 288777 282632 -71601 -338046 -335440 -223920 -60341 -157818
964 -157818 -409508 -217321 21559 158888 -8374 50560 -36273 -9538 -131206 -109967 45625
953 45625 -97933 19755 89228 281568 -3367 -182456 -176984 107728 -8563 -94655 121031
942 121031 169029 -7468 -126913 -122583 -30981 152605 -9963 -295458 -108602 142449 64733
931 64733 -21482 23476 106987 44052 -85014 -37518 201932 -75427 -46779 -11757 -69900
920 -69900 -202992 -98798 -77602 3895 -184862 -113541 -11248 -40953 -214968 -209064 -723
909 -723 -126492 84958 -51233 -169266 -101581 -249148 -83890 -146249 1130 39996 -89546
898 -89546 -244988 -254899 -121917 -166341 -250516 -181661 42821 117600 117434 -115464 7459 94035
886 94035 50302 -160814 88659 118239 -59242 -54985 -43215 -296879 -302794 -48333 -99703
875 -99703 -77718 24622 45578 -81629 -226554 -436051 -110886 -226228 -55204 -28423 81021
864 81021 190954 -51015 -231870 -172610 113496 98364 10317 -143874 -160224 -106159 68857
853 68857 223435 391558 286183 215294 -38495 -321883 -309608 -201607 91821 173767 150303
842 150303 139243 166619 186029 101200 101157 -256098 -421619 -400422 -424536 -160756 -205145 -200316
830 -200316 90222 -242509 38592 105615 225236 50959 -24713 -125405 -108567 9096
820 9096 -10726 -47750 -40466 -101640 -238447 -162340 -303346 -398772 -502423 -415194 -208237 -53067
808 -53067 -31727 38541 -197028 -273460 -155244 -151532 -269643 -294330 -370375 -405177 -367821 -420177
796 -420177 -57659 298898 -9551 76554 -16385 16586 -9653 -73986 183122 124516 55119
785 55119 126143 -10551 79832 44866 3567 -6356 -64414 -8192 -113565 -325992 -141504
774 -141504 -90182 -50271 -89812 -102366 44778 93980 -78109 -150096 -250702 -298031 -237934
763 -237934 -275293 -202997 -140841 22619 -118274 -8317 56969 -118622 -243504 -282158 -156147
752 -156147 48888 -166553 -20918 -52604 -118759 -304966 -269008 -94473 -180069 -19744 286297
741 286297 157728 -77865 -253734 -242948 5293 10340 -67991 -60145 197211 147564 48448
730 48448 147205 -85467 -162757 -141113 -199506 -158688 -309525 -494734 -293178 -66736 158027
719 158027 35005 -310496 -174571 211474 34196 -32520 147340 153964 435535 352149 312651
708 312651 228986 138584 31492 123869 -120859 -84666 60484 -139932 -234776 -3561 26490
697 26490 -208766 22367 -130426 -314918 -180898 94388 45344 -218991 -92018 -185732
687 -185732 -239860 -391151 -166072 38536 -109971 -235346 -262389 -224346 -107881 -183566 -92941
676 -92941 -33823 -184861 -199838 -18519 75433 64619 -137286 -289370 -234870 -342581 -511166
665 -511166 -464858 -85558 -199503 -40026 68564 196489 80755 225526 -11503 -155232
655 -155232 -77287 -30257 78085 -120978 -102340 56751 -81786 -98090 -14859 -261347 -321427
644 -321427 5101 57890 -19208 86590 -91081 -56357 -153107 16998 119776 181375 56292
633 56292 -136284 -58277 -123637 33044 95369 14638 -95071 -125250 -46731 -215371 32134
622 32134 43977 -24911 38671 143568 51227 -85367 -76490 -183482 -18390 8760 -946 -94217
610 -94217 -54769 199586 23844 193902 111332 -31213 11363 76636 -53967 -259264 -579722
599 -579722 -441567 -291891 -113146 67091 -112059 -291483 -306451 -154438 -116656 34345
589 34345 21949 220921 -193039 -538521 -344523 -312352 -468361 -396174 -288514 -318053 -367445
578 -367445 -85620 106717 231801 -76685 -90443 23389 94037 -85087 -203488 -300469
568 -300469 -96181 -57618 -37309 -189872 -215873 26953 -200318 -401340 -416338 -362424 -252494
557 -252494 -45106 -121457 1434 24408 -166026 -215173 -251093 -259801 -230272 11134 1381
546 1381 -91 -178076 7151 146667 47466 23772 147841 248383 -64038 152727 59977
535 59977 -135743 -372523 -104675 144299 58814 -152295 -274602 -306706 -511 159787
525 159787 -76877 -257391 -313726 -238766 -168620 -283748 -369876 -165340 -68998 -82000 -324466
514 -324466 26638 122094 -120805 -146842 -168296 -207632 18634 285793 181293 99337 248672
503 248672 356757 5457 -7632 -26871 104037 -33098 -326125 -100783 96647 -178786
493 -178786 -125942 -318504 -220166 -45151 32482 25828 -126179 -315311 -319722 -144040 93204
482 93204 43986 -124211 -189672 -128072 74918 59803 84437 111431 275745 125594 34386
471 34386 92873 92855 90126 87038 -207228 -83014 -76475 -114941 -126723 68545 160944 57524
459 57524 -179422 -493206 -342712 -144595 174876 125082 -23394 -38070 4122 -105825 21161
448 21161 185564 21218 185886 105546 53182 88188 -2851 12068 16104 -87172 -69620
437 -69620 -37326 -71521 -139899 -262705 -338590 -322456 -29864 -291588 -321650 -106171 -1423
426 -1423 -81549 -126460 -66757 -94409 -355323 -416188 -354037 -395658 -291452 -109528 -56724 -106387
414 -106387 -148478 -166945 -224516 -200730 -209698 -273608 -263075 -201211 -194694 -305756 -86236 57182
402 57182 -113085 -58622 -44582 -122306 27235 -7480 -35148 -422401 -369150 -178088 -85551
391 -85551 139774 218841 20097 31141 -40436 9439 -151977 -197687 -304951 -330648 -278004
380 -278004 -266283 -58301 -100265 -227854 -464462 -239540 -161388 -237937 -387011 -329927 -192403
369 -192403 -116271 105093 -60765 -228149 -393025 -157304 -78009 180462 206341 -202704
359 -202704 -278133 -227150 -55612 279444 86313 -216619 -174262 -372492 -303466 -306713 -65415
348 -65415 -167290 -218776 -54027 -108600 -98118 -254501 -189595 -27803 -208648 -350582 -414653
337 -414653 -616522 -350836 -76637 -55305 -291498 -102768 -123484 23044 -89984 -233015
327 -233015 -127507 -225417 -106218 -60412 -151494 -3390 115663 2418 -179640 -386813
317 -386813 -257332 -209991 13788 231005 249018 196218 159932 -241587 -357242 -231204 -316732
306 -316732 -156807 54642 146572 149286 163981 72942 62785 -130491 5460 46108 -28793
295 -28793 136693 -113246 -148724 -330423 -345783 -409928 -135797 -315541 -290780 -89130 -151435
284 -151435 -78240 -1678 -59567 -160216 -307629 -145168 -211280 -117025 -146392 -120065 -193492
273 -193492 -81183 -94486 23 -33229 -375923 -358673 -137042 -97975 -100274 -347813 -444305
262 -444305 -316468 -294602 -192125 -65083 -163651 -275665 -388426 -571753 -246755 -158021
252 -158021 -196561 -400815 -414188 -83731 15356 -46690 74879 187264 180824 -141610 -172032
241 -172032 -274197 -272120 -145675 -157107 -65765 -118352 -199591 -135641 -90895 -213255 -319069
230 -319069 -359247 -341691 -293716 -238328 8550 -136881 -232016 -222586 -186128 -294590 -409097
219 -409097 -407528 -164037 -183808 -36672 -35063 150258 -81901 -28628 -43627 -294956 -316568
208 -316568 -166009 -154224 -175057 33898 76961 -137483 -105802 93440 -140497 -49554 15914
197 15914 -73781 88943 174201 103278 2658 2246 241208 117089 14498 157751 27826
186 27826 -118128 -248156 -206348 -35919 -106736 -77007 -12198 -30444 -111908 -295742 -92963
175 -92963 19628 47818 -178348 -208165 95744 -148816 -265148 -255208 -255211 -171629 -106627 -306579
163 -306579 -240467 -186285 -233010 -246579 -239083 -302164 -149769 -111642 -186009 -279643 -456873 -559524
151 -559524 -498388 -336363 -226249 -185974 -87402 -327316 -263225 -1516 -88822 37985 22536
140 22536 64846 7300 -122331 -83707 -271571 -124651 -104815 -137346 -138748 -113148 -230512
129 -230512 -198959 -152059 -132290 -211897 -211735 -134612 -250905 61099 -4880 -28997 -134144 -47806
117 -47806 -278836 -332025 -198272 -166487 -32300 -87470 -52608 -63476 12510 7640 -361163
106 -361163 -132538 58902 48838 -56137 -207896 -136809 -175546 -196534 -264579 -196521 -300860
95 -300860 -154980 -85050 -78522 -144351 -73946 -243129 -86071 -84785 -187696 -87082 67016
84 67016 70233 -172961 -381832 -264747 -198788 -140089 -167684 -303152 -189944 -137386 -173732
73 -173732 -120395 -175305 -42099 -39503 -90644 -136513 -154896 -56438 -20553 -191587 -339445 -414524
61 -414524 -339276 -180500 -93424 117417 40179 52576 5741 -49681 -173300 -86417 -104347
50 -104347 -93514 -55567 -75533 -231636 -207563 -204137 -239530 -188279 -131168 -86132 -91349 -92294 -86807
37 -86807 -186610 -86505 -106527 -203789 -185463 -147876 22111 -114388 -253452 60443 -3948
26 -3948 -167909 -136431 -54537 -179150 -290595 -189296 -224422 -179886 -120248 -216944 -165707 -155432
14 -155432 -160950 -102328 -45297 -17613 -1586 -63616 -51808 -160866 -303736 -254463 -158699 -82188
2 -82188 -54140 -217838
0 -217838
$$ Imaginary data points
##PAGE= N=2
##DATA TABLE= (X++(I..I)), XYDATA
16383 -4113627 -4066978 -3862833 -3817015 -3800187 -3712254 -3622694 -3562987 -3508276 -3437893 -3212508 -3280329
16372 -3280329 -3392534 -3331355 -3169768 -3111889 -3109768 -3190216 -3099430 -2889430 -2898369 -2958567 -2864944
16361 -2864944 -2816410 -2804978 -2669130 -2668220 -2826379 -2741106 -2505672 -2331246 -2418620 -2453523 -2216082
16350 -2216082 -2163784 -2140710 -2272284 -2166078 -2052766 -1748019 -1638626 -1686916 -1573739 -1470041
16340 -1470041 -1446799 -1438818 -1654227 -1622015 -1354592 -1179697 -1127112 -1281890 -1272117 -1165856 -1105407
16329 -1105407 -1048701 -927542 -877074 -711869 -579897 -688025 -717543 -639893 -564219 -535462
16319 -535462 -397722 -211025 -122605 -105118 -302138 -121890 -26770 102112 125033 231996
16309 231996 418127 429822 290293 197030 283638 345498 499093 576479 693004 692874 574107
16298 574107 646458 727865 640918 624331 789526 814209 955463 953029 940842 1156662 1121543
16287 1121543 1111884 1162872 1114372 1050439 1033595 1076731 1124789 1163478 1500339 1498805 1722001
16276 1722001 1826353 1799277 1743061 1741393 1833571 1838554 1704089 1885669 2066024 1870362 1971935
16265 1971935 2016028 1973647 2177947 2034445 2067989 2281230 2277972 2314185 2408233 2457951 2378283
16254 2378283 2485607 2514155 2640953 2636415 2726712 2842570 2831315 2677620 2760732 2938186
16244 2938186 2787261 2636458 2906965 3003589 3101512 2959259 2786364 2844571 2912997 3042235
16234 3042235 3169039 3059249 2939773 2805747 2815057 3256991 3215265 3247138 3214403 3338508
16224 3338508 3356521 3232948 3307782 3458589 3484478 3239173 3316908 3586690 3601284 3450089
16214 3450089 3587997 3887579 3719042 3653722 3623833 3665174 3724495 3554996 3696895 3832095
16204 3832095 3979744 3952974 3973733 3874707 3780914 3859117 3908477 3800974 3968943 4019418 3903360
16193 3903360 4133844 4246020 4319751 4065988 3966355 4071021 4077967 4261931 4527623 4359509
16183 4359509 4383115 4330331 4245978 4262543 4178953 4145493 4312087 4349342 4444280 4451468 4111317
16172 4111317 4145975 4296293 4291685 4302125 4717367 4659797 4768360 4867129 4806893 4865566 4764584
16161 4764584 4620761 4415644 4488310 4586505 4492102 4279074 4383553 4462080 4535464 4662418
16151 4662418 4353229 4542813 4851489 4737064 4606969 4584433 4639111 4533770 4503503 4495321
16141 4495321 4541996 4844557 4827828 4796641 4751754 4960308 5081958 5066875 5091149 5150681 5342443
16130 5342443 4999027 4820347 4778313 5012636 4891126 4901771 4961709 4832267 4789503 4864958
16120 4864958 4774530 4835775 4920759 4799938 4942208 4942139 5251114 4944006 4633937 4868451 5034615
16109 5034615 5107318 4833668 4836304 4826139 4773790 4686709 4916179 5205669 5230683 5326630 5303190
16098 5303190 5126147 5150154 5247857 5031273 5170668 5231855 5215577 5094950 5046107 5132081
16088 5132081 5267327 5435168 5308684 5126884 4998876 5077664 5195054 5271818 5365612 5366111
16078 5366111 5590439 5367776 5212614 5321444 5440492 5350814 5329141 5359161 5123770 4976344
16068 4976344 5271112 5286255 5150120 5336093 5211551 5145604 4942089 5122686 5130274 5052419
16058 5052419 5211271 5311809 5186281 5312148 5409559 5349679 5333606 5140349 5088410 5230890
16048 5230890 5522823 5269119 5155285 5080828 4983383 5141660 5017816 5125121 5248495 5397575
16038 5397575 5234530 5045944 5218472 5080538 5151931 5395963 5094610 5030208 5305014 5321727
16028 5321727 5244811 4916073 5025501 5018619 5137649 5239572 5287694 5101389 5207749 5345366
16018 5345366 5565623 5432491 5318607 5466080 5206767 5161824 5001904 5301515 5317122 5309236
16008 5309236 5535183 5323991 5291382 5315391 5358446 5234742 5282481 5508085 5486092 5502324
15998 5502324 5299566 5185760 5221638 5535544 5428577 5485829 5388310 5592582 5418561 5315546
15988 5315546 5348648 5365807 5101780 5236501 5341031 5233709 5429140 5490894 5508301 5479341
15978 5479341 5463671 5328573 5497929 5595241 5361516 5266991 5239815 5156798 5336377 5506279
15968 5506279 5571762 5500932 5486974 5601265 5658633 5429100 5437494 5263095 5366066 5438960 5272274
15957 5272274 5251271 5374813 5187365 5194597 5321105 5379742 5395033 5296578 5382401 5348445 5348818
15946 5348818 5379813 5338437 5179558 5109113 5188363 5585266 5571237 5472962 5590223 5532015 5588171
15935 5588171 5488344 5313219 5425062 5689225 5694679 5625625 5648549 5402581 5289399 5346557
15925 5346557 5184172 5263951 5386849 5463451 5457208 5571652 5571622 5523189 5418019 5018877 4991511
15914 4991511 5237984 5230171 5478205 5493443 5276830 5318226 5305850 5071134 5471685 5616524
15904 5616524 5600101 5386944 5216398 5250194 5494915 5470755 5224694 5264304 5380483 5382500
15894 5382500 5193824 5240385 5237112 5160821 5308668 5254865 5148603 5369213 5537472 5455992
15884 5455992 5264856 5535952 5575597 5444626 5675234 5584608 5502431 5653140 5579913 5598509
15874 5598509 5721745 5581913 5315997 5583557 5464103 5496370 5555077 5372057 5108047 5170678
15864 5170678 5160359 5217536 5321786 5317907 5385472 5269982 5140739 5281808 5350479 5165742
15854 5165742 5135404 5221477 5226959 5331902 5568769 5699318 5531052 5419122 5549236 5380960
15844 5380960 5351841 5406520 5342664 5373964 5380640 5404262 5322422 5247014 5183012 5261393 5555658
15833 5555658 5549028 5197614 5460979 5340327 5226212 5191759 5166937 5220960 5332553 5290478
15823 5290478 5503744 5607675 5423177 5443601 5264863 5497859 5339798 5092570 5056717 5053701
15813 5053701 5286794 5349186 5124155 5160653 5294967 5130342 5228949 5492407 5375267 5387929
15803 5387929 5283313 5362308 5311746 5185004 5122888 5369758 5204424 5188217 5452115 5464773
15793 5464773 5308883 5315731 5229590 5328892 5347195 5420335 5412611 5318015 5413452 5461532 5465432 5303176
15781 5303176 5281114 5467414 5665727 5297897 5408522 5375377 5443903 5448122 5279737 5223047
15771 5223047 5312278 5403017 5336400 5157711 5374882 5133590 5199187 5510144 5347970 5427315
15761 5427315 5517530 5641648 5632760 5609448 5588496 5584815 5619855 5781661 5823514 5762721 5662903
15750 5662903 5475160 5396431 5525985 5494865 5416501 5187464 5010676 5373206 5565930 5396785
15740 5396785 5242846 5168113 5434515 5346522 5429706 5604758 5522558 5539371 5393594 5380327
15730 5380327 5485071 5414092 5361488 5072560 5131830 5379226 5308383 5343315 5295867 5342036 5306668
15719 5306668 5222583 5339308 5313348 5554729 5356388 5215222 5415989 5530677 5374624 5272987
15709 5272987 5353342 5372785 5358473 5514251 5364041 5740458 5739550 5559969 5438300 5200706
15699 5200706 5248472 5287001 5387731 5472164 5488958 5581685 5844718 5545190 5511286 5673169
15689 5673169 5576653 5576592 5601396 5399089 5265090 5306056 5431262 5317684 5492577 5383455 5613901
15678 5613901 5419980 5083889 5052344 5124876 5322169 5384720 5425916 5401898 5305156 5360996 5306772
15667 5306772 5535172 5404345 5316634 5400099 5260262 5217442 5343560 5346933 5493895 5644967
15657 5644967 5500487 5533737 5499199 5424424 5599693 5684354 5419314 5241749 5205047 5431860
15647 5431860 5446453 5383276 5316916 5466943 5334756 5418942 5552314 5508722 5406545 5321464
15637 5321464 5358491 5291852 5471392 5558749 5617635 5426696 5274808 5247696 5456025 5354914
15627 5354914 5249820 5252896 5344044 5499193 5517519 5638352 5516962 5478004 5435529 5294543
15617 5294543 5301516 5290273 5400057 5496987 5079749 5141795 5394580 5220643 5234086 5276983 5291787
15606 5291787 5346927 5296674 5523306 5604853 5443731 5489712 5635812 5625546 5418295 5514990
15596 5514990 5615049 5423055 5438052 5631374 5590060 5433018 5589418 5529216 5557695 5405221
15586 5405221 5507591 5597780 5555902 5580714 5606090 5645776 5693942 5662519 5664981 5528558 5556668
15575 5556668 5608359 5560357 5591898 5359337 5404537 5602245 5616889 5645346 5584675 5382190 5499266
15564 5499266 5643071 5479476 5545518 5740401 5645247 5543111 5541400 5397073 5354988 5392703
15554 5392703 5693690 5487939 5522433 5691361 5460436 5393849 5094393 5381673 5628111 5507814
15544 5507814 5445314 5475026 5441812 5518331 5439632 5587435 5717561 5685788 5555803 5429971
15534 5429971 5600420 5900815 5981526 5975174 5598023 5757824 5594432 5676610 5758311 5795439
15524 5795439 5840102 5609046 5693678 5393571 5466507 5436799 5603990 5868614 5975505 5755942
15514 5755942 5724759 5462420 5525861 5579629 5473050 5651716 5581459 5645004 5670565 5602138 5533911
15503 5533911 5870110 5556925 5417122 5378746 5243856 5153593 5328099 5597221 5741427 5542828
15493 5542828 5288127 5415295 5388645 5642865 5626472 5403413 5490753 5403312 5642073 5832855
15483 5832855 5562865 5715172 5755145 5916223 5711260 5309477 5457943 5538990 5702360 5876208
15473 5876208 5822523 5698140 5502059 5583059 5496465 5401916 5460808 5580388 5331671 5562233
15463 5562233 5769835 5738146 5540590 5638316 5842865 5715207 5719472 5469502 5160260 5562781
15453 5562781 5589659 5500522 5364740 5640425 5598378 5655539 5758913 5648774 5579025 5441770
15443 5441770 5519059 5462852 5710906 5532787 5421360 5485862 5675713 5466651 5634094 5665775
15433 5665775 5656113 5658925 5778859 5764508 5548663 5491420 5353618 5428118 5641946 5789629 5770484
15422 5770484 5744005 5804461 5501973 5500369 5694714 5695940 5765858 5921811 5614519 5356200 5440006
15411 5440006 5596997 5627716 5888195 5899703 5548461 5597563 5659333 5711007 5581851 5657698
15401 5657698 5845639 5924951 5903250 5778250 5795039 5761835 5738693 5434386 5469104 5735299
15391 5735299 5675768 5616697 5705028 5566780 5299718 5517395 5678965 5822036 5771049 5562647
15381 5562647 5552088 5667548 5749243 5704151 5762405 5711609 5703617 5728449 5682328 5712111 5675992
15370 5675992 5464234 5814116 5893449 5545019 5640840 5681047 5685591 5520940 5551432 5371050
15360 5371050 5210798 5410376 5542083 5426035 5354803 5420182 5413843 5655121 5650420 5518308
15350 5518308 5273593 5334519 5498367 5401053 5509401 5425478 5454450 5595064 5672833 5591849
15340 5591849 5970711 5977578 5572549 5658807 5833115 5752166 5676586 5703277 5954982 6007979 5755536
15329 5755536 5575271 5624323 5722524 5854942 5932181 5938279 6119384 5863507 5742393 5905762
15319 5905762 5888518 5730620 5835327 5995217 6125497 5986034 5903531 5857557 5928687 6061575
15309 6061575 5960479 5774242 5836781 5824342 5857225 5716335 5801076 5891411 5672234 5543775
15299 5543775 5397232 5593543 5593283 5873200 5933193 5513526 5474744 5972015 6154953 5842399
15289 5842399 5480596 5498900 5501066 5546970 5590516 5735603 5836758 5605993 5497624 5500626 5666053
15278 5666053 5765824 5747362 5981191 5802183 5518865 5788039 5910217 5743309 5879952 5815635
15268 5815635 5503552 5643828 5531100 5584132 5682733 5642252 5816046 5706290 5549747 5530770
15258 5530770 5797115 5561059 5629816 5471442 5398357 5612331 5615347 5616764 5604531 5530262 5808829
15247 5808829 5628589 5672537 5680442 5490975 5448922 5609637 5885421 5565833 5836667 5833384
15237 5833384 5892056 6093111 5881036 5836027 5734415 5381721 5507467 5786693 5697903 5833477
15227 5833477 6004316 5759636 5788781 5651879 5471585 5692531 5647425 5683483 5863289 5627196
15217 5627196 5816598 5794013 5815019 5783341 5656328 5873426 5927931 6059415 6167705 5877523
15207 5877523 5828161 5654876 5765193 6022390 6034226 5770099 5775035 5825991 5470710 5582795
15197 5582795 5655463 5617108 5670001 5600613 5729303 5995231 6016501 5904676 5626581 5504802
15187 5504802 5670089 5477560 5564132 5746062 5851080 5893604 5845922 5815916 6017204 5746903
15177 5746903 5589955 5799057 5764861 5452496 5441642 5620503 5657658 5666151 5694042 5623729 5506842
15166 5506842 5807761 5996230 5752816 5632301 5666731 5683831 5975316 5964732 5820261 5810982
15156 5810982 5787437 5703424 5673548 5835701 5851905 5943655 5818564 5592323 5566046 5716618
15146 5716618 5822797 5673710 5551936 5526026 5680436 5641432 5572257 5689288 5610578 5702259
15136 5702259 5698474 5793398 5739957 5557951 5691269 5730636 6012894 6043046 5872314 5700041
15126 5700041 5774068 5472904 5546918 5645209 5690855 5662980 5765621 5857171 5866266 5820384 5711915
15115 5711915 5855907 5743429 5829108 5846004 5762498 6064483 6069737 6009012 6011991 6073559 5911784
15104 5911784 5796646 5816794 5768042 5858526 5821115 5728615 5670077 5663008 5734757 5748820 5901173
15093 5901173 5712723 5727191 5932705 6084339 5920666 5808672 5825212 5834855 5735559 5435233
15083 5435233 5338086 5713025 5684028 5626780 5654226 5635011 5708042 5698863 5696882 5674044 5675513 5826128
15071 5826128 6067270 5728816 5836053 6011381 5936865 6012692 5879104 5812900 5810158 5720534
15061 5720534 5911906 5991228 5848402 5892381 5773208 5708670 6037355 5857733 5833936 5728226
15051 5728226 5590273 5506800 5755724 5806422 5880692 5935166 5807873 5554207 5530741 5799043
15041 5799043 5949077 5981403 5844086 5880331 5815632 5755991 5761947 5912455 5969660 5937762 5842813
15030 5842813 5991803 5877710 6069481 6292962 6279904 6166031 5974186 5759411 5570804 6016010
15020 6016010 5996513 5700140 5696718 5733496 5753057 5823427 5923193 5814460 6056736 6152933 6011900
15009 6011900 5786779 5619535 5772223 5690661 5785866 5875691 5963108 5737742 5797726 5785477
14999 5785477 5802480 5860076 5622744 5669790 5712146 5682081 5769035 6001875 6280598 5953082
14989 5953082 5987327 5959942 5845191 5802025 5760006 5793580 6144752 6077582 5926264 6044799
14979 6044799 5983837 5937323 5763960 5695594 5804577 6182611 6028486 5943140 6118518 6110280
14969 6110280 6022787 6071028 6197044 5988391 6136957 6264283 6015250 6105310 6134882 5997031
14959 5997031 6013784 6112725 6147475 5828028 5615062 5666510 5798084 5911406 5919965 5907549 5872871
14948 5872871 6050544 5803219 5642538 5769976 6064036 6003427 5904053 5767010 5694714 5744583
14938 5744583 5862723 5924408 5828050 6095615 5892440 5832376 5748617 5521700 5756327 5910365
14928 5910365 6048430 6064226 6075416 5853636 5783172 5885485 6020960 6228279 6124452 5960629
14918 5960629 5998467 5802468 5856073 6130629 6136833 6051748 6124122 6224124 6253734 6147749 5943843
14907 5943843 5894417 6024786 6123875 6167172 5963539 6029401 6019414 5846390 5695404 5766782 5708451
14896 5708451 5572438 6024230 5999335 5824877 5945868 5863763 5923021 5883517 5957737 6091550
14886 6091550 5908315 6028198 6281866 6135396 6063632 6111844 6022215 6204812 6258558 6196118
14876 6196118 6269856 6147596 6253527 6188887 6164511 5945937 5806674 6142563 6346247 6336354
14866 6336354 6205888 6241508 6134084 5996175 6071134 5812139 5886228 5726422 5630127 6012993
14856 6012993 5774928 5793444 5745757 5886651 6121688 6091614 5902615 5754385 5802121 6047330
14846 6047330 6036716 6035009 6141167 5950975 5849390 5753687 6046419 6331774 5772548 5910959
14836 5910959 5987496 5864360 6001249 6149065 6010193 6012313 6103982 6143292 6039768 6140704
14826 6140704 5902645 5838758 5930421 5684440 5603277 5704729 5825736 5682269 5966471 6075318
14816 6075318 6050987 5992445 6003294 5795169 6189433 6194887 6083928 5821007 5748728 5979893
14806 5979893 5996526 5750350 5722636 5953173 5968353 5848240 5761793 6149624 5979049 6095770
14796 6095770 6362615 6199639 6110151 5886898 5781843 5943717 6050521 6075550 6042802 6021513
14786 6021513 5979531 5977067 5956142 6041436 6091048 5982022 6190587 6151451 6075621 6033676 6046815
14775 6046815 5924845 5865868 5957791 5833385 6026615 6068272 6083841 5958480 5990402 6085779
14765 6085779 6176068 5980018 5902044 5927933 6090445 6047341 6184857 6172608 6127001 6252548
14755 6252548 6173061 6028967 5928436 5928439 5989743 6046717 5966739 5859597 5841138 5884918 5962565
14744 5962565 6182177 6274023 6349614 6343277 6294714 6308795 5975525 5942937 5745706 5865752 6158572
14733 6158572 6084007 6082673 6019015 6211465 5999617 6130988 6065584 5959599 6032804 6018270 6095904
14722 6095904 6395694 6518689 6211509 6116513 5811774 5860329 5844128 5984829 6119176 6196572
14712 6196572 6178526 5749292 5945628 5872359 5897208 6144380 6223471 6220440 6253810 6068040 5846796
14701 5846796 5807357 5913689 6001747 6033237 5972872 6023058 6052702 5997212 6083978 6083641 5968398
14690 5968398 5990647 6048920 6098644 6101843 6183217 6075703 6115289 6171771 6198408 5925407 5751177
14679 5751177 6029156 6105053 6015265 6292544 6215884 6108308 6235345 6341318 6043516 6026986
14669 6026986 6046515 6260265 6177046 6076361 6312478 6225897 6412439 6072919 6162684 6368259
14659 6368259 6300806 6360868 6231420 6079856 6066575 6264352 6487859 6329758 6098904 5911697
14649 5911697 6135970 6251760 6047925 5880714 5991821 5859016 6010883 6065185 5742560 5927191
14639 5927191 6118622 5929626 5832403 5825185 6040076 6065115 6066954 6114682 6060746 6308640 6235741
14628 6235741 6100626 6063633 5940626 6046553 6022928 6010989 5929055 5883810 6103366 6104632 6350040
14617 6350040 6229223 6069014 6211141 6022257 6131615 6257699 6257098 6179958 6057902 6170698
14607 6170698 6251293 6201312 5994239 5980314 6093602 6064326 6166093 6390094 6354567 6236894
14597 6236894 6118751 6095561 6385275 6477960 6542071 6432414 6106697 5917953 5944616 5995115
14587 5995115 5972234 5898587 6319962 6377819 6009224 6058489 6354981 6170616 5928568 6321087
14577 6321087 6401311 6448469 6268448 6165721 6433829 6157147 6042245 6085111 6246780 6160321
14567 6160321 6124184 6182997 6003310 6023723 5765050 5863803 6156313 6237648 5991670 5787304
14557 5787304 5862893 5972134 5955759 6220379 6260219 6332420 6469173 6443567 6439223 6336779 6250126
14546 6250126 6153492 6218027 6360829 6297676 6354976 6374368 6383947 6388563 6413348 6304129 6016628
14535 6016628 6096400 6104559 6053985 6075038 6289181 6384937 6266846 6001315 6018019 6120067 6043819
14524 6043819 6065262 5979758 5945255 6081077 6047831 6163500 6330264 6116521 5975300 6368039
14514 6368039 6312633 6207965 6047823 6121267 6212942 6383508 6423214 6429522 6295815 6262738 6177736
14503 6177736 6273303 6371144 6335874 6379208 6318256 6195076 6096379 6243888 6084540 6131371 6133109
14492 6133109 6300250 6389752 6378708 6286099 6405588 6384549 6320500 6288644 6114321 6192701 6121115
14481 6121115 5953711 5905113 6004540 6134703 6330353 6560932 6324037 6362283 6175881 6453546
14471 6453546 6467277 6328819 6236967 6133993 6326051 6296736 6312997 6083112 6216960 6267546
14461 6267546 6247838 6502855 6374170 6289602 6402011 6298795 6143778 6041041 6178362 6399567
14451 6399567 6224312 6210732 6385155 6358284 6172528 6026478 6155792 6405287 6710146 6645037
14441 6645037 6430952 6519932 6292803 6039709 5938964 6167345 6266422 6442260 6251548 6359544
14431 6359544 6254998 6338383 6423793 6234954 6167679 6139341 6135776 6330305 6490334 6440774 6145829
14420 6145829 6242656 6387285 6194489 6220087 6273518 6549948 6395086 6408455 6196638 6275397
14410 6275397 6374005 6261198 6212013 6341471 6519588 6611822 6382450 6205626 6377247 6414481
14400 6414481 6181356 6084501 6036170 6419898 6367784 6370738 6533368 6336922 6251821 6354921
14390 6354921 6344839 6312027 6067721 6347705 6410668 6351669 6407931 6451094 6345631 6367376 6421825
14379 6421825 6385500 6442837 6420827 6345937 6419593 6179023 5686359 5709915 6001410 6177658
14369 6177658 6146731 6324706 6271917 6147591 6150474 6146321 6291223 6383048 6129081 6293492 6471283
14358 6471283 6638932 6474329 6461578 6216707 6282906 6165138 6210392 6400677 6335204 6392687
14348 6392687 6231136 6329199 6368783 6507760 6608209 6351142 6421573 6385711 6301690 6317610
14338 6317610 6495886 6371441 6231394 6333958 6315028 6696693 6597265 6726940 6808573 6720852
14328 6720852 6417736 6449907 6263773 6435848 6335174 6274834 6433904 6438111 6468849 6412950
14318 6412950 6310534 6417020 6562296 6283036 6146386 6425350 6346869 6267843 6220913 6296177
14308 6296177 6349947 6378651 6526143 6414191 6389254 6355187 6450063 6412761 6354140 6134643 6232753
14297 6232753 6466214 6584234 6522651 6403039 6303986 6309748 6362678 6502815 6570438 6557118 6416432
14286 6416432 6471933 6157516 6187790 6282920 6353690 6395694 6629782 6607618 6604027 6255704 6148317
14275 6148317 6179944 6249529 6344640 6481041 6435409 6205421 6257067 6421946 6576841 6475244
14265 6475244 6337918 6384808 6533923 6455100 6460139 6474832 6407171 6428115 6441641 6232577 6283928
14254 6283928 6284069 6167778 6147781 6099497 6057387 6528246 6671898 6556514 6399211 6379981 6264767
14243 6264767 6305697 6464717 6680711 6596628 6585120 6583361 6551184 6803348 6712394 6529302 6344330
14232 6344330 6515885 6669368 6572678 6446977 6487515 6496340 6247889 6366307 6534084 6636613
14222 6636613 6404820 6324859 6370770 6232107 6426047 6524621 6401195 6307921 6389353 6358290
14212 6358290 6518423 6517706 6369267 6377530 6466279 6657148 6578708 6506623 6487076 6532531 6438895
14201 6438895 6222274 6180622 6341207 6328458 6378115 6282933 6022959 6214323 6267371 6243061
14191 6243061 6715095 6610987 6647374 6526033 6388061 6514919 6628071 6835806 6405220 6407534
14181 6407534 6604095 6592623 6480879 6764528 6646425 6590749 6658514 6698639 6559777 6507767
14171 6507767 6326008 6397236 6485644 6436760 6429600 6478082 6597334 6704737 6940309 6684088
14161 6684088 6481594 6591329 6516537 6610732 6695709 6704287 6620797 6766742 6594610 6450222
14151 6450222 6626972 6530196 6353656 6004408 6105388 6261304 6331633 6199126 6455799 6498379
14141 6498379 6320033 6187698 6364467 6682957 6706775 6793433 6955725 6681385 6984032 6920988
14131 6920988 6511959 6462590 6589835 6479300 6626869 6648716 6549908 6615176 6664906 6562974
14121 6562974 6498098 6612226 6583874 6742732 6834424 6605408 6520231 6244191 6559541 6648496
14111 6648496 6551779 6439424 6603806 6817623 6604626 6518496 6674203 6584578 6420720 6385017
14101 6385017 6225611 6517530 6639252 6967140 6696738 6822845 6679930 6632493 6669777 6608800
14091 6608800 6646655 6572545 6508523 6776812 6548382 6435547 6634302 6446386 6564941 6581368
14081 6581368 6582964 6426078 6395620 6444190 6327519 6317252 6411571 6320440 6441729 6334496 6259263
14070 6259263 6248586 6559894 6558881 6173538 6271914 6454861 6547512 6341967 6504643 6617125
14060 6617125 6733512 6728096 6781960 6638143 6675877 6661080 6707402 6525120 6604267 6741488 6816165
14049 6816165 6798044 6799782 6741451 6529692 6496282 6600462 6636737 6596997 6486253 6412727 6442486
14038 6442486 6283731 6527060 6756276 6791545 6819978 6892974 6856244 7123628 6927223 6811792
14028 6811792 6852280 6862104 6700629 6522502 6355638 6295851 6350602 6492571 6318832 6483005
14018 6483005 6636113 6731105 6913089 6918476 6951142 6709784 6829629 6784406 6985555 6945181
14008 6945181 6898955 6716457 6874025 7009931 6994168 7015664 6961649 6804963 6816561 6809458 6754593
$$ [...]
##END NTUPLES=NMR SPECTRUM
##END=
