##TITLE=1H_CG-1175-2
 CDCl3
 8 sc, 
 31.8.2023
##JCAMPDX= 6.0         $$ Bruker NMR JCAMP-DX V2.0
##DATA TYPE= NMR SPECTRUM
##DATA CLASS= NTUPLES
##ORIGIN= UXNMR, Bruker Analytische Messtechnik GmbH
##OWNER= root
$$ XWIN-NMR		Version 3.5
$$ Thu Aug 31 13:59:26 2023 Russian Standard Time (UT+4h)  she@DPX200
##.OBSERVE FREQUENCY= 200.13135
##.OBSERVE NUCLEUS= ^1H
##.ACQUISITION MODE= SIMULTANEOUS
##.ACQUISITION SCHEME= undefined
##.AVERAGES= 8
##.DIGITISER RES= 18
##SPECTROMETER/DATA SYSTEM= spect
##.PULSE SEQUENCE= zg30
##.SOLVENT NAME= CDCl3
##.SHIFT REFERENCE= (INTERNAL, CDCl3, 0, 15.7304)
##AUDIT TRAIL= $$ (NUMBER, WHEN, WHO, WHERE, WHAT)
$$ ##TITLE= Audit trail, XWIN-NMR		Version 3.5
$$ ##JCAMPDX= 5.01
$$ ##ORIGIN= Bruker BioSpin GmbH
$$ ##OWNER= she
$$ F:/spectra/data/she/nmr/H-F/1/pdata/1/auditp.txt
$$ ##AUDIT TRAIL=  $$ (NUMBER, WHEN, WHO, WHERE, WHAT)
(   1,<2023-08-31 13:58:01.67 +0400>,<she>,<DPX200>,
      <created by zg, POWCHK disabled, PULCHK disabled
       configuration hash MD5:
       00 E9 B6 7A A2 85 ED C7 34 08 36 98 17 FE 4E 26
       data hash MD5: 16K
       8B E7 69 CB 96 F6 BE 36 71 53 C2 ED 60 ED A9 A8>)
(   2,<2023-08-31 13:58:04.45 +0400>,<she>,<DPX200>,
      <Start of raw data processing
       efp BC_mod = 2 LB = 0.24 FT_mod = 6 PKNL = 1 PHC0 = -21206.23 PHC1 = 9.65272 SI = 16K 
       data hash MD5: 16K
       47 77 D2 03 A4 F4 47 34 5F AF 79 AC 48 1C 94 CC>)
(   3,<2023-08-31 13:58:27.04 +0400>,<she>,<DPX200>,
      <pk PHC0 = 155.5591 PHC1 = 6.199999 
       data hash MD5: 16K
       E3 25 AA 59 CB 66 BD C9 40 53 A2 AB C2 72 1F 2E>)
(   4,<2023-08-31 13:58:30.45 +0400>,<she>,<DPX200>,
      <abs ABSG = 5 
       data hash MD5: 16K
       51 7E 66 89 3B B6 55 6A 12 AF 8F D2 34 AE 5F 7C>)
$$ ##END=
$$ 
$$ hash MD5
$$ 18 C0 B4 4B 44 D7 83 37 FA AF FA 8B BB 53 07 44
##$RELAX= 
##$RELAX= 
##$RELAX= 
##$RELAX= 
##$RELAX= 
##$RELAX= 
$$ Bruker specific parameters
$$ --------------------------
##$DU= <F:/spectra>
##$EXPNO= 1
##$NAME= <H-F>
##$PROCNO= 1
##$TYPE= <nmr>
##$USER= <she>
##$AMP= (0..31)
100 100 100 100 100 100 100 100 100 100 100 100 100 100 100 100 100 100 
100 100 100 100 100 100 100 100 100 100 100 100 100 100 
##$AQSEQ= 0
##$AQ_mod= 1
##$AUNM= <au_zg>
##$AUTOPOS= <>
##$BF1= 200.13
##$BF2= 200.13
##$BF3= 200.13
##$BF4= 200.13
##$BF5= 200.13
##$BF6= 200.13
##$BF7= 200.13
##$BF8= 200.13
##$BYTORDA= 1
##$CFDGTYP= 0
##$CFRGTYP= 5
##$CHEMSTR= <none>
##$CNST= (0..31)
1 1 145 1 1 1 1 1 1 1 1 1 1 1 1 1 1 1 1 1 1 1 1 1 1 1 1 1 1 1 1 1 
##$CPDPRG= <>
##$CPDPRG1= <>
##$CPDPRG2= <>
##$CPDPRG3= <>
##$CPDPRG4= <mlev>
##$CPDPRG5= <mlev>
##$CPDPRG6= <mlev>
##$CPDPRG7= <mlev>
##$CPDPRG8= <mlev>
##$CPDPRGB= <>
##$CPDPRGT= <>
##$D= (0..31)
0 1.2 0 0 0 0 0 0 0 0.06 0 0.03 0 0 0 0 0.0002 0 0 0 0 0 0 0 0 0 0 0 0 
0 0 0 
##$DATE= 1693475881
##$DBL= (0..7)
120 120 120 120 120 120 120 120 
##$DBP= (0..7)
150 150 150 150 150 150 150 150 
##$DBP07= 0
##$DBPNAM0= <>
##$DBPNAM1= <>
##$DBPNAM2= <>
##$DBPNAM3= <>
##$DBPNAM4= <>
$$ [...]
##$SUBNAM3= <"">
##$SUBNAM4= <"">
##$SUBNAM5= <"">
##$SUBNAM6= <"">
##$SUBNAM7= <"">
##$SUBNAM8= <"">
##$SUBNAM9= <"">
##$SW= 18.05172834244
##$SWIBOX= (0..15)
0 0 2 0 0 0 0 0 0 0 0 0 0 0 0 0 
##$SW_h= 3612.71676300578
##$TD= 16384
##$TD0= 1
##$TE= 0
##$TE2= 300
##$TE3= 300
##$TEG= 300
##$TL= (0..7)
0 120 120 120 120 120 120 120 
##$TP= (0..7)
150 150 150 150 150 150 150 150 
##$TP07= 0
##$TPNAME0= <>
##$TPNAME1= <>
##$TPNAME2= <>
##$TPNAME3= <>
##$TPNAME4= <>
##$TPNAME5= <>
##$TPNAME6= <>
##$TPNAME7= <>
##$TPOAL= (0..7)
0.5 0.5 0.5 0.5 0.5 0.5 0.5 0.5 
##$TPOFFS= (0..7)
0 0 0 0 0 0 0 0 
##$TUNHIN= 0
##$TUNHOUT= 0
##$TUNXOUT= 0
##$USERA1= <user>
##$USERA2= <user>
##$USERA3= <user>
##$USERA4= <user>
##$USERA5= <user>
##$V9= 5
##$VALIST= <valist>
##$VCLIST= <CCCCCCCCCCCCCCC>
##$VD= 0
##$VDLIST= <DDDDDDDDDDDDDDD>
##$VPLIST= <PPPPPPPPPPPPPPP>
##$VTLIST= <TTTTTTTTTTTTTTT>
##$WBST= 1024
##$WBSW= 4
##$XGAIN= (0..3)
0 0 0 0 
##$XL= 0
##$YL= 0
##$YMAX_a= 178527
##$YMIN_a= -165915
##$ZGOPTNS= <>
##$ZL1= 120
##$ZL2= 120
##$ZL3= 120
##$ZL4= 120
##$ABSF1= 15.73698
##$ABSF2= -2.314869
##$ABSG= 5
##$ABSL= 3
##$ALPHA= 0
##$AQORDER= 0
##$ASSFAC= 0
##$ASSFACI= 0
##$ASSFACX= 0
##$ASSWID= 0
##$AUNMP= <proc_1d>
##$AZFE= 0.1
##$AZFW= 0.1
##$BCFW= 0
##$BC_mod= 2
##$BYTORDP= 0
##$COROFFS= 0
##$CY= -3
##$DATMOD= 1
##$DC= 0
##$DFILT= <>
##$DTYPP= 0
##$F1P= 0
##$F2P= 0
##$FCOR= 1
##$FTSIZE= 16384
##$FT_mod= 6
##$GAMMA= 0
##$GB= 0
##$INTBC= 1
##$INTSCL= 3.70164e-10
##$ISEN= 128
##$LB= 0.24
##$LEV0= 0
##$LPBIN= 0
##$MAXI= 10000
##$MC2= 0
##$MEAN= 0
##$ME_mod= 0
##$MI= 1.114404
##$NCOEF= 0
##$NC_proc= -7
##$NLEV= 6
##$NOISF1= 3.799351
##$NOISF2= 2.8
##$NSP= 0
##$NTH_PI= 0
##$NZP= 0
##$OFFSET= 15.73036
##$PC= 1
##$PHC0= -21050.67
##$PHC1= 15.85272
##$PH_mod= 1
##$PKNL= yes
##$PPARMOD= 0
##$PSCAL= 0
##$PSIGN= 0
##$REVERSE= no
##$SF= 200.130008241529
##$SI= 16384
##$SIGF1= 3
##$SIGF2= 2
##$SINO= 5.538805
##$SIOLD= 16384
##$SREGLST= <1H.CDCl3>
##$SSB= 0
##$STSI= 16384
##$STSR= 0
##$SW_p= 3612.71676300578
##$SYMM= 0
##$S_DEV= 0
##$TDeff= 16384
##$TDoff= 0
##$TI= <>
##$TILT= no
##$TM1= 0
##$TM2= 0
##$TOPLEV= 0
##$USERP1= <user>
##$USERP2= <user>
##$USERP3= <user>
##$USERP4= <user>
##$USERP5= <user>
##$WDW= 1
##$XDIM= 16384
##$YMAX_p= 323998879
##$YMIN_p= -1196732
$$ End of Bruker specific parameters
$$ ---------------------------------
##NTUPLES= NMR SPECTRUM
##VAR_NAME=  FREQUENCY,     SPECTRUM/REAL,   SPECTRUM/IMAG
##SYMBOL=    X,             R,               I
##VAR_TYPE=  INDEPENDENT,   DEPENDENT,       DEPENDENT
##VAR_FORM=  AFFN,          ASDF,            ASDF
##VAR_DIM=   16384,         16384,           16384
##UNITS=     HZ,            ARBITRARY UNITS, ARBITRARY UNITS
##FACTOR=    0.220516191357247, 1,           1
##FIRST=     3148.11708267185, 0,            0
##LAST=      -464.599680333929, 0,           0
##MIN=       -464.599680333929, -1196732,    0
##MAX=       3148.11708267185, 323998879,    0
$$ Real data points
##PAGE= N=1
##DATA TABLE= (X++(R..R)), XYDATA
$$ [...]
6285a03301j9751Q8437j33947k3646J65086j68770Q4828O3698K9224L62620j47378
6274A97100j10069j05972J15539n5889n5400l8708p5322J38101k0709L5284k1007
6263B948L6166L9884j44872J05654J56382n7902K3549q7292k44073j01752J33651
6252a37657J04316j0587j17444J74076L8597J009Q0173o2229j69568K35741J5433
6241A51860j1632J1046k7805j10404n4133M2268k6259j02214J54734R9153j08109
6230A8505p4821j38934J39335J66814j01661q1557Q553N1570r8309j60539P3378
6219a97666Q1637L74553m5185k80580o4563j37388k581L06804k21253J28923J19016
6208F1717R472l3519P9470k16322J50389r7219j663q0922j84904J11620R0721
$$ plain form
6285 -103301 -123052 -34615 -168562 -192208 -27122 -195892 -111064 -47366 -18142 344478 197100
6274 197100 87031 -18941 96598 40709 -14691 -53399 -128721 9380 -11329 23955 2948
6263 2948 39114 78998 -65874 39780 196162 138260 161809 74517 -169556 -271308 -137657
6252 -137657 -33341 -43928 -161372 12704 51301 52310 132483 70254 -99314 136427 151860
6241 151860 140228 151274 123469 13065 -41068 1200 -25059 -127273 27461 126614 18505
6230 18505 -56316 -195250 -55915 110899 9238 -72319 -63766 -12196 -110505 -271044 -197666
6219 -197666 -116029 258524 213339 -67241 -131804 -269192 -271773 35031 -186222 -57299 61717
6208 61717 71189 37670 117140 -99182 51207 -46012 -47675 -128597 -313501 -201881 -111160
6197a11160L1806J43491j14907K1166P9531k36801o0591K99103k07576K23206
6187F7268j3913k32208N4074n0033K19760Q048k81380Q1960n1407J8078N2980
6176a26773j98417J92796j45048J35981m3918L9765J59354L2969m3405M4588k18028
6165a70136J94927J38802j04336Q7996j57946j36451R9221j9650r2982N3154q54
6154a08255J8423K57922J1832k6427j08946K6865K1584J6881J01403p5915k22032
6143h6665J41361L3235J27642l608k07493q5123J73569n8907l0183k1956k29385
6132b47513J9687J66760J12802K20756M852j45202k69272k7218O5816j65182M6887
6121b16827J96855J26789L4939j37603q7417N3988p5908p0545o717Q3542R5084
$$ plain form
6197 -111160 -79354 64137 -50770 -29604 49927 -186874 -247465 51638 -155938 67268
6187 67268 53355 -178853 -124779 -174812 44948 52996 -228384 -146424 -197831 -179753 -126773
6176 -126773 -325190 -132394 -277442 -141461 -185379 -145614 13740 46709 3304 47892 -170136
6165 -170136 24791 163593 59257 147253 -10693 -147144 -47923 -67573 -160555 -107401 -108255
6154 -108255 -89832 168090 179922 153495 44549 71414 92998 109879 211282 135367 -86665
6143 -86665 54696 87931 215573 211965 4472 -80651 92918 34011 3828 -18128 -247513
6132 -247513 -227826 -61066 51736 272492 277344 132142 -137130 -164348 -98532 -263714 -216827
6121 -216827 -19972 106817 141756 4153 -83264 -29276 -105184 -175729 -182446 -98904 -3820
6110c820J32409j98666K0194J22700J80535k01585p8789j82341K233J21242q6793
6099a72681P4311l6919J4115J68578o8423m6575K2015q926L1010p1314j1512j33526
6087b39847J24165M5220O1199j24751L0105o2567J02621K1100n0465Q9807j84398
6076a87811L0956O1331k48717K50800K38591R3294J32554l12725K2677r7511k29827
6065b46388Q8829J59752J32353j1322N7047j02941j85266P6058k2340K94049k023
6054B37808Q4472l51015j48773J69700j172J50333p2265p4076K3955J4232j18804
6043h5605N9482L0139M5199K1325J1553l13927j09140K93852K47382j16256J6431
6032A00435j10622J9901K2933J15851l9928p0943k040O1012K0988j23385J27251
$$ plain form
6110 -3820 128589 -70077 -49883 72817 253352 51767 -27022 -209363 -207130 -85888 -172681
6099 -172681 -98370 -135289 -121174 47404 -21019 -67594 -45579 -54505 -23495 -94809 -106321 -239847
6087 -239847 -115682 -70462 -9263 -134014 -103909 -166476 -63855 -42755 -93220 -3413 -187811
6076 -187811 -156855 -95524 -344241 -93441 145150 238444 370998 58273 80950 -16561 -246388
6065 -246388 -157559 2193 134546 123224 180271 77330 -107936 -31878 -54218 239831 237808
6054 237808 322280 -28735 -177508 -7808 -8980 141353 69088 -4988 18967 33199 -85605
6043 -85605 -26123 4016 49215 70540 82093 -231834 -340974 -47122 200260 84004 100435
6032 100435 -10187 9714 32647 148498 108570 37627 35587 96599 117587 -5798 121453
6021A21453O599k01136m6238K86872P8796Q0062n7452j27770n2786q755j7387
6010F2258Q248n4081q258p8365K9036J41624K97446j1159j15676j49897P1219
5999A92395N6188m6921p1641j52129j36467j2925P8615j60874J23871L37579k8419
5988A79272R3135J28193N1546k63201q6286j10433J8368M0863j10923J16797M7040
5977A04371j60542j62896J13783K79260p0549K5616k42411j30888K39662j13490
5967a18084M3195n9051k0396r2483J11930J28164P5642J56121j19054j51923l7029
5956h2968L922l01734o180M9257j85266K84828J21542l0412J33946j3772j27366
5945a54203J61223k951p1093J7482m6510N8564L7968K56960o5648m5448n4954
$$ plain form
6021 121453 128052 -73084 -119322 167550 246346 326408 268956 141186 88400 79645 62258
6010 62258 70506 16425 8167 -70198 -41162 100462 397908 386749 271073 121176 192395
5999 192395 248583 201662 130021 -22108 -158575 -171500 -92885 -253759 -129888 207691 179272
5988 179272 272407 400600 452146 188945 102659 -7774 10594 51457 -59466 57331 104371
5977 104371 -56171 -219067 -105284 173976 103427 129043 -113368 -244256 -4594 -118084
5967 -118084 -74889 -133940 -154336 -246819 -134889 -6725 68917 225038 105984 -45939 -82968
5956 -82968 -79046 -380780 -386960 -337703 -522969 -238141 -116599 -147011 -13065 -26837 -154203
5945 -154203 7020 4069 -67024 -49542 -96052 -37488 480 257440 191792 146344 91390
5934I1390o7032j52333Q7509l2924n8827q2336j75787J64931O4563J17253J39766
5923I6173o4413j97071j9345M8467O6644K12297j22512k39614K6140J65716K17807
5912A90289j76677j47538R2781j08827K028M4626J75339J63844k01999M2332j99943
5901a23745K0421L2088K7437q4162J59162n8688j26124j9914J09996J56936K421
5890I5828m1394l7556o3702Q6212j89843J07875O5031m6237j43027N5942o4065
5879a74936J27110J58081j00939j15146R5026J42216L6051j13930o9129M542q007
5868a9061O3174K01099m6008j25116j35932L3039K00580j23576l8014k7305N4486
5857C7366P3439P7532j40562j50446p542P4780P2949j2110J09514p9881j46191
$$ plain form
5934 91390 24358 -127975 -40466 -73390 -132217 -214553 -390340 -225409 -160846 -43593 96173
5923 96173 31760 -165311 -184656 -136189 -69545 142752 20240 -219374 -193234 -27518 190289
5912 190289 13612 -133926 -41145 -149972 -147944 -103318 72021 235865 33866 76198 -123745
5901 -123745 -103324 -71236 -43799 -127961 31201 -27487 -153611 -173525 -63529 93407 95828
5890 95828 54434 16878 -46824 39388 -150455 -42580 22451 -23786 -166813 -110871 -174936
5879 -174936 -47826 110255 9316 -105830 -10804 131412 167463 53533 -15596 -11054 -19061
5868 -19061 44113 245212 199204 74088 -61844 -28805 171775 48199 10185 -17120 37366
5857 37366 110805 188337 47775 -102671 -110213 -35433 37516 25406 134920 55039 -91152
5846i1152q2578J03262K85282m583q5479k37771J21864K1657j26100k6922N7314
5835f5206P8373J57630m3492n7216r4860p9929p016k7855Q3449R2234R8652Q7246
5823B22010j28003j1414j47150J022J86008N2323l0612j569J28246k13339j37473
5812g9951K27208N4619j22244r4156K2665l7245J1780j5485K1923p7458K0078
5801f8266k00602Q9928L31056J82736j97743r5409j82684n4520J73310L8565j29994
5790a13623P9433P6762J553j83882J01905P9673r4118m1604J92675m21j04142
5779e789j91607q7231P1393N8684K3829J52254J55193k32978j16491O0325l7394
5768a49812L1554M7578K71497o9927j17667k3825p0679j17228j2151L3743J1136
$$ plain form
5846 -91152 -173730 -70468 214814 210231 124752 -113019 8845 30502 -95598 -122520 -65206
5835 -65206 13167 170797 127305 70089 -24771 -104700 -111716 -139571 -56122 36112 134764 222010
5823 222010 94007 82593 -64557 -63535 122473 174796 144184 142615 270861 57522 -79951
5812 -79951 147257 201876 79632 -14524 8141 -29104 -17324 -32809 -10886 -88344 -68266
5801 -68266 -268868 -178940 152116 334852 137109 41700 -140984 -195504 -22194 16371 -113623
5790 -113623 -34190 42572 44125 -139757 -37852 41821 -52297 -93901 98774 98353 -5789
5779 -5789 -197396 -284627 -213234 -154550 -130721 21533 176726 -56252 -172743 -112418 -149812
5768 -149812 -118258 -70680 200817 130890 13223 -10602 -81281 -198509 -210660 -176917 -165781
5757a65781P5528q3622J84471j25178m7926J8732m0419p3390K74486j2202j12158
5746a07459J7824j50431P7326J94031q5342J6171j2866q0618J6691P1268l1139
5735g4544j7361P4959J9053j89173J31785j23951n5036J27038J8304O646J50025
5724F7745P556j42139M6980j4824l2652J38420j0274j5146r6481K2853n4530o2168
5712a44660N1711n1343j09094M8748K2096O1900k2656L9922L6099N9618r9738
5701a07397j3050K10768O704r5201L2006R2829L4423j43955j6317m0554k4452
5690f4196m3925K721J64070J49152m4105L1143R6447k74257N91J83051j9717m5449
5678A35526M1615K13187k0188k31414j64873j23115p8017J51377p0759J88216
$$ plain form
5757 -165781 -90253 -173875 10596 -114582 -162508 -143776 -184195 -257585 16901 4699 -107459
5746 -107459 -89635 -240066 -162740 31291 -54051 -37880 -50746 -131364 -114673 -43405 -74544
5735 -74544 -91905 -16946 2107 -187066 -55281 -179232 -234268 -107230 -88926 -82280 67745
5724 67745 75301 -66838 -19858 -34682 -67334 71086 60812 45666 -50815 -27962 -82492 -144660
5712 -144660 -92949 -144292 -253386 -204638 -182542 -120642 -143298 -103376 -67277 -7659 -107397
5701 -107397 -120447 90321 97025 1824 33830 126659 161082 17127 810 -39744 -64196
5690 -64196 -108121 -105400 58670 207822 163717 194860 291307 17050 17641 200692 180975 135526
5678 135526 177141 390328 370140 138726 -26147 -149262 -227279 -75902 -146661 41555
5668D1555J88050n1148r9593j35167m494j51679l2507N1651M5357J12297j14326
5657a50004o5978M0339N4201K9119K45769J39l78840J44130p8464j69646J83540
5646a45695R9962j22382k2022O3411K74914J22027k52571R411j77868k2395L26584
5635A53376j27568Q2412K3046j50024k800K44838j67360j01943P4337O0978Q9652
5624A78944l686r8341M3019j7941n2158J30308J29707j65499O8647q8181r2615
5613C2204j71995j4143K78962K9054n9591k5786o3427K6447p5937J15876K3295
5602I4959m6321j38238J56776J21323k48344P485J16804r0098j47251J80360K07282
5591B14737j29946r3247P9955N4778R2175M9409j71177j32744J88225k04538J03557
$$ plain form
5668 41555 229605 178457 78864 -56303 -60797 -212476 -244983 -193332 -147975 -35678 -150004
5657 -150004 -215982 -175643 -121442 -92323 153446 153585 -225255 -81125 -159589 -329235 -145695
5646 -145695 -45733 -168115 -190137 -126726 148188 270215 17644 27055 -150813 -173208 153376
5635 153376 25808 108220 131266 -18758 -21558 223280 55920 -46023 28314 89292 178944
5624 178944 175258 76917 119936 101995 49837 180145 309852 144353 213000 124819 32204
5613 32204 -139791 -153934 125028 154082 94491 68705 5278 31725 -44212 71664 94959
5602 94959 48638 -89600 67176 188499 -59845 -52360 64444 -25654 -172905 7455 214737
5591 214737 84791 -8456 71499 126277 218452 267861 96684 -36060 152165 -52373 51184
5580E1184P7750N5047Q8183j04937k456O5297N1873J05136J49796k51892K11427
5569D96408q2734j79343r6508N5586R0566j65187k19478k6481J55274J40362J26499
5558B94964q167M0528k5749j10708j6014N1262L6061r6093k25407K08976r8067
5547E1586n1653J34207M4012O4679m3195j5689J1245k34784J30891M3578j28999
5536E878O7002R9650K52639o9076k4917O1011L4691K3236j75129j45416m2920
5525H6649K8145J1687p7089q1570O5319K9436J21613K27393n9976k07479J42992
5514B87120J86385o1331p0243p9043j05021L1414k499K75342P1261l97130j20723
5503A5532K535N9498O4228J55939p5932j7225J46153j04549J4071N480j00583
$$ plain form
5580 51184 128934 183981 272164 167227 164771 230068 281941 387077 536873 284981 496408
5569 496408 413674 234331 137823 193409 283975 118788 -100690 -127171 28103 168465 294964
5558 294964 286797 327325 301576 190868 174854 226116 262177 166084 -59323 149653 51586
5547 51586 -67 134140 178152 242831 199636 183947 195192 -39592 91299 134877 5878
5536 5878 72880 172530 425169 356093 331176 392187 426878 450114 274985 129569 86649
5525 86649 114794 126481 49392 -32178 33141 62577 184190 411583 351607 144128 287120
5514 287120 473505 412174 341931 262888 157867 189281 186782 462124 533385 136255 15532
5503 15532 18067 77565 141793 297732 221800 204575 350728 246179 260250 265730 165147
5492A65147J34450J25566m9792j18786j1877J79370j17450l6728L2362P8911j53657
5481B27516P5304K4003o1397P2612N4020R031K38205k96297k08716n3616J72514
5470B53179j08021R8238p9442j93703m14P7722N9829m5154J07088J43838j2525
5459C00635j09224k2481J13616P2291k0997m0207j57585R494K49913J34433j50953
5448C78935M2034J30779o0442k35823J59896J2820l9371n3372n6407j77857J68705
5437B69897j31976o4555J61098K40982l86j25891k0255n8235l31137N7865J37194
5426A34601l1107J23720J66331n2505l8942R1963J67494p6393n0305n8697j52260
5415B23900J94341j0026o8568k26634R1998K04549J65078L1652j12423k25754
$$ plain form
5492 165147 299597 425163 375371 256585 244708 424078 306628 269900 302262 381173 227516
5481 227516 302820 326823 265426 338038 392058 401089 639294 342997 134281 80665 253179
5470 253179 145158 243396 163954 -29749 -30163 47559 107388 62234 169322 313160 300635
5459 300635 191411 168930 282546 354837 333840 293633 136048 145542 395455 529888 378935
5448 378935 420969 551748 491306 255483 415379 428199 388828 335456 279049 101192 269897
5437 269897 137921 73366 234464 475446 475060 349169 328914 270679 -60458 -2593 134601
5426 134601 103494 227214 393545 341040 302098 394061 561555 485162 434857 376160 223900
5415 223900 418241 408215 339647 113013 205011 409560 574638 606290 493867 268113
5405B68113J34947J46704l77108J89759J29544j27311m9594J7718R1866k49567
5395A75071j10682K48118M676K60111J22462k20347j13686J58036P234j52981
5385C78012J5048n7136J98667J34236n6675n061k13804K19737Q2465k16298K6067
5374E05258j03045M3023R0195k4001M9910j16231J24879p8791r905q5082L4261
5363D30471j40383L6744L3893j831K7920q6747R1020L1869k11161R0190l6612
5352B65373p5592j03200n3214J12475P416K44905L9515r333k4399j21391q8705
5341A93850o7321m2367K71545q2216J00811L934R992o7779M3916r8147L2898P9245
5329C78361k38285j44432J48039N431J52927P7600l9608N814Q3932r2362o8584
$$ plain form
5405 268113 403060 549764 172656 362415 491959 364648 315054 332772 424638 175071
5395 175071 64389 312507 317183 577294 699756 479409 365723 523759 530993 378012
5385 378012 393060 335924 534591 668827 612152 607091 393287 613024 695489 479191 505258
5374 505258 402213 445236 535431 511430 561340 445109 569988 491197 481292 396210 430471
5363 430471 290088 326832 360725 358894 386814 300067 391087 422956 211795 301985 265373
5352 265373 189781 86581 33367 145842 153258 398163 437678 428345 403946 282555 193850
5341 193850 126529 84162 355707 273491 374302 378236 388228 320449 364365 266218 299116 378361
5329 378361 140076 -4356 143683 149114 302041 379641 340033 345847 429779 337417 268833
5318B68833N8294k583P7918j07539R9466j20732l6597L1050J72601J73574p8258
5307E36027K5601j3311O2256j45623j9021k86500N3781M3203j4158l4354K3082
5296B30983M6291L0536J19663l9874j3038j39399M5690J3859M7521J84862N5758
5285E82852M0239l29502n4284J40065m1238j02741Q5507m236L1104P5103j05768
5274C17101R9465L7255j41060R025P0812n3966J00561L3848k37241o7651o5414
5263A02735p5313K13471O9938j6065k3122j5017q8476N2038J4894n809J12395
5252C41669J56472m3256j03546n47j49149R0193j36925Q8306j6289j8403R3826
5241C02351l6907L4715k82779L15555J46030j19632j10446n0433L3492J68738
$$ plain form
5318 268833 327127 324544 402462 294923 394389 273657 237060 268110 440711 614285 536027
5307 536027 561628 548317 610573 464950 445929 159429 213210 256413 242255 207901 230983
5296 230983 277274 307810 427473 387599 374561 235162 280852 294711 342232 527094 582852
5285 582852 623091 293589 239305 379370 338132 235391 320898 316662 347766 422869 317101
5274 317101 416566 453821 312761 321786 392598 338632 439193 473041 235800 168149 102735
5263 102735 27422 240893 310831 294766 271644 256627 168151 220189 235083 229274 341669
5252 341669 498141 454885 351339 350792 201643 291836 154911 243217 226928 208525 302351
5241 302351 265444 300159 17380 332935 478965 359333 248887 198454 231946 400684
5231D00684j8793R1746m2366Q669m355j55915o0767O0923n3715o8426M6047l2736
5219A70996j00318J42007N3952J21574R9035l2268j48767J7156r0474j44494L2362
5208A20761J26228N1287N3373n2586N6912J7433j47136J22132n245r9208N9201
5197C03152L1856k7854K13593p0119K4514j43119j30575M284J9674J65067k938
5186C87535k4562J91156r6016k97439K13784K05145r1545j81002q0370K31133
5176D57819p9595j24386P2326L31231p1312j99371J81750o969l6398N2660l3016
5165E44739J21355j46078K3527n4120j29173J85648K221O8288k15695p5919N5459
5154C80252l2600R485P8311j2215J41842J22288r8916K5745m0696r1932J41556
$$ plain form
5231 400684 381891 473637 431271 439940 435585 279670 218903 279826 226111 157685 203732 170996
5219 170996 70678 212685 266637 388211 487246 454978 306211 323367 232893 88399 120761
5208 120761 246989 298276 351649 299063 355975 373408 226272 348404 343159 243951 303152
5197 303152 335008 307154 520747 450628 475142 332023 201448 205732 225406 390473 387535
5186 387535 362973 554129 458113 160674 374458 579603 488058 307056 226686 457819
5176 457819 378224 253838 326164 657395 586083 386712 568462 561493 525095 577755 544739
5165 544739 666094 520016 543543 489423 360250 545898 548119 616407 400712 324793 380252
5154 380252 347652 357137 435448 423233 565075 687363 588447 614192 573496 481564 623120
5143F23120j12679j28773L3810p8879K47405P2130L3731r2804r5596K4636l314
5132E22787J1940O3617J09529K0515J24582m7856J5075j25865q8624l0966J56611
5121G31345K38002j45054J76148R157j27900K05618q0855j46615O7296j6986Q5997
5110I96153J56262l1129n3857o8709j61773J0679J13407J10609k3051L4784K19149
5099A302524J6729j99577j84599p0542J91720K8352J18133L3288O7094j31321
5089A171801j16188J74367j30252k74557r4780j7403l1859J80480R8921J3835
5079I74365N4753O9022m273R4644r3651R1036J19204q3908J88483n80m0404L1863
5067A400554q2294j55524J99447l7849q7427L5408L324p8616j30792J14224j9234
$$ plain form
5143 623120 510441 381668 415478 336599 584004 656134 689865 597061 501465 526101 522787
5132 522787 534727 598344 707873 728388 852970 805114 820189 694324 605700 574734 731345
5121 731345 969347 824293 1000441 1009598 881698 1087316 1006461 859846 927142 910156 996153
5110 996153 1152415 1121286 1067429 998720 836947 847626 961033 1071642 1048591 1083375 1302524
5099 1302524 1319253 1119676 935077 864535 1056255 1084607 1202740 1236028 1303122 1171801
5089 1171801 1055613 1229980 1099728 825171 730391 712988 681129 861609 960530 974365
5079 974365 1029118 1098140 1093867 1188511 1094860 1185896 1305100 1221192 1409675 1409095 1368691 1400554
5067 1400554 1318260 1162736 1362183 1324334 1236907 1272315 1275639 1197023 1066231 1180455 1161221
5056A161221J43878K3232K21867j48861k8131J32185j95237l4279Q2286j62618
5046A195543J65745R3604r4659J21332r7877k29923J33854K78407J0483j21762
5036A454747J00936l4345k12725M2690J09770p4244j35992L8146J14508J01181
5026A504672l14250M4820O1432m0392j53165J05037M6262k5275k457j66398n3994
5015A006292k128P5262o7540M0689R4167l875j57078J21557L8482j94122R065
5004I60771J79021O3459L6104l13858K2541K85133j47434k14842k1141J47221
4994I96975J68937K22189m7452K4241j57580P5357M4718Q3695k2730q9686J5895
4983A314559R5171J21349j36326j16142o0601o3666J65844R8225l66147J314P4016
$$ plain form
5056 1161221 1305099 1328331 1550198 1401337 1373206 1505391 1310154 1275875 1358161 1195543
5046 1195543 1361288 1454892 1360233 1481565 1383688 1153765 1287619 1566026 1576509 1454747
5036 1454747 1555683 1521338 1308613 1351303 1461073 1386829 1250837 1288983 1403491 1504672
5026 1504672 1190422 1235242 1296674 1256282 1103117 1208154 1254416 1229141 1226684 1060286 1006292
5015 1006292 1004164 1079426 1011886 1052575 1146742 1142867 985789 1107346 1145828 951706 960771
5004 960771 1139792 1203251 1239355 925497 948038 1233171 1085737 870895 849754 996975
4994 996975 1165912 1388101 1340649 1364890 1207310 1282667 1327385 1411080 1388350 1298664 1314559
4983 1314559 1409730 1531079 1394753 1278611 1218010 1154344 1320188 1418413 1052266 1053580 1127596
4972A127596J24599J02447j08466k05768P1534R6703j82005p6863o8521L2192
4962I13448j39850J29537P7605k28752J2078N9060R1826m8247j64986j44J61790
4951H63365K6479m5846n2537J21225J88827j89746o3981K16502j42400K3658n2185
4940H93361N2764J4830j70421P8385J28731P361J79585l1329j05904K2973p3338
4929I96998j57372P0237J55570o9590j79607q8944J75406K310J19879p4712L8765
4918I88940m7293P134l3382O5877J39160j1967n8744j56254J51426O5177L0922
4907A140996J54610M2637k52933m4522j3680L1987J46838k16004J21104j61385
4897I49648j27791k4722J66693R3841K2875J43589P3191P370j98387j66439K99516
$$ plain form
4972 1127596 1252195 1354642 1246176 1040408 1111942 1208645 1026640 949777 881256 913448
4962 913448 773598 903135 980740 751988 764066 823126 914952 866705 701719 701575 863365
4951 863365 889844 843998 791461 912686 1101513 911767 847786 1064288 921888 945546 893361
4940 893361 946125 960955 790534 868919 997650 1005011 1184596 1153267 1047363 1070336 996998
4929 996998 839626 909863 1065433 995843 816236 727292 902698 905008 1024887 950175 988940
4918 988940 941647 948781 915399 981276 1120436 1108469 1049725 893471 1044897 1110074 1140996
4907 1140996 1295606 1338243 1085310 1040788 1027108 1059095 1205933 989929 1111033 949648
4897 949648 821857 797135 963828 1057669 1080544 1224133 1297324 1304694 1106307 939868 1239384
4886A239384K20232k77285k01428J60800J83220j07887j12866K2967J77259p5089
4876A229307J08103o333J880m5135M1809L1859j0052R6666n1482j50256J00086
4865A346452P6457j947P8940k2240j16609J6583l7912p8351l9176K4095l3289
4854A213003J0481K6422R5694O237k86679J04606L49163K8555n5476o1080p2328
4843A358598n4945N2771J61379n6593j85898Q949J46901P6287j45425J40515m3169
4832A459370k36017Q0321J62397J6246j83474R1294J68199j34344J20626J3094
4822A557712l39142J77808J84910j96702N1307o5843K22715J0177l11091q8766
4812A203085l1458J17405n28Q9638o3801J8547R2780P361j95196J11204J43689
$$ plain form
4886 1239384 1459616 1182331 980903 1141703 1324923 1217036 1104170 1127137 1304396 1229307
4876 1229307 1337410 1331077 1332957 1287822 1329631 1361490 1351438 1448104 1396622 1246366 1346452
4865 1346452 1422909 1420962 1499902 1477662 1361053 1377636 1339724 1261373 1222197 1246292 1213003
4854 1213003 1223484 1249906 1345600 1351837 1065158 1169764 1518927 1547482 1492006 1430926 1358598
4843 1358598 1303653 1356424 1517803 1461210 1275312 1284261 1431162 1507449 1362024 1502539 1459370
4832 1459370 1223353 1303674 1466071 1482317 1298843 1390137 1558336 1423992 1544618 1557712
4822 1557712 1218570 1396378 1581288 1384586 1435893 1370050 1592765 1602942 1291851 1203085
4812 1203085 1171627 1289032 1288504 1378142 1314341 1332888 1425668 1433029 1237833 1349037 1492726
4801A492726N5959J4193l5976j25049Q2069J6916n4533q87Q4342j79240p2507
4790A278013L15795p6812q4561M0173O0030j5344j03321j48718K83387n7182j76799
4779A314661J26901j26599j27768q3610J62522o7219J49871p2844K19877o0711
4769A435081K1721L1243J1780K1397P1843j3619j7232k30927n9357J21970j71918
4758A221982L1959N5001J86537K29795J23941j81594m8635J3114L0277m0962o6254
4747A555161O9982P7594K836L2676k22612l0865P6563J49311M9472R6251n9034
4736A797335P7123m7956r0767o9916J40232j04987J17344l0237j56052J20730
4726A752849L828m9914K2150R2866J14284j69602Q7666l9058L2394P4036j28839
$$ plain form
4801 1492726 1548685 1562878 1526902 1401853 1483922 1500838 1446305 1445418 1529760 1350520 1278013
4790 1278013 1593808 1516996 1432435 1472608 1532638 1517294 1413973 1265255 1548642 1491460 1314661
4779 1314661 1441562 1314963 1187195 1103585 1266107 1198888 1348759 1275915 1495792 1435081
4769 1435081 1456802 1488045 1499825 1521222 1593065 1579446 1562214 1331287 1271930 1393900 1221982
4758 1221982 1253941 1308942 1495479 1725274 1849215 1667621 1618986 1632100 1662377 1621415 1555161
4747 1555161 1625143 1702737 1705573 1738249 1515637 1484772 1561335 1710646 1760118 1856369 1797335
4736 1797335 1874458 1826502 1735735 1665819 1806051 1701064 1818408 1788171 1632119 1752849
4726 1752849 1756677 1706763 1728913 1821779 1936063 1766461 1854127 1815069 1847463 1921499 1792660
4715A792660J45335k3251J0489q0772N3219J46289J42902k25520l67855N1587
4705A645083J41411K9964J56340p364l2921j3441j27478k0434k5965J12775k7667
4694A830303J79035M0695k98191j44419J48813k3258r23K33134p2565j68874Q0498
4683A804248Q2815k1460Q0648J24730K9180j17049K6039j8803n6600K83353J19483
4672B336584q4276j26515l6806J51874j25616r1545j6501M3946L4213M4215m6724
4661B082849p9265k3362P0230m779K37611p1150n7087j21339Q5731J23688k4440
4650B218687P9131l9928R2299j05991n2482P0661N5746O0054Q1120J64102k2359
4639B601040q5417M2928r4427k08168L8102O2869K18917j15387o1520K8402O9993
$$ plain form
4715 1792660 1937995 1914744 1925233 1844461 1897680 2043969 2186871 1961351 1593496 1645083
4705 1645083 1786494 1816458 1972798 1965434 1932513 1919072 1791594 1771160 1745195 1857970 1830303
4694 1830303 2009338 2050033 1751842 1607423 1756236 1732978 1732055 1965189 1892624 1723750 1804248
4683 1804248 1887063 1865603 1946251 2070981 2100161 1983112 2009151 1990348 1933748 2217101 2336584
4672 2336584 2252308 2125793 2088987 2240861 2115245 2023700 2007199 2051145 2085358 2129573 2082849
4661 2082849 2003584 1980222 2050452 2045673 2283284 2212134 2155047 2033708 2119439 2243127 2218687
4650 2218687 2297818 2257890 2350189 2244198 2191716 2262377 2318123 2378177 2459297 2623399 2601040
4639 2601040 2515623 2558551 2464124 2255956 2294058 2356927 2575844 2460457 2398937 2427339 2497332
4628B497332J00114p1099J30450J58663K85P3719r0021J68340J6647k52584J69413
4617B901259l9024J6545o267k50746J79566L54355J53790j99939k27977J79769
4607C061331Q4568q8076j31142K6312j8687k0586J36129J01617j18572k710P8635
4596C108819p3573M1891j38312q7015J62911Q801J51321l0763j0345l6477N7782
4585C155040P4473j8385M2641q1951j93935o9298K72706J56503o7420J56882j49929
4574C277327M7426J22836K9770P9168n5091j34653l3318k13155K43487O5045o5576
4563C363266j15553K10541K0570l3719L16973P058p7940O8818K0110Q326m9187
4552C739263J29723J97250R2697P9740k9726l9487Q6333L4219k08541P395J4045
$$ plain form
4628 2497332 2597446 2526347 2656797 2815460 2815745 2889464 2799443 2967783 2984430 2731846 2901259
4617 2901259 2862235 2878780 2872513 2621767 2801333 3155688 3309478 3109539 2881562 3061331
4607 3061331 3145899 3057823 2926681 2952993 2934306 2913720 3049849 3151466 3032894 3030184 3108819
4596 3108819 3035246 3077137 2938825 2851810 3014721 3023522 3174843 3144080 3133735 3097258 3155040
4585 3155040 3229513 3211128 3253769 3171818 2977883 2908585 3181291 3337794 3270374 3427256 3277327
4574 3277327 3324753 3447589 3477359 3556527 3501436 3366783 3333465 3120310 3363797 3428842 3363266
4563 3363266 3247713 3458254 3478824 3445105 3762078 3769136 3691196 3760014 3780124 3788450 3739263
4552 3739263 3868986 4066236 4158933 4238673 4208947 4169460 4255793 4290012 4081471 4088866 4102911
4541D102911R2869J64908j51662O88J56192j08001o0046J98729K84026n095m7116
4530D628403k16297J46309j98787J21561K205J90129J17373J61214j25720L1150
4520D857540J75524P4904j17513r556K39767L4430n966J0573J9266K06154n9882
4509E425241J06302O9811Q3038N1414j8077L98777K4807J98001L33648L35658
4499G008620R1078J99667J20003m2990j97659n00641l40210j96311K7135Q6761
4489F255453j77109k9184m3653j08904J06441r2939k7448r692k03849M669q853
4478E664932J67649n2551P4937q9005o3058k39530q6353J37249Q9612o5854j81167
4467E356861K0708j3590J41691J892K59642O3130j37440j96160j38776L6452K41523
$$ plain form
4541 4102911 4195780 4360688 4209026 4209714 4365906 4257905 4197859 4396588 4680614 4675519 4628403
4530 4628403 4412106 4558415 4359628 4481189 4483394 4673523 4790896 4952110 4826390 4857540
4520 4857540 5033064 5107968 4990455 4980899 5220666 5255096 5249130 5259703 5278969 5485123 5425241
4509 5425241 5531543 5601354 5684392 5735806 5717729 6116506 6141313 6339314 6672962 7008620
4499 7008620 7099698 7299365 7419368 7376378 7178719 6678078 6337868 6141557 6168692 6255453
4489 6255453 6078344 6049160 6005507 5896603 6003044 5910105 5882657 5872965 5669116 5673785 5664932
4478 5664932 5832581 5780030 5854967 5765962 5702904 5463374 5377021 5514270 5603882 5538028 5356861
4467 5356861 5377569 5363979 5505670 5507562 5767204 5830334 5692894 5496734 5357958 5394410 5635933
4456E635933J73685O4705j58939k72088L5803P3413j61543n338J00028R6074J72139
4445E753872j53534l8034n9620J8485j47621j10005l4769K48224J59549n1594
4435E584953j32409K79956k59464j85945j89836R0228J61268j44930J87773L128
4425E394722r5668p5915M9333J16271k19606J6748Q1080K3438J06809l0333P41
4414E367620m1098n0546j03277p929J58924N5839j88466J13135M1660m7123m3554
4403E255185n3192J358J07466L6397r5655o9380K02557j17960P182n1186j8948
4392E203824m7895L8918k41282N6609J19697K9017R8675l3226N5260J24626K0199
4381E424422J15224J1690P703K6351p8400J44488K6070m3284K6232K66702J22609
$$ plain form
4456 5635933 5809618 5874323 5715384 5443296 5479099 5552512 5390969 5385631 5485659 5581733 5753872
4445 5753872 5600338 5562304 5502684 5521169 5373548 5263543 5228774 5476998 5636547 5584953
4435 5584953 5452544 5732500 5473036 5287091 5097255 5187483 5348751 5203821 5391594 5394722
4425 5394722 5299054 5223139 5272472 5388743 5169137 5185885 5266965 5290403 5397212 5366879 5367620
4414 5367620 5326522 5275976 5172699 5164770 5323694 5379533 5191067 5304202 5345862 5298739 5255185
4403 5255185 5201993 5203351 5310817 5347214 5251559 5182179 5384736 5266776 5273958 5222772 5203824
4392 5203824 5155929 5194847 4953565 5010174 5129871 5158888 5257563 5224337 5279597 5404223 5424422
4381 5424422 5539646 5551336 5559039 5585390 5506990 5651478 5677548 5634264 5660496 5927198 6049807
4370F049807j3849j32170j47695P0057m3317L6853m5468K9729N0966o2851j59099
4359E632963O2964K449J50497K79475j66327R0004j68552K2145J79852L9037l03656
4348E820851l0800L05841J26954K2114j72815l9640k04794m0175L46682o3156
4338F071062N4954L2948J15219M6352J47419M3303q3188J44613j636J78141K51670
4327G000857j49324j28341J77980j46868m922J05590R4826P805O1871K21263J31746
4316G372483o6955R2140k48892p1176J66581L8447k1000K9954M1003j8410Q2817
4305G396992j91235J78162J5071J12331j81439J72719o3692k45782L04092J30777
4295G627996J45796o6989J55846J49851j41390Q5778k00471J80758J35190j09149
$$ plain form
4370 6049807 6035958 5903788 5756093 5826150 5782833 5819686 5774218 5803947 5854913 5792062 5632963
4359 5632963 5695927 5698376 5848873 6128348 5962021 6052025 5883473 5905618 6085470 6124507 5820851
4348 5820851 5790051 6095892 6222846 6244960 6072145 6032505 5827711 5787536 6134218 6071062
4338 6071062 6126016 6158964 6274183 6320535 6467954 6511257 6428069 6572682 6571046 6749187 7000857
4327 7000857 6851533 6723192 6901172 6754304 6749382 6854972 6949798 6957603 7019474 7240737 7372483
4316 7372483 7305528 7397668 7148776 7077600 7244181 7282628 7261628 7291582 7332585 7314175 7396992
4305 7396992 7205757 7383919 7398990 7511321 7329882 7502601 7438909 7193127 7497219 7627996
4295 7627996 7773792 7706803 7862649 8012500 7871110 7956888 7756417 7937175 8072365 7963216
4285G963216N5831M1476L348P1807K67089K79310K47753k2235K63357K75765L86422
4274I833139M34502N20286N49607O59036O63376Q60279M63487J81614k58186l91690
4264A3515450n98483r83093o26798k30630k43488l94980o6606k44815M8879p0319
4254A0105117L6142J38246J00930K2282J61834J42733q186K47105K45993K89801
4244A1481997M06973O34700M10579N62852P07343R93407J211039J382568J146535
4235A8937993J039700L00954n5833q79764j065061j450002j191191j025188q87212
4226A3724396p40498m87460k28178k67351k13316k10196l4965m26486m6338j27268
4216A0942340P3466J8173J50286p5939k42566J51342K09441M61213M31787M35053
$$ plain form
4285 7963216 8019047 8060523 8063871 8135678 8402767 8682077 8929830 8907595 9170952 9446717 9833139
4274 9833139 10267641 10787927 11337534 11996570 12659946 13520225 13983712 14165326 13907140 13515450
4264 13515450 12916967 11933874 11307076 11076446 10832958 10437978 10371372 10126557 10175436 10105117
4254 10105117 10141259 10279505 10380435 10402717 10564551 10707284 10699098 10946203 11192196 11481997
4244 11481997 11888970 12523670 12934249 13497101 14204444 15197851 16408890 17791458 18937993
4235 18937993 19977693 20278647 20222814 19343050 18277989 16827987 15636796 14611608 13724396
4226 13724396 12983898 12496438 12268260 12000909 11787593 11577397 11542432 11115946 11069608 10942340
4216 10942340 11015806 11033979 11184265 11108326 10865760 11017102 11226543 11687756 12119543 12554596
4206A2554596M66193N06163O91564P19612R34438O18938M89625k15366m98811
4197A6266952r10667q80140q50936o29366m78184n03983l41240k59056q2569j86862
4187A1143949k7269L2833q3249j80323m63222j46013q3652l04445j39887m6809
4177I701913k66769L2813r5045K5228l85985n12101Q0070N6970J27767k1613k00496
4166H542752K5288Q0842K0544k621Q0645k2373p8922n273P7637j74595n8402k7387
4154H458135j54253J71882R4767o5325N6636K1723q7477J44906N0627N3527J49917
4143H895065K1347j28090O1962J0257k07413k25786R2839P856J47666K19533J68768
4132I064004K26986o8012M6309j06548j45483r2079l58383o565j14489r1418P4354
$$ plain form
4206 12554596 13020789 13526952 14218516 14938128 15872566 16491504 16981129 16765763 16266952
4197 16266952 15356285 14476145 13625209 12995843 12517659 12013676 11672436 11413380 11330811 11143949
4187 11143949 11116680 11149513 11066264 10885941 10422719 10276706 10193054 9888609 9748722 9701913
4177 9701913 9435144 9467957 9372912 9398140 9012155 8500054 8580124 8637094 8764861 8743248 8542752
4166 8542752 8568040 8648882 8669426 8666805 8747450 8725077 8646155 8640882 8718519 8543924 8485522 8458135
4154 8458135 8303882 8475764 8570531 8505206 8561842 8583565 8496088 8640994 8691621 8745148 8895065
4143 8895065 8916412 8788322 8850284 8860541 8653128 8427342 8520181 8528037 8675703 8895236 9064004
4132 9064004 9290990 9222978 9269287 9162739 9017256 8925177 8566794 8560229 8445740 8354322 8428676
4121H428676j80924n4844m1570k2593J69132K01163j58290o9738J21474J2593
4111H405079j8180J19200O8980R2647K34154k3255L6258R8887L23629L9705p238
4100I369866p9163J13252J69337J95546M49742K55876L74872L63483Q5008N92627
4090A1890446M95656P61553O94018J128954J260605J364294J913287K166749K377595
4081B4053157K082667O50207j411528l028115k885383k206720j631992j077883
4073A4544410o59238q09484n48530l92745m10454j88824k38060n3393k97785l11666
4063A0634231l42673j22520J37194j60469l34335l05878L4455j6022j338J3230
4053I535875n3608j6777j82245L199M9061p3705j27719r1111k00893j39402J29630
$$ plain form
4121 8428676 8247752 8192908 8151338 8128745 8297877 8499040 8340750 8271012 8392486 8405079
4111 8405079 8386899 8506099 8575079 8667726 8901880 8878625 8914883 9013770 9337399 9377104 9369866
4100 9369866 9290703 9403955 9573292 9768838 10218580 10474456 10849328 11212811 11297819 11890446
4090 11890446 12386102 13147655 13841673 14970627 16231232 17595526 19508813 21675562 24053157
4081 24053157 26135824 26786031 25374503 22346388 19461005 17254285 15622293 14544410
4073 14544410 13885172 13075688 12527158 12134413 11723959 11535135 11297075 11243682 10945897 10634231
4063 10634231 10291558 10169038 10306232 10145763 9811428 9505550 9540005 9523983 9522645 9535875
4053 9535875 9482267 9465490 9283245 9286444 9335505 9261800 9134081 9042970 8842077 8702675 8832305
4042H832305j60915k59076K584n0018K0093k02437K32505j59935q2471j40995
4032H031640k30224k56727o3132p1957J3378P7642j64765K4288j64317k20439
4022F975387m8977M5748j9265j36373j57674j1459J4661k33117J66563j03641
4012F491853r5921J20085j14390k31140M4727n2839j46033K32150J8500j55939
4002F111053P891j77146J72852J1016m0080j68112P5844L6154K1555o6499j02532
3991E881996O1165l49693j33134K77414j66291k94277J37096J73200m3048M6324
3981E590752M1460j3546J26505j42026j92939J72202K02588j17149j10516o3245
3971E494086K54755Q9169P9307L3663q8695j48534j23010M0098J43908n3217j51530
$$ plain form
4042 8832305 8671390 8412314 8414898 8364880 8384973 8182536 8415041 8255106 8172635 8031640
4032 8031640 7801416 7544689 7481557 7409600 7422978 7500620 7335855 7360143 7195826 6975387
4022 6975387 6926410 6972158 6952893 6816520 6658846 6647387 6662048 6428931 6595494 6491853
4012 6491853 6395932 6516017 6401627 6170487 6215214 6162375 6016342 6248492 6266992 6111053
4002 6111053 6118944 5941798 6114650 6125666 6085586 5917474 5993318 6029472 6051027 5984528 5881996
3991 5881996 5943161 5593468 5460334 5737748 5571457 5277180 5414276 5587476 5544428 5590752
3981 5590752 5632212 5618666 5745171 5603145 5410206 5582408 5784996 5667847 5557331 5494086
3971 5494086 5748841 5838010 5917317 5950980 5862285 5713751 5590741 5630839 5774747 5721530 5570000
3960E570000j04515O0134q0649j6627J33545m1595N5724J38384l007J62163m3618
3949E829939j5939o8123J14536L7535j09518K53257N6757j03180J68781m0088
3939F123957j4163J18669j3216j60203K48612L26419R6536l4469k3241J44778
3929F813679J19944L00261K18856K31253J74473J03084J34120J72725l15791q3447
3919G869157k2934j91424l33217p1416M5408k8730p4404k83697l9543J6741p6479
3908F809462j55456J10836j05291p2672r7020j9012j52839J69066K17714o4711
3898F640077k1222N8593o9049m5515Q4801K16704J25165q0762j93621J67628r1757
3887F791042n9221k167o5013k8827J34220J4234k89314J46875M1240L134J41881
$$ plain form
3960 5570000 5465485 5525619 5444970 5428343 5561888 5520293 5576017 5714401 5711394 5873557 5829939
3949 5829939 5814000 5745877 5860413 5897948 5788430 6041687 6098444 5995264 6164045 6123957
3939 6123957 6109794 6228463 6215247 6055044 6303656 6630075 6726611 6692142 6668901 6813679
3929 6813679 6933623 7233884 7452740 7683993 7858466 7961550 8095670 8268395 7952604 7869157
3919 7869157 7846223 7654799 7321582 7250166 7295574 7266844 7192440 6908743 6869200 6885941 6809462
3908 6809462 6654006 6764842 6659551 6586879 6489859 6470847 6318008 6487074 6704788 6640077
3898 6640077 6618855 6677448 6608399 6562884 6647685 6864389 6989554 6908792 6715171 6882799 6791042
3887 6791042 6731821 6729654 6664641 6635814 6770034 6784268 6494954 6641829 6683069 6686203 6828084
3876F828084N770M8313l6776m6503p0427J9156L4353J91252J18446k69477K0011
3865F842202L8627j32423N1391K19945j84366O9459k68885R4352M1017R916M30465
3854G211700l25239n4634J8568J59770K53230j59842J8441J813J762j83119j25182
3843F817268J16630N0318N1222J66553N0804K6303N2379O0832J71657k51209m9629
3832G263128K37672J23100j73870K9728L14668J10953M4993p8132p2383J60253
3822G960110K07868k39111J56390J14755K66053J89295p1980N4125J06590J44258
3812H888353J23622K6813Q6729J00664J21829J8980j9437M13Q0981M0937M17204
3801I887088L21175k6140K80819J96651J03005L38032Q3696J91921L91261J70149
$$ plain form
3876 6828084 6833854 6882167 6845391 6798888 6728461 6747617 6781970 6973222 7091668 6822191 6842202
3865 6842202 6880829 6748406 6799797 7019742 6835376 6904835 6635950 6730302 6771319 6781235 7211700
3854 7211700 6886461 6831827 6850395 7010165 7263395 7103553 7121994 7123807 7125569 6942450 6817268
3843 6817268 6933898 6984216 7035438 7201991 7252795 7279098 7331477 7392309 7563966 7312757 7263128
3832 7263128 7500800 7623900 7450030 7479758 7794426 7905379 7950372 7872240 7799857 7960110
3822 7960110 8167978 7928867 8085257 8200012 8466065 8655360 8583380 8637505 8744095 8888353
3812 8888353 9011975 9038788 9125517 9226181 9348010 9366990 9347553 9347966 9428947 9469884 9887088
3801 9887088 10208263 10182123 10462942 10659593 10762598 11100630 11184326 11376247 11767508 11937657
3791A1937657P6124K23358M30819N07857L40037L3703L37916K43203J79305J03104
3781A4413083J68928J69058J56209J65890K14310P795p4241P8016j32382J32806
3771A5299472L1161J61366k1396q9123J6707k09553j39876k0646l1497p8709p3196
3760A4844710j52540k96848j0782j48199m13041j31575j32876j19181l45116j50929
3750A2943623j43561J08597j18889j81827L7253m15726k26996O066K59520k0354
3740A2247706p638j77220R2334r8613m5021J01355j3461N1937j68210j82411K58560
3729A2059318L23940j01434j5258M8310J91928L5370j01330J05622L77813j10292
3719A2813987j11317L0682P5679L8196K09662n3791p426r4211L08349J01201O7233
$$ plain form
3791 11937657 12013781 12237139 12667958 13175815 13515852 13549555 13887471 14130674 14309979 14413083
3781 14413083 14582011 14751069 14907278 15073168 15287478 15295273 15221032 15299048 15166666 15299472
3771 15299472 15330633 15491999 15470603 15381480 15398187 15188634 15048758 15028112 14996615 14917906 14844710
3760 14844710 14692170 14395322 14384540 14236341 13823300 13691725 13558849 13439668 13094552 12943623
3750 12943623 12800062 12908659 12789770 12607943 12645196 12229470 12002474 12008540 12268060 12247706
3740 12247706 12240068 12062848 12155182 12056569 12011548 12112903 12099442 12151379 11983169 11800758 12059318
3729 12059318 12383258 12281824 12266566 12314876 12506804 12542174 12440844 12546466 12924279 12813987
3719 12813987 12702670 12733352 12809031 12847227 13056889 13003098 12995672 12901461 13209810 13311011 13378244
3708A3378244M1206L7695j07334l4390J45062j81485N9990L76146J39203R0777
3698A3945114J25377K01347K28633O1441K60760P3128J45069K54173l6809o4123
3688A5194110L8752m1409N0772K03824O8163l7651M9210L7675p8956P3376r858
3677A5548008K94367J52761q5126J30175j40814j42930L1812R9625j3875J21827
3667A5995830P6153j73004j51520r963J80894K77448Q1551K08562k7352K26662
3657A6685261J04191J6283K31079J17323N3514J76789J01885p0115P3905K73241
3647A7763356l0177K02826L29337J18388K96983L35138J4606J89782L44755J07665
3637A9672659J57170J89537L18955J42169J70885J12837L22763L45789L20949
$$ plain form
3708 13378244 13419450 13457145 13349811 13315421 13460483 13278998 13338988 13715134 13854337 13945114
3698 13945114 14070491 14271838 14500471 14561912 14822672 14895800 15040869 15295042 15258233 15194110
3688 15194110 15232862 15191453 15242225 15446049 15514212 15476561 15525771 15563446 15484490 15557866 15548008
3677 15548008 15842375 15995136 15910010 16040185 15899371 15756441 15788253 15887878 15874003 15995830
3667 15995830 16071983 15898979 15747459 15737496 15918390 16195838 16277389 16485951 16458599 16685261
3657 16685261 16789452 16805735 17036814 17154137 17207651 17384440 17486325 17416210 17490115 17763356
3647 17763356 17733179 17936005 18265342 18383730 18680713 19015851 19030457 19220239 19564994 19672659
3637 19672659 19829829 20019366 20338321 20480490 20651375 20764212 21086975 21432764 21753713
3628B1753713K62879J26683L47726N19201L90313L39602M98251K68527N59734
3619B5066629P93875M50211M25305P02383N96244O25857P06303P34248O87272
3610C0788327P46976O79298P45250O24369N37521O81728N48134O58473J58858
3601C6168934Q8956k75670j02340k56923j40556m76471n53089m22413m05447m94339
3591C3130642m82074o36841q59317l02881n85991m74998m21208j73565m24161
3582B8769606n08185q63156k65966k87932n21891l29436k22631l65425r5995j95551
3572B5113438k55254l38791k29468q5351j40982k92174m6930p8975l79232m03433
3562B2862848L3654N9097l17O5642J79190n192L7388M5247k8172J57099P6271
$$ plain form
3628 21753713 22016592 22143275 22491001 23010202 23400515 23740117 24238368 24506895 25066629
3619 25066629 25860504 26310715 26736020 27438403 28034647 28660504 29366807 30101055 30788327
3610 30788327 31535303 32214601 32959851 33584220 34121741 34803469 35351603 36010076 36168934
3601 36168934 36257890 35982220 35879880 35622957 35482401 35005930 34452841 34030428 33624981 33130642
3591 33130642 32648568 32011727 31152410 30849529 30263538 29788540 29367332 29193767 28769606
3582 28769606 28261421 27398265 27132299 26844367 26322476 25993040 25770409 25404984 25308989 25113438
3572 25113438 24858184 24519393 24289925 24204574 24063592 23771418 23724488 23645513 23266281 22862848
3562 22862848 22896502 22955599 22955282 23020924 23200114 23194922 23232310 23277557 23249385 23406484 23482755
3551B3482755Q2083j01874m1844k12012j19387j22521o5292k36945k23172j54111
3541B2287680p6430k25487l14397l48412J85420j03830j89667j70564J68266O7591
3531B1280170j56240K8955P61K15410M13316L39362j06104L7489K45523K20743
3521B2519385J82746P9169K5453J29069K94626M5660J509Q5822j7078l03096p4108
3510B2969157l35348j99951k93635k27957j82976j80842j77557l68959k93571
3501B0708361j42114n06323k02904j00074j55787k83319j05714J37510j96747
3492A9152889p1084j65383n6732r551r1064q3144j80882O9001N1605j25795J70882
3481A8660742j69660P640l7803k9199j80287P632k19659m4632K53724J74610J58895
$$ plain form
3551 23482755 23564838 23462964 23421120 23209108 23089721 22967200 22901908 22664963 22441791 22287680
3541 22287680 22211250 21985763 21671366 21322954 21508374 21404544 21214877 21044313 21212579 21280170
3531 21280170 21123930 21152885 21153646 21369056 21782372 22121734 22015630 22053119 22298642 22519385
3521 22519385 22702131 22781300 22806753 22935822 23230448 23276108 23277617 23363439 23346361 23043265 22969157
3510 22969157 22633809 22433858 22140223 21912266 21729290 21548448 21370891 21001932 20708361
3501 20708361 20566247 20059924 19857020 19756946 19601159 19317840 19212126 19349636 19152889
3492 19152889 19081805 18916422 18859690 18850139 18759075 18675931 18495049 18564050 18615655 18489860 18660742
3481 18660742 18491082 18498722 18460919 18431720 18251433 18259065 18039406 17994774 18248498 18423108 18582003
3470A8582003k12818J8767r1778q8746k4158o671J68639Q3823K24977j19313l1794
3459A8502931m4892J19665J52750k40546j20395N2830K25823J23486q6939o2799
3449A8621914K09329K7225k35829K67673K62171j27577n9434K4975K5054K29462
3439A9244963R965n8126R7582J23017J61410J21295R3390j33949R7963J04961
3429A9862471K06443J89041K51274O024k27428J94985J39889J62823K20236O6208
3419B1071966J24034J36508K61291l5605r2698M15284J80407O6054P9854K18055
3409B2425150Q4260O2265K14020K91250K20100K26386L79959J68848J55771J48091
3399B4376100R3466K31271M03142K10172K13140J96957K26843M33278P8472K35313
$$ plain form
3470 18582003 18369185 18387952 18296174 18207428 18183270 18176599 18345238 18429061 18654038 18534725 18502931
3459 18502931 18458039 18577704 18730454 18489908 18369513 18422343 18648166 18771652 18684713 18621914
3449 18621914 18831243 18858468 18622639 18890312 19152483 19024906 18965472 18990447 19015501 19244963
3439 19244963 19254928 19196802 19294384 19417401 19578811 19700106 19793496 19659547 19757510 19862471
3429 19862471 20068914 20257955 20509229 20515253 20287825 20482810 20622699 20785522 21005758 21071966
3419 21071966 21196000 21332508 21593799 21558194 21465496 21880780 22061187 22127241 22207095 22425150
3409 22425150 22509410 22571675 22785695 23076945 23297045 23523431 23903390 24072238 24228009 24376100
3399 24376100 24469566 24700837 25103979 25314151 25527291 25724248 25951091 26384369 26462841 26698154
3389B6698154J87256N0530L44498K24847K92697K97067O1560J05305K32762K84962
3379B8779638L46711K10376L89998M14407J27697J23851L30436K09620L52510
3370C1285244M43960K28454J55333L82214N48995K80710N21192L01624M91983
3361C4639709O37843M24095M29458O70121N25533M26916P12858P96059N89813
3352C9852405M98727Q56099R29183P53206O71809O78583N24384N92531M18524
3343D5775451P21034N59871M46697L66138O01599O61398L78255N98835N16565
3334E0625843M89665P81860P92383O11185O06871L59973M62468P96985O40293
3325E6167526M95993P60490N24136O88122P49712P71705Q25328R82373J177610
$$ plain form
3389 26698154 26885410 26935940 27280438 27505285 27797982 28095049 28156609 28261914 28494676 28779638
3379 28779638 29126349 29336725 29726723 30141130 30268827 30392678 30723114 30932734 31285244
3370 31285244 31729204 31957658 32112991 32495205 33044200 33324910 33846102 34147726 34639709
3361 34639709 35277552 35701647 36131105 36801226 37326759 37753675 38466533 39262592 39852405
3352 39852405 40351132 41207231 42136414 42889620 43561429 44240012 44764396 45356927 45775451
3343 45775451 46496485 47056356 47503053 47869191 48470790 49132188 49510443 50109278 50625843
3334 50625843 51115508 51897368 52689751 53300936 53907807 54267780 54730248 55527233 56167526
3325 56167526 56663519 57424009 57948145 58636267 59385979 60157684 60983012 61965385 63142995
3316F3142995J042704R10041R99584R67030J224836J203440J076384J066295J040470
3307G2673779J348094J195952J069079J372652J321747J293654J315003J176608
3299H2766568J239163J224016J305226J039010Q61707P58618Q24034J013124Q41474
3290I1872940Q17674O56051R72394Q58669Q66706J118019J276543J679055J456536
3281A01574587J491255J734300J799411J871256K149918J943218J993820J826446
3273A16384211K156007K143504K214874K090809K143463K511656K600894L069608
3265A35315026L250053L698158L899018M405648N053509N795544O636069P150458
3257A75203483Q200348R206945J0218376J1480663J2619597J3784391J4927297
$$ plain form
3316 63142995 64185699 65095740 66095324 67062354 68287190 69490630 70567014 71633309 72673779
3307 72673779 74021873 75217825 76286904 77659556 78981303 80274957 81589960 82766568
3299 82766568 84005731 85229747 86534973 87573983 88435690 89194308 90018342 91031466 91872940
3290 91872940 92690614 93346665 94319059 95177728 96044434 97162453 98438996 100118051 101574587
3281 101574587 103065842 104800142 106599553 108470809 110620727 112563945 114557765 116384211
3273 116384211 118540218 120683722 122898596 124989405 127132868 129644524 132245418 135315026
3265 135315026 138565079 142263237 146162255 150567903 155621412 161416956 168053025 175203483
3257 175203483 183403831 192610776 202829152 214309815 226929412 240713803 255641100
3250B55641100J5431407J5694057J4975002J2523612Q229524J504177p571425
3243C16427454j6520416k2717154k5404750k4549362k1780312j8937354j5911002
3236A70607104j3394397j1612514j0002239q367180p373581o601243n706189n245526
3228A02304235m673533m118320l576999l334093l191258k708598k376811k314108
3220G6010515k164323j901550j667914j760660j697139j718468j453391j135430
3212F2511640j616028j553205j233589j269218j285659j333586r01090r74408
3204E2344857j178615j048659r02513r99394p63887p74213o59270q17597o24978
3195D4575731n39167q45417l11732m78640m22196m28011l20453l29723m64665
$$ plain form
3250 255641100 271072507 286766564 301741566 314265178 322494702 323998879 316427454
3243 316427454 299907038 277189884 251785134 227235772 205455460 186518106 170607104
3236 170607104 157212707 145600193 135597954 127230774 119857193 113255950 107549761 102304235
3228 102304235 97630702 93512382 89935383 86601290 83410032 80701434 78324623 76010515
3220 76010515 73846192 71944642 70276728 68516068 66818929 65100461 63647070 62511640
3212 62511640 60895612 59342407 58108818 56839600 55553941 54220355 53319265 52344857
3204 52344857 51166242 50117583 49215070 48215676 47451789 46677576 46018306 45200709 44575731
3195 44575731 44036564 43191147 42879415 42400775 41978579 41550568 41230115 40900392 40435727
3186D0435727n14210l88915k27612l06651l58810k82490k35999j32939j46991
3177C7841110l58357R8947J30531o5419m8430j2682K59776J87559r0001p6256
3167C7866778K17255N6595l01600K23734L19162o4527j14274P1094q8170j93256
3157C7992791l18452k28362k16610j84487k64658l83164l01647k47539m73958
3148C5373914j66701r3299j83570k44509l64329l26655k89791l09888o05838m34229
3138C2355105n29962l71039k59023l04778k77177l65718m82182k05907j98821
3129B9360498l82873j85020k41012k24268r5282n2181l05574k42679j56106j82561
3119B7292942k81890k47353k15775k68635k31192l60340m54504l47630k35253
$$ plain form
3186 40435727 39921517 39532602 39304990 38998339 38639529 38357039 38121040 37988101 37841110
3177 37841110 37482753 37581700 37712231 37646812 37598382 37585700 37845476 38033035 37943034 37866778
3167 37866778 38084033 38140628 37839028 38062762 38381924 38317397 38203123 38274217 38186047 37992791
3157 37992791 37674339 37445977 37229367 37044880 36780222 36397058 36095411 35847872 35373914
3148 35373914 35207213 35113914 34930344 34685835 34321506 33994851 33705060 33395172 32789334 32355105
3138 32355105 31825143 31454104 31195081 30890303 30613126 30247408 29765226 29559319 29360498
3129 29360498 28977625 28792605 28551593 28327325 28232043 28179862 27874288 27631609 27475503 27292942
3119 27292942 27011052 26763699 26547924 26279289 26048097 25687757 25233253 24885623 24650370
3110B4650370j26234l97169l65443l58352j94088k79121o7278r9623l15178j12668
3100B2335216l10423q8535k44889n3348k31833m25907j53587p1333P4367p9359
3090B0750369j27019k9461j7471k48088n2727R2069j29988K3113j54585k37573
3080A9868639j34565j17339l1678n1680l77820j58243k8417l5916j87349J01240
3070A8846872j24788j69679q8467J98115k06691j6669J9254j85355n5940L01647
3060A8518299j32472R1518J8689l28499l7463L7240N9709j69091J06461j16508
3050A8047883J75260k43628j77452m2344r8707J02389R306k24818p1403m5584
3040A7430902J44581k03734m0843J06671J18127J55337k81605K2691J68619j6762
$$ plain form
3110 24650370 24524136 24126967 23761524 23403172 23209084 22929963 22862685 22763062 22447884 22335216
3100 22335216 22024793 21936258 21691369 21638021 21406188 20980281 20826694 20755361 20829728 20750369
3090 20750369 20623350 20593889 20576418 20328330 20275603 20367672 20237684 20260797 20106212 19868639
3080 19868639 19734074 19616735 19585057 19533377 19155557 18997314 18968897 18932981 18745632 18846872
3070 18846872 18722084 18552405 18463938 18662053 18455362 18438693 18457947 18272592 18216652 18518299
3060 18518299 18385827 18477345 18496034 18167535 18130072 18167312 18227021 18057930 18164391 18047883
3050 18047883 18223143 17979515 17802063 17759719 17661012 17763401 17772707 17547889 17476486 17430902
3040 17430902 17575483 17371749 17330906 17437577 17555704 17711041 17429436 17452127 17620746 17603984
3030A7603984J63965J3724J46824K48000j62799j66682p0939K34635K48695K3288
3020A8282695p9638K19374J05505k5445K24565J93979O2044J07031L8831L09131
3010A9438072J92112p6095J49908J88305K66143J34130J07997M54389Q2376Q1258
3000B1018595K69777K34015P3059m2680M19369J44160J16098P3859M9339K0840
2990B2376431J51150L10628K42844J52822J72090L03925J29764K57995K57840
2981B4355489N13095K26445J05404L12379K3337Q6317J34695K85726M82710L31572
2971B6857169K43375M02096L93083M79092L55219K99713K97014J86179K32619
2962B9745559M99583L10885K48867K35549L83574K20412M19582M47246L22132
$$ plain form
3030 17603984 17767949 17781673 17928497 18176497 18013698 17847016 17776077 18010712 18259407 18282695
3020 18282695 18203057 18422431 18527936 18502491 18727056 18921035 18983079 19090110 19128941 19438072
3010 19438072 19630184 19554089 19703997 19892302 20158445 20292575 20400572 20854961 20937337 21018595
3000 21018595 21288372 21522387 21595446 21552766 21972135 22116295 22232393 22306252 22355591 22376431
2990 22376431 22527581 22838209 23081053 23233875 23405965 23709890 23839654 24097649 24355489
2981 24355489 24868584 25095029 25200433 25512812 25536149 25622466 25757161 26042887 26525597 26857169
2971 26857169 27100544 27502640 27895723 28374815 28730034 29029747 29326761 29512940 29745559
2962 29745559 30245142 30556027 30804894 31040443 31424017 31644429 32064011 32511257 32833389
2953C2833389L58606L77443M26121O20005O30585N00641O90607P03608O70676
2944C7811681P91669J010530J120870R90095J077193J043964R50803J001537J355459
2935D7153801J079815Q16845P38067L50274K61553N08273N37967K05313L31834
2926E1983742K49451L33484L77423O35239Q01569N41463Q80260J084652J001869
2917E7889152J374853J445062J638404K093311K387356K375416K818459L209113
2909G5231126L459928L168132K704636J815277L10654j637134k904450k886167
2901G9262002k485917j833117j174407n41518k5867M32264P99987J418387K021397
2892G7873211K509403L335565M152143M122633L937946K756133P66676r84792
$$ plain form
2953 32833389 33191995 33569438 33995559 34615564 35246149 35746790 36437397 37141005 37811681
2944 37811681 38603350 39613880 40734750 41724845 42802038 43846002 44796805 45798342 47153801
2935 47153801 48233616 49050461 49788528 50138802 50400355 50908628 51446595 51651908 51983742
2926 51983742 52233193 52566677 52944100 53579339 54380908 54922371 55802631 56887283 57889152
2917 57889152 59264005 60709067 62347471 64440782 66828138 69203554 72022013 75231126
2909 75231126 78691054 81859186 84563822 86379099 86689753 85052619 82148169 79262002
2901 79262002 76776085 74942968 73768561 73227043 73201176 73633440 74433427 75851814 77873211
2892 77873211 80382614 83718179 87870322 91992955 95930901 98687034 99453710 98468918
2884I8468918k339449k341168j880723j334106q05064m31643j50136l54665q12910
2875H8019054p02011j004018j179395j304799j735814j818209k079712k108149
2867G6086947k074555k006282j959327j782933j624842j278698j050062r68460
2859F3341788p74407m49918o29008q64158q39240j087431r89566j021887j113682
2850E5572491j347872j520184j606206j851846k204616j944010j639726j764098
2842D1693933j916920j388110j417450j349275j255427j081227q83281q28018
2834C1574225n71813q34401o30376o38507q93129n75136o03593p49089p46366
2825B5331815l32147n23268q74545n65076n96393l87312m42739m33746l15090
$$ plain form
2884 98468918 96129469 93788301 91907578 90573472 89768408 89336765 89186629 88831964 88019054
2875 88019054 87317043 86313025 85133630 83828831 82093017 80274808 78195096 76086947
2867 76086947 74012392 72006110 70046783 68263850 66639008 65360310 64310248 63341788
2859 63341788 62567381 62117463 61488455 60624297 59785057 58697626 57708060 56686173 55572491
2850 55572491 54224619 52704435 51098229 49246383 47041767 45097757 43458031 41693933
2842 41693933 39777013 38388903 36971453 35622178 34366751 33285524 32402243 31574225
2834 31574225 31002412 30168011 29537635 28899128 28005999 27430863 26827270 26078181 25331815
2825 25331815 24999668 24476400 23601855 23036779 22440386 22053074 21610335 21176589 20861499
2816B0861499l98400m98733m24303l05530m42102l16136j50694m77631m41233
2807A7406737l07095l13566m10114l10395l06087l80958l04430m78136k03063
2798A4392893k69643k03056j08912j34299j70517J00095k04921m12750j10712
2789A2878178j46876k04907l57167j72266k04811k38588j76949j24781j81016
2780A1070817j01922m10158j70013o0924r3855m43583j15323l5386j17528j84587
2770I337538k08615q5579r8435l8210l55219L1438j06855j7079k57596j68526
2760H032862j38734j81636K2648j23031l3558M4827k70381k90965k12632p8649
2750F770751p6626K8836p763j24030j00940j65662k08531j59404P4791j06142
$$ plain form
2816 20861499 20463099 19964366 19540063 19234533 18792431 18476295 18325601 17847970 17406737
2807 17406737 17099642 16786076 16375962 16065567 15759480 15378522 15074092 14595956 14392893
2798 14392893 14123250 13920194 13811282 13676983 13506466 13606561 13401640 12988890 12878178
2789 12878178 12731302 12526395 12169228 11996962 11792151 11553563 11376614 11251833 11070817
2780 11070817 10968895 10558737 10388724 10327800 10233945 9790362 9675039 9639653 9522125 9337538
2770 9337538 9128923 9043344 8944909 8906699 8551480 8582918 8476063 8458984 8201388 8032862
2760 8032862 7894128 7712492 7735140 7612109 7578551 7623378 7352997 7062032 6849400 6770751
2750 6770751 6694125 6722961 6715198 6591168 6490228 6324566 6116035 5956631 6031422 5925280
2740E925280J21897k517k15271j42306m2732J1813j64173k02624J24774o8109
2730E346032k40561j46438J11174k3659o2055k28020Q8925j97473J77561j993
2720D823493j14789K7375q6957m7642j20232j27876M15J35958n0226k76302l8274
2709D124943N2627n8058r5846k05621p6073K35173j54397k7146k4126o1923r577
2698C699976N7170M276j07081n0362o3807J57806j30145j92494Q5016Q9071q3777
2687C465649Q5705j81566l3113j1162J05427k16695r3513k08411Q8590Q1534o9210
2676C013235o7661J72374n8237N0869l06885O5961K10598j87164N4351n2129o670
2665B888642M7953k64265L089r966M0118J76615o0743o4635q9275j41503M1649
$$ plain form
2740 5925280 6047177 6044660 5829389 5687083 5644351 5656164 5491991 5289367 5414141 5346032
2730 5346032 5105471 4959033 5070207 5046548 4984493 4756473 4845398 4647925 4825486 4823493
2720 4823493 4708704 4736079 4649122 4601480 4481248 4353372 4353787 4489745 4439519 4163217 4124943
2709 4124943 4177570 4119512 4023666 3818045 3741972 3977145 3822748 3795602 3771476 3709553 3699976
2698 3699976 3757146 3761422 3654341 3603979 3540172 3697978 3567833 3375339 3460355 3549426 3465649
2687 3465649 3551354 3369788 3336675 3325513 3430940 3214245 3120732 2912321 3000911 3082445 3013235
2676 3013235 2945574 3117948 3059711 3110580 2803695 2869656 3080254 2893090 2947441 2895312 2888642
2665 2888642 2936595 2672330 2675419 2665453 2705571 2882186 2821443 2756808 2667533 2526030 2567679
2654B567679p2882K12823K76796l1720n67886P1938J73112k6594J37580Q4553
2644B825399j19479J10079J09024j65199n8772n7361N686j33308J53644j89286
2634B480427n185J12326O0422J1300K66987j59043o4528k7013j75473J22532J32745
2623B755497L13494m4359j11894j94974m6723R3774n8732K13560j36859j91797
2613B590987Q7687K3268q5804J29753j18662Q3575o0926m198P7236r4077o5505
2602B563334j00039Q3853J24616j53280L7201q6235K17739q2889M2739J05793
2592B752832L3027q0034j86847O3845K5670O7741j59799Q4189r575l5416k7293
2581B528340q0518j21771q4257R8946J5228r0063L7493j24295j53148J07350l7498
$$ plain form
2654 2567679 2494797 2707620 2984416 2952696 2384810 2456748 2629860 2603266 2740846 2825399
2644 2825399 2705920 2815999 2925023 2759824 2701052 2643691 2649377 2516069 2669713 2480427
2634 2480427 2475242 2587568 2647990 2659290 2926277 2767234 2702706 2675693 2500220 2622752 2755497
2623 2755497 3068991 3024632 2912738 2717764 2671041 2764815 2706083 2919643 2782784 2590987
2613 2590987 2678674 2701942 2616138 2745891 2627229 2710804 2649878 2645680 2722916 2628839 2563334
2602 2563334 2463295 2547148 2671764 2518484 2555685 2469450 2687189 2604300 2647039 2752832
2592 2752832 2785859 2705825 2518978 2582823 2608493 2676234 2516435 2600624 2591049 2555633 2528340
2581 2528340 2447822 2326051 2241794 2340740 2355968 2265905 2303398 2179103 2025955 2133305 2095807
2570B095807q0045J8156J79822o1320j35741J71661j86650j0836j7518k1734j49245
2559A802357P0972q5281k63098K00439J6115J49720K76080R8756o2735q9463k70598
2548A843264j68137P0493O5790k60887j24212J99234m6856L4710j03242j53776
2538A356381J09294k02337J34830j917m4647o1453J27228Q2608L942j50790k83219
2527A069920L1710q266J02433j15169J46465j21850K37440J2264j96714P5359
2517A233592j51928p0475J47746M3710n9760k4422l4905m9816k30936J50961K36948
2506A190715n4494q724q3633j30915m7881j57663K29146P7034k5914l7073J09295
2495A059893j19596j27247K5372o7624J84136J82132R88r5942m9311j49449j49158
$$ plain form
2570 2095807 2015762 2033918 2213740 2152420 2016679 2188340 2001690 1990854 1973336 1951602 1802357
2559 1802357 1873329 1788048 1524950 1725389 1741504 1891224 2167304 2266060 2203325 2113862 1843264
2548 1843264 1675127 1745620 1811410 1550523 1426311 1625545 1578689 1613399 1510157 1356381
2538 1356381 1465675 1263338 1398168 1396251 1351604 1290151 1417379 1499987 1503929 1353139 1069920
2527 1069920 1101630 1093364 1195797 1080628 1227093 1105243 1342683 1354947 1158233 1233592
2517 1233592 1081664 1011189 1158935 1202645 1142885 1118463 1083558 1033742 802806 953767 1190715
2506 1190715 1136221 1127497 1043864 912949 865068 707405 936551 1013585 987671 950598 1059893
2495 1059893 940297 813050 838422 770798 954934 1137066 1138054 1042112 992801 843352 694194
2484F94194j24571J29725o7913O8057l489o4294Q6360J36509q5972J03027m9912
2473H21721N92j39867j3179M5784k6702k43964J07021O0442r2296J01500J19735
2462G40787L8475j01720L2626J24839j35482o3761p8667q3985J46797j0610M3626
2451F52925J0244J59395m2257o399q3418K07674j23726j59840K1305J95831j21442
2440G10292j45730p0920J35242J63476P9002M2075l06908j71893O7034j07513
2430C94157O9340N4868k5813P7182n649M31l9725R4524k63184K3429R6757J28064
2418F04381j82424q8101J40917J39590P1540j30280l366j59675R5512K36910O9185
2407G94189n9651o8680j43328J11457l4059K596j34891M0380J08224p5874K9719
$$ plain form
2484 694194 569623 699348 631435 699492 696003 631709 718069 854578 768606 871633 821721
2473 821721 822313 682446 669267 715051 688349 444385 551406 611848 519552 621052 740787
2462 740787 779262 677542 710168 835007 699525 635764 557097 473112 619909 609299 652925
2451 652925 663169 822564 780307 773908 690490 898164 774438 614598 635903 831734 710292
2440 710292 564562 493642 628884 792360 871362 913437 606529 434636 501670 394157
2430 394157 463497 518365 492552 569734 564085 564516 524791 619315 356131 379560 476317 604381
2418 604381 421957 333856 474773 614363 685903 555623 552257 392582 488094 725004 794189
2407 794189 734538 665858 522530 633987 599928 602524 467633 508013 616237 540363 570082
2396E70082j59918K49094j11145k29997J79551R0951l4825j77055K10893k2459
2386E65172O248O2485n4799k648K28406Q2335k38944J16643K4606L8593j03778
2375G24319J722J19400P8737o6924K2967N4383q7254r9964q6309K0222j45966
2364E35333L070n77K03211l6691j35533j56436j88353K90489k3642q779K7200
2353E09292J9970j8697j05593k6499J31622q951O0366K8227j25829j20660J11992
2342D55240O7170M2072J927O9699k9227O3841n8239l2556j87595l1507Q6721j04171
2330C43375R1520K05093o4676o5279K37788m8816j30135O5685k7741m5572Q0608
2319F41850j83686N6333j27916L1612m3213l3664O7005J18106n3846m3916J19969
$$ plain form
2396 570082 410164 659258 548113 318116 497667 588618 553793 376738 587631 565172
2386 565172 571420 633905 579106 576458 804864 887199 648255 764898 789504 828097 724319
2375 724319 726041 845441 924178 857254 880221 934604 847350 747386 661077 681299 535333
2364 535333 538403 537826 741037 704346 568813 412377 224024 514513 490871 482092 509292
2353 509292 529262 510565 404972 378473 510095 501144 561510 589737 463908 343248 455240
2342 455240 522410 564482 566409 636108 606881 670722 612483 579927 392332 360825 447546 343375
2330 343375 434895 639988 575312 510033 747821 699005 568870 634555 606814 561242 641850
2319 641850 458164 514497 386581 418193 374980 341316 408321 526427 472581 428665 548634
2308E48634j0344r9438q9785j32421p3764K53085J97315J29477l7536l53729K97069
2297F28563J10355L7716l2605r0887p7118j02593j93004n2503J43044O3061Q0004
2286E14033L9176R7732j8917M210Q9279J37858o0905k21254J08960O2968R6817
2275H49957o8911r4778L5142J03698Q7924j36401N2431j51831j72153n2558K70198
2264G22718j27934R5614N6502M2394m0980j40714j25818J8379K0838l0717Q9137
2253E79419J13244l6616L2771J31845j37908J175l533n010J64717P4900q8155
2242H26849n8955K8340K8545M7662l8699J7552m4619K8291O3506L4628K5203P29
2230I59032J53263r8504p276L516j46681j8975J2696J56368K19089L980j27031
$$ plain form
2308 548634 538290 438852 349067 216646 142882 395967 593282 722759 685223 331494 628563
2297 628563 738918 776634 744029 653142 576024 473431 280427 227924 370968 434029 514033
2286 514033 553209 650941 632024 636234 725513 863371 802466 581212 690172 753140 849957
2275 849957 781046 686268 721410 825108 913032 776631 829062 677231 505078 452520 722718
2264 722718 594784 690398 746900 789294 748314 607600 481782 500161 520999 490282 579419
2253 579419 692663 656047 688818 820663 682755 683930 680397 675387 840104 915004 826849
2242 826849 767894 796234 824779 872441 833742 851294 806675 834966 898472 933100 958303 959032
2230 959032 1112295 1013791 1006515 1010031 863350 844375 857071 1013439 1232528 1236508 1109477
2219A109477j53339M03j6526K28381J18948l9467J7066K6957k5866m795k24511
2208A036728n0451K02695J7826J39993P862j61873K30038j72797J44465J55746
2198A550232l7894J0331j65407q7894k6790K45036K0029j76085j65270o9360K22245
2187A319173L05640M3084q8128P2334J98771k56487j98253J34710K37290K1267
2177A789401L2231l6502o7045P2920N1857O5553K06839J13865j47168j02824J80089
2166B159216J69921J40664j59177J15964J32563O0552L0302K96101K88885P5081
2156C310072J1368M2865M8299N6251j62915J56755R2501K3029J85908J52510K24773
2145D141416K14595J34512J50614O7949J83201K44776J01566n7089J21133L74701
$$ plain form
2219 1109477 956138 956541 940015 1168396 1287344 1247877 1264943 1291900 1266034 1261239 1036728
2208 1036728 986277 1188972 1206798 1346791 1354653 1192780 1422818 1250021 1394486 1550232
2198 1550232 1512338 1522669 1357262 1269368 1242578 1487614 1507643 1331558 1166288 1096928 1319173
2187 1319173 1624813 1667897 1579769 1652103 1850874 1594387 1396134 1530844 1768134 1789401
2177 1789401 1821632 1785130 1718085 1791005 1842862 1908415 2115254 2229119 2081951 1979127 2159216
2166 2159216 2329137 2469801 2310624 2426588 2559151 2619703 2650005 2946106 3234991 3310072
2156 3310072 3321440 3364305 3412604 3468855 3305940 3462695 3555196 3578225 3764133 3916643 4141416
2145 4141416 4356011 4490523 4641137 4709086 4892287 5137063 5238629 5181540 5302673 5677374
2135E677374K31314K85105K08061M57399N44312L68467K68080M42441L68005P59448
2125I610006O30718O68419R97403J187451O11491M63228O11213J048622J620499
2116A7449050K073976K428799L574857M025345N556004P478535R716886J2672281
2108F4975733J7027751J3162318o448816k0878473j8081778j0973340p088582
2101C1694813n143653l993196k948450k206730j843854j405621j050228p18320
2093A2384761m19035m52020p99790j180658r57397p22511n52929n68098l09759
2084F422564m51252l09821j65304j73041l02505o4967j90575l55406k74018q6977
2074D048698l39147k11441J40217m0109l77855j67247j37513j48257J4416k11512
$$ plain form
2135 5677374 5908688 6193793 6401854 6859253 7403565 7772032 8040112 8482553 8850558 9610006
2125 9610006 10240724 10909143 11906546 13093997 13705488 14168716 14779929 15828551 17449050
2116 17449050 19523026 21951825 25526682 29552027 35108031 42586566 52303452 64975733
2108 64975733 82003484 95165802 88716986 67838513 49756735 38783395 31694813
2101 31694813 26551160 22557964 19609514 17402784 15558930 14153309 13103081 12384761
2093 12384761 11965726 11513706 10713916 9533258 8575861 7853350 7300421 6732323 6422564
2084 6422564 5971312 5661491 5496187 5323146 5020641 4955674 4765099 4409693 4135675 4048698
2074 4048698 3709551 3498110 3638327 3598218 3220363 3053116 2915603 2767346 2781762 2570250
2064B570250j90221j6435O5304j24871j33487j76117k62680J64553J28590q058
2054B016828k62807M2760K07472j11810j16878j25179K88019j55390j75775p5271
2044A531969k5157k5523j98927J27682J26731J07968k61097k19406Q783J55854
2034A328877k9175j87057N0995l1066j56549q6521K07998n0374j61471K5086O7219
2023I77962j00286R6589j48323L3582j35748k4740P1745q0069O8947K26643p1327
2012I14975j17854j93762l226R5724j47205R2744p1502j32255J90205O9591j99749
2001D97686N3476N2504O7310k0795j16775O226O0820j16032P9133l5830j88290
1990C39433J3970L24117J23825r621j29160m8577p5655N4933K4060j06168P7156
$$ plain form
2064 2570250 2380029 2363594 2428898 2304027 2170540 1994423 1731743 1896296 2024886 2016828
2054 2016828 1754021 1796781 2004253 1892443 1775565 1650386 1938405 1783015 1607240 1531969
2044 1531969 1506812 1481289 1282362 1410044 1536775 1644743 1383646 1164240 1173023 1328877
2034 1328877 1299702 1112645 1163640 1132574 976025 889504 1097502 1047128 885657 910743 977962
2023 977962 877676 974265 825942 859524 723776 699036 770781 690712 759659 986302 914975
2012 914975 797121 603359 600133 695857 548652 641396 569894 437639 627844 697435 497686
2001 497686 551162 603666 670976 650181 533406 539632 600452 484420 563553 527723 339433
1990 339433 353403 677520 801345 791724 662564 613987 538332 593265 617325 511157 588313
1979E88313K9293q0795O1220O506J8868l57378k01441R9997J39141j07108P3010
1968B69626j02060O5190J02629M7272L01446j55414j18238K01689j29688j03699
1958C78753M0285j47726J79584j54457m6054J49147l2129p0634L05801k1250p0832
1947E10488p2314Q969P5070l12058R29j5358K4455J31018k54215k4023K58574
1936C31535L8579J1911j09380L948n5693k594l8617J15517P1091r0063l1895k0243
1924B24096K24866O4242j09514N4937j60556N1133J39026j55704j55365m3020
1914A34141J71701M9734j49018j65755O990R0500k1665J3582Q2249p1528j31594
1903I337J77531J29732r2507P9586r6087R2601k97143Q7810J65498J30341p888
$$ plain form
1979 588313 617606 536811 598031 604537 623405 266027 64586 164583 303724 196616 269626
1968 269626 167566 232756 335385 382657 684103 528689 410451 612140 482452 378753
1958 378753 419038 271312 450896 296439 250385 399532 367403 296769 602570 581320 510488
1947 510488 438174 447143 522213 210155 211084 195726 220181 351199 96984 72961 331535
1936 331535 370114 382025 272645 276593 220900 218306 179689 295206 366297 276234 244339 224096
1924 224096 448962 513204 403690 458627 298071 349204 488230 332526 177161 134141
1914 134141 305842 355576 206558 40803 47793 138293 116628 130210 212459 140931 9337
1903 9337 186868 316600 224093 303679 207592 300193 3050 90860 256358 386699 378811
1892C78811J07660L1453k34791J65138J18800J9575q3101k44147L9207k60977
1882C7628n6220K12979j10540R0553K01451q2367j1699O7346j30584m4810k33216
1871e9479J77283J66169k41577q8756J13343J92921q1718l9170p5159N0883o8836
1860D5904K32367j90253j92937K19512j62768o0365L9204J11307K93921j51655
1850A84237j50506j24871n7023J99951j3646K99709k2698p7287o972K07217J34925
1839E73036k3967p8471K64737Q2170j64913j40695k49888j92321R0667J05521
1829B65876j2720p8087j10579l6000p3217k6461J60409q6189J27521j04259L2884
1818E9178K3782K30771M9153j59088K10857r1913j16300j77137K68335J31740
$$ plain form
1892 378811 486471 517924 283133 448271 567071 586646 503545 259398 298605 37628
1882 37628 -18592 194387 83847 174400 375851 293484 281785 349131 218547 173737 -59479
1871 -59479 117804 283973 42396 -46360 66983 259904 178186 139016 63857 114740 45904
1860 45904 278271 88018 -104919 114593 -48175 -108540 -69336 41971 335892 184237
1850 184237 33731 -91140 -148163 51788 38142 337851 315153 237866 230894 438111 573036
1839 573036 549069 470598 735335 817505 652592 511897 262009 69688 160355 265876
1829 265876 253156 175069 64490 28490 -44727 -71188 89221 3032 130553 26294 59178
1818 59178 82960 313731 362884 203796 414653 322740 206440 29303 297638 429378
1808D29378j87733o4983J53633j00815l0021N1797k89838K52820J14927m6009
1798B83156J12222m5173Q1053k52731k53773J44789J01249k2320r6358j22647
1788g0533p4043J29507K7311J60757K09752o2443k81980p2375J16971J03900n7059
1777A29765j18456J19829m7561n5154l4643J63233j33443j28205J03000m2688
1767d4323J25439Q5053L7098K8738j26784k63696K6448R1702O9690j10911J59197
1756G7651M1254R1420J31878j16678j82642j79855J50757k9151q4932J59806N1208
1745A10716K5204j34989j30559J54861L9606J03938J715j36359J0192L0989j05001
1734b9687r136J42550q1912r2363J26560M8153N542k27929K11161J49213N5732
$$ plain form
1808 429378 241645 176662 330295 229480 199459 251256 -38582 214238 329165 283156
1798 283156 395378 350205 431258 178527 -75246 69543 170792 148472 52114 -70533
1788 -70533 -144576 -15069 12242 172999 382751 320308 38328 -34047 82924 186824 129765
1777 129765 11309 131138 83577 28423 -6220 157013 23570 -104635 -1635 -44323
1767 -44323 81116 166169 203267 232005 105221 -158475 -132027 -40325 29365 -81546 77651
1756 77651 118905 210325 342203 225525 42883 -136972 13785 -15366 -100298 59508 110716
1745 110716 135920 931 -129628 25233 64839 168777 170492 34133 44325 75314 -29687
1734 -29687 -38823 103727 21815 -70548 56012 104165 109707 -118222 92939 242152 297884
1723B97884k54919o755j28433J33171L4024O1641j00694R9542J29597R2009J56255
1712E13322k20395j66543j96072P8492N0013O3633m3587L4354J09827j24989o9613
1701B8442L5601K4306L3152j90589L27o8570J83175J99102q6233N0404j22543
1690H6574J21829K7149l05405R5190O4387J05553r0166j33619J53855K6667o4695
1679H7319j30189K54752J35858l05799J4232J03290R5738j30459o9743o5973M2924
1668C1950o1242n1571j000L8842P3355o4588K2251R7774m5289J88886k3652j46122
1656E9594L5450J67655k01526r5839m5083J70391N7995j2275J5359p8186j6170
1645E7365j75327N9025J28117Q4091L5766j26752j01626K3285P004J76421j36056
$$ plain form
1723 297884 42965 36210 -92223 40948 74972 136613 35919 135461 265058 357067 513322
1712 513322 292927 126384 -69688 8804 58817 122450 78863 113217 223044 98055 28442
1701 28442 64043 88349 121501 -69088 -68761 -137331 45844 244946 158713 209117 86574
1690 86574 208403 235552 -69853 25337 89724 195277 105111 -28508 125347 152014 87319
1679 87319 -42870 211882 347740 41941 56173 159463 255201 124742 54999 -10974 31950
1668 31950 -29292 -80863 -81863 -43021 30334 -34254 -12003 85771 40482 229368 205716 59594
1656 59594 95044 262699 61173 -34666 -79749 90642 148637 136362 151721 73535 57365
1645 57365 -117962 -58937 69180 153271 189037 62285 -39341 -16056 -9052 167369 31313
1634C1313n6909P8818k3149k0534m604P7223j6660k44192J60265K3574j63605
1623a58460M9838j40568j51154J72504K14280J00179j4008P342O7816p1044Q1509
1612A58234j23297k9763K6953j30437l0353N3622J46125j27430j27880K12370
1602B8144m5909N2603J33016j01723j45121l1622J95385k18008j2610O1163M7278
1591c7404K14297o7403m2349J20717N1072Q9687k82818M2150j03799L1353j2636
1580B867l2994k3761Q2003Q752J85749j32858j6652J30210Q579k1357j06708j27489
1568d3659K4900J78001J7347M6052K1696q0342j02047k7109m0981j20859l2722
1557a59723K56800p5519j24333Q1436O9459J4486K1637j39399J70225j70187M3719
$$ plain form
1634 31313 -25596 53222 30073 9539 4935 82158 65498 -178694 -18429 5145 -158460
1623 -158460 -108622 -249190 -400344 -227840 -13560 86619 72611 79953 147769 76725 158234
1612 158234 34937 5174 32127 -98310 -128663 -75041 71084 -56346 -184226 28144
1602 28144 -17765 34838 167854 66131 -78990 -110612 84773 -133235 -145845 -84682 -37404
1591 -37404 176893 109490 67141 187858 238930 328617 45799 87949 -15850 15503 2867
1580 2867 -30127 -53888 28115 36867 222616 89758 73106 203316 211895 190538 83830 -43659
1568 -43659 -18759 159242 176589 222641 244337 163995 61948 34839 -6142 -127001 -159723
1557 -159723 97077 21558 -102775 -21339 48120 62606 84243 -55156 115069 -55118 -11399
1546a1399O9325J35472j81306j85823P2005L7027o9163K13041n3576n9856r1103
1535a25356O1145J3569p3281K4047p2791K30295J36475k60257j7864O7849j85552
1524b01721J31721J6658K87312K5744k20708O1533p5722l8658M1531p7393J07540
1513E7837j6608Q4457K04778j9786j41525j07429j18380M0442K21224l4101n8501
1502A12408o0788J15803q7970j2568O8557j15434l2632J0859n0997K44035j8731
1491A72542j77658j30648O194J40779j07799J97217r566j72399k361J064n7682
1480a40317N4606J98589j79500J19243J04907j22622N637K0934r911j88830R6346
1469d0918L4452J45820N3819j94506l9029K1311M9694j46307r1596J46510J88836
$$ plain form
1546 -11399 57926 193398 12092 -173731 -101726 -64699 -133862 79179 25603 -34253 -125356
1535 -125356 -64211 -50642 -123923 -99876 -172667 57628 194103 -66154 -84018 -16169 -201721
1524 -201721 -70000 -53342 233970 259714 39006 100539 24817 -13841 27690 -49703 57837
1513 57837 41229 125686 330464 310678 169153 61724 -56656 -16214 205010 170909 112408
1502 112408 51620 167423 79453 66885 135442 20008 -12624 -1765 -52762 191273 172542
1491 172542 -5116 -135764 -129570 11209 -96590 100627 91061 -81338 -83699 -82635 -140317
1480 -140317 -85711 112878 -66622 52621 157528 34906 40543 61477 51566 -137264 -40918
1469 -40918 -6466 139354 193173 -1333 -40362 -19051 30643 -115664 -207260 -60750 128086
1458A28086J33236q4244O8837K1995k9873l9380P5950m2576k17665m8501J96723
1447A62588q5721j05403J42701k1887J12019L2530j11525k2551k74343K80866
1437A09274o4138k33363K68790M4631R0477q089j03769j31317j91964J00291K45733
1426A26556O7983o7768k7820R9908q332p7881J86401O946j86401K4535L8087j47088
1414C5126j60844m2334J27725J93801O4303k29489P2253K13790o5516P5574k29194
1403E5195j12599k4989R7313k7820N0084n6486k28991o1498L0895O2557J04781
1392a11558O4404p8318N8810k9062q947L0154Q4620O910L2075j30569J35201j46645
1380i2925k43467K17718J82892Q3888q8969k53011q259J21823n4813q5523J44857
$$ plain form
1458 128086 261322 177078 245915 267910 238037 198657 274607 232031 14366 -34135 162588
1447 162588 76867 -28536 114165 92278 204297 236827 125302 102751 -171592 109274
1437 109274 45136 -188227 80563 125194 215671 207582 103813 -27504 -219468 -119177 126556
1426 126556 194539 126771 98951 198859 190527 112646 299047 305993 119592 144127 182214 35126
1414 35126 -125718 -168052 -40327 153474 217777 -11712 60541 274331 208815 284389 55195
1403 55195 -57404 -82393 14920 -12900 37184 -19302 -248293 -309791 -278896 -216339 -111558
1392 -111558 -47154 -125472 -66662 -95724 -104671 -74517 10103 17013 49088 -81481 53720 -92925
1380 -92925 -336392 -118674 64218 148106 59137 -193874 -202133 -80310 -135123 -220646 -75789
1369g5789J27819q2826n6391n8356k6317P9695J57168j03474k3503j06454J3221
1358a55207K57433k8789R1292q9670k28381n4799l5196o776J63446J45273R0874
1347A49500j0878j47393P6444N3074J1097N4154j1277M8902p4939p5973o5504
1336G207K721R0172r3947J32493q1566L5319j69066j6102p0358q4381J94135j88302
1324b41675q1164J99222J11298L4671L203q4521j23740J34030O2867j5589r3379
1313i4777N2020o9743K18855J00656j00918L8993j26668O3670L3202p0305N9397
1302A04382J12546j78350k13529o0388l6724J00942l2023j5782L14684n4851O6997
1291A07904m2107j474J7082k5970q160J2496r1034N2272O2018j63091q9355q9767
$$ plain form
1369 -75789 52030 -30796 -87187 -145543 -171860 -92165 65003 -38471 -61974 -168428 -155207
1358 -155207 102226 73437 164729 75059 -153322 -208121 -243317 -250093 -86647 58626 149500
1347 149500 138622 -8771 67673 120747 131844 185998 174721 223623 148684 72711 7207
1336 7207 9928 100100 6153 138646 57080 92399 -76667 -92769 -163127 -247508 -53373 -241675
1324 -241675 -322839 -123617 -12319 22352 25555 -58966 -182706 -48676 14191 -1398 -94777
1313 -94777 -42757 -112500 106355 207011 106093 145086 18418 82088 115290 44985 104382
1302 104382 216928 38578 -174951 -235339 -272063 -171121 -203144 -218926 95758 40907 107904
1291 107904 65797 64323 81405 55435 47275 59771 -31263 21009 83027 -80064 -169419 -259186
1279b59186J8654J75753j131J37312R500k95627J6964M9583P2172J56112j14398
1268c4292k2451K19879p1192q9594J2924J06346q1063o3589L8293P5780l9315
1257E1726j17472N7034J64012o7583o6547r4058j65690J23292J05668l6017j22543
1246a68178J31J19228O0663m624o7642r1169O8021P5223R6183O969K6408p1748
1234D9465j32639q2893J05314J16130n2946N3959k20941R0004J32307K87459j52292
1223A92927m19431o792J12881n723m5276J89726k7214q8029N3934M811M5753P8052
1211H5619M5451k65513p350J76566j3511P5203j28132j03140L55762K0689j21061
1200A20583N1129k47340M9666O5319n650l29266O4896K44352k8002O5203J76561
$$ plain form
1279 -259186 -240532 -64779 -65910 71402 80902 -214725 -197761 -148178 -76006 80106 -34292
1268 -34292 -56743 163136 91944 2350 15274 121620 40557 -23032 15261 91041 51726
1257 51726 -65746 -8712 155300 87717 21170 -72888 -238578 -115286 -9618 -45635 -168178
1246 -168178 -168047 -48819 11844 7220 -60422 -151591 -83570 -8347 87836 94805 121213 49465
1234 49465 -83174 -166067 -60753 55377 2431 56390 -164551 -74547 57760 345219 192927
1223 192927 -226504 -233296 -120415 -126138 -171414 18312 -8902 -96931 -42997 -38186 7567 85619
1211 85619 131070 -134443 -141793 34773 21262 96465 -31667 -134807 220955 241644 120583
1200 120583 171712 -75628 -25962 39357 33707 -295559 -230663 13689 -14313 50890 227451
1189B27451o9728o6256j04983o7428m405R2989O9159N2766j51010N3264l0373
1178A446k15619O6327P9764n6992k5080J05092N9550o8820L7631L7283o7907O4908
1166A7583j13677P2081R9244Q4748N5937n7999m6719k43101K33868J33643n7663
1155A77945J1690J01510q8421j28717K3329j8682q4890J27831L4594N6528k49720
1144c7003j63606K14435P9288L7832n2934K0925k41808Q6852J12900j23055J18392
1133E2218O5631J1966n2259j99913K4573J06737Q4433p0576K1677l6330O6368
1122G4525k36344m5623R1795m4404L35036o6556p4853J14604M2685j14095k63016
1111a86246N5333L2604k3636n4399J31163K19817q995j32421J7919j11726R6797
$$ plain form
1189 227451 157723 91467 -13516 -80944 -85349 7640 76799 129565 -21445 31819 1446
1178 1446 -214173 -147846 -68082 -125074 -150154 -45062 14488 -54332 -16701 20582 -47325 17583
1166 17583 -96094 -24013 75231 159979 215916 157917 111198 -131903 101965 235608 177945
1155 177945 189635 291145 202724 74007 97336 78654 -6236 121595 156189 212717 -37003
1144 -37003 -200609 13826 93114 130946 78012 98937 -142871 -56019 56881 -66174 52218
1133 52218 117849 129815 77556 -122357 -97784 8953 93386 22810 44487 8157 74525
1122 74525 -161819 -207442 -115647 -160051 174985 108429 33576 148180 190865 76770 -186246
1111 -186246 -130913 -98309 -121945 -176344 -45181 174636 165641 33220 51139 -60587 36210
1100C6210j25367K11558j0224K506J38907J21094p1481O0219j58599j21027K24778
1089C08574k54945K9515J61483L8620j63823j32037j62782j2398O1710k8357J63595
1078I155o6364m8387J52024j2383J27181N8563r6038P254k1682n6766J32581k15919
1066c0781k06428R1072J41767J6053M2047q690j63182R9384M5819Q948o0409K550
1054b1850k1686M9552J0737j17066O1019n4976K9188R6417k23428J1483L66143
1043A85533K6473l74657j05586M0265J54979K5397K09217j33330k43845K17021
1033A467l1486n3278R8581K0476q4046J1002k5754R7211m389k2130o0403J3594
1021c9155o4996n0075J61427J72535k31778J29920J43864j70013j32543J42433
$$ plain form
1100 36210 -89157 122401 112177 114683 253590 374684 303203 363422 204823 83796 308574
1089 308574 53629 83144 244627 283247 119424 -12613 -175395 -187793 -126083 -154440 9155
1078 9155 -57209 -105596 46428 34045 161226 219789 123751 131005 109323 52557 185138 -30781
1066 -30781 -237209 -146137 -4370 11683 53730 45040 -118142 -18758 27061 36009 -24400 -21850
1054 -21850 -43536 6016 16753 -100313 -39294 -94270 -65082 31335 -192093 -180610 185533
1043 185533 212006 -162651 -268237 -227972 -72993 -47596 161621 28291 -215554 1467
1033 1467 -30019 -83297 15284 35760 -48286 -37284 -63038 34173 29784 7654 -52749 -39155
1021 -39155 -104151 -154226 7201 179736 -52042 77878 221742 51729 -80814 61619
1011F1619r6879m5910M8300L5286R3248J17263l3199k92258j48832P3441p6498
1000b64419J85730Q5527l0908J51926L3833j14575p6810k429J44966q3424l04211
989b74794J21572J93801r3260J06948j6724m0519j35498P85J23850N4263J55951
978A96375m5979N1720k00089J7876k6272j09990m1708K20284J3835j06613J14227
967H3666L5512P3169p9474l6840j84015k28873J24803q604M7775k3869k4678M3810
955a77618M8542J9207j67483R8353R3629K0890j35343j11343q204M1552J71487
944a06331O3292j55847P1723J13574m1905k09j31491j45905P6570J07457K31522
933H2450M870j4493L9134k30040L18628J45196j92249j77442o8163J31219j37900
$$ plain form
1011 61619 -35260 -81170 -32870 2416 95664 212927 179728 -112530 -261362 -187921 -264419
1000 -264419 -78689 6838 -24070 127856 161689 47114 -29696 -32125 112841 29417 -274794
989 -274794 -153222 40579 -52681 54267 37543 -2976 -138474 -137689 -13839 40424 196375
978 196375 150396 202116 2027 19903 -6369 -116359 -158067 62217 76052 -30561 83666
967 83666 119178 192347 112873 76033 -107982 -336855 -212052 -220656 -172881 -196750 -221428 -177618
955 -177618 -129076 -109869 -277352 -178999 -85370 -64480 -199823 -311166 -319370 -277818 -106331
944 -106331 -43039 -198886 -127163 -13589 -55494 -55703 -187194 -333099 -256529 -149072 82450
933 82450 87320 72827 111961 -118079 200549 345745 153496 -23946 -92109 39110 -98790
922i8790Q130P3163l4409J49725M9917j15651J61316L69o0870n3197j7583J78572
910B40692j16130k81036O521J6766p8799O1320R7587K19104l1740P1670j74733
899C1222K6758k3787m6727p5411J44901j3796L2770J36391j69525J0458J72301
888B25555j89968J05497J24093M1921q2156k29718L9454p2107l2113J98832q1259
877D8031K65554n4835l93151J46237n9249n0034M0277K29125l5797k28804N851
866h6795J69098J5517m3637j03235o7991j44196R395K36802M9417K1469o4144
855h300K8262J33054J53850k12020j25785K15237j39482q5898j8488J12499k1780
844C1149J10112q6749k41402L8406K91398p3472j84141R8342O3841J17875j12868
$$ plain form
922 -98790 -90660 -17497 -51906 97819 147736 32085 193401 193770 132900 79703 62120 240692
910 240692 124562 -156474 -149953 -133187 -211986 -150666 -53079 166025 134285 205955 31222
899 31222 57980 34193 -12534 -87945 56956 43160 75930 212321 42796 53254 225555
888 225555 35587 141084 265177 307098 224942 -4776 34678 -37429 -69542 129290 48031
877 48031 313585 258750 -134401 11836 -47413 -97447 -57170 171955 136158 -92646 -86795
866 -86795 82303 97820 54183 -49052 -117043 -261239 -251844 -15042 34375 55844 -8300
855 -8300 19962 153016 306866 94846 -30939 184298 44816 -41082 -59570 52929 31149
844 31149 141261 54512 -186890 -148484 142914 69442 -114699 -16357 47484 165359 52491
833E2491k63081N9056j18154J88502J82492j03167l3495J03381o075M6937J5266
822A24153l35584J68119k8559j88335K46368O6021J17022r1214p9445J31191n2491
811G7246j19732Q020j63160m5317Q9877P2678j336j8296M5418m3881P269q091
799i9305j5316r7767j7436o1116K57451O2403p1963j18408k692K86581K5152J84516
787C32100j37588j51228o0834k4676O908l0163r9088k0528M09850j05383k02850
776h3480J05542l4197j0944R5649j220N7519k0784q7252J05269j23755m4224P7651
764C5774k40142Q1686J83475K7105j07633R7874k29107J68534p6278j72006M7387
753a83331o535J11475J09650J34718o3564q4404r4394J153l5143n1948J38666
$$ plain form
833 52491 -210590 -151534 -269688 -81186 101306 -1861 -35356 68025 61950 108887 124153
822 124153 -211431 -43312 -71871 -260206 -13838 52183 169205 77991 -1454 129737 77246
811 77246 -42486 -34466 -197626 -242943 -153066 -80388 -81724 -100020 -54602 -98483 -91214 -99305
799 -99305 -114621 -212388 -229824 -290940 -33489 28914 -43049 -161457 -164149 122432 147584 332100
787 332100 194512 43284 -17550 -42226 -35318 -65481 -164569 -185097 224753 119370 -83480
776 -83480 22062 -12135 -23079 72570 71350 128869 108085 20833 126102 2347 -41877 35774
764 35774 -204368 -122682 60793 87898 -19735 78139 -150968 17566 -58712 -230718 -183331
753 -183331 -189866 -78391 31259 165977 102413 18009 -76385 -75232 -110375 -162323 -23657
742b3657J33316k169k3965p5346o5324j27282J61514L4407R0162l7660j13430
731d9434r2681J59650m5616J04461j7373j44298k3337M6262j00041k4165J33665
720e2907P8560l5708l2133R0362j51750L2257J22602O0181k6790o8946K4824l7262
708C290q2417O2796m8813M3413J45625J72213p5682j76238P8263j96875N3946
697b0479J08281j09214n2884K4860K3610J37250j12270J58366J35124k28016k3400
686D1228j10655k5368J46577L8425p0673J56774o2538J8105q9583J05817j03427
675D4682k8903P7024J9536m9632n5518M9616M0090k3029j08209J72656k25788
664h7475R4651J55208k4105P0972l2349J7208p1794p7792q4735N5111n6350J50414
$$ plain form
742 -23657 109659 107490 83525 8179 -57145 -184427 -22913 11494 101656 63996 -49434
731 -49434 -142115 17535 -28081 76380 59007 -85291 -108628 -62366 -162407 -186572 -52907
720 -52907 25653 -10055 -42188 48174 -103576 -71319 51283 111464 84674 15728 40552 3290
708 3290 -79127 -16331 -65144 -21731 123894 296107 220425 44187 122450 -74425 -20479
697 -20479 87802 -21412 -74296 -49436 -25826 111424 -846 157520 292644 64628 41228
686 41228 -69427 -94795 51782 90207 19534 176308 113770 131875 42292 148109 44682
675 44682 15779 92803 112339 62707 7189 56805 96895 73866 -34343 138313 -87475
664 -87475 7176 162384 138279 209251 176902 194110 122316 44524 -40211 14900 -41450 108964
652A08964J44283j26085j24516P6577J20016j30938k10903O4842J02600j3665
642A1175j2609N9960j02635q4862l4178K55627N3179j02112j5326J61272L5626
631B25117o5143j22962l3065L4031m7679n3947P3456O7718j25552p3321P1133
620e0214L4200k92860N6372Q4753P2828j39193J2223N7326K5291J619P8068J71578
608A11991N8983n8586k00191j55215R6347K58910K5739j77586J65839j08539M9868
597F7560J22721k14010j4052N500k3710o2581J23387q5589o5654o979J69706J54622
585A70921k01591j01676K51210K569n8350P67L7666N5363O1451j20239N066J63361
573B66518k97772r5298J92719p053j03645k84310K7845K80290M4783J20290j98914
$$ plain form
652 108964 253247 127162 2646 79223 199239 68301 -142602 -77760 24840 11175
642 11175 -1434 58526 -44109 -128971 -163149 92478 145657 43545 28219 189491 225117
631 225117 159974 37012 3947 37978 -9701 -63648 9808 77526 -48026 -121347 -50214
620 -50214 -16014 -308874 -252502 -167749 -94921 -234114 -221891 -164565 -139274 -137655 -59587 111991
608 111991 170974 112388 -87803 -243018 -146671 112239 137978 -39608 126231 17692 67560
597 67560 190281 -23729 -37781 -32281 -55991 -118572 4815 -80774 -146428 -153407 16299 170921
585 170921 -30670 -132346 118864 121433 63083 63850 101516 156879 218330 98091 103157 266518
573 266518 -31254 -126552 66167 59114 -44531 -328841 -300996 -20706 24077 144367 -54547
562e4547j48137J379l4915J58332N9323J5196K4937n8879M3254K0053k8599J42394
550A39791j61024O5446M7567O5424J48796k59765O0960O957k0102j09126L7263
539B2187K793q3188j2393J16628n7347J67112l5790k45785j9972J72376m2335
528a5714R1121p7997m7144n4595K7150k717r8581r1108J04529J19592m1502J7104
516f9862K31767j4024k35641m0231k10901K56265q690N3194l8638M8669k16890
505b44982k75725K50742o2032J69072J14301O3558n396J68547Q6554j37743R5313
494B22209j69038l26050N293L39304K01786k41213j07886K42454j83613j57864
484a74618n0857J52665p3003j19009j38734J52043K68351K9624p2840M9362K123
$$ plain form
562 -54547 -202684 -201305 -236220 -77888 -18565 -3369 21568 -37311 5943 25996 -2603 139791
550 139791 -21233 44213 91780 157204 306000 46235 107195 114152 94050 -15076 22187
539 22187 24980 -58208 -70601 46027 -11320 155792 120002 -125783 -145755 26621 -15714
528 -15714 75407 -2590 -49734 -104329 -77179 -79896 -178477 -269585 -165056 -45464 -86966 -69862
516 -69862 161905 147881 -87760 -127991 -338892 -82627 -91317 -38123 -76761 -28092 -244982
505 -244982 -520707 -269965 -331997 -162925 -48624 14934 9538 178085 264639 126896 222209
494 222209 53171 -272879 -267586 71718 273504 32291 -75595 166859 -16754 -174618
484 -174618 -225475 -72810 -145813 -264822 -403556 -251513 16838 46462 -26378 22984 25107
473B5107j8225J16368k69570J13169J22162j06201o7560j20837J01599k1669r8339
462b23996J82415k6652M8766M6366j31420J97406l9203j67249P355M3693k36020
451b98539J50792j10929K67019Q0454k45531r4911k11238L10293J33375j17321
441a36536J53683k68997J26927N9650j67771L1065j55845K25968r6401J32694
431i5563J8259l1344L2724q9037M2748M0183j45793L2845o9937J46924R5434J3494
419i063p2167o1901n201q929J96015j11590j4787n1648P6140M9475O022j11035
407a18669J07271l0364p6892J40309J27751k47846n0256k6322m6507J12414O2249
396d6862J172J06008J4684Q3867l0890k23788j8340N1083J94420O5410j54285
$$ plain form
473 25107 6882 123250 -146320 -33151 89011 -17190 -84750 -205587 -103988 -125657 -223996
462 -223996 -41581 -68233 -19467 26899 -104521 92885 53682 -113567 -106212 -62519 -298539
451 -298539 -147747 -258676 8343 88797 -156734 -251645 -462883 -152590 -19215 -136536
441 -136536 17147 -251850 -124923 -65273 -233044 -201979 -357824 -131856 -228257 -95563
431 -95563 -77304 -108648 -75924 -164961 -122213 -82030 -227823 -194978 -264915 -117991 -22557 -9063
419 -9063 -81230 -143131 -148332 -157261 38754 -72836 -87623 -139271 -63131 -13656 -7634 -118669
407 -118669 -11398 -41762 -118654 21655 149406 -98440 -148696 -175018 -221525 -109111 -46862
396 -46862 -45690 60318 75002 158869 127979 -95809 -114149 -63066 131354 196764 42479
385D2479r0402K23449m8985j53254M49m5480j97944L4214P7101L1172J4696J21673
373I168J30744m7828q4606p8430k7938K26514Q9549k60805q5330J43576J42575
362A57189p5654j63541R0387L6911J15418q0904j45520j29745J20670M7941j6616
351d3464j01723J61117J37952L1541k00135l38267J37611J6715O08J21507Q0374
340C836o3484j563N1005j97608L3634m991k3508J75163l5770k09244J60820M9291
328f2419P8552R7562l1031j50987R7935j6694k1007Q0061j07682J29111m1759
317E1642j11705j6872J19958l3480k79426o5461R5593K13075k4488J4414j01433
306a38183L3981L0254N7119Q6528q9311l3694j25023K88142k2587P564j1384j30595
$$ plain form
385 42479 -47923 175526 126541 -26713 -26264 -71744 -269688 -235474 -158373 -127201 -112505 9168
373 9168 139912 92084 7478 -70952 -98890 127624 217173 -43632 -128962 14614 157189
362 157189 81535 -82006 8381 45292 160710 79806 -65714 -195459 -74789 -26848 -43464
351 -43464 -145187 15930 153882 185423 -14712 -352979 -215368 -198653 -198045 -76538 3836
340 3836 -59648 -61211 -10206 -207814 -174180 -179171 -202679 -27516 -63286 -272530 -111710 -62419
328 -62419 16133 113695 82664 -68323 29612 12918 -8089 71972 -35710 93401 51642
317 51642 -60063 -76935 43023 9543 -269883 -335344 -239751 -26676 -51164 -36750 -138183
306 -138183 -104202 -73948 -16829 69699 -19612 -53306 -178329 109813 87226 94790 83406 -47189
294d7189j48834J52244p3751k7976J04886j1418m2819J03686n7239j5788M7799
283a6399P9430j17469N560J20647j44870j63046q3434J83126O1592P5749J08458
272A09344M2215l3482j8181J1928j76140J01941M1143Q8551j55679q2065J51953
261H1528l8619q321O1355j02206n8020K2239K8548k01083j87098K12582j05612
250b94707K2783J82234o8882j41849M5112j5506O3836J50151O2290o1994k64277
239c20809j54461J71158J10231M6419Q935J52410j9169k13382l7357n2026J36780
228a71271K31753p0497j32703R4474k8779j81426J57101L2171K61435Q4305L3243
217C09806j00678L7040n2761j64875q4080O8121J08431k84267m093l719Q7437
$$ plain form
294 -47189 -196023 -43779 -117530 -145506 -40620 -52038 -94857 8829 -48410 -64198 -16399
283 -16399 63031 -54438 -48878 71769 -73101 -236147 -319581 -136455 -74863 886 109344
272 109344 151559 118077 99896 111824 -64316 37625 78768 167319 11640 -70425 81528
261 81528 42909 34588 95943 -6263 -64283 -42044 -13496 -214579 -401677 -189095 -294707
250 -294707 -271924 -89690 -158572 -300421 -255309 -270815 -206979 -56828 5462 -56532 -320809
239 -320809 -475270 -304112 -193881 -147462 -138527 13883 -5286 -218668 -256025 -308051 -171271
228 -171271 60482 -10015 -142718 -48244 -77023 -258449 -101348 -69177 192258 276563 309806
217 309806 209128 246168 193407 28532 -55548 12573 121004 -163263 -167356 -171075 -83638
206h3638j3627n6801N0673K21825k1200M6013j36250o1619R0018m5823j88066
195a98495L2113R6522l4435J29979M817m4931k224J64935L7976r3794J5993j46318
183c7862p6067j50956j4911J46885o5685J28590M1104o4084L1052K7401j2289
172d6822n3196K40850j54763j43654j33581Q5192J22843L3590Q8160q859n308
$$ plain form
206 -83638 -97265 -154066 -103393 118432 97232 143245 6995 -54624 35394 -10429 -198495
195 -198495 -166382 -69860 -104295 25684 30501 -14430 -16654 148281 186257 92463 108456 -37862
183 -37862 -113929 -264885 -279796 -132911 -198596 -70006 -28902 -92986 -61934 -34533 -46822
172 -46822 -100018 140832 -13931 -157585 -291166 -205974 -83131 -49541 38619 29760 24452
$$ [...]
##END NTUPLES=NMR SPECTRUM
##END=
