##TITLE=1H_CG-1175-1
 CDCl3
 8 sc, 
 24.9.2023
##JCAMPDX= 6.0         $$ Bruker NMR JCAMP-DX V2.0
##DATA TYPE= NMR SPECTRUM
##DATA CLASS= NTUPLES
##ORIGIN= UXNMR, Bruker Analytische Messtechnik GmbH
##OWNER= root
$$ XWIN-NMR		Version 3.5
$$ Mon Sep 25 14:00:33 2023 Russian Standard Time (UT+4h)  she@DPX200
##.OBSERVE FREQUENCY= 200.13135
##.OBSERVE NUCLEUS= ^1H
##.ACQUISITION MODE= SIMULTANEOUS
##.ACQUISITION SCHEME= undefined
##.AVERAGES= 8
##.DIGITISER RES= 18
##SPECTROMETER/DATA SYSTEM= spect
##.PULSE SEQUENCE= zg30
##.SOLVENT NAME= CDCl3
##.SHIFT REFERENCE= (INTERNAL, CDCl3, 0, 15.7458)
##AUDIT TRAIL= $$ (NUMBER, WHEN, WHO, WHERE, WHAT)
$$ ##TITLE= Audit trail, XWIN-NMR		Version 3.5
$$ ##JCAMPDX= 5.01
$$ ##ORIGIN= Bruker BioSpin GmbH
$$ ##OWNER= she
$$ F:/spectra/data/she/nmr/H-F/1/pdata/1/auditp.txt
$$ ##AUDIT TRAIL=  $$ (NUMBER, WHEN, WHO, WHERE, WHAT)
(   1,<2023-09-25 13:59:21.53 +0400>,<she>,<DPX200>,
      <created by zg, POWCHK disabled, PULCHK disabled
       configuration hash MD5:
       00 E9 B6 7A A2 85 ED C7 34 08 36 98 17 FE 4E 26
       data hash MD5: 16K
       54 6A A9 47 91 1E 93 EC CE 17 FA BE 32 FE C1 04>)
(   2,<2023-09-25 13:59:24.03 +0400>,<she>,<DPX200>,
      <Start of raw data processing
       efp BC_mod = 2 LB = 0.24 FT_mod = 6 PKNL = 1 PHC0 = -21728.18 PHC1 = 34.65271 SI = 16K 
       data hash MD5: 16K
       EF C6 99 FD D8 8A BC 4E A1 2F 3F 71 F0 DD CC 32>)
(   3,<2023-09-25 13:59:46.20 +0400>,<she>,<DPX200>,
      <pk PHC0 = 16.30892 PHC1 = -22.8 
       data hash MD5: 16K
       66 79 24 01 74 2A EC 11 73 4C 4F 0D 94 B3 9F 53>)
(   4,<2023-09-25 13:59:50.14 +0400>,<she>,<DPX200>,
      <abs ABSG = 5 
       data hash MD5: 16K
       42 34 D3 6A 25 38 3A EF 77 00 65 B3 65 0A 24 D9>)
$$ ##END=
$$ 
$$ hash MD5
$$ 50 14 16 5D 7F A0 4F 10 BB 4E DC 38 08 42 C8 56
##$RELAX= 
##$RELAX= 
##$RELAX= 
##$RELAX= 
##$RELAX= 
##$RELAX= 
$$ Bruker specific parameters
$$ --------------------------
##$DU= <F:/spectra>
##$EXPNO= 1
##$NAME= <H-F>
##$PROCNO= 1
##$TYPE= <nmr>
##$USER= <she>
##$AMP= (0..31)
100 100 100 100 100 100 100 100 100 100 100 100 100 100 100 100 100 100 
100 100 100 100 100 100 100 100 100 100 100 100 100 100 
##$AQSEQ= 0
##$AQ_mod= 1
##$AUNM= <au_zg>
##$AUTOPOS= <>
##$BF1= 200.13
##$BF2= 200.13
##$BF3= 200.13
##$BF4= 200.13
##$BF5= 200.13
##$BF6= 200.13
##$BF7= 200.13
##$BF8= 200.13
##$BYTORDA= 1
##$CFDGTYP= 0
##$CFRGTYP= 5
##$CHEMSTR= <none>
##$CNST= (0..31)
1 1 145 1 1 1 1 1 1 1 1 1 1 1 1 1 1 1 1 1 1 1 1 1 1 1 1 1 1 1 1 1 
##$CPDPRG= <>
##$CPDPRG1= <>
##$CPDPRG2= <>
##$CPDPRG3= <>
##$CPDPRG4= <mlev>
##$CPDPRG5= <mlev>
##$CPDPRG6= <mlev>
##$CPDPRG7= <mlev>
##$CPDPRG8= <mlev>
##$CPDPRGB= <>
##$CPDPRGT= <>
##$D= (0..31)
0 1.2 0 0 0 0 0 0 0 0.06 0 0.03 0 0 0 0 0.0002 0 0 0 0 0 0 0 0 0 0 0 0 
0 0 0 
##$DATE= 1695635961
##$DBL= (0..7)
120 120 120 120 120 120 120 120 
##$DBP= (0..7)
150 150 150 150 150 150 150 150 
##$DBP07= 0
##$DBPNAM0= <>
##$DBPNAM1= <>
##$DBPNAM2= <>
##$DBPNAM3= <>
##$DBPNAM4= <>
$$ [...]
##$SUBNAM3= <"">
##$SUBNAM4= <"">
##$SUBNAM5= <"">
##$SUBNAM6= <"">
##$SUBNAM7= <"">
##$SUBNAM8= <"">
##$SUBNAM9= <"">
##$SW= 18.05172834244
##$SWIBOX= (0..15)
0 0 2 0 0 0 0 0 0 0 0 0 0 0 0 0 
##$SW_h= 3612.71676300578
##$TD= 16384
##$TD0= 1
##$TE= 0
##$TE2= 300
##$TE3= 300
##$TEG= 300
##$TL= (0..7)
0 120 120 120 120 120 120 120 
##$TP= (0..7)
150 150 150 150 150 150 150 150 
##$TP07= 0
##$TPNAME0= <>
##$TPNAME1= <>
##$TPNAME2= <>
##$TPNAME3= <>
##$TPNAME4= <>
##$TPNAME5= <>
##$TPNAME6= <>
##$TPNAME7= <>
##$TPOAL= (0..7)
0.5 0.5 0.5 0.5 0.5 0.5 0.5 0.5 
##$TPOFFS= (0..7)
0 0 0 0 0 0 0 0 
##$TUNHIN= 0
##$TUNHOUT= 0
##$TUNXOUT= 0
##$USERA1= <user>
##$USERA2= <user>
##$USERA3= <user>
##$USERA4= <user>
##$USERA5= <user>
##$V9= 5
##$VALIST= <valist>
##$VCLIST= <CCCCCCCCCCCCCCC>
##$VD= 0
##$VDLIST= <DDDDDDDDDDDDDDD>
##$VPLIST= <PPPPPPPPPPPPPPP>
##$VTLIST= <TTTTTTTTTTTTTTT>
##$WBST= 1024
##$WBSW= 4
##$XGAIN= (0..3)
0 0 0 0 
##$XL= 0
##$YL= 0
##$YMAX_a= 354776
##$YMIN_a= -510950
##$ZGOPTNS= <>
##$ZL1= 120
##$ZL2= 120
##$ZL3= 120
##$ZL4= 120
##$ABSF1= 15.73366
##$ABSF2= -2.31819
##$ABSG= 5
##$ABSL= 3
##$ALPHA= 0
##$AQORDER= 0
##$ASSFAC= 0
##$ASSFACI= 0
##$ASSFACX= 0
##$ASSWID= 0
##$AUNMP= <proc_1d>
##$AZFE= 0.1
##$AZFW= 0.1
##$BCFW= 0
##$BC_mod= 2
##$BYTORDP= 0
##$COROFFS= 0
##$CY= -3
##$DATMOD= 1
##$DC= 0
##$DFILT= <>
##$DTYPP= 0
##$F1P= 0
##$F2P= 0
##$FCOR= 1
##$FTSIZE= 16384
##$FT_mod= 6
##$GAMMA= 0
##$GB= 0
##$INTBC= 1
##$INTSCL= 3.70164e-10
##$ISEN= 128
##$LB= 0.24
##$LEV0= 0
##$LPBIN= 0
##$MAXI= 10000
##$MC2= 0
##$MEAN= 0
##$ME_mod= 0
##$MI= 1.114404
##$NCOEF= 0
##$NC_proc= -6
##$NLEV= 6
##$NOISF1= 3.799351
##$NOISF2= 2.8
##$NSP= 0
##$NTH_PI= 0
##$NZP= 0
##$OFFSET= 15.74579
##$PC= 1
##$PHC0= -21711.87
##$PHC1= 11.85271
##$PH_mod= 1
##$PKNL= yes
##$PPARMOD= 0
##$PSCAL= 0
##$PSIGN= 0
##$REVERSE= no
##$SF= 200.130005152855
##$SI= 16384
##$SIGF1= 3
##$SIGF2= 2
##$SINO= 5.538805
##$SIOLD= 16384
##$SREGLST= <1H.CDCl3>
##$SSB= 0
##$STSI= 16384
##$STSR= 0
##$SW_p= 3612.71676300578
##$SYMM= 0
##$S_DEV= 0
##$TDeff= 16384
##$TDoff= 0
##$TI= <>
##$TILT= no
##$TM1= 0
##$TM2= 0
##$TOPLEV= 0
##$USERP1= <user>
##$USERP2= <user>
##$USERP3= <user>
##$USERP4= <user>
##$USERP5= <user>
##$WDW= 1
##$XDIM= 16384
##$YMAX_p= 297787156
##$YMIN_p= -277088
$$ End of Bruker specific parameters
$$ ---------------------------------
##NTUPLES= NMR SPECTRUM
##VAR_NAME=  FREQUENCY,     SPECTRUM/REAL,   SPECTRUM/IMAG
##SYMBOL=    X,             R,               I
##VAR_TYPE=  INDEPENDENT,   DEPENDENT,       DEPENDENT
##VAR_FORM=  AFFN,          ASDF,            ASDF
##VAR_DIM=   16384,         16384,           16384
##UNITS=     HZ,            ARBITRARY UNITS, ARBITRARY UNITS
##FACTOR=    0.220516191357247, 1,           1
##FIRST=     3151.20493935301, 0,            0
##LAST=      -461.511823652771, 0,           0
##MIN=       -461.511823652771, -277088,     0
##MAX=       3151.20493935301, 297787156,    0
$$ Real data points
##PAGE= N=1
##DATA TABLE= (X++(R..R)), XYDATA
$$ [...]
5736A089365O7983l6989O0672o1388q5989L1695l1187P0954n3597j81825m1084
$$ 1089365 1157348 1120359 1181031 1119643 1033654 1065349 1034162 1105116 1051519 869694 828610
5725H28610l350m8445j7909N5551j8388j5295n6781N5349Q5556p484o7281p2242
$$ 828610 825260 776815 758906 814457 796069 780774 723993 779342 864898 857414 790133 717891
5713G17891l6800j08819J05574J1855p2294J0131Q5457p4640r9601m28m367o1341
$$ 717891 681091 572272 677846 689701 617407 627538 712995 638355 538754 538326 533959 472618
5701D72618K4733Q4569K211l922m9492l5015o8649J06173p825N2921j4404r6886
$$ 472618 497351 581920 584131 580209 530717 495702 427053 533226 525401 578322 563918 467032
5689D67032J31258J15151j10765p0534J422j17316N1864m4729k4972R1331K0235
$$ 467032 598290 713441 602676 532142 533564 416248 468112 423383 398411 489742 509977
5678E09977l4100n9222O9286j5922k7711n2219k2688j27529J36827l6849K0595
$$ 509977 475877 416655 485941 470019 442308 390089 367401 239872 376699 339850 360445
5667C60445l1256q2205l0945J9420J03046Q61N7567l4404m2999L0186K8998K15
$$ 360445 329189 246984 216039 235459 338505 339366 396933 362529 319530 349716 378714 378929
5655C78929L9103q1350k2087L5527M8843L9427K5277m4830j43766K102R402P9867
$$ 378929 418032 336682 314595 350122 398965 438392 463669 418839 275073 277175 286577 366444
5643C66444R580k467L1216m7168J0697Q1277j25153m9947M1886Q916Q9991J7140
$$ 366444 376024 373557 404773 357605 368302 449579 324426 274479 316365 325281 415272 432412
5631D32412l470l9947K1204n147j1558m4909k0305N2915N2331m8762K3328n6930
$$ 432412 428942 388995 410199 405052 393494 348585 328280 381195 433526 384764 408092 351162
5619C51162m08Q8906M7206k9763m1135r6320M0140N6435p1528j09581P0966P8052
$$ 351162 350754 439660 486866 457103 415968 319648 359788 416223 344695 235114 306080 384132
5607C84132J00419q9986J9821k0211O0913K0476J35161o5237k4779K2074m8928
$$ 384132 484551 394565 414386 394175 455088 475564 610725 545488 520709 542783 493855
5596D93855O1669k5676K5530p1102j9868n6238R6008J69098r6769n8448P1998
$$ 493855 555524 529848 555378 484276 464408 408170 504178 673276 576507 518059 590057
5585E90057o0721K9666l6550J48955K8198q1865K3637L5640M4837K1271q3035
$$ 590057 529336 559002 522452 671407 699605 617740 641377 677017 721854 743125 660090
5574F60090k3136M4000j042q9066k927J03795P7693j12018l6581J2210j4248M5348
$$ 660090 636954 680954 679912 590846 587919 691714 769407 657389 620808 633018 618770 664118
5562F64118j6024j6621n6890m6410J5535m7028l6578J29379j8678p0572n3131
$$ 664118 648094 631473 574583 528173 543708 496680 460102 589481 570803 500231 447100
5551D47100p0192R0831p5015R3862J3816n1885j1402j05541O1650Q155L8144L7052
$$ 447100 376908 467739 392724 486586 500402 448517 437115 331574 393224 401379 439523 476575
5539D76575j7011j18534P9965K1746j08540M247P0648O7856o3423j48566J0747
$$ 476575 459564 341030 420995 442741 334201 338448 409096 476952 413529 264963 275710
5528B75710P7205R5160k7081j01530J09691k3261j26569P67J38634J6296o443
$$ 275710 352915 448075 420994 319464 429155 405894 279325 280092 418726 435022 428579
5517D28579k381l3090K3340J1853J2297o776J09982J05921n5108k3668J15054
$$ 428579 426198 393108 416448 428301 440598 433822 543804 649725 594617 570949 686003
5506F86003K5223k5122j03398P7823Q4483j39956j43175l8424N730k6296l9939
$$ 686003 711226 686104 582706 660529 745012 605056 461881 423457 429187 402891 362952
5495C62952O8184M0742J5795m6739p958R5415j61593N8563M9009m8126l0534L2263
$$ 362952 431136 471878 487673 440934 432976 528391 366798 425361 474370 426244 395710 427973
5483D27973l377J14422J3273l9602p7014J31722R4792j4116m2278J1009m2735
$$ 427973 424596 539018 552291 512689 435675 567397 662189 648073 605795 616804 574069
5472E74069J07491N5758j02840L5951j3963n0656P783J7282r9298n1768n0980
$$ 574069 681560 737318 634478 670429 656466 605810 613593 630875 531577 479809 428829
5461D28829K1251K0044R1964P2598j75462k7402J07057j16404r0632N054J21090
$$ 428829 450080 470124 562088 634686 459224 431822 538879 422475 331843 336897 457987
5450D57987O6694K5025Q986m1244J4098Q0903j21759L6632J19492K3155N5590
$$ 457987 524681 549706 558692 517448 531546 612449 490690 527322 646814 669969 725559
5439G25559m6050r0222k7162o4812J5173Q2658o0334j05403l4383R8031K7806
$$ 725559 679509 589287 562125 497313 512486 595144 534810 429407 395024 493055 520861
5428E20861j0399L9034m5406o075m1059N875J23086o5244k6633J06534m3477O80
$$ 520861 510462 549496 504090 498015 456956 462831 585917 520673 494040 600574 557097 557777
5416E57777q1564J43421J21159m295j44515j59221J21226N0169m9698k7018l7380
$$ 557777 476213 619634 740793 736498 591983 432762 553988 604157 554459 527441 490061
5405D90061J04135j14826K6766R387k2294Q8082m5010r5981o0737P0830J9154
$$ 490061 594196 479370 506136 515523 493229 581311 536301 440320 379583 450413 469567
5394D69567p1985P2639p457p0268M8199j2451L2477p4867L6422M2102K4293l6502
$$ 469567 397582 470221 462764 392496 440695 428244 460721 385854 422276 464378 488671 452169
5382D52169K2851M3182K7403Q8597n8040N763l6728p1931L525o6351m6199j3211
$$ 452169 475020 518202 545605 634202 576162 581925 545197 473266 476791 410440 364241 351030
5370C51030o322K0869L8415P2388O9102o4775l7977K1923n0026l5686r5596N8774
$$ 351030 344708 365577 403992 476380 545482 480707 442730 464653 414627 378941 283345 342119
5358C42119L0510N2421K2410k6439R926J00489K904j32882P9522m5941j24491
$$ 342119 372629 425050 447460 421021 430947 531436 534340 401458 480980 435039 310548
5347C10548R61M5418K6166R1958l5384l7711l3296R5738J1662n6662j00469N9178
$$ 310548 311509 356927 383093 475051 439667 401956 368660 464398 476060 419398 318929 378107
5335C78107n7941J4405M2190k7398O7700n9720l6357J05889M2712n872j01168
$$ 378107 320166 334571 376761 349363 417063 357343 320986 426875 469587 463715 362547
5324C62547k7433n4564R1796L9297q5972K0752l303J4902Q2104j2840j03130m0164
$$ 362547 335114 280550 372346 411643 325671 346423 343120 358022 440126 427286 324156 283992
5312B83992j7871J29902j2126r8815k2931Q7415Q7601K5792q1620P1139q3932
$$ 283992 266121 396023 383897 285082 262151 349566 437167 462959 381339 452478 368546
5301C68546r82K5113O5984Q2601r0912l6788O544J02971R8381k9765o8491n4271
$$ 368546 367564 392677 458661 541262 450350 413562 420106 523077 621458 591693 523202 468931
5289D68931p941J04777k8033k7400m2496p7762k3533o884Q2822L351m1222J2253
$$ 468931 460990 565767 537734 510334 467838 390076 366543 359659 442481 445832 404610 416863
5277D16863J3916J2219K8099R1807n0687k4226l7456N2522n6536l3206M265k560
$$ 416863 430779 442998 471097 562904 512217 487991 450535 503057 446521 413315 417580 415020
5265D15020P5205j8112L5913L7559m9616l77L3972J3070L5481m9559n1411o5018
$$ 415020 490225 472113 508026 545585 495969 495592 529564 542634 578115 528556 477145 412127
5253D12127L9291M3898L9871j6492k7002J1396r340k9991L2026R9925k1082N0443
$$ 412127 451418 495316 535187 518695 491693 503089 493749 463758 495784 595709 574627 625070
5241F25070N1995p7081n723q6203K137O0454j1969l9464J303K3694O3403N2350
$$ 625070 677065 599984 594261 508058 510195 570649 558680 519216 520519 544213 607616 659966
5229F59966L0412j6120o1388O4096j2703k8372L2269p6752N0390P9006p4502j42201
$$ 659966 690378 674258 612870 676966 664263 635891 668160 591408 641798 720804 646302 504101
5217E04101P5341N580o0275J36824m4804j48832K1173l4560m8880L5523O564L2607
$$ 504101 579442 585022 524747 661571 616767 467935 489108 454548 405668 441191 447755 480362
5205D80362J7157l3652P2842m1497p216K6092l3047J5993K459o805K3051Q7711
$$ 480362 497519 463867 536709 495212 487996 514088 481041 497034 499493 492688 515739 603450
5193F03450p144m6905K0448j89563N0827L5415J6436k8102R1788O8852j05341
$$ 603450 596306 549401 569849 380286 431113 466528 482964 454862 546650 615502 510161
5182E10161J0796L5701N0052p0353J1470N0502p3312L3411M7378p2184N3607M5305
$$ 510161 520957 556658 606710 536357 547827 598329 525017 558428 605806 533622 587229 632534
5170F32534M337p5104K6444J1148K5560o590L8454m4124j18335j300R3949k574
$$ 632534 636871 561767 588211 599359 624919 618329 656783 612659 494324 493024 586973 584399
5158E84399k7248P8300j4648l2969Q6048P962O4148K8922J26321K9351n4029k7627
$$ 584399 557151 635451 620803 587834 673882 681844 745992 774914 901235 930586 876557 848930
5146H48930r1724J14709P2240j2323l2702l2293J8901j00941m6198N9385P324
$$ 848930 757206 871915 944155 931832 899130 866837 885738 784797 738599 797984 805308
5135H05308l9095O4549j92958n1820P7185r332P3738L4146j75388L6242J71879
$$ 805308 766213 830762 637804 585984 663169 653837 727575 761721 586333 622575 794454
5124G94454O081j9001j3834L0493J07597N98r9714R0791J59635O7746p5094J916
$$ 794454 800535 781534 767700 798193 905790 906388 806674 897465 1057100 1124846 1049752 1051668
5112A051668j20428p0788m7648j2961M0054Q6865J3032j3366q4485n126k3381
$$ 1051668 931240 860452 812804 799843 839897 926762 939794 926428 841943 836817 813436
5101H13436L394J33543l7320m6470m4130J79532J60889l453q7893O2348j6201
$$ 813436 816830 950373 913053 866583 822453 1001985 1162874 1159421 1071528 1133876 1117675
5090A117675l514o4560j81593q6765J9767J6323N0461q4664n848J86278N6168
$$ 1117675 1114161 1049601 868008 781243 801010 817333 867794 783130 777282 963560 1019728
5079A019728J6455J9093j6212J1529J45122J42598J5560m8678l2627m244J8994
$$ 1019728 1036183 1055276 1039064 1050593 1195715 1338313 1353873 1305195 1272568 1268324 1287318
5068A287318o2724p4161J5847J2178r0643m4635j9741P1119n5405L174J35720
$$ 1287318 1224594 1150433 1166280 1178458 1087815 1043180 1023439 1094558 1039153 1042327 1178047
5057A178047k4169p6525M6167P8466n4288K8468J9821j2249K703o2282m2968j25348
$$ 1178047 1153878 1077353 1123520 1201986 1147698 1176166 1195987 1183738 1186441 1124159 1081191 955843
5045I55843p9286j3677M1132J15025p5800j20983M0012r9421q322J4453N6362
$$ 955843 876557 862880 904012 1019037 943237 822254 862266 762845 754523 768976 825338
5034H25338N097P8686n6550k7111J41690k0345l5928J9715J3913m99p2148P3176
$$ 825338 830435 909121 852571 825460 967150 946805 910877 930592 944505 944006 871858 945034
5022I45034Q2469L0152M5293J866L3134M7397J6088n4457Q7536Q8666J2079J09945
$$ 945034 1027503 1057655 1102948 1104814 1137948 1185345 1201433 1146976 1234512 1323178 1335257 1445202
5010A445202M7626L5685J59956J30748k5331R8783J29306m8917M1644J68678k4270
$$ 1445202 1492828 1528513 1688469 1819217 1793886 1892669 2021975 1973058 2014702 2183380 2159110
4999B159110j8249P036O5733N2488j05887M3225J22532l8604k7811N4692O1897
$$ 2159110 2140861 2147897 2213630 2266118 2160231 2203456 2325988 2287384 2259573 2314265 2376162
4988B376162l9226J0124R3162O2761J72924J44173J11537M1740j16685J1691M4883
$$ 2376162 2336936 2347060 2440222 2502983 2675907 2820080 2931617 2973357 2856672 2868363 2913246
4977B913246J692r8284k6764O9533j82889j16616o9962o7402m3853O7653n8236
$$ 2913246 2914938 2816654 2789890 2859423 2676534 2559918 2489956 2422554 2378701 2446354 2388118
4966B388118j2309J208L7374J9563J03552L9805L5687J7864J06746J09146K4018
$$ 2388118 2375809 2377017 2414391 2433954 2537506 2577311 2612998 2630862 2737608 2846754 2870772
4955B870772K15420k5934m6152O8325L4645J50535M948j19446k76L9392L7991
$$ 2870772 3086192 3060258 3014106 3082431 3117076 3267611 3272559 3153113 3152837 3192229 3230220
4944C230220J1216J32169M8216q804M7451O4699M7305m1631M184M6287j02962
$$ 3230220 3241436 3373605 3421821 3413017 3460468 3525167 3572472 3530841 3535025 3581312 3478350
4933C478350L1060L2457j01137J0864J12462N1734m3960J23342l7763o9479j5273
$$ 3478350 3509410 3541867 3440730 3451594 3564056 3615790 3571830 3695172 3657409 3587930 3572657
4922C572657r3393l8963N7139k8428n7927N141o330j768j8865K7211r9221j3360
$$ 3572657 3479264 3440301 3497440 3469012 3411085 3416226 3409896 3408128 3389263 3416474 3317253 3303893
4910C303893Q3488r176l068q2207k0095J1840j15690m0681J51436n7728j19234
$$ 3303893 3387381 3378205 3375137 3292930 3272835 3284675 3168985 3128304 3279740 3222012 3102778
4899C102778q9398n1463k01629R2048n4260j19263m1042K6847n6323l2939j02133
$$ 3102778 3013380 2961917 2760288 2852336 2798076 2678813 2637771 2664618 2608295 2575356 2473223
4888B473223O0870m0445k7726J58929J38824J03638q4315J69422J26509J15250
$$ 2473223 2534093 2493648 2465922 2624851 2763675 2867313 2782998 2952420 3078929 3194179
4878C194179Q718O1842O4528J19114K0068N2475k5033Q0925J6238N4379N3931
$$ 3194179 3202897 3264739 3329267 3448381 3468449 3520924 3495891 3576816 3593054 3647433 3701364
4867C701364q6922j14671J7108P5102j90030j63128j91360k22695Q5788j08713
$$ 3701364 3614442 3499771 3516879 3591981 3401951 3238823 3047463 2824768 2910556 2801843
4857B801843j27676j37928K190q3239p9351r7991j60138q5581j00718j36791j23279
$$ 2801843 2674167 2536239 2538429 2455190 2375839 2277848 2117710 2032129 1931411 1794620 1671341
4846A671341j0544m8447L762k3763K3235r617m6018n306j3192N1409l9009k3749
$$ 1671341 1660797 1612350 1616112 1592349 1615584 1605967 1559949 1554643 1541451 1592860 1553851 1530102
4834A530102m5573K3038J6426n4034N9742k3315j6574K1193J7792k4716L7791
$$ 1530102 1484529 1507567 1523993 1469959 1529701 1506386 1489812 1511005 1528797 1504081 1541872
4823A541872K2092J5580m753K990L1320r6576j06115R2166N2581n4464m5143o809
$$ 1541872 1563964 1579544 1574791 1577781 1609101 1512525 1406410 1498576 1551157 1496693 1451550 1444741
4811A444741J2520J4755o3726k2635N088J2727J9815j3964o0571l8783N7438M1589
$$ 1444741 1457261 1472016 1408290 1385655 1390743 1403470 1423285 1409321 1348750 1309967 1367405 1408994
4799A408994o0902L2459P7612o6429r678j7499q6081j7180K8755K391j7569R001
$$ 1408994 1348092 1380551 1458163 1391734 1382056 1364557 1278476 1261296 1290051 1292442 1274873 1283874
4787A283874J31516M4346m3147r4186J52032M0668j8185J30827L4419j63554O3050
$$ 1283874 1415390 1459736 1416589 1322403 1474435 1515103 1496918 1627745 1662164 1498610 1561660
4776A561660N1984k2291K6177K4199J20415O8542Q9346Q4053J52194R7167J16290
$$ 1561660 1613644 1591353 1617530 1641729 1762144 1830686 1920032 2004085 2156279 2253446 2369736
4765B369736J34392K65024L48478L92218N81488P33747O25150N01616M4604k19682
$$ 2369736 2504128 2769152 3117630 3509848 4091336 4825083 5450233 5951849 5996453 5776771
4755E776771o52190p16638o49127o02040l49497k00645l04667j68117j19972j45916
$$ 5776771 5124581 4407943 3758816 3156776 2807279 2606634 2301967 2133850 2013878 1867962
4745A867962Q768m5377j27717n6808r744O9222n2404j85086L2973O5954p3932
$$ 1867962 1876730 1831353 1703636 1646828 1637084 1706306 1653902 1468816 1501789 1567743 1493811
4734A493811l5440J04674k3780l2583m8012P451N778L7874l1276q0412M5723R8434
$$ 1493811 1458371 1563045 1539265 1506682 1458670 1466121 1471899 1509773 1478497 1398085 1443808 1542242
4722A542242n6338M2874Q8913J33226j0006r680J14335K6681k8091J24159Q7449
$$ 1542242 1485904 1528778 1617691 1750917 1740911 1731231 1845566 1872247 1844156 1968315 2055764
4711B055764R4934J72006Q1129J76913Q5126k0033j01239p3269j3327m3005P7061
$$ 2055764 2150698 2322704 2403833 2580746 2665872 2645839 2544600 2471331 2458004 2414999 2492060
4700B492060J90070R1414l7432J65047L42027L86362N08952O35705O50350M74588
$$ 2492060 2682130 2773544 2736112 2901159 3243186 3629548 4138500 4774205 5424555 5899143
4690E899143J11607p9122l79449o29889m66073n21364k87236j15795j66892o5598
$$ 5899143 6010750 5931628 5552179 4922290 4456217 3934853 3647617 3531822 3364930 3299332
4680C299332j04208l17712j83653k26571j86076l6966r8526l025J9933L5860J20426
$$ 3299332 3195124 2877412 2693759 2467188 2281112 2244146 2145620 2142595 2162528 2198388 2318814
4669B318814N6052J04847l7590j30747j55600j46052k87543j52524k140k8642
$$ 2318814 2374866 2479713 2442123 2311376 2155776 2009724 1722181 1569657 1567517 1538875
4659A538875o4811o2131J5840j5787l2752q4758M1682k8071k5163o7258k6243
$$ 1538875 1474064 1411933 1427773 1411986 1379234 1294476 1336158 1308087 1282924 1215666 1189423
4648A189423Q8343k648r4333m3612N2400r4250j5105M2934j1216M1881l6017l1578
$$ 1189423 1277766 1275118 1180785 1137173 1189573 1095323 1080218 1123152 1111936 1153817 1117800 1086222
4636A086222M3766p830L9481M9897j18074p8509N6694q524q6409n9612K7405R7557
$$ 1086222 1129988 1122158 1161639 1211536 1093462 1014953 1071647 1063123 976714 917102 944507 1042064
4624A042064N5903o9684Q7789J18842J1207j03682p5691l1n327o9196o3693K5868
$$ 1042064 1097967 1028283 1116072 1234914 1246121 1142439 1066748 1066717 1061390 992194 928501 954369
4612I54369K3025R3492J09614k9842K2452k2078p5438P7934o700j7735K3475p4105
$$ 954369 977394 1070886 1180500 1150658 1173110 1151032 1075594 1153528 1146828 1129093 1152568 1078463
4600A078463p7047P1612m8113P8515k5680l534J2881K1768p000k315o5979N0111
$$ 1078463 1001416 1073028 1024915 1103430 1077750 1074216 1087097 1108865 1101865 1099550 1033571 1083682
4588A083682N4090m8694n0194P3707P1685r0340r710M3692P361J7636n7108J8535
$$ 1083682 1137772 1089078 1038884 1112591 1184276 1093936 1084226 1127918 1135279 1152915 1095807 1114342
4576A114342j9042j01592N4673O19L6615K1876l6832p397M8346K6132o9362J53685
$$ 1114342 1095300 993708 1048381 1049000 1085615 1107491 1070659 1063262 1111608 1137740 1068378 1222063
4564A222063r819o3710k8473j09197K0692R2492q1413N1232L1695M8055M4713
$$ 1222063 1212244 1148534 1120061 1010864 1031556 1124048 1042635 1093867 1125562 1173617 1218330
4553A218330q1909m6437K2952k5423M0388J02937j5504j02645L618j5497m3667
$$ 1218330 1136421 1089984 1112936 1087513 1127901 1230838 1215334 1112689 1116307 1100810 1057143
4542A057143O1752K7002Q1964L075P1882M5533o7175L5579O4600J4180j3577o2536
$$ 1057143 1118895 1145897 1227861 1230936 1302818 1348351 1281176 1316755 1381355 1395535 1381958 1319422
4530A319422O0453k7155J25092r7831p4438Q4468R3701o707m1755p1036O2163
$$ 1319422 1379875 1352720 1477812 1379981 1305543 1390011 1483712 1477005 1435250 1364214 1426377
4519A426377J07979o638K7380K6491L0903r1762O5554j1278o8061J24250K02j0962
$$ 1426377 1534356 1527718 1555098 1581589 1612492 1520730 1586284 1575006 1506945 1631195 1631397 1620435
4507A620435K5410J12556j7457Q7499p8386Q4634N6334L2673P0593R007R4892
$$ 1620435 1645845 1758401 1740944 1828443 1750057 1834691 1891025 1923698 1994291 2003298 2098190
4496B098190L7294N3758m2706j5373R8852J01589N6826M7070M0474O5380M1339
$$ 2098190 2135484 2189242 2146536 2131163 2230015 2331604 2388430 2435500 2475974 2541354 2582693
4485B582693J16358K07243J35957K67868K64173L55039K19396J96789J89708J14098
$$ 2582693 2699051 2906294 3042251 3310119 3574292 3929331 4148727 4345516 4535224 4649322
4475D649322R0186j61084k39975k92000j39794r5283k58048o3658O6511P4800
$$ 4649322 4739508 4578424 4338449 4046449 3906655 3811372 3553324 3489666 3556177 3630977
4465C630977r3068r9152J10257Q6811j7116L2098J55785k7451O5111J54923J10007
$$ 3630977 3537909 3438757 3549014 3635825 3618709 3650807 3806592 3779141 3844252 3999175 4109182
4454D109182J64468K71651J57904K32724K90843K18753K35780K92235L21048L42462
$$ 4109182 4273650 4545301 4703205 4935929 5226772 5445525 5681305 5973540 6294588 6637050
4444F637050Q5496K62050J12852j19256J647l02305j65671l4637r9104K23596
$$ 6637050 6722546 6984596 7097448 6978192 6979839 6677534 6511863 6477226 6378122 6601718
4434F601718K31013Q9625r1553J62602J40063J49964k177R9142r4869Q561J7052
$$ 6601718 6832731 6922356 6830803 6993405 7133468 7283432 7281255 7380397 7285528 7294089 7311141
4423G311141q8191K6128N1107J38137q8059j2386j02583r1147n2622j01251j4897
$$ 7311141 7222950 7249078 7300185 7438322 7350263 7337877 7235294 7144147 7091525 6990274 6975377
4412F975377j61670r203K04765R2425J32591J56984J80402J36623K07264Q6437
$$ 6975377 6813707 6804504 7009269 7101694 7234285 7391269 7571671 7708294 7915558 8001995
4402H001995J98425L3953J3705J68755J66105J72151J08315J0908n0441k7710
$$ 8001995 8200420 8234373 8248078 8416833 8582938 8755089 8863404 8874312 8823871 8796161
4392H796161k6630m9907j60664k00729j77179l79286l22661l64933l35426m14171
$$ 8796161 8769531 8719624 8558960 8358231 8181052 7801766 7479105 7114172 6778746 6364575
4382F364575l79274k06237k68148k82297k03932j76809j7682M7001j08451j42140
$$ 6364575 5985301 5779064 5510916 5228619 5024687 4847878 4830196 4877197 4768746 4626606
4372D626606o3300m2665j77000m3885l8777L7441J3920k42025O880R0292q180
$$ 4626606 4563306 4520641 4343641 4299756 4260979 4298420 4312340 4070315 4077195 4167487 4159307
4361D159307n8834L00O7582L6096R6412R2313N2146k2484R0797L5214K5687J3445
$$ 4159307 4100473 4100773 4168355 4204451 4300863 4393176 4445322 4422838 4513635 4548849 4574536 4587981
4349D587981L9656M1589J35421k2947l8782Q9333J30140P4515J8818J9355M7604
$$ 4587981 4627637 4669226 4804647 4781700 4742918 4832251 4962391 5036906 5055724 5075079 5122683
4338E122683R4647q402l9172P1355J02395J12503R6044Q0161P8661J30106J16334
$$ 5122683 5217330 5208928 5169756 5241111 5343506 5456009 5552053 5632214 5710875 5840981 5957315
4327E957315Q0412K60930J47300K28543J83166L15026L10917K90623L87231L49572
$$ 5957315 6037727 6298657 6445957 6674500 6857666 7172692 7483609 7774232 8161463 8511035
4317H511035L50411L00326L15006K89830O4504K14737K21242m4318N6468Q0426
$$ 8511035 8861446 9161772 9476778 9766608 9831112 10045849 10267091 10222773 10279241 10359667
4307A0359667j18001p3827m3370j94226j93260j16381o4793k12128j29096j40047
$$ 10359667 10241666 10167839 10124469 9930243 9736983 9620602 9555809 9343681 9214585 9074538
4297I074538L845q9715m4766m5716L9808J09449M766J52550Q9548M6009J09971
$$ 9074538 9078383 8988668 8943902 8898186 8937994 9047443 9052209 9204759 9294307 9340316 9450287
4286I450287L5784J17255J13232O2197n8137p9414n6733j06964m3452L5907P4391
$$ 9450287 9486071 9603326 9716558 9778755 9720618 9641204 9584471 9477507 9434055 9469962 9544353
4275I544353p8897J5901p7944n3938j49586j5405n1715j49617j46203p9386j11974
$$ 9544353 9465456 9481357 9403413 9349475 9199889 9184484 9132769 8983152 8836949 8757563 8645589
4264H645589P2508P0789j41399l320l793Q4999Q7720J10802J27368J47050K2470
$$ 8645589 8718097 8788886 8647487 8644167 8640374 8725373 8813093 8923895 9051263 9198313 9220783
4253I220783k0059l42146m11507l20643l29962k36513j13293p0434J2428R553
$$ 9220783 9200724 8858578 8447071 8126428 7796466 7559953 7446660 7376226 7388654 7398207
4243G398207o5184N1317P9939J37254m2279P6426R9560J9518j7120k35j17647
$$ 7398207 7333023 7384340 7464279 7601533 7559254 7635680 7735240 7754758 7737638 7737403 7619756
4232G619756o0046P0792J64445K56779K88779K15566L52453M83045N88024O45062
$$ 7619756 7559710 7630502 7794947 8051726 8340505 8556071 8908524 9391569 9979593 10624655
4222A0624655O35975K32662j43108l80447l35052l49783l73130j96904q0862k58844
$$ 10624655 11260630 11493292 11350184 10969737 10634685 10284902 9911772 9714868 9634006 9375162
4212I375162j99996n1295j46663j62587j98794O0397j46473K5224J49937O5049
$$ 9375162 9175166 9123871 8977208 8814621 8615827 8676224 8529751 8554975 8704912 8769961
4202H769961R9842K74262K72821K84619J94849K23111R9803Q8598P7295j1094
$$ 8769961 8869803 9144065 9416886 9701505 9896354 10119465 10219268 10307866 10385161 10374067
4192A0374067j57081l37449k87983k45496k15202q7616j09926m7282o959j644
$$ 10374067 10216986 9879537 9591554 9346058 9130856 9043240 8933314 8886032 8879073 8877429
4182H877429O3657N5998K16183J65218J69267J34351O0172K45683L44342K90018
$$ 8877429 8941086 8997084 9213267 9378485 9547752 9682103 9742275 9987958 10332300 10622318
4172A0622318K86725L00200J42632J36372J05580O8820K06455l3750Q6120J51650
$$ 10622318 10909043 11209243 11351875 11488247 11593827 11662647 11869102 11835352 11921472 12073122
4162A2073122K31006L46161L57731N65721N74003O72114O25002N82615M33039
$$ 12073122 12304128 12650289 13008020 13573741 14147744 14819858 15444860 16027475 16460514
4153A6460514L81597K97533K25650J99550L94185M40390K82461r8942n81065p96590
$$ 16460514 16842111 17139644 17365294 17564844 17959029 18399419 18681880 18582938 18001873 17205283
4143A7205283o56029n33265k10418L5032K69126K53355L58049M41986M63273L55272
$$ 17205283 16549254 16015989 15805571 15840603 16109729 16363084 16721133 17163119 17626392 17981664
4133A7981664J09314L5535j87221k09381k97714m08315l92251j86782k07107l4649
$$ 17981664 18090978 18126513 17939292 17729911 17432197 17023882 16631631 16444849 16237742 16203093
4123A6203093J24012J05334K35658L83226L83412L76588L09978N30272M83381
$$ 16203093 16327105 16432439 16668097 17051323 17434735 17811323 18121301 18651573 19134954
4114A9134954M14988L09865K34228M14011L76643K39827m0453j64466j91084j85501
$$ 19134954 19549942 19859807 20094035 20508046 20884689 21124516 21084063 20919597 20728513 20543012
4104B0543012O576P6331J96431K91511K67587J85104J14348K13444J62773J30137
$$ 20543012 20549588 20625919 20822350 21113861 21381448 21566552 21680900 21894344 22057117 22187254
4094B2187254K57970K69714K90171J09179K74912K09994L61432M32053M15417
$$ 22187254 22445224 22714938 23005109 23114288 23389200 23599194 23960626 24392679 24808096
4085B4808096N13154M51395M39920M27046M04181N00288M00009L73230P50768
$$ 24808096 25321250 25772645 26212565 26639611 27043792 27544080 27944089 28317319 29068087
4076B9068087R21321R06922R97822J197057J332862J550976J726067J942269K466334
$$ 29068087 29989408 30896330 31894152 33091209 34424071 35975047 37701114 39643383 42109717
4067D2109717K932356L262503L725612M284507M805547N315445N862155O256052
$$ 42109717 45042073 48304576 52030188 56314695 61120242 66435687 72297842 78553894
4059G8553894O281857N696279M003457K119250J831483L209809M512003M241789
$$ 78553894 84835751 90532030 94535487 96654737 98486220 101696029 106208032 110449821
4051A10449821J447713m726173r744544j0867165r268067o753875m849297l317516
$$ 110449821 111897534 107171361 97426817 86559652 77291585 70537710 65688413 62370897
4043F2370897k398961j855888j538739j174789j112540r83076p33315n84753k99831
$$ 62370897 59971936 58116048 56577309 55402520 54289980 53306904 52573589 51988836 51689005
4034E1689005l6420j93792J00938M52666O47982R16140J099580J263724J228486
$$ 51689005 51652585 51458793 51559731 52012397 52660379 53576519 54676099 55939823 57168309
4025E7168309J363625J376446J509088J680085K012531K396732L214791M140361
$$ 57168309 58531934 59908380 61417468 63097553 65110084 67506816 70721607 74861968
4017G4861968N394968P020781Q541891R028748P396791K488512m141433q600902
$$ 74861968 80256936 87277717 95819608 104848356 112245147 114733659 110592226 101991324
4009A01991324r226999p770173o103783m896433l979428l292604k550014k025387
$$ 101991324 92764325 84994152 78890369 73993936 70014508 66721904 64171890 62146503
4001F2146503j725402j152286p86970n79157j20866J00446m858K64585Q2030j37192
$$ 62146503 60421101 59268815 58481845 57902688 57781822 57882268 57877410 58141995 58224025 58086833
3991E8086833n51739o71993o09539n99061o16813m12855j59754J34256M41844
$$ 58086833 57535094 56863101 56253562 55654501 55037688 54624833 54465079 54599335 55041179
3982E5041179M77416M49815L86737J61034k92137m83853p70983r15214j029411
$$ 55041179 55518595 55968410 56355147 56516181 56224044 55740191 54969208 54053994 53024583
3973E3024583j161583j082878j021749r39415o55561l57758j566K50087M51617
$$ 53024583 51863000 50780122 49758373 48818958 48163397 47805639 47804073 48054160 48505777
3964D8505777N73474P71904Q82211J136746J195651J394201J576464J840812K200457
$$ 48505777 49079251 49851155 50733366 51870112 53065763 54459964 56036428 57877240 60077697
3955F0077697K754651L639434M594319N933507Q063184J1463686J6237674K2174865
$$ 60077697 62832348 66471782 71066101 76999608 85062792 96526478 112764152 134939017
3947A34939017K6970127K4423684Q232252j5480472l0021538k9391911k1510601
$$ 134939017 161909144 186332828 194565080 179084608 149063070 119671159 98160558
3940I8160558j4275748r883185p235388n572148m240217l613575l295307k855105
$$ 98160558 83884810 74001625 66766237 61194089 56953872 53340297 50044990 47189885
3932D7189885k707415k281832j867554j810626j521839j305773r86861p63190
$$ 47189885 44482470 42200638 40333084 38522458 37000619 35694846 34707985 33944795
3924C3944795p96602j043279j261372j161995j162452r77090p26717n43617l14780
$$ 33944795 33148193 32104914 30843542 29681547 28519095 27542005 26815288 26271671 25956891
3915B5956891l45607q4154k2033M2045L67509M00528L87754N53436O96272M07399
$$ 25956891 25611284 25527130 25505097 25547142 25914651 26315179 26702933 27256369 27952641 28360040
3905B8360040M947m12431q46789j088577j006460j010681q98859q09388p12131
$$ 28360040 28364987 27952556 27105767 26017190 25010730 24000049 23101190 22291802 21579671
3896B1579671n89138o68357m84908l28787l95228m21301k70169j45830k04391
$$ 21579671 20990533 20322176 19837268 19508481 19113253 18691952 18421783 18275953 18071562
3887A8071562j41550o5404N7205J37885l3653l5713n8189n2684r6819m1825p8008
$$ 18071562 17930012 17864608 17921813 18059698 18026045 17990332 17932143 17879459 17782640 17740815 17662807
3876A7662807j08593J93163n0930k25920m0172j36806j43192k33358j86322k52317
$$ 17662807 17554214 17747377 17696447 17470527 17430355 17293549 17150357 16916999 16730677 16478360
3866A6478360j11049k3437j37854r1071k2224j1921L2074l334j06398p1508p5329
$$ 16478360 16367311 16343874 16206020 16114949 16092725 16080804 16112878 16109544 16003146 15931638 15856309
3855A5856309M5589J74948M5701L8439L54883K97134J64314M25707L94693L96696
$$ 15856309 15901898 16076846 16122547 16160986 16515869 16813003 16977317 17403024 17797717 18194413
3845A8194413N44989O65652N70120M95697L33249m2052o6598k56769m78634m66917
$$ 18194413 18739402 19405054 19975174 20470871 20804120 20762068 20695470 20438701 19960067 19493150
3835A9493150n64124n31757l89681l91503k72190k53538j43123M5668L0904O8803
$$ 19493150 18929026 18397269 18007588 17616085 17343895 17090357 16947234 16992902 17023806 17092609
3825A7092609J60846K71384K86997L30653N11555N37974O89930P90817Q15287
$$ 17092609 17253455 17524839 17811836 18142489 18654044 19192018 19881948 20672765 21488052
3816B1488052P72871O56404K59760J1060k66785k90309l34160k28523j26441o0797
$$ 21488052 22260923 22917327 23177087 23188147 22921362 22631053 22296893 22068370 21941929 21881132
3806B1881132J50226K32598M41171O39159P07295N58854N08886N79247O42755
$$ 21881132 22031358 22263956 22705127 23344286 24051581 24610435 25119321 25698568 26341323
3797B6341323N17446M75424N27992Q08362Q66116R54524R46974J074308J159394
$$ 26341323 26858769 27334193 27862185 28670547 29536663 30491187 31438161 32512469 33671863
3788C3671863J033342J035895R04822O75492M81954J26560j21241j48560j96507
$$ 33671863 34705205 35741100 36645922 37321414 37803368 37929928 37808687 37660127 37463620
3779C7463620j671M6069K00245L19852K98139N7305l6724j42931l31087m43327
$$ 37463620 37461949 37508018 37708263 38028115 38326254 38383559 38346835 38203904 37872817 37429490
3769C7429490o03331q61915o80784n48167m63832k52440k82590J5105J78047K58268
$$ 37429490 36826159 35964244 35283460 34735293 34271461 34019021 33736431 33751536 33929583 34187851
3759C4187851M26807O56626Q74075P52604Q65766Q47396R35769J028680J002173
$$ 34187851 34614658 35271284 36145359 36897963 37763729 38611125 39546894 40575574 41577747
3750D1577747Q86383Q31573Q42728P99511N81738L78955R5360l09020p95513j060111
$$ 41577747 42464130 43295703 44138431 44937942 45519680 45898635 45993995 45684975 44889462 43829351
3740D3829351j032680j068685p96112p86762o39378n36291m34606k00333k67334
$$ 43829351 42796671 41727986 40931874 40145112 39505734 38969443 38534837 38334504 38067170
3731C8067170k74676r6399j99864j19936k45511k66748m14811m12335k26390k99539
$$ 38067170 37792494 37696095 37496231 37376295 37130784 36864036 36449225 36036890 35810500 35510961
3721C5510961j4843o2408j06351o8381j89256l21925k11924p865O8247K78n3013
$$ 35510961 35496118 35433710 35327359 35258978 35069722 34747797 34535873 34528008 34596255 34596533 34543520
3710C4543520M7060j74929m25104n00752n28640n73565l87757m48200k65888j61298
$$ 34543520 34590580 34415651 33990547 33489795 32961155 32387590 31999833 31551633 31285745 31124447
3700C1124447o9733j14196O6807J71917J45607J96810K51887J20834Q5899p6424
$$ 31124447 31054714 30940518 31007325 31179242 31324849 31521659 31773546 31894380 31980279 31903855
3690C1903855j45335j70654j38982P2078Q1112L7641K14499N88284O61451R24618
$$ 31903855 31758520 31587866 31448884 31520962 31602074 31639715 31854214 32442498 33103949 34028567
3680C4028567J064567J271723J568104J545014J589368J785028J853623J938458
$$ 34028567 35093134 36364857 37932961 39477975 41067343 42852371 44705994 46644452
3672D6644452K094663K431780K306070K227180K034060J595207J131760P45227
$$ 46644452 48739115 51170895 53476965 55704145 57738205 59333412 60465172 61210399
3664F1210399K23311j92905m64938o25629n78833l49205k10011J8355J60823J53195
$$ 61210399 61433710 61240805 60775867 60150238 59571405 59222200 59012189 59030544 59191367 59344562
3654E9344562J14271j37378l94069q16029j380062j712509k151352k462046k579791
$$ 59344562 59458833 59321455 58927386 58111357 56731295 55018786 52867434 50405388 47825597
3645D7825597k488412k408534k392311k054461k057341j688086j434273j241452
$$ 47825597 45337185 42928651 40536340 38481879 36424538 34736452 33302179 32060727
3637C2060727j110476p25307m75000m65621k50060j53209N3231J91479M16018
$$ 32060727 30950251 30224944 29749944 29284323 29034263 28881054 28934285 29125764 29541782
3628B9541782M60302P48632Q76895J067509J388854J637289K008023K287147K639710
$$ 29541782 30002084 30750716 31627611 32695120 34083974 35721263 37729286 40016433 42656143
3619D2656143K753417K697974K719619K289243J868008J366648N34748l54481
$$ 42656143 45409560 48107534 50827153 53116396 54984404 56351052 56885800 56531319
3611E6531319r95522j720605k128440k518771k555652k412673k321619k132046
$$ 56531319 55535797 53815192 51686752 49167981 46612329 44199656 41878037 39745991
3603C9745991j797726j404074j387955j077846q31252o03508k96338j82027N8210
$$ 39745991 37948265 36544191 35156236 34078390 33247138 32643630 32347292 32165265 32223475
3594C2223475K28665L04516N21572Q11311J056604J185082J380083J664829J944014
$$ 32223475 32452140 32756656 33278228 34089539 35146143 36331225 37711308 39376137 41320151
3585D1320151K110883K411121K474973K571118K751037K715748K467091K230175
$$ 41320151 43431034 45842155 48317128 50888246 53639283 56355031 58822122 61052297
3577F1052297J802559J454066J015964L42546m34756q83473j201001j769927j982649
$$ 61052297 62854856 64308922 65324886 65667432 65232676 64349203 63148202 61378275 59395626
3568E9395626k115821k194723k263696k162589j911611j935406j736073j417811
$$ 59395626 57279805 55085082 52821386 50658797 48747186 46811780 45075707 43657896
3560D3657896j226723r43009p11078n20926m20754k88297j57855j05484q7982
$$ 43657896 42431173 41488164 40777086 40256160 39835406 39547109 39389254 39283770 39195788
3551C9195788m2356j58082M0325j05256r3404J7217J3072P9047k6867N700n3192
$$ 39195788 39153432 38995350 39035675 38930419 38837015 38854232 38867304 38946351 38919484 38925184 38871992
3540C8871992J07327P5051j35207j65958k2771j03599j21761j30414r9618j85997
$$ 38871992 38979319 39054370 38919163 38753205 38730434 38626835 38505074 38374660 38275042 38089045
3530C8089045k44130j53404J4698k26867j93774j50641n4800n8652j23696K5406
$$ 38089045 37844915 37691511 37706209 37479342 37285568 37134927 37080127 37021475 36897779 36923185
3520C6923185r191j07704O6230J23022M4868Q6322L21409N34680O51775P89433
$$ 36923185 36913994 36806290 36872520 36995542 37040410 37126732 37448141 37982821 38634596 39424029
3510C9424029P96923J244801J310830J625006J918945K245941K665289L072858
$$ 39424029 40220952 41465753 42776583 44401589 46320534 48566475 51231764 54304622
3502E4304622L521347L982605M509473M936092N456302N900419O279929O358123
$$ 54304622 57825969 61808574 66318047 71254139 76710441 82610860 88890789 95248912
3494I5248912O461478O443372O109399N598105M655960L474482J952461K99274
$$ 95248912 101710390 108153762 114263161 119861266 124517226 127991708 129944169 130243443
3486A30243443j512707l223738m694708n950747o869175p270348p373488p452481
$$ 130243443 128730736 125506998 120812290 114861543 107992368 100722020 93348532 85896051
3478H5896051p098872o694847o006409n563692m950618m342439l795979l331076
$$ 85896051 78797179 72102332 66095923 60532231 55581613 51239174 47443195 44112119
3470D4112119k935521k552197k215771j878189j670300j637378j357541j287070
$$ 44112119 41176598 38624401 36408630 34530441 32860141 31222763 29865222 28578152
3462B8578152j128174j006656q26294p91190p88554o88007p37987n67955n24129
$$ 28578152 27449978 26443322 25617028 24825838 24037284 23349277 22611290 22043335 21519206
3453B1519206n29107m69630l70365n43985k65481k53101k94250l44734j98020
$$ 21519206 20990099 20520469 20150104 19606119 19340638 19087537 18793287 18448553 18250533
3444A8250533j62335j77613j79057j32894j36271j97922k456j67386r4804k1065
$$ 18250533 18088198 17910585 17731528 17598634 17462363 17264441 17261985 17094599 16999795 16978730
3434A6978730k2978j9520j25089o4284j53920j15186j76654j70197k69794k39234
$$ 16978730 16955752 16936232 16811143 16746859 16592939 16477753 16301099 16130902 15861108 15621874
3424A5621874j74072j19206k05418q5121j35673k01722r7407j9581k3666J039
$$ 15621874 15447802 15328596 15123178 15038057 14902384 14700662 14603255 14583674 14560008 14561047
3414A4561047p6426q7033J6639N584j5962m0859J2017K19920J08779j2347J35869
$$ 14561047 14484621 14397588 14414227 14419811 14403849 14362990 14375007 14594927 14703706 14691359 14827228
3403A4827228K54237K13064L07215L42887L49691M93057M98808K91224J35932
$$ 14827228 15081465 15294529 15601744 15944631 16294322 16787379 17286187 17577411 17713343
3394A7713343J53477J68598L22780L02956L36261M37348M93607N97427L47162
$$ 17713343 17866820 18035418 18358198 18661154 18997415 19434763 19928370 20525797 20872959
3385B0872959K16376L01659J80329K10182J16099L57367K42050J46647p054J52002
$$ 20872959 21089335 21390994 21571323 21781505 21897604 22254971 22497021 22643668 22636614 22788616
3375B2788616J03310P3678R772l7549J35787O3661J13179M5720N6274L6684J55926
$$ 22788616 22891926 22965604 22975376 22937827 23073614 23137275 23250454 23296174 23352448 23389132 23545058
3364B3545058J37344O7100l6155K5411J15168J62228J94341J54435K69922L09975
$$ 23545058 23682402 23749502 23713347 23738758 23853926 24016154 24210495 24364930 24634852 24944827
3354B4944827L49218N57260O30291O54182P17669Q19257R22391J040172J123231
$$ 24944827 25294045 25851305 26481596 27135778 27853447 28672704 29595095 30635267 31758498
3345C1758498J197703J244466J357555J476451J421834J325794J104797J091680
$$ 31758498 32956201 34200667 35558222 37034673 38456507 39782301 40887098 41978778
3337D1978778J138240J014647R72025J085910J141180J144288J031638J134513
$$ 41978778 43117018 44131665 45103690 46189600 47330780 48475068 49506706 50641219
3329E0641219J134784J072612J065862Q95698P88718O97082N08412L07780K36632
$$ 50641219 51776003 52848615 53914477 54810175 55598893 56295975 56804387 57112167 57348799
3320E7348799K20304j21095j48629n8767j88720j36144j35115p7116K12874J76118
$$ 57348799 57569103 57448008 57299379 57240612 57051892 56915748 56780633 56703517 56916391 57092509
3310E7092509K72359L69667N33976O84697P49356Q58931J015092R63103J075095
$$ 57092509 57364868 57734535 58268511 58953208 59702564 60561495 61576587 62539690 63614785
3301F3614785J280131J399796J418162J716548K071131K003853K115456K247063
$$ 63614785 64894916 66294712 67712874 69429422 71500553 73504406 75619862 77866925
3293G7866925K251202K398221K536326K528776K521413K587363K583354K490973
$$ 77866925 80118127 82516348 85052674 87581450 90102863 92690226 95273580 97764553
3285I7764553K310739K086613J824413J609962J260058Q47628P30427N67462M06234
$$ 97764553 100075292 102161905 103986318 105596280 106856338 107703966 108434393 109001855 109408089
3276A09408089L01226M62956M97369O16145P65989J235750J973096K936367M402732
$$ 109408089 109709315 110172271 110669640 111285785 112051774 113287524 115260620 118196987 122599719
3267A22599719N900995O400848L184129l393968q137936q280355n934576l970582
$$ 122599719 128500714 134901562 138085691 134691723 126553787 118273432 112338856 108368274
3259A08368274k666047j959641j531605j200747q72560o76830n80261m91340m22034
$$ 108368274 105702227 103742586 102210981 101010234 100137674 99460844 98880583 98389243 97967209
3250I7967209j07583N3178J26210N82829R22777J437513J703207K139116K331303
$$ 97967209 97859626 97912804 98039014 98621843 99544620 100982133 102685340 104824456 107155759
3241A07155759K479032K765070L401062M275485N807021Q021521J1127451J2953035
$$ 107155759 109634791 112399861 115800923 120076408 125883429 133904950 145032401 157985436
3233A57985436R932236j777690j4748054j8523500j5397447j1002418q554413
$$ 157985436 167917672 166139982 151391928 132868428 117470981 106468563 97914150
3226I7914150p455408p132504o140890m994399m046992l297915k810421k400678
$$ 97914150 90458742 83326238 77185348 72190949 68143957 64846042 62035621 59634943
3218E9634943j997020j745721j458105j272133j028379p93809m17116k30946J77604
$$ 59634943 57637923 55892202 54434097 53161964 52133585 51339776 50922660 50691714 50869318
3209E0869318M30294O09632R80287J446513K097390L254798M829476O153364O114200
$$ 50869318 51299612 51909244 52889531 54336044 56433434 59688232 64517708 70671072 76785272
3200G6785272K527458l824222p600885p399157n435066l810088l122956k342296
$$ 76785272 79312730 75488508 67887623 60488466 55053400 51243312 48120356 45778060
3192D5778060j912827j413443j100642j041612j020894j004430q71121q06055
$$ 45778060 43865233 42451790 41351148 40309536 39288642 38284212 37413091 36607036
3184C6607036o93967p07754p39067p04815p58661p25086n68866n39433n25958
$$ 36607036 35913069 35205315 34466248 33761433 33002772 32277686 31708820 31169387 30643429
3175C0643429m42166l77243n51805m30126j91343j26765j11089J29738K55886
$$ 30643429 30201263 29824020 29272215 28842089 28650746 28523981 28412892 28542630 28798516
3166B8798516K29692L52535M36813O68545O90327P98565P73080O38950P90254
$$ 28798516 29028208 29380743 29817556 30486101 31176428 31974993 32748073 33387023 34177277
3157C4177277Q10881Q93779J104710J194271J410992J509527J655000J586936
$$ 34177277 34988158 35881937 36986647 38180918 39591910 41101437 42756437 44343373
3149D4343373J427155J299311J339933J391275J422081J187244J147200J001669
$$ 44343373 45770528 47069839 48409772 49801047 51223128 52410372 53557572 54559241
3141E4559241P96146L95511J70155j62592m16522o30796q36551j091691j298643
$$ 54559241 55355387 55750898 55921053 55758461 55341939 54711143 53874592 52782901 51484258
3132E1484258j363421j465963j295039j141626r50261p85541n56536l87485j73261
$$ 51484258 50120837 48654874 47359835 46218209 45267948 44482407 43925871 43538386 43365125
3123D3365125M206J34509J36487K55166L84833M49323N63505O98260O79033Q22988
$$ 43365125 43369331 43503840 43640327 43895493 44280326 44729649 45293154 45991414 46670447 47493435
3113D7493435J001944J087155J248931J655841J976803J945589K130663K256806
$$ 47493435 48495379 49582534 50831465 52487306 54464109 56409698 58540361 60797167
3105F0797167K356874K437315K335213K276244J947745J689798J155911M27220
$$ 60797167 63154041 65591356 67926569 70202813 72150558 73840356 74996267 75423487
3097G5423487o45579j343683k127264k891088l367824l739298m035924l984411
$$ 75423487 74777908 73434225 71306961 68415873 65048049 61308751 57272827 53288416
3089E3288416l821593l627377l365686l027103k785136k339767k057163j853434
$$ 53288416 49466823 45839446 42473760 39446657 36661521 34321754 32264591 30411157
3081C0411157j658165j486693j312566j135545j107630r53237j024036q45303
$$ 30411157 28752992 27266299 25953733 24818188 23710558 22757321 21733285 20887982
3073B0887982p39124p44021n01421n54877m76570m92631l86158l91931n22138
$$ 20887982 20148858 19404837 18903416 18348539 17871969 17379338 16993180 16601249 16079111
3064A6079111n26287m42730k55978k94512l51890l59192l47365m5255j42483j60437
$$ 16079111 15552824 15110094 14854116 14559604 14207714 13848522 13501157 13455902 13313419 13152982
3054A3152982k02800j44511j43533j37555r7885q6324o4891l2137o3735q2183
$$ 13152982 12950182 12805671 12662138 12524583 12426698 12340374 12275483 12243346 12179611 12097428
3044A2097428n1235K1277j05240K6819r6789j93614o5602m8819j80993l96664
$$ 12097428 12046193 12067470 11962230 11989049 11892260 11698646 11633044 11584225 11403232 11006568
3034A1006568k66137r5714j92515q1334j52606j09970j94569j25006r5313q1529
$$ 11006568 10740431 10644717 10452202 10370868 10218262 10108292 9913723 9788717 9693404 9611875
3024I611875j26770j12799r0250o9328n2338J10355P7893j1682r702k9539o304
$$ 9611875 9485105 9372306 9282056 9212728 9160390 9270745 9348638 9336956 9327254 9297715 9291411
3013I291411j5812R0238M4311K078Q8922N2156n3402P3231n3320Q6282J12077
$$ 9291411 9275599 9365837 9410148 9412226 9501148 9553304 9499902 9573133 9519813 9606095 9718172
3002I718172J4401J4571J22685Q0831Q8266J16833N8307n8048m2515j31639j02514
$$ 9718172 9732573 9747144 9869829 9950660 10038926 10155759 10214066 10156018 10113503 9981864 9879350
2991I879350q5680m1243J7868m825l929M4964j3395J38789L3756j17599J11594
$$ 9879350 9793670 9752427 9770295 9765470 9761541 9806505 9793110 9931899 9965655 9848056 9959650
2980I959650J75062L8261O5860P8197J39347R6543K5734R0046J21659J54755J08717
$$ 9959650 10134712 10172973 10238833 10317030 10456377 10552920 10578654 10668700 10790359 10945114 11053831
2969A1053831K91699K13667J85402K40209J43773J81429J28386j2196R3259J5967
$$ 11053831 11345530 11559197 11744599 11984808 12128581 12310010 12438396 12426200 12519459 12535426
2959A2535426N0569O2739K59282J01223R3298K42340O2868J10412J44290K60644
$$ 12535426 12585995 12648734 12908016 13009239 13102537 13344877 13407745 13518157 13662447 13923091
2949A3923091K21045J33250L86907L29774K44076K13956K14322K04915K73701
$$ 13923091 14144136 14277386 14664293 14994067 15238143 15452099 15666421 15871336 16145037
2940A6145037K53435J47518L34867K51280M07129M36534L85308L66560M03212
$$ 16145037 16398472 16545990 16880857 17132137 17539266 17975800 18361108 18727668 19130880
2931A9130880M69087L80944L22672M61558M98686M26393M74030O23597O17864
$$ 19130880 19599967 19980911 20303583 20765141 21263827 21690220 22164250 22787847 23405711
2922B3405711N45616P27368P41844O61118P58292P74308J070846J181019J204061
$$ 23405711 23951327 24678695 25420539 26081657 26839949 27614257 28685103 29866122 31070183
2913C1070183J269733J345386Q68992O55778M18297p1966r091o4236K32435L07800
$$ 31070183 32339916 33685302 34554294 35210072 35628369 35556403 35547312 35483076 35715511 36023311
2903C6023311L61739O06243O75043Q41962J046540R65958J177815J347378J201782
$$ 36023311 36385050 36991293 37666336 38508298 39554838 40520796 41698611 43045989 44247771
2894D4247771J135427R83449Q07308P34032O83586O27937Q20466R28939J358712
$$ 44247771 45383198 46366647 47173955 47907987 48591573 49219510 50039976 50968915 52327627
2885E2327627J613207J738303J999513K429510K950224L277603L916581M397265
$$ 52327627 53940834 55679137 57678650 60108160 63058384 66335987 70252568 74649833
2877G4649833N250445N879459O758230P596547Q553407J0166794J2371011J4937831
$$ 74649833 79900278 85779737 92537967 100134514 108687921 118854715 131225726 146163557
2869A46163557J7992429K0721329K1675186J9296815J1647714l43815j2736357
$$ 146163557 164155986 184877315 206552501 225849316 237497030 237153215 224416858
2862B24416858k0633427k2143208j9117510j4658241j0634723p666868n150277
$$ 224416858 203783431 181640223 162522713 147864472 137229749 129562881 124412604
2855A24412604l174740j964534j101419N3157Q11037J790181K565101K708260
$$ 124412604 121237864 119273330 118171911 118225068 119036105 120826286 123391387 126099647
2847A26099647K755175K378936K423857K699615K862565L124938L386567L816490
$$ 126099647 128854822 131233758 133657615 136357230 139219795 142344733 145731300 149547790
2839A49547790M415437N310526O771269Q736647J1298282J4682192J8213658K1701746
$$ 149547790 153963227 159273753 166045022 174781669 186079951 200762143 218975801 240677547
2831B40677547K3355513K1132391J2621705j382578j6570317k7060682l0493606
$$ 240677547 264033060 285165451 297787156 296404578 279834261 252773579 222279973
2824B22279973k8646873k4385982k0098011j6528271j3313243j0777571r291878
$$ 222279973 193633100 169247118 149149107 132620836 119307593 108530022 99238144
2817I9238144p964315p070735o106374n536302m963197m388569l804544l331374
$$ 99238144 91273829 84203094 78096720 72560418 67597221 63208652 59404108 56072734
2809E6072734l097233k682999k439054k354130k133858j937726j842177j812814
$$ 56072734 52975501 50292502 47853448 45499318 43365460 41427734 39585557 37772743
2801C7772743j652892j401236j426561j317505j210544j225385j099716j033993
$$ 37772743 36119851 34718615 33292054 31974549 30764005 29538620 28438904 27404911
2793B7404911j001263q75570q37701q24562p84813q24724p08063o26059p03864
$$ 27404911 26403648 25528078 24690377 23865815 23081002 22256278 21548215 20922156 20218292
2784B0218292n53602n03072n77073m12940m50125n24615m92412n05771n29067
$$ 20218292 19664690 19161618 18584545 18171605 17721480 17196865 16704453 16198682 15669615
2775A5669615l63757l52661l33885l72922l97518l54548l61545m24957l63695
$$ 15669615 15305858 14953197 14619312 14246390 13848872 13494324 13132779 12707822 12344127
2766A2344127j97600k67392l03809l33776k44017k11696l00592l5685j51377k09838
$$ 12344127 12146527 11879135 11575326 11241550 10997533 10785837 10485245 10449560 10298183 10088345
2756A0088345k62283k46565k53277r2055k18793k43875l4687k12247k62643j69930
$$ 10088345 9826062 9579497 9326220 9234165 9015372 8771497 8736810 8524563 8261920 8091990
2746H091990j35879j11417k28060j94023j69573j21365r8319p4645q1792j75540
$$ 8091990 7956111 7844694 7616634 7422611 7253038 7131673 7033354 6958709 6876917 6701377
2736F701377j27173j09983k26737q9008p154j96473j67034j59773q9037k0533
$$ 6701377 6574204 6464221 6237484 6148476 6141322 5944849 5777815 5618042 5529005 5508472
2726E508472j16226j27842j41202n3220L9814r1613j0531j54719j19127J2053
$$ 5508472 5392246 5264404 5123202 5069982 5109796 5018183 5007652 4852933 4733806 4745859
2716D745859n8415j1987o7344L335m0709j55873j03515j04818J3071p4267j45429
$$ 4745859 4687444 4675457 4608113 4611448 4570739 4414866 4311351 4206533 4219604 4145337 3999908
2705C999908j40806k7122l2307p6764j36279j37272j38150m2270j00610J089K2378
$$ 3999908 3859102 3831980 3799673 3722909 3586630 3449358 3311208 3268938 3168328 3169417 3191795
2694C191795l6615l6375l9537j33537k4667m725j24736j43278K0942K4378p8100
$$ 3191795 3155180 3118805 3079268 2945731 2921064 2916339 2791603 2648325 2669267 2693645 2615545
2683B615545l9888j20311J9790O5411p781m220o1831N259j8141R8301r95N0646
$$ 2615545 2575657 2455346 2475136 2540547 2532766 2528546 2466715 2471974 2453833 2552134 2551139 2601785
2671B601785o5499j63084J6024q6433m8970n0405k979n2972o5682n8505j8010
$$ 2601785 2536286 2373202 2389226 2302793 2253823 2203418 2200439 2147467 2081785 2023280 2005270
2660B005270r4625k0156J10535p6710L5859j08524j58882k7875K4727K6620N0482
$$ 2005270 1910645 1890489 2001024 1924314 1960173 1851649 1692767 1664892 1689619 1716239 1766721
2649A766721m6615o1804k8004J5891L5375L077N1280m057K2333O4372m1359k5538
$$ 1766721 1720106 1658302 1630298 1646189 1681564 1684641 1735921 1731864 1754197 1818569 1777210 1751672
2637A751672j4633K2582J41231m9876r35p915P0267m1732j18270j1099j7424O1400
$$ 1751672 1737039 1759621 1900852 1850976 1850041 1842126 1912393 1870661 1752391 1741292 1723868 1785268
2625A785268J3115J4966n3106j6745m2275l9631K4521M945N7866M6671n7120j55580
$$ 1785268 1798383 1813349 1760243 1743498 1701223 1661592 1686113 1691058 1748924 1795595 1738475 1582895
2613A582895L0340M5482p8501K3760K9132o2451l2088k1324L0341q91j6413k7557
$$ 1582895 1613235 1658717 1580216 1603976 1633108 1570657 1538569 1517245 1547586 1546695 1530282 1502725
2601A502725N6818j27593O2678L4930p9699P9815N7590p1185J1121Q8550L8749
$$ 1502725 1559543 1431950 1494628 1529558 1449859 1529674 1587264 1516079 1527200 1615750 1654499
2590A654499K6538J2449J03258M3772K7995O0571P6144J00726K3840J05306J30843
$$ 1654499 1681037 1693486 1796744 1840516 1868511 1929082 2005226 2105952 2129792 2235098 2365941
2579B365941j38403r8396q9990q4787M050k21658r5618j9424J199j17962l887
$$ 2365941 2227538 2129142 2039152 1954365 1958415 1736757 1641139 1621715 1622914 1504952 1501065
2568A501065R4852M0247j1634Q5069J4549m0101J9718j15840j0799J05008q393
$$ 1501065 1595917 1636164 1624530 1709599 1724148 1684047 1703765 1587925 1577126 1682134 1673741
2557A673741J3370O3862K9951o1394J8415k0919K2085R9916J07661K9188J51237
$$ 1673741 1687111 1750973 1780924 1719530 1737945 1717026 1739111 1839027 1946688 1975876 2127113
2546B127113L8485K583N8006L045j76474j93400j31679j30666j27628K845J4792
$$ 2127113 2165598 2168181 2226187 2229232 2052758 1859358 1727679 1597013 1469385 1472230 1487022
2535A487022j65035p7590o9171p1061q8855N3030j07543J1206K295m0991j14117
$$ 1487022 1321987 1244397 1175226 1104165 1015310 1068340 960797 972003 974298 933307 819190
2524H19190l3274j1003L2415o4374l1767j4999L4613k6857j9262p04Q6340J094
$$ 819190 785916 774913 807328 742954 711187 696188 730801 703944 684682 683978 770318 771412
2512G71412L2638N9452m3150j02490k5893o9165O00j8640r704m8553n0548P3596
$$ 771412 804050 863502 820352 717862 691969 622804 623404 604764 595060 546507 495959 569555
2500E69555J6610L919P136m7703j6215l4758L107P4770O8476n6864j085R1606
$$ 569555 586165 590084 597220 549517 533302 498544 501651 576421 644897 588033 586948 678554
2488F78554n0694n2367K4977j35801J16495j645r4264M7172l4777j0536M3368
$$ 678554 627860 575493 600470 464669 581164 579519 485255 532427 497650 487114 530482
2477E30482l9709j02832P0282j3097j70468N950L4180M6450P3895q7481m8895
$$ 530482 490773 387941 458223 445126 274658 280608 314788 361238 435133 347652 298757
2466B98757n4640M1658J54681K6018o2049J4930J6408L0937j12754l2395l2163
$$ 298757 244117 285775 440456 466474 404425 419355 435763 466700 353946 321551 289388
2455B89388O8252P2414r3339r1832Q5435K8495K8347P852p7111o0670M2054N4857
$$ 289388 357640 430054 336715 244883 330318 358813 387160 395012 317901 257231 299285 354142
2443C54142J615j06850K28L6032L9691o7740K4995o461o372r667P5531r3733J9359
$$ 354142 355757 248907 249135 285167 324858 257118 282113 275652 269280 259613 335144 241411 260770
2430B60770N2815M9079k4563K1261R335j452J5252K3874r3880k4666N8008r1121
$$ 260770 313585 362664 338101 359362 368697 367245 382497 406371 312491 287825 345833 254712
2418B54712P2902o0404l4182p39j4746l5753O3673l0277M4068O0733L1251o579
$$ 254712 327614 267210 233028 232289 217543 181790 245463 215186 259254 319987 351238 344659
2406C44659n7461o8706q1738J4781L068R5795j6449K2443J3803k0552J8951m8942
$$ 344659 287198 218492 136754 151535 154603 250398 233949 256392 270195 249643 268594 219652
2394B19652j9498J3072M1331M0489k1546j10403N2119P14j7923L0643N4958k5933
$$ 219652 200154 213226 254557 295046 273500 163097 215216 215930 198007 228650 283608 257675
2382B57675j1476r8304N1576N1604o5484m7017J78580J3915Q3238n5138k5379
$$ 257675 246199 147895 199471 251075 185591 138574 317154 331069 414307 359169 333790
2371C33790J6489L3497J6585l5512l755j25068N0898N0020J41958N1261o9316
$$ 333790 350279 383776 400361 364849 361094 236026 286924 336944 478902 530163 460847
2360D60847O6263l335j01370l1481l2096r3873K6211m0951j543M3259p7237J6091
$$ 460847 527110 523775 422405 390924 358828 264955 291166 250215 248672 291931 214694 230785
2348B30785L3878r819j06802P1265J4021n7542l0904L7912p7453m4062Q5118N8095
$$ 230785 264663 254844 148042 219307 233328 175786 144882 182794 105341 61279 146397 204492
2336B04492o0271M6300M0083j9674j7200J11577L492j05597M0091P927j62749
$$ 204492 144221 190521 230604 210930 193730 305307 308799 203202 243293 251220 88471
2325H8471Q1199M7795L8597n4665j1249J23193k8440l2157J1466j9965r115q2690
$$ 88471 169670 217465 256062 201397 190148 313341 284901 252744 264210 244245 235130 152440
2313A52440o3082N2189l6340J26789M1340q6324m8305N5511J4077M3493N823M820
$$ 152440 89358 141547 105207 231996 273336 187012 138707 194218 208295 251788 257611 262431
2301B62431n2255j6303J16649Q2510r4502l3611l4105K991O4378Q0411j00899
$$ 262431 210176 193873 310522 393032 298530 264919 230814 233805 298183 378594 277695
2290B77695J7622J5730K7014n4850p589P227l1354k7680j0593R010l078J09175
$$ 277695 295317 311047 338061 283211 275622 282849 251495 223815 213222 222232 219154 328329
2278C28329q933j9159N0495l7467o0512M0230J652N7835J870l7444K0623p6972
$$ 328329 319396 300237 350732 313265 252753 292983 294635 352470 354340 316896 337519 260547
2266B60547P111L1331L6008J9327q6084P840o7323R498L4509m1816j8950N2430
$$ 260547 267658 298989 334997 354324 268240 276080 208757 218255 252764 210948 191998 244428
2254B44428l4704R419q1096L1801r672m1879O4254m4834l185K3107P3261O1222
$$ 244428 209724 219143 138047 169848 160176 118297 182551 137717 134532 157639 230900 292122
2242B92122p322n1596K0019M2159N6791l5540k1182J5069j42686O1515r4842m1001
$$ 292122 284800 233204 253223 295382 352173 316633 295451 310520 167834 229349 134507 93506
2230I3506M2320M0226m12M3101j6738o312P2598J53609k8269j01322O9520l2178
$$ 93506 135826 176052 175640 218741 202003 195691 268289 421898 393629 292307 361827 329649
2218C29649o5491j9883k0261O188j1335J6742Q0786K5934L5007J7058k9108L5511
$$ 329649 264158 244275 224014 230202 218867 235609 316395 342329 377336 394394 365286 400797
2206D00797M3488q2937L9689m2455q243Q612P5761n2983j6366K6700N4535k0767
$$ 400797 444285 361348 401037 358582 350339 358951 434712 381729 365363 392063 446598 425831
2194D25831N3697j7134N9142L0435p5058P9392m9914m0225J37499N3248P1668
$$ 425831 479528 462394 521536 551971 476913 556305 506391 466166 603665 656913 728581
2183G28581k7269p2610m007K9540p530j5502J27520m0861q9402R8801k6733q5397
$$ 728581 701312 628702 624695 654235 646705 631203 758723 717862 628460 727261 700528 615131
2171F15131M9057M9196R2599Q6011m239p8037J9187O9326N3867k3242q7237P8176
$$ 615131 664188 713384 805983 891994 887755 809718 828905 898231 952098 928856 841619 919795
2159I19795J62476K7572K9111q7941M5996j7341O5565n4251K9473M1262o315L3484
$$ 919795 1082271 1109843 1138954 1051013 1097009 1079668 1145233 1090982 1120455 1161717 1155402 1188886
2147A188886K1854J28273M8003P0305L8736R4701j9334J01245Q8842j060N6661
$$ 1188886 1210740 1339013 1387016 1457321 1496057 1590758 1571424 1672669 1761511 1760451 1817112
2136A817112K2933K1151N5084K04120O7964M3442P0434P7195J08775N0259O9234
$$ 1817112 1840045 1861196 1916280 2120400 2188364 2231806 2302240 2379435 2488210 2538469 2607703
2125B607703J48312O8148K01746Q4936J28860J66336M8389R1706K47567K10281
$$ 2607703 2756015 2824163 3025909 3110845 3239705 3406041 3454430 3546136 3793703 4003984
2115D003984J03678K04043K90291L64750M91989N30665M96886L76476L03724O20251
$$ 4003984 4107662 4311705 4601996 4966746 5458735 5989400 6486286 6862762 7166486 7786737
2105G786737N51257P62854Q97813J264857J526043J942162K624718L605929N137759
$$ 7786737 8337994 9100848 9998661 11263518 12789561 14731723 17356441 20962370 26100129
2096B6100129P047490R594078Q303006n60871r325746j0721562p214181m479441
$$ 26100129 33147619 42741697 51044703 50483832 41158086 30436524 23222343 18742902
2088A8742902l257266k535760j941345j437220j136365p90233n16167m08211l12570
$$ 18742902 15485636 12949876 11008531 9571311 8434946 7644713 7128546 6720335 6407765
2079F407765j34610l71164o37553n17594m47910l42564k01226k80137j73719j31622
$$ 6407765 6273155 5901991 5264438 4746844 4298934 3956370 3755144 3475007 3301288 3169666
2069C169666j91393j31158j58004j91700j52761j05802j16234j25016k7123j22552
$$ 3169666 2978273 2847115 2689111 2497411 2344650 2238848 2122614 1997598 1970475 1847923
2059A847923l8827j14580k5130j04269j00732l7160k14679q531R6388m3454k1335
$$ 1847923 1809096 1694516 1669386 1565117 1464385 1427225 1212546 1204015 1300403 1256949 1235614
2048A235614r8370j2509K2648N323o9920q0799J2032p1428j6151Q143q048L493
$$ 1235614 1137244 1124735 1147383 1152706 1082786 1001987 1014019 942591 926440 934583 926535 930028
2036I30028j06576o963M8098n6371j29394L1721L8611o1904L3380p7287N1841
$$ 930028 823452 816489 864587 808216 678822 710543 749154 687250 720630 643343 695184
2025F95184K4843J7798l8186l7180l7039j11134l1226M864J31743j4929m5114
$$ 695184 720027 737825 699639 662459 625420 514286 483060 487924 619667 604738 559624
2014E59624J1564k6060j2806j15583o7013K7612J00341Q0127j28512N6751j29277
$$ 559624 571188 545128 532322 416739 349726 377338 477679 557806 429294 486045 356768
2003C56768j15687N281l8151P2829J10547k1629n6051M5536L612M3562j11113
$$ 356768 241081 246362 208211 281040 391587 369958 313907 359443 363055 406617 295504
1992B95504l0332M8554J4648j28970J67Q749L8296P367P0900J5006j767n7510
$$ 295504 265172 313726 328374 199404 199571 208320 246616 253983 324883 339889 338122 280612
1980B80612k1739k5579J2044M7828m5305m0879O1313L0380l4488o7244r2364K8353
$$ 280612 258873 233294 245338 293166 247861 206982 268295 298675 264187 196943 104579 132932
1968A32932J6379l4751K7939J01677j5603Q4158k7919J2488l4633j7544L4430
$$ 132932 149311 114560 142499 244176 228573 312731 284812 297300 262667 245123 279553
1957B79553j04264k4215L7410M9438n1548l8655m011J0366J19340o7781O5134
$$ 279553 175289 151074 188484 237922 186374 147719 143708 154074 273414 205633 270767
1946B70767r3465l4262j28391N132k6300N7275L8859n799J1692M7670j6282q3579
$$ 270767 177302 143040 14649 19781 -6519 50756 89615 83816 95508 143178 126896 43317
1934D3317O609J15030K3604j52845Q0142j22141M7327L6774r495P253m5626j852
$$ 43317 49926 164956 188560 35715 115857 -6284 41043 77817 68322 75575 29949 28097
1922B8097K1030o602m8105O4880k1822r2546J14825p460j06694K1280R0233J3536
$$ 28097 49127 42525 -5580 59300 37478 -55068 59757 52297 -54397 -33117 57116 70652
1910G0652L2973r5428j5269J0362j0140K2759M4968k1681l1982J10435k3150j843
$$ 70652 103625 8197 -7072 3290 -6850 15909 60877 39196 7214 117649 94499 92656
1898I2656m3732J30137J04187j85062L8804j17151j09992J7126M2231J25011Q4113
$$ 92656 48924 179061 283248 98186 136990 19839 -90153 -73027 -30796 94215 178328
1887A78328j19672j55433J4938L6977J12437L2616R935j01178L1214J18450p8586
$$ 178328 58656 -96777 -81839 -44862 67575 100191 110126 8948 40162 158612 80026
1876H0026l0994k7555m4485O5243J5867m4353N6122J2736P176n0563J4556N217
$$ 80026 49032 21477 -23008 42235 58102 13749 69871 82607 89783 39220 53776 58993
1864E8993J09459r0998J339p1626k486M9070k2308n0668N0060J6992K4822l4070
$$ 58993 168452 77454 78793 7167 4681 53751 31443 -19225 30835 47827 72649 38579
1852C8579l1928K2882J68245l1724j15832M9639m7512J4822q3580K8886J9538
$$ 38579 6651 29533 197778 166054 50222 99861 52349 67171 -16409 12477 32015
1841C2015Q8201J00325q6766m2752o6303l1010k7365k5799J23407M3571N5656
$$ 32015 120216 220541 133775 91023 24720 -6290 -33655 -59454 63953 107524 163180
1830A63180j40410M5904O8174q099M8949J16515r1714K3419L0235J963k4940l0362
$$ 163180 22770 68674 136848 128749 177698 294213 202499 225918 256153 258116 233176 202814
1818B02814n2029J6127j5806o8605N57M1008q4410R59k1010q243L4351j0589K6122
$$ 202814 150785 166912 151106 82501 83058 124066 39656 40615 19605 11362 45713 35124 61246
1805F1246m399q0666k4916J7475K8257J2747r0452n1409R2297P3631J07447o2226
$$ 61246 56847 -23819 -48735 -31260 -3003 9744 -80708 -132117 -39820 33811 141258 79032
1793G9032j18227J7946k2256M1422N6833J2257q1604n0036M2095K4822q4758J301
$$ 79032 -39195 -21249 -43505 -2083 54750 67007 -14597 -64633 -22538 2284 -82474 -81173
1781h1173J60761n1523j8000J17398m7647j13773R594K9289n8318p6599Q3188
$$ -81173 79588 28065 10065 127463 79816 -33957 -24363 4926 -53392 -129991 -46803
1770d6803J26748M3691j4344k4674m961k5756j44918m9106P4192m9773r511K7364
$$ -46803 79945 123636 109292 84618 79657 53901 -91017 -140123 -65931 -115704 -125215 -97851
1758i7851l6216P3296J22157q0690r8453J44711M3571l7639M4231k1162p1414
$$ -97851 -134067 -60771 61386 -19304 -117757 26954 70525 32886 77117 55955 -15459
1747a5459Q0630J0446j0726M8890j01922l6758K692L6336j02706Q5161n4909j23359
$$ -15459 65171 75617 64891 113781 11859 -24899 -22207 14129 -88577 -3416 -58325 -181684
1735a81684q8579J42284N6818K0960k4571O3675R8345M5568j05092l630M3919
$$ -181684 -270263 -127979 -71161 -50201 -74772 -11097 87248 132816 27724 24094 68013
1724F8013l3516p4044k8915N9468L1570j2154R8053k0946m1599J2727K7894j7499
$$ 68013 34497 -39547 -68462 -8994 22576 10422 108475 87529 45930 58657 86551 69052
1712F9052r1753q076J46103r5106k2115R2220j6853j0732K4945l0149p7406O029
$$ 69052 -22701 -30777 115326 20220 -1895 90325 73472 62740 87685 57536 -19870 -13841
1700a3841k50M4909J760N9517k268L1119p8657m8439L0701J26646o5369q5351
$$ -13841 -14091 30818 32578 92095 89827 120946 42289 -6150 24551 151197 85828 477
1688D77M511p3352k9790N8886M4699J11970o2838j49404M7985O0519k4768n1395
$$ 477 4988 -68364 -98154 -39268 5431 117401 54563 -94841 -46856 13663 -11105 -62500
1676f2500O4852K633L3251k9863J3564j7184j29822P7038J00492m8593q0901N7859
$$ -62500 2352 4985 38236 8373 21937 4753 -125069 -48031 52461 3868 -77033 -19174
1664a9174l0964J21027L1476j04165r5122M2900K8449L8908k9192N1187j6156
$$ -19174 -50138 70889 102365 -1800 -96922 -54022 -25573 13335 -15857 35330 19174
1653A9174n3870l9542J9457L3124j1406Q7700O7488k6908p4101J3704m5537L2471
$$ 19174 -34696 -74238 -54781 -21657 -33063 54637 122125 95217 21116 34820 -10717 21754
1641B1754k5812k9622R7197p9473o826L9114n6712j4517k8082l1684P7735l7708
$$ 21754 -4058 -33680 63517 -15956 -22782 16332 -40380 -54897 -82979 -114663 -36928 -74636
1629g4636J7600L6022K4651L8231j13716M8101P8359M7808r5804k7396J7734j21387
$$ -74636 -57036 -21014 3637 41868 -71848 -23747 54612 102420 6616 -20780 -3046 -124433
1617a24433l145Q000J65031o2951n5987r659M3084N5932l5834l6352l3328L8947
$$ -124433 -127578 -119578 45453 -17498 -73485 -83144 -40060 15872 -19962 -56314 -89642 -50695
1605e0695P225R7235L3942L6703m9861j1748J01237q4748n4409j5611k9775o888
$$ -50695 -43470 53765 87707 124410 74549 62801 164038 79290 24881 9270 -20505 -27393
1593b7393k4552N4205k9975j7595O0763n7396o3289N5685K224M6116K3199o6329
$$ -27393 -51945 2260 -27715 -45310 15453 -41943 -105232 -49547 -47323 -1207 21992 -44337
1581d4337p1137R1727J5017Q7553N4154j10006q418M3979j3152k9276o4837n9323
$$ -44337 -115474 -23747 -8730 78823 132977 22971 14553 58532 45380 16104 -48733 -108056
1569a08056J5147N6084N8682m072k7555M6378r9710k023M7798p0211K4852L1622
$$ -108056 -92909 -36825 21857 17785 -9770 36608 -63102 -65125 -17327 -87538 -62686 -31064
1557c1064Q484J0582K8914J37410j16754r8406k3185k2240k2783M0010R5452r1112
$$ -31064 -22580 -11998 16916 154326 37572 -60834 -84019 -106259 -129042 -89032 6420 -84692
1545h4692N8573n3478J7052M6731j1187L2938n25P8808p2292K7781m1925J4480
$$ -84692 -26119 -79597 -62545 -15814 -27001 5937 5412 84220 11928 39709 -2216 12264
1533A2264k1907N6899n7851J40787o0736r3949J0082j18430L7865J40087P1790
$$ 12264 -9643 47256 -10595 130192 69456 -24493 -14411 -132841 -94976 45111 116901
1522A16901m2371J4577r3404L5065l0573m1224N6760k4966j40483J25874L1316
$$ 116901 74530 89107 -4297 30768 195 -41029 15731 -9235 -149718 -23844 7472
1511G472j8435k8357m7461R3060l3695o5500K5457p6258J46348L1470K0417l0020
$$ 7472 -10963 -39320 -86781 6279 -27416 -92916 -67459 -143717 2631 34101 54518 24498
1499B4498j7658L1758n4832K3894n1698k159P1666O255L0072j34411N4081O9145
$$ 24498 6840 38598 -16234 7660 -44038 -46197 25469 31724 61796 -72615 -18534 50611
1487E0611j37279n121P0458K3155j9666m9246O311N9513q315j3570P1437n7917
$$ 50611 -86668 -91789 -21331 1824 -17842 -67088 -60777 -1264 -9579 -23149 48288 -9629
1475i629j3686k2782o9934R2217l0539K3486j0691M4314n5703L240J09034p5019
$$ -9629 -23315 -46097 -116031 -23814 -54353 -30867 -41558 2756 -52947 -49707 59327 -15692
1463a5692o0690j8787M4636J920N0154k1409l6782L4306K0429l0605n315o6606
$$ -15692 -76382 -95169 -50533 -48613 1541 -19868 -56650 -22344 -1915 -32520 -37835 -104441
1451a04441J64825k6622m5615L2016Q852j9143r787K5290K0177R9186m7361m1852
$$ -104441 60384 33762 -11853 20163 29015 9872 85 25375 45552 144738 97377 55525
1439E5525k0004J94M4733L558j44996P8028K9456J896J0380J13578k2910q0803
$$ 55525 35521 35715 80448 84006 -60990 17038 46494 48390 58770 172348 149438 68635
1427F8635j27627n667Q9903o9414N0627R9681j10315o8218j4382k4417M4134q5840
$$ 68635 -58992 -64659 25244 -44170 6457 106138 -4177 -72395 -86777 -111194 -67060 -152900
1415a52900N6612L1617j5206J12657k527l1223r12o5747m4218P1518O1671M5323
$$ -152900 -96288 -64671 -79877 32780 30253 -970 -1882 -67629 -111847 -40329 21342 66665
1403F6665n7955O8471o5690L4259K1731o3574j2318j1629L3177j0619M3827n0835
$$ 66665 8710 77181 11491 45750 67481 3907 -8411 -20040 13137 2518 46345 -4490
1391d490r388J0181j4296M9453N2175Q7338J0004r8951M7875q4833m9888k2367
$$ -4490 -13878 -3697 -17993 31460 83635 170973 180977 82026 129901 45068 -4820 -27187
1379b7187o0687j829q7126L0770Q1676J30296O7226p9861q4016p2968M9198Q7955
$$ -27187 -87874 -89703 -176829 -146059 -64383 65913 133139 53278 -30738 -103706 -54508 33447
1367C3447q8336K3999O4396L3294q7973J1148Q5878l2731M3421L049o211k9836
$$ 33447 -54889 -30890 33506 66800 -21173 -10025 75853 43122 86543 89592 83381 53545
1355E3545m1659j17960n1339j0967J12986p557J23332q7991j06565J31498N0338
$$ 53545 11886 -106074 -157413 -168380 -55394 -62951 60381 -27610 -134175 -2677 47661
1344D7661k7150n5216J17972j1454r3562k4980O0140N4652j01707L0492o1021
$$ 47661 20511 -34705 83267 71813 -21749 -46729 13411 68063 -33644 -3152 -64173
1333f4173Q8750O0916j01746K4060O0337J5983j49343P5089l0849p2023J06854
$$ -64173 24577 85493 -16253 7807 68144 84127 -65216 9873 -20976 -92999 13855
1322A3855N4125l2914l5506q5212R5562J3763j48758O8436O3520k8677j8876J09508
$$ 13855 67980 35066 -440 -85652 9910 23673 -125085 -56649 6871 -21806 -40682 68826
1310F8826R2271l1089j10582J470j22888J2311J17693m3087p9858J29070N8413
$$ 68826 161097 130008 19426 20896 -101992 -89681 28012 -15075 -94933 34137 92550
1299I2550j68552L3209n8458n7266l4254J23452J23142m111K4953l0846j06360
$$ 92550 -76002 -42793 -101251 -158517 -192771 -69319 53823 49712 74665 43819 -62541
1288f2541O432l4240k9212K3114J24680l642m9873K1603p9160J4050j12325K192
$$ -62541 -56109 -90349 -119561 -96447 28233 24591 -25282 -3679 -82839 -68789 -181114 -178922
1276a78922M4136j3251R8966R857k4507l2735p6041K4577J89279m453M8838J10512
$$ -178922 -134786 -148037 -49071 -39214 -63721 -96456 -172497 -147920 41359 36906 85744 196256
1264A96256j59933K605n9982m9188J4883O6812l0587l3412n2594m5055M3568l0057
$$ 196256 36323 38928 -21054 -70242 -55359 11453 -19134 -52546 -105140 -150195 -106627 -136684
1252a36684O1413N2438L3655l8736L1216N4408o4838p208o50J1051N2273n4443
$$ -136684 -75271 -22833 10822 -27914 3302 57710 -7128 -14336 -14986 -3935 48338 -6105
1240f105M2549q980o7164k2979J5973m7487o5503Q2753K4805N9901J6243J26256
$$ -6105 36444 27464 -39700 -62679 -46706 -94193 -159696 -76943 -52138 7763 24006 150262
1228A50262p5757r2914o3202M0760P4212j04344K1605L7391Q0938l8223j1087
$$ 150262 74505 -18409 -81611 -40851 33361 -70983 -49378 -11987 68951 30728 19641
1217A9641q6613k6791J9836K2044Q52Q7035K6586P216p9623J0214J2029L382n2881
$$ 19641 -66972 -93763 -73927 -51883 -51031 36004 62590 69806 -9817 397 12426 15808 -37073
1204c7073j44188J41222J23591O0128j57703J560j3662p3421K7367J3058l2716
$$ -37073 -181261 -40039 83552 143680 -14023 -12463 -26125 -99546 -72179 -59121 -91837
1193i1837p774J42178L9776l0856M6343n5530m6521l2000L8087L792n6071Q0847
$$ -91837 -99611 42567 82343 51487 97830 42300 -4221 -36221 1866 5658 -50413 30434
1181C0434o531n2977q7769O2196R5547K9505m92p7298l5641J08881m2525M4947
$$ 30434 23903 -29074 -116843 -54647 40900 70405 69913 -7385 -43026 65855 23330 68277
1169F8277l1439L5862o4896m6721q2512M549L5080O092M0044m6216O4855L0489
$$ 68277 36838 72700 7804 -38917 -121429 -116880 -81800 -75708 -35664 -81880 -17025 13464
1157A3464J3495m9844k3390J6013P8158P0675k3527o7813L2511j659J9594p8768
$$ 13464 26959 -22885 -46275 -30262 47896 118571 95044 27231 59742 58083 77677 -1091
1145a091o3951M4272m714q562O3243l3675j0105L9983N2540j04255J3482J7305
$$ -1091 -65042 -20770 -25484 -34046 29197 -4478 -14583 25400 77940 -26315 -12833 4472
1133D472l802P202N5625m3832m5373m3718J351O1364n8411J4394O8400K2190o2172
$$ 4472 670 7872 63497 19665 -25708 -69426 -68075 -6711 -65122 -50728 17672 39862 -22310
1120b2310m3535L5080l8940L7665M5005k1053m0989P6441L5182Q693n3443j05267
$$ -22310 -65845 -30765 -69705 -32040 12965 -8088 -49077 27364 62546 71239 17796 -87471
1108h7471O7366j145j1082p70Q9116l0373j33357M2790l0274n4115P5492L4976
$$ -87471 -20105 -21250 -32332 -33102 56014 25641 -107716 -64926 -95200 -149315 -73823 -38847
1096c8847j3888L6084k3221k957J3903N3801P441n7781k8083k2216Q8316O7226
$$ -38847 -52735 -16651 -39872 -42829 -28926 24875 32316 -25465 -53548 -75764 12552 79778
1084G9778j44571m2483R8906J10439P6885j8699p9795l3215p2532l7343M6767
$$ 79778 -64793 -107276 -8370 102069 178954 160255 80460 47245 -25287 -62630 -15863
1073a5863n912L2888K6943N1004l2998j9637K658o559l8388J920n3414K7774Q5999
$$ -15863 -21775 11113 38056 89060 56062 36425 39083 32524 -5864 -3944 -57358 -29584 56415
1060E6415O6277j55848j9476j6693k0070P446R1666L0032p9537N536P2270n1450
$$ 56415 122692 -33156 -52632 -69325 -89395 -81949 9717 39749 -39788 -34252 38018 -13432
1048a3432M3690N2568m4797K341k7870K1122o0203k9000O3332J08821M765o5939
$$ -13432 30258 82826 38029 40370 12500 33622 -26581 -55581 7751 116572 121337 55398
1036E5398j02822P815l8535j4840j4365O8074J37545j1894m5115K9097M7624o3739
$$ 55398 -47424 -39609 -78144 -92984 -107349 -39275 98270 86376 41261 70358 117982 54243
1024E4243m480k3518k8781L6340m8919J24068J5124q8711K6133o582L0346J4410
$$ 54243 49763 26245 -2536 33804 -15115 108953 124077 35366 61499 54917 85263 99673
1012I9673K1982j34772o9344J6148n0450L4698J09510n1198K0892r975Q261J6778
$$ 99673 121655 -13117 -82461 -66313 -116763 -82065 27445 -23753 -2861 -12836 -4575 12203
1000A2203o011j2429q2115M2710k8587j16M1975M0123l1422q477l0077O970L9277
$$ 12203 6192 -6237 -88352 -45642 -74229 -74345 -32370 7753 -23669 -32146 -62223 -55253 -15976
987a5976J7390K5144j0757m092M6018j21361r3350N2855P6882R4892L4063n2929
$$ -15976 1414 26558 15801 11709 57727 -63634 -156984 -104129 -27247 67645 101708 48779
975D8779k0288L0654j11623R8513p7550O848M7791l922O1994o1063j6305l7841
$$ 48779 28491 59145 -52478 46035 -31515 -24667 23124 19202 81196 20133 3828 -34013
963c4013J23313n1235q8251k0084J3732K9474N3332j3392L3710n53o917L2485
$$ -34013 89300 38065 -50186 -70270 -56538 -27064 26268 12876 46586 46033 39116 71601
951G1601p0517j07105L4022K141M3394J8436p6378N1766M9824j208N353k5850
$$ 71601 1084 -106021 -71999 -69858 -26464 -8028 -84406 -32640 17184 15976 21329 -4521
939d521M1342j5671n5413J1909l200J945k454J3043K6598k1566K1626m6287m5258
$$ -4521 36821 21150 -34263 -22354 -25554 -23609 -26063 -13020 13578 -7988 13638 -32649 -77907
926g7907P4465M2092K4353k5030J8353O740n8663P0113l0842r013O0328M1321
$$ -77907 -3442 38650 63003 37973 56326 63066 4403 74516 43674 34661 94989 136310
914A36310l8118r6751L8250j8068m5643N1430k2730j24885P9300n837M3656k0951
$$ 136310 98192 1441 39691 21623 -24020 27410 4680 -120205 -40905 -46742 -3086 -24037
902b4037r835M7354M5970k1664k6036J6758l93P7005o0608K7033j5767j04978
$$ -24037 -33872 13482 59452 37788 11752 28510 28117 105122 44514 71547 55780 -49198
890d9198o6675L4644J37880P9391r3702j56419P3161j6632Q6814l1166p5163P2490
$$ -49198 -115873 -81229 56651 136042 42340 -114079 -40918 -57550 29264 -1902 -77065 -4575
878d575r397K8528O9536p0134k6250m4712n9883K8285J18952N3367j31612P8468
$$ -4575 -13972 14556 84092 13958 -12292 -57004 -116887 -88602 30350 83717 -47895 30573
866C0573L1757p6374o0539K9414m5031K3919q3619J52935L5731o5582N2022k9845
$$ 30573 62330 -14044 -74583 -45169 -90200 -66281 -149900 3035 38766 -26816 25206 -4639
854d639R7601o9187j8179O2084k6298r6043N1398J4817q2143j25016Q9295Q0385
$$ -4639 92962 23775 5596 67680 41382 -54661 -3263 11554 -70589 -195605 -106310 -25925
842b5925j8758m7475R0565p19m0442R5895J9507m5865o6307r363J031J0351p3848
$$ -25925 -44683 -92158 -1593 -2312 -42754 53141 72648 26783 -39524 -48887 -47856 -37505 -111353
829a11353m95K9131J2065O9949L2089M5337L4943P1678j37387m7053n683n2196
$$ -111353 -111848 -82717 -70652 -703 31386 76723 111666 183344 45957 -1096 -6779 -58975
817e8975J03878l4477j7948q08P9223p149N5881r1559n9771K7672P3535Q9625
$$ -58975 44903 10426 -7522 -8330 70893 63744 119625 28066 -31705 -4033 69502 159127
805A59127o6451r855n5804L4346M0399j0527r7835k1555O8012p9589M3638M1528
$$ 159127 92676 82821 27017 61363 101762 91235 -6600 -28155 39857 -39732 3906 45434
793D5434n7929l0932P3210m1225J9471N8167J189o5946l0739O4691J7990O7511
$$ 45434 -12495 -43427 29783 -11442 8029 66196 67385 1439 -29300 35391 53381 120892
781A20892p6017k9410q4935o9101N4782J08958M6800o2588n0692j9307O3144l0256
$$ 120892 44875 15465 -69470 -138571 -83789 25169 71969 9381 -41311 -60618 2526 -27730
769b7730N1516j9574k9699R5623L7736j17854o5151N3059N957q846k4518J49598
$$ -27730 23786 4212 -25487 70136 107872 -9982 -75133 -22074 -16117 -24963 -49481 100117
757A00117L4996j7518j18421o9496J84983L4604m1247j13940k0273l7321r1690
$$ 100117 135113 117595 -826 -70322 114661 149265 108018 -5922 -26195 -63516 -155206
746a55206j8905R4287P9525j47635M7450J70043J7908p7596j3849L7767K0044
$$ -155206 -174111 -79824 -299 -147934 -100484 69559 87467 9871 -3978 33789 53833
735E3833j08970P3503l1933k7536J2896Q817k2949j0762l675M0699n9772R051
$$ 53833 -55137 18366 -13567 -41103 -28207 -19390 -42339 -53101 -56776 -16077 -75849 -66798
723f6798J17766q0106K731l1826J32846n615L65k5998j16588j8536M7647N4510
$$ -66798 50968 -29138 -26407 -58233 74613 68998 69363 43365 -73223 -91759 -44112 10398
711A0398l639k3704O0284L1964j4548j4236m0869p3864M7829j05441O3488R0813
$$ 10398 6759 -16945 43339 75303 60755 46519 5650 -68214 -20385 -125826 -62338 28475
699B8475o4433M5420l6098m3334j3962J13627K4092o8459R210K7070k2871J5593
$$ 28475 -35958 9462 -26636 -69970 -83932 29695 53787 -14672 -5462 21608 -1263 14330
687A4330M9743m7396L4891m4703K5751j9521q6507m760L1821J44264j7785j41645
$$ 14330 64073 16677 51568 6865 32616 13095 -73412 -78172 -46351 97913 80128 -61517
675f1517K7848Q1910q3618r224O0127l8508k0822K8682O1963r1572o3356J33129
$$ -61517 -33669 48241 -35377 -44601 15526 -22982 -43804 -15122 46841 -44731 -108087 25042
663B5042l3352j56375M9658J46901q31Q3223J863j44455o5569O3894N4870J032
$$ 25042 -8310 -164685 -115027 31874 31043 114266 116129 -28326 -93895 -30001 24869 25901
651B5901L9152q4463k532O7472l0711M4957l7041o487Q2068j35238o1305K3032
$$ 25901 65053 -19410 -21942 45530 14819 59776 22735 16248 98316 -36922 -98227 -75195
639g5195l4439R3690r2235M6903J7245R5168M845m2612N385j53388L4535R0030
$$ -75195 -109634 -15944 -108179 -61276 -44031 51137 55982 13370 18755 -134633 -100098 -10068
627a0068P9006L2212Q6085m0807j16193l6307l0950K8506k2144L4732r0026j5054
$$ -10068 68938 101150 187235 146428 30235 -6072 -37022 -8516 -30660 4072 -85954 -101008
615a01008J0256j1232K5802J14800k5822q1229j3092M5930N861O9025o7606P279
$$ -101008 -90752 -101984 -76182 38618 12796 -68433 -81525 -35595 -29734 39291 -28315 -21036
603b1036l7233p711O4061r7243N4432N2294l0827P34J12546j05728J4853L0713
$$ -21036 -58269 -65980 -1919 -99162 -44730 7564 -23263 -22529 90017 -15711 -858 29855
591B9855l4412k8548l4208J3964O8174n1048J6273j07033M0396Q3472N6610J292
$$ 29855 -4557 -33105 -67313 -53349 14825 -36223 -19950 -126983 -86587 -3115 53495 54787
579E4787l6822q573Q2602j00333r4676N593J7811J05054k8202L491k6456p5204
$$ 54787 17965 9392 91994 -8339 -103015 -97422 -79611 25443 -2759 732 -25724 -100928
567a00928L9624L8362L1946J619j1446M0686M5526q3246o2182j0801j8440R084
$$ -100928 -61304 -22942 9004 10623 -823 39863 85389 2143 -60039 -70840 -89280 -80196
555h0196O1788R0615K3301j1623j03564j8096K8895K6172j10726Q4683J47878
$$ -80196 -18408 72207 95508 83885 -19679 -37775 -8880 17292 -93434 -8751 139127
544A39127r1727j28051m8955R6002N8660N5687n7919j026K8410k1825J3901q2573
$$ 139127 47400 -80651 -129606 -33604 25056 80743 22824 21798 50208 28383 42284 -40289
532d0289m5092J8372j1398m582O3853O4823k8046q6296N6818Q9211o9656l8589
$$ -40289 -85381 -67009 -78407 -82989 -19136 45687 17641 -68655 -11837 77374 7718 -30871
520c0871J29801J03119j13256j24885N669L2454Q2541p6332k5307l8988k2919
$$ -30871 98930 202049 88793 -36092 -30423 2031 84572 8240 -17067 -56055 -78974
509g8974J6037P9018O3122k7610m2456k6510n9451j6266j959P5344R8623j27207
$$ -78974 -62937 16081 79203 51593 9137 -17373 -76824 -93090 -95049 -19705 78918 -48289
497d8289M8868O8627n8658k064m6247R3152O8620n4300q6330p1973O0007K647
$$ -48289 579 69206 10548 8484 -37763 55389 124009 69709 -16621 -88594 -28587 -25940
485b5940J08754p1804l9704K4551J37664k9454j12388k5618k8340K9570P8960
$$ -25940 82814 11010 -28694 -4143 133521 104067 -8321 -33939 -62279 -32709 46251
474D6251j05670P2740j3406l6453J77146j20153q9335l6402J19789k9299O478
$$ 46251 -59419 13321 -85 -36538 140608 20455 -68880 -105282 14507 -14792 -8314
463h314j12245P5898M0223l4723L9462M6848o4452M892q3764O5410K8979k7750
$$ -8314 -120559 -44661 -4438 -39161 301 47149 -17303 -12411 -96175 -30765 -1786 -29536
451b9536P4859p4082p736N5385l2955n9873j5422J18702K4415q0091K4817j4380
$$ -29536 45323 -28759 -36495 18890 -14065 -73938 -89360 29342 53757 -26334 -1517 -15897
439a5897Q769J1159k7654M7400M8038o8241q0616j3463K07233p510p9136p4304
$$ -15897 -7128 4031 -23623 23777 71815 3574 -77042 -90505 116728 109218 30082 -44222
427d4222j6939P2177O4277J6953k3863j12009m325J0880N0709O4795j02402N0456
$$ -44222 -61161 11016 75293 92246 68383 -43626 -47951 -37071 13638 78433 -23969 26487
415B6487J43453n7544j8853p6984p1817J3883K6350K5101O0072p0087Q3529J828
$$ 26487 169940 112396 93543 16559 -55258 -41375 -15025 10076 70148 61 83590 85418
403H5418l9090o0634J3103Q9966j33303O1855L4873p5888o6168L3593N0048N9787
$$ 85418 46328 -14306 -1203 88763 -44540 17315 52188 -23700 -89868 -56275 -6227 53560
391E3560l6354k9478J9718O1757p9293n73r89k275j794K0750K4944L7260j2656
$$ 53560 17206 -12272 7446 69203 -10090 -10663 -11652 -13927 -15721 5029 29973 67233 54577
378E4577j903N2370n0013o9368N5889L5331j08781l9281P2072L8010m026P51l591
$$ 54577 52674 105044 55031 -14337 41552 76883 -31898 -71179 893 38903 34877 35628 32037
365C2037j2485O687j0261j0456K7220L6210L4163p7355K7076j8143l6468q6237
$$ 32037 19552 26239 15978 5522 32742 68952 103115 25760 52836 34693 -1775 -88012
353h8012O5592m9493k8477Q5237J17066n6900r2276l7414o118n9639J09930L9966
$$ -88012 -22420 -71913 -100390 -15153 101913 45013 -47263 -84677 -90795 -150434 -40504 -538
341e38R4517n8064n6694M8894j3923l0153K5617R3313k8179L9089j02472O426
$$ -538 93979 35915 -20779 28115 14192 -15961 9656 102969 74790 113879 11407 17833
329A7833j2962K6273l6304L3244k9839l2365L5956P3981r9588j37975R2162O3547
$$ 17833 4871 31144 -5160 28084 -1755 -34120 1836 75817 -23771 -161746 -69584 -6037
317f037M0137o0268k4492N8211o2617m4668R2962j4260J2869R6744l1586K5380
$$ -6037 34100 -26168 -50660 7551 -55066 -99734 -6772 -21032 -8163 88581 56995 82375
305H2375j8565N8420p5766j0601k19m1695M8332M8612p6983m7606P7473L7063
$$ 82375 63810 122230 46464 35863 35644 -6051 42281 90893 13910 -33696 43777 80840
293H0840k5403l0137L3667l6494J5402p4579l0040P8847J7168O3701r8940k3476
$$ 80840 55437 25300 58967 22473 37875 -36704 -66744 12103 29271 92972 -5968 -29444
281b9444J04065M7603K8694l6835o1054j9301m8778j601M8097P531J4313q3163
$$ -29444 74621 122224 150918 114083 53029 33728 -15050 -16651 31446 38977 53290 -29873
269b9873P6793J44144j01504r1101M2187k9455l4000J8055k1672j9863O6887O6101
$$ -29873 46920 191064 89560 -1541 40646 11191 -22809 -4754 -26426 -46289 20598 86699
257H6699k8831n2358p9102R2905L1391l8350m2838J6760r5318J3739Q4349K0845
$$ 86699 57868 5510 -73592 19313 50704 12354 -30484 -13724 -109042 -95303 -10954 9891
245I891q2706J012Q8063j47354M7127M1607r135O4117J2775l0741Q4842j09652
$$ 9891 -72815 -71803 16260 -131094 -83967 -42360 -51495 12622 25397 -5344 79498 -30154
233c0154J4647k3702k6008J9092j8039M6370q9097J02844M2545l6021k9875J28712
$$ -30154 -15507 -39209 -65217 -46125 -64164 -17794 -106891 -4047 38498 2477 -27398 101314
221A01314j4426j9630k9462l2638L4397o2595P6198q2946J8333K4899Q3744R14
$$ 101314 86888 67258 37796 5158 39555 -23040 53158 -29788 -11455 13444 97188 98102
209I8102n1618K469j6111k1547O157L8777j9054l0146j8563M6875K7579q861P1273
$$ 98102 46484 48953 32842 11295 17452 56229 37175 7029 -11534 35341 62920 54059 125332
196A25332j08929l7408K1661O1273l9636J1880J9391n5306M9227N7776n1206o0973
$$ 125332 16403 -21005 656 61929 22293 34173 53564 -1742 47485 105261 54055 -6918
184f918L9932q5189J58546N1455j30596m0712o2405n9962R1593L0658K3965l5911
$$ -6918 33014 -52175 106371 157826 27230 -13482 -75887 -135849 -44256 -13598 10367 -25544
172b5544J788j7594N9207r823m4813r245N0080M3927r0480J7144M8863n392m0739
$$ -25544 -23756 -41350 17857 8034 -36779 -46024 4056 47983 -42497 -25353 23510 18118 -22621
159b2621j2572j2091l9954K9168Q8123j9489L1477n5731L8446k7709m243L0452
$$ -22621 -35193 -47284 -87238 -58070 30053 10564 42041 -13690 24756 -2953 -7196 23256
147B3256k556M9594N038l0968n413m1685Q2260N5040n8734j01326J0711N1551
$$ 23256 20700 70294 75332 44364 38951 -2734 79526 134566 75832 -25494 -14783 36768
135C6768n7810n5382P0588M9225N1700L4023p6560j0536k2990K8710r784P9581
$$ 36768 -21042 -76424 -5836 43389 95089 129112 52552 42016 19026 47736 37952 117533
123A17533m3028n1586j7287q0692n805R2932J2420J6556L5207n0968j01297J9977
$$ 117533 74505 22919 5632 -75060 -80865 12067 24487 41043 76250 25282 -76015 -56038
111e6038p4774L8015O4638k4581N1232L7236l0711J3440o898q7954Q0102M1945
$$ -56038 -130812 -92797 -28159 -52740 -1508 35728 5017 18457 11559 -76395 3707 45652
99D5652m082l9750j8267n1629L6050L9292J4647n4290n2529k8114M9438K4969
$$ 45652 41570 1820 -16447 -68076 -32026 7266 21913 -32377 -84906 -113020 -63582 -38613
87c8613R0013O8706j09362l1635P4633k013l3076j9168j00713P534N9465Q0529
$$ -38613 51400 120106 10744 -20891 53742 51729 18653 -515 -101228 -93694 -34229 46300
75D6300k9050K7773m71q1406K4219k2480K2946M6454o6041M564J7620L9041L8679
$$ 46300 17250 45023 44552 -36854 -12635 -35115 -12169 34285 -31756 -27192 -9572 29469 68148
62F8148m7353j1564L7868k069m3065L8904l1786J2214N265K756k8493l7290K6780
$$ 68148 20795 9231 47099 45030 1965 40869 9083 21297 26562 29318 825 -36465 -9685
49i685L2345K2982N0613O0888j06500k1850j0051K9985n4592p73O5877J1328m3523
$$ -9685 22660 45642 96255 157143 50643 28793 18742 48727 -5865 -6638 59239 70567 27044
36B7044k5262j2535j7837L460L6193j1995k5872P4242j5705n1540J9361p8966
$$ 27044 1782 -10753 -28590 -25130 11063 -932 -26804 47438 31733 -19807 -446 -79412
24g9412N5493N7939o893O0469k1403l8174m2708J3336j1586J2899n6346J7355
$$ -79412 -23919 34020 27127 87596 66193 28019 -14689 -1353 -12939 -40 -56386 -39031
12c9031P5884j5086M1604o310k6415n2075l975L2882k4383R150k5554o1484
$$ -39031 36853 21767 63371 57061 30646 -21429 -25404 7478 -16905 -7755 -33309 -94793
0i4793
$$ -94793
$$ Imaginary data points
##PAGE= N=2
##DATA TABLE= (X++(I..I)), XYDATA
16383b285669K5992P1609n6995L7200R303J25627M3176M2879O011l7703O0052
$$ -2285669 -2259677 -2188068 -2245063 -2207863 -2198560 -2072933 -2029757 -1986878 -1980867 -2018570 -1958518
16372a958518Q70Q2569J05032j51596j6307J62584Q1439J2092q688N4403J7626
$$ -1958518 -1957648 -1875079 -1770047 -1921643 -1937950 -1775366 -1693927 -1681835 -1690523 -1636120 -1618494
16361a618494L6426K0737J7299J18114Q4548m1633R206N084M4315N3617k0896
$$ -1618494 -1582068 -1561331 -1544032 -1425918 -1341370 -1383003 -1373797 -1368713 -1324398 -1270781 -1291677
16350a291677o546J08786k541k1023J02493P461P1450N910l6495K1704K5389L0100
$$ -1291677 -1298223 -1189437 -1191978 -1213001 -1110508 -1103047 -1031597 -1025687 -1062182 -1040478 -1015089 -984989
16338i84989O8693K0106N7552o435K4728J01227k511J6162J0558k1912K1747O3819
$$ -984989 -916296 -896190 -838638 -845073 -820345 -719118 -721629 -705467 -694909 -716821 -695074 -631255
16326f31255N3682m077K0620M3421M3750R6996l2611R8478R7577L1533k3243j3983
$$ -631255 -577573 -581650 -561030 -517609 -473859 -376863 -409474 -310996 -213419 -181886 -205129 -219112
16314b19112J4125M723Q282K6198j3374L5995J40049r461o379k6825n1415M8572
$$ -219112 -204987 -200264 -191982 -165784 -179158 -143163 -3114 -12575 -18954 -45779 -97194 -48622
16302d8622K7371J19462R4159q3935j7305R503L6447M1303Q4301L338N5256j5030
$$ -48622 -21251 98211 192370 108435 91130 100633 137080 178383 262684 266022 321278 306248
16290C06248R3M2606L3993M6189l5757j1329O2323N7982j1540L0859Q725J7352
$$ 306248 306341 348947 382940 429129 393372 382043 444366 502348 490808 521667 530392 547744
16278E47744Q6774R7227l3573k7603J5736M6073o4536L189J42044N3186K7547
$$ 547744 634518 731745 698172 670569 686305 732378 667842 671031 813075 866261 893808
16267H93808R5381j5901q971l4746m9632O0206O2710k3397J2341K4384N4326o8344
$$ 893808 989189 973288 964317 929571 879939 940145 1002855 979458 991799 1016183 1070509 1002165
16255A002165J00497J3214J3680O3391L6035o6640n140J00992o645j201p9406
$$ 1002165 1102662 1115876 1129556 1192947 1228982 1162342 1157202 1258194 1251549 1250348 1170942
16244A170942P4643m8561Q0348L8741k3008O3105P4271L1676J289M7119K1564
$$ 1170942 1245585 1197024 1277372 1316113 1293105 1356210 1430481 1462157 1463446 1510565 1532129
16233A532129m9290l3057k5835R7668P7236p4437J7803K0355m7489N4001J25824
$$ 1532129 1482839 1449782 1423947 1521615 1598851 1524414 1542217 1562572 1515083 1569084 1694908
16222A694908j4693L6755P8022r0763o43j8927R694j7198K7559P3359k4257N2341
$$ 1694908 1680215 1716970 1794992 1704229 1703586 1684659 1694353 1677155 1704714 1778073 1753816 1806157
16210A806157l9608O716M4390j1672M6660O9241M108m4594l9663l8866K2486O6003
$$ 1806157 1766549 1773265 1817655 1805983 1852643 1921884 1925992 1881398 1841735 1802869 1825355 1891358
16198A891358K921J68136l0986p0219P7112n8435N950j2840n4067K1365N4836
$$ 1891358 1894279 2062415 2031429 1961210 2038322 1979887 1985837 1972997 1918930 1940295 1995131
16187A995131J19143p5235Q0878M6018j0800j4805P6270N8752r3230r7286m3890
$$ 1995131 2114274 2039039 2119917 2165935 2155135 2140330 2216600 2275352 2182122 2084836 2040946
16176B040946J54526j39136J7829N4756j5558n2570L3810o026L8631J31091k022
$$ 2040946 2195472 2056336 2074165 2128921 2113363 2060793 2094603 2088577 2127208 2258299 2256277
16165B256277J9963L7864o0462l3143K8271J2066m6042r671J5748n416J20527
$$ 2256277 2276240 2314104 2253642 2220499 2248770 2260836 2214794 2205123 2220871 2215455 2335982
16154B335982j4547j1185N7683k6754j1977J7843K4861n0358k7900L5415M4637
$$ 2335982 2321435 2310250 2367933 2341179 2329202 2347045 2371906 2321548 2293648 2329063 2373700
16143B373700O6823j1908q1404l1056J29484j7985j6162L3559j06076M5424K3308
$$ 2373700 2440523 2428615 2347211 2316155 2445639 2427654 2411492 2445051 2338975 2384399 2407707
16132B407707k201o0771o1673L0035O4567j4310L7921L2407m4199L1871Q6222
$$ 2407707 2405506 2344735 2283062 2313097 2377664 2363354 2401275 2433682 2389483 2421354 2507576
16121B507576o6612j02742J225M2429Q8301O050N5333K180L0664l6499n3866K9394
$$ 2507576 2440964 2338222 2339447 2381876 2470177 2476227 2531560 2533740 2564404 2527905 2474039 2503433
16109B503433J38381j4110q6396N6336q41Q920q5814J3748O588q008j11247M0140
$$ 2503433 2641814 2627704 2541308 2597644 2596803 2605723 2519909 2533657 2540245 2532237 2420990 2461130
16097B461130N8396o8936j14804J10243L6815J2002J8867L4916m0374K1812p9779
$$ 2461130 2519526 2450590 2335786 2446029 2482844 2494846 2513713 2548629 2508255 2530067 2450288
16086B450288l635R3537m6702L0598k5905M5459K5007m1382p5903L6891l9325
$$ 2450288 2446653 2540190 2493488 2524086 2498181 2543640 2568647 2527265 2451362 2488253 2448928
16075B448928K7945N2083n90m5188O2140N0209k4361p6218K9147Q4644J5131p5218
$$ 2448928 2476873 2528956 2528366 2483178 2545318 2595527 2571166 2494948 2524095 2608739 2623870 2548652
16063B548652n0805N3595o057l8407L2758J09072N149j50231M6336K6184K9114
$$ 2548652 2497847 2551442 2545385 2506978 2539736 2648808 2653957 2503726 2550062 2576246 2605360
16052B605360j07409j12381K4285N3266K8741J11444k8377n4675M9100P150L6984
$$ 2605360 2497951 2385570 2409855 2463121 2491862 2603306 2574929 2520254 2569354 2576504 2613488
16041B613488L6052k6436j8565r7168O2229j6801k1278P7581J01096m1758n2660
$$ 2613488 2649540 2623104 2604539 2507371 2569600 2552799 2531521 2609102 2710198 2668440 2615780
16030B615780o1845N3739Q8087j7129n9239m7341l0637O874m7535L1135J02609
$$ 2615780 2553935 2607674 2695761 2678632 2619393 2572052 2541415 2548289 2500754 2531889 2634498
16019B634498j15276j30249J31060L9668o2190P8177m059Q5367J1354R689j63180
$$ 2634498 2519222 2388973 2520033 2559701 2497511 2575688 2571629 2656996 2668350 2678039 2514859
16008B514859N9396Q0409m8923m6479m4105L9902K3764l9849k8010P5175N966
$$ 2514859 2574255 2654664 2605741 2559262 2515157 2555059 2578823 2538974 2510964 2586139 2592105
15997B592105l3887P8036J56424m7476p432M2867j11882o6960k321P6187k6785
$$ 2592105 2558218 2636254 2792678 2745202 2737770 2780637 2668755 2601795 2599474 2675661 2648876
15986B648876k1699M5422k9639j9568Q7133q1894L6918j09357p021J2678P3032
$$ 2648876 2627177 2672599 2642960 2623392 2710525 2628631 2665549 2556192 2549171 2561849 2634881
15975B634881K9251n8438j0104L9070n243o3884M2629Q9429j1485O5642l6181
$$ 2634881 2664132 2605694 2595590 2634660 2629417 2565533 2608162 2697591 2686106 2751748 2715567
15964B715567r4778J8575K1525M078r4023J5641j1023L0391L1072q0450k2190
$$ 2715567 2620789 2639364 2660889 2664967 2570944 2586585 2575562 2605953 2637025 2556575 2534385
15953B534385l7480Q7054J27896n0148j09117J1780n6641p0579K7980J01999P199
$$ 2534385 2496905 2583959 2711855 2661707 2552590 2564370 2507729 2437150 2465130 2567129 2574328
15942B574328P8609J8950m8989J27012K81k4653m8142q4541m5039J9109m3432
$$ 2574328 2652937 2671887 2622898 2749910 2750191 2725538 2677396 2592855 2547816 2566925 2523493
15931B523493P4646L5609K8710o955j5685j07726j1692n1297J03154J3804m3955
$$ 2523493 2598139 2633748 2662458 2655503 2639818 2532092 2520400 2469103 2572257 2586061 2542106
15920B542106l6435M3494l279N8572O8738J4461m1027j7549m2131K3780J29983
$$ 2542106 2505671 2549165 2545886 2604458 2673196 2687657 2646630 2629081 2586950 2610730 2740713
$$ [...]
##END NTUPLES=NMR SPECTRUM
##END=
