##TITLE=1H_CG-1174-G
 CDCl3
 8 sc, 
 31.7.2023
##JCAMPDX= 6.0         $$ Bruker NMR JCAMP-DX V2.0
##DATA TYPE= NMR SPECTRUM
##DATA CLASS= NTUPLES
##ORIGIN= UXNMR, Bruker Analytische Messtechnik GmbH
##OWNER= root
$$ XWIN-NMR		Version 3.5
$$ Mon Jul 31 13:54:49 2023 Russian Standard Time (UT+4h)  she@DPX200
##.OBSERVE FREQUENCY= 200.13135
##.OBSERVE NUCLEUS= ^1H
##.ACQUISITION MODE= SIMULTANEOUS
##.ACQUISITION SCHEME= undefined
##.AVERAGES= 8
##.DIGITISER RES= 18
##SPECTROMETER/DATA SYSTEM= spect
##.PULSE SEQUENCE= zg30
##.SOLVENT NAME= D2O
##.SHIFT REFERENCE= (INTERNAL, D2O, 0, 15.7348)
##AUDIT TRAIL= $$ (NUMBER, WHEN, WHO, WHERE, WHAT)
$$ ##TITLE= Audit trail, XWIN-NMR		Version 3.5
$$ ##JCAMPDX= 5.01
$$ ##ORIGIN= Bruker BioSpin GmbH
$$ ##OWNER= she
$$ F:/spectra/data/she/nmr/H-F/1/pdata/1/auditp.txt
$$ ##AUDIT TRAIL=  $$ (NUMBER, WHEN, WHO, WHERE, WHAT)
(   1,<2023-07-31 13:51:51.90 +0400>,<she>,<DPX200>,
      <created by zg, POWCHK disabled, PULCHK disabled
       configuration hash MD5:
       00 E9 B6 7A A2 85 ED C7 34 08 36 98 17 FE 4E 26
       data hash MD5: 16K
       5D C9 77 BF A6 AB 76 B6 40 F8 A1 08 FF D6 B6 5E>)
(   2,<2023-07-31 13:52:13.39 +0400>,<she>,<DPX200>,
      <Start of raw data processing
       efp BC_mod = 2 LB = 0.24 FT_mod = 6 PKNL = 1 PHC0 = -21002.43 PHC1 = 18.85272 SI = 16K 
       data hash MD5: 16K
       33 E6 0D D0 9F 54 D5 B1 26 DB 06 A2 DC 6C 97 79>)
(   3,<2023-07-31 13:52:32.20 +0400>,<she>,<DPX200>,
      <pk PHC0 = -37.65203 PHC1 = -10 
       data hash MD5: 16K
       74 7E 9C 9A 75 E6 24 F3 74 BB DF 6A 3E E0 FE 81>)
(   4,<2023-07-31 13:52:35.92 +0400>,<she>,<DPX200>,
      <abs ABSG = 5 
       data hash MD5: 16K
       BE 4B 8B E6 92 22 AC D8 02 2E 24 2E 13 B0 D5 0A>)
$$ ##END=
$$ 
$$ hash MD5
$$ C7 6C C8 76 A5 FE 2A 59 AE 83 9A C4 81 42 D0 83
##$RELAX= 
##$RELAX= 
##$RELAX= 
##$RELAX= 
##$RELAX= 
##$RELAX= 
$$ Bruker specific parameters
$$ --------------------------
##$DU= <F:/spectra>
##$EXPNO= 1
##$NAME= <H-F>
##$PROCNO= 1
##$TYPE= <nmr>
##$USER= <she>
##$AMP= (0..31)
100 100 100 100 100 100 100 100 100 100 100 100 100 100 100 100 100 100 
100 100 100 100 100 100 100 100 100 100 100 100 100 100 
##$AQSEQ= 0
##$AQ_mod= 1
##$AUNM= <au_zg>
##$AUTOPOS= <>
##$BF1= 200.13
##$BF2= 200.13
##$BF3= 200.13
##$BF4= 200.13
##$BF5= 200.13
##$BF6= 200.13
##$BF7= 200.13
##$BF8= 200.13
##$BYTORDA= 1
##$CFDGTYP= 0
##$CFRGTYP= 5
##$CHEMSTR= <none>
##$CNST= (0..31)
1 1 145 1 1 1 1 1 1 1 1 1 1 1 1 1 1 1 1 1 1 1 1 1 1 1 1 1 1 1 1 1 
##$CPDPRG= <>
##$CPDPRG1= <>
##$CPDPRG2= <>
##$CPDPRG3= <>
##$CPDPRG4= <mlev>
##$CPDPRG5= <mlev>
##$CPDPRG6= <mlev>
##$CPDPRG7= <mlev>
##$CPDPRG8= <mlev>
##$CPDPRGB= <>
##$CPDPRGT= <>
##$D= (0..31)
0 1.2 0 0 0 0 0 0 0 0.06 0 0.03 0 0 0 0 0.0002 0 0 0 0 0 0 0 0 0 0 0 0 
0 0 0 
##$DATE= 1690797111
##$DBL= (0..7)
120 120 120 120 120 120 120 120 
##$DBP= (0..7)
150 150 150 150 150 150 150 150 
##$DBP07= 0
##$DBPNAM0= <>
##$DBPNAM1= <>
##$DBPNAM2= <>
##$DBPNAM3= <>
##$DBPNAM4= <>
##$DBPNAM5= <>
$$ [...]
##$SUBNAM3= <"">
##$SUBNAM4= <"">
##$SUBNAM5= <"">
##$SUBNAM6= <"">
##$SUBNAM7= <"">
##$SUBNAM8= <"">
##$SUBNAM9= <"">
##$SW= 18.05172834244
##$SWIBOX= (0..15)
0 0 2 0 0 0 0 0 0 0 0 0 0 0 0 0 
##$SW_h= 3612.71676300578
##$TD= 16384
##$TD0= 1
##$TE= 0
##$TE2= 300
##$TE3= 300
##$TEG= 300
##$TL= (0..7)
0 120 120 120 120 120 120 120 
##$TP= (0..7)
150 150 150 150 150 150 150 150 
##$TP07= 0
##$TPNAME0= <>
##$TPNAME1= <>
##$TPNAME2= <>
##$TPNAME3= <>
##$TPNAME4= <>
##$TPNAME5= <>
##$TPNAME6= <>
##$TPNAME7= <>
##$TPOAL= (0..7)
0.5 0.5 0.5 0.5 0.5 0.5 0.5 0.5 
##$TPOFFS= (0..7)
0 0 0 0 0 0 0 0 
##$TUNHIN= 0
##$TUNHOUT= 0
##$TUNXOUT= 0
##$USERA1= <user>
##$USERA2= <user>
##$USERA3= <user>
##$USERA4= <user>
##$USERA5= <user>
##$V9= 5
##$VALIST= <valist>
##$VCLIST= <CCCCCCCCCCCCCCC>
##$VD= 0
##$VDLIST= <DDDDDDDDDDDDDDD>
##$VPLIST= <PPPPPPPPPPPPPPP>
##$VTLIST= <TTTTTTTTTTTTTTT>
##$WBST= 1024
##$WBSW= 4
##$XGAIN= (0..3)
0 0 0 0 
##$XL= 0
##$YL= 0
##$YMAX_a= 135376
##$YMIN_a= -138640
##$ZGOPTNS= <>
##$ZL1= 120
##$ZL2= 120
##$ZL3= 120
##$ZL4= 120
##$ABSF1= 15.72485
##$ABSF2= -2.327
##$ABSG= 5
##$ABSL= 3
##$ALPHA= 0
##$AQORDER= 0
##$ASSFAC= 0
##$ASSFACI= 0
##$ASSFACX= 0
##$ASSWID= 0
##$AUNMP= <proc_1d>
##$AZFE= 0.1
##$AZFW= 0.1
##$BCFW= 0
##$BC_mod= 2
##$BYTORDP= 0
##$COROFFS= 0
##$CY= -3
##$DATMOD= 1
##$DC= 0
##$DFILT= <>
##$DTYPP= 0
##$F1P= 0
##$F2P= 0
##$FCOR= 1
##$FTSIZE= 16384
##$FT_mod= 6
##$GAMMA= 0
##$GB= 0
##$INTBC= 1
##$INTSCL= 3.70164e-10
##$ISEN= 128
##$LB= 0.24
##$LEV0= 0
##$LPBIN= 0
##$MAXI= 10000
##$MC2= 0
##$MEAN= 0
##$ME_mod= 0
##$MI= 1.114404
##$NCOEF= 0
##$NC_proc= -8
##$NLEV= 6
##$NOISF1= 3.799351
##$NOISF2= 2.8
##$NSP= 0
##$NTH_PI= 0
##$NZP= 0
##$OFFSET= 15.73477
##$PC= 1
##$PHC0= -21040.08
##$PHC1= 8.85272
##$PH_mod= 1
##$PKNL= yes
##$PPARMOD= 0
##$PSCAL= 0
##$PSIGN= 0
##$REVERSE= no
##$SF= 200.130007358336
##$SI= 16384
##$SIGF1= 3
##$SIGF2= 2
##$SINO= 5.538805
##$SIOLD= 16384
##$SREGLST= <1H.CDCl3>
##$SSB= 0
##$STSI= 16384
##$STSR= 0
##$SW_p= 3612.71676300578
##$SYMM= 0
##$S_DEV= 0
##$TDeff= 16384
##$TDoff= 0
##$TI= <>
##$TILT= no
##$TM1= 0
##$TM2= 0
##$TOPLEV= 0
##$USERP1= <user>
##$USERP2= <user>
##$USERP3= <user>
##$USERP4= <user>
##$USERP5= <user>
##$WDW= 1
##$XDIM= 16384
##$YMAX_p= 441247824
##$YMIN_p= -3378611
$$ End of Bruker specific parameters
$$ ---------------------------------
##NTUPLES= NMR SPECTRUM
##VAR_NAME=  FREQUENCY,     SPECTRUM/REAL,   SPECTRUM/IMAG
##SYMBOL=    X,             R,               I
##VAR_TYPE=  INDEPENDENT,   DEPENDENT,       DEPENDENT
##VAR_FORM=  AFFN,          ASDF,            ASDF
##VAR_DIM=   16384,         16384,           16384
##UNITS=     HZ,            ARBITRARY UNITS, ARBITRARY UNITS
##FACTOR=    0.220516191357247, 1,           1
##FIRST=     3148.99960009187, 0,            0
##LAST=      -463.717162913907, 0,           0
##MIN=       -463.717162913907, -3378611,    0
##MAX=       3148.99960009187, 441247824,    0
$$ Real data points
##PAGE= N=1
##DATA TABLE= (X++(R..R)), XYDATA
$$ [...]
7926 -271050 52421 94915 -10799 270083 245940 -487280 -703719 -595618 -477025 -476470 -668630
7915 -668630 -587700 -245515 -211828 -622087 -818797 -545530 -389768 -367111 -368951 -415199 -482577
7904 -482577 -143996 -310752 -248452 -341451 109315 272415 270423 415975 212138 -159913
7894 -159913 -174747 215672 347491 97599 -223800 -332424 -196868 -25132 129521 -72639
7884 -72639 -387899 -321405 -121212 373005 218725 -255269 -228174 309623 307085 158747 31029
7873 31029 -142074 -84149 -73424 51025 142269 74449 -217126 18910 -59676 -376253 -435481
7862 -435481 -447896 -337416 -135735 -185861 -359562 -249826 -21326 -190427 -548460 -484563
7852 -484563 -466660 -252566 58023 -185983 -123707 -32833 -192431 -37948 -310143 -157430
7842 -157430 -294104 -6913 -321232 -417820 -622661 -989889 -507045 -96020 -68991 170571
7832 170571 170831 275154 -26734 -146208 -21470 105006 102357 326885 492969 388902 280531
7821 280531 174209 75823 -370208 -412747 -202206 -252847 -79828 130547 428755 253823
7811 253823 85237 46869 61999 -58852 -71698 10485 979157 139086 -896575 -229064
7801 -229064 -257949 32721 -87746 -374758 -507751 93497 -42112 67621 -113612 -109351
7791 -109351 14466 -63906 -365902 -383876 -288893 -348706 -306310 -227357 -196678 -115296 -147956
7780 -147956 -96681 -100954 -230101 -568597 -547488 -40479 -232260 -305824 85855 70348 407583
7769 407583 201724 211348 370753 403645 -199695 -470481 -510923 -396936 -268913 -97991
7759 -97991 -327257 -328143 -239994 -921299 -551026 -16750 44167 -230641 -140372 -474028 -513891
7748 -513891 81420 70676 -65507 -75412 -568286 -292345 -24265 -2113 -487640 -870890
7738 -870890 -835373 -261352 19367 -82719 -126942 -416323 -423923 -309192 -145517 -179591 204290
7727 204290 138207 -87459 -179735 152871 104675 -40519 -70725 -241981 -89083 -261857
7717 -261857 -70842 -382493 -620858 -299485 28059 184784 84535 -526467 -230931 31793
7707 31793 -412546 -375196 -376634 -228939 -131701 -17633 169589 414119 415105 -78058 -228238
7696 -228238 -204202 -531130 -195344 -133355 -515494 -448134 -276657 -284424 -398936 -181335 52847
7685 52847 -230874 -264370 -75237 -424494 -357132 342761 460441 331708 606194 517791
7675 517791 176251 342043 -99810 -4503 -247676 -420592 -95378 -41304 -33921 6037 26076
7664 26076 22395 14847 -149116 -33559 -300372 -272243 -244895 -243645 -232414 -215978 100344 280116
7652 280116 202359 409063 479178 437318 -59157 -172424 89313 96253 -119737 219374 281897
7641 281897 181039 81595 109280 -194545 103549 -173779 -144008 3818 -213575 -79427
7631 -79427 -2310 -207046 -320534 -333348 -678464 -404814 -73933 -481574 -105072 -145318
7621 -145318 -17474 -354006 -425882 330206 397860 166285 -86700 -523820 -453381 436526
7611 436526 149603 -22385 -416063 -556690 -142495 288239 98614 29916 326017 -321477
7601 -321477 -141430 -94966 -470034 -277936 -191417 111827 125790 129441 283410 66745 -239928
7590 -239928 115160 -445299 -226038 -325992 -167600 282011 -88120 -263975 -664346 -442705
7580 -442705 161179 -379739 -227812 -282897 -269538 -43055 254159 126824 551912 97081
7570 97081 -70725 287839 223183 368502 108161 66094 -165888 -11565 13351 -166130
7560 -166130 -17050 96338 43378 -105792 -194159 -497833 -456941 -220692 -656421 -721717
7550 -721717 -120119 -68392 131085 -133715 -387215 -392669 -164001 -172418 -147611 -91916 -610541
7539 -610541 -580940 -377130 54915 -35245 -93413 -352275 -202139 -227272 -278043 -396672 -197190
7528 -197190 -294808 -368293 -9538 -39041 -52878 -407917 -194938 5532 43035 198189 -48267
7517 -48267 -14134 248845 17492 159185 511407 411246 211914 -46052 -255783 -65307
7507 -65307 217229 537303 372027 -142528 -185685 -19001 -117692 -368773 -11771 12172
7497 12172 -80123 -141695 211720 266820 -263918 -407114 -137145 -87215 85994 74430 36225
7486 36225 36678 412091 391552 573138 148311 -157402 -148438 -22077 202420 407766 856277
7475 856277 392846 273151 -136641 -403570 -261150 -139067 -110311 -234454 -215337 -310591
7465 -310591 -322518 -284462 -455104 -224051 -88687 172050 347501 6932 -329950 -38959
7455 -38959 332651 115987 128637 272996 318332 65646 -385208 -477089 -623989 -458554
7445 -458554 -243025 -598119 -345872 -156637 108740 164810 334363 -57066 -201252 -264077
7435 -264077 -109314 161548 330028 287428 127112 376657 343092 283663 440415 343651
7425 343651 387865 72556 301002 8001 88837 -262576 -73086 373333 -119445 -148493
7415 -148493 -218519 44423 -178919 -79469 329769 70278 120879 -177147 -96062 489331
7405 489331 516842 352236 305960 226364 64920 -208914 -559589 -235268 -220945 -342463
7395 -342463 118822 431854 98615 37210 -68385 197543 105404 368574 247982 625160
7385 625160 465739 190554 -205187 -1049 82062 -79812 -423120 -269143 -379124 -372065
7375 -372065 -90878 131587 -345594 235219 227742 174741 41078 -149259 -167731 -32410
7365 -32410 494960 634781 251051 265825 399726 595917 518442 -47581 -87642 182772
7355 182772 460921 192716 280789 395504 425030 477215 334988 225587 227591 239459 262983
7344 262983 -35509 310951 384025 465126 449241 608075 618501 468177 253233 137186
7334 137186 271965 340797 445169 462914 696551 424061 504348 791944 466696 816235
7324 816235 686590 770196 405538 95804 101514 648602 769068 803292 806301 714820 574180
7313 574180 -158227 -227901 62580 302437 270875 503962 924879 975101 1282743 855937
7303 855937 613041 940104 541373 491725 872467 304487 377178 471862 644986 803564
7293 803564 965775 1248380 1188912 846674 934524 891058 962125 880174 529639 551150 726026
7282 726026 718998 606043 625411 925737 873926 944994 893659 1172262 889388 455509 316940
7271 316940 450775 955762 803830 694628 737847 1254698 1068688 1532800 1409723 1510027
7261 1510027 1493789 1491268 1572764 1348327 1342032 1095392 1057577 1385763 1917065 1817461 1513810
7250 1513810 1659042 2248841 2585379 2345994 1963430 2116345 2249530 2243688 2352300 2616122
7240 2616122 2710784 2653003 2498431 2605186 2688740 3060353 3325471 3849846 4165697 4688577
7230 4688577 4679013 4995304 4772277 4587597 4733337 4683075 4791298 4979765 5128393 4535521
7220 4535521 4595017 4308892 4452950 4470507 3951125 3843909 3850968 3666566 3589962 3453427
7210 3453427 3421730 2986298 2942374 2603296 2614446 2675054 2581867 2489496 2553519 2019285 1832878
7199 1832878 2070197 2022643 1841013 1588473 1756519 1793436 1718875 2053093 1899769 1881532
7189 1881532 1904265 2031122 1694579 1792902 1859346 1758583 1764405 1736818 2008908 2478210 1905777
7178 1905777 2001318 2105886 1876129 1851295 1599028 1639036 1504524 1347357 1230977 1599374
7168 1599374 1589571 2046425 1969145 1417146 1425261 1916093 1788124 2050997 2270257 2071202
7158 2071202 1856388 1717538 1797838 1856792 2078029 2027022 1782665 1564954 2142808 1898219
7148 1898219 1937962 1732441 1793819 2029530 2375319 2691327 2541117 2582150 2107366 2266737
7138 2266737 2324793 2413164 2530814 2864429 2811018 2715620 2482993 2659470 2205201 2309031
7128 2309031 2665372 2917816 3293004 3067652 2816063 3132588 3327590 3412626 3616864 3400935
7118 3400935 3847940 3690155 4067558 4629494 4415406 4599711 4734017 4828689 4696301 4981311
7108 4981311 5237821 5135712 5912155 6566118 6686595 6790685 6691594 7398611 7884090 7903440
7098 7903440 8501304 9102088 9066128 9148430 9153440 9574754 9514374 9265020 9687475 9944192
7088 9944192 9780761 9518500 9223904 8655328 8108730 8412574 8171254 7496100 7470997 7517246
7078 7517246 7072175 7118659 6883675 6842145 6731871 6609584 6308960 5702563 6214181 5998789
7068 5998789 5790587 6137311 6150840 6660546 6919717 6448693 6325153 6249560 6624661 7003623
7058 7003623 6951542 6897896 7023129 6935256 7529018 8037074 8269369 7934997 8086643 8144125
7048 8144125 8570540 8452283 8876139 9570329 9581895 9926295 10164277 10479973 10701173 11178497
7038 11178497 11560340 12194180 12475008 13076515 13350787 13903547 14958986 15466245 15788092
7029 15788092 16090602 16769455 17513958 18077156 18715996 19514788 19923913 20335932 20785776
7020 20785776 20627273 21035746 21144180 20894144 21010021 20782950 20559208 20037017 19371564
7011 19371564 18935239 18385541 18134303 17486943 16631887 15970960 15366413 14457832 13634747
7002 13634747 13277167 13118148 12746332 12283715 12032922 11465174 10927692 10054404 10010125 9726301
6992 9726301 9392377 9116312 8446363 7927935 7593462 7222537 6659532 6938050 6401188 5965035
6982 5965035 6148165 6022668 5612479 5543461 5328091 5596298 5319129 4779788 4732836 4970893
6972 4970893 4782607 4271797 4362023 4199366 3926868 3488220 3553604 3204812 3180282 3421628
6962 3421628 3341081 3057815 3269249 3308747 3303859 3079897 2877543 2569624 2515380 2724691
6952 2724691 2725397 2650537 2554063 1922485 1988885 2246230 1917202 1796546 1622278 2133873 2013853
6941 2013853 1918576 2270718 1668174 2093502 2181668 2007437 1761159 1670634 2129035 1741425
6931 1741425 1727996 1565420 1853911 1536009 1363560 1108744 1124379 1288880 1257227 1505904
6921 1505904 1449441 1527175 1196913 1012777 944093 1189332 1539238 1680882 1623020 1288482
6911 1288482 944123 760079 1102181 995588 1064225 1422532 1218738 916441 1280125 1261064
6901 1261064 1280460 1232067 1074549 923954 574279 944257 1014596 747543 824702 1005050
6891 1005050 1394206 1347187 1054118 1263812 1148690 876991 747141 823698 1170931 1335504
6881 1335504 1078174 876740 921238 972127 560780 436497 218432 391869 318849 225169
6871 225169 435820 621972 566059 817200 816606 666235 537787 668441 797864 222495
6861 222495 94135 126334 433531 487523 625642 773515 612492 708960 697586 707862 572300
6850 572300 255096 307691 421440 827963 692120 363098 159660 453543 479445 437000
6840 437000 467282 489206 175965 243257 441220 373838 463374 280517 -123030 174400 90047
6829 90047 -197691 47255 41048 2528 278705 460632 709978 472404 421244 295092 531954
6818 531954 846725 1040995 884688 292726 311245 100359 136995 227905 -93247 5939
6808 5939 30779 141389 200714 78146 543314 808969 604482 534966 370797 464620 276317
6797 276317 146772 407729 316464 287357 241708 316335 408368 457761 436495 682191 745049
6786 745049 217709 -309495 397540 582747 534165 484482 608630 397983 598781 656170
6776 656170 459819 395885 562693 800559 635107 656137 154505 90689 70337 334789
6766 334789 613476 275547 461610 477609 302919 259619 440473 673904 852549 796528
6756 796528 940820 709772 400485 585578 724997 1070033 839181 699420 1203291 1095515
6746 1095515 862227 929722 1505167 1643554 1458615 1862794 1627188 1258382 1120507 1520661
6736 1520661 2484367 1929171 1446915 1651499 1608098 1506071 1885497 1817836 1800133 1846690
6726 1846690 1541191 1334407 1322933 1440136 2079164 2217379 2093735 2071693 2185745 2185139
6716 2185139 1863489 2420058 2740558 2417537 2549345 2687964 3011733 3407732 3670941 3933145
6706 3933145 4152096 4170165 4754859 4644202 4380198 5063443 5121655 5190237 5490651 5413046
6696 5413046 5266064 4974487 4219224 4222545 3869582 3263556 3493149 3170410 2949640 2753348
6686 2753348 2701938 2562269 2144294 2313290 1914314 2044831 1653192 1528952 1344555 1506379
6676 1506379 1076010 1071912 951703 1155038 1278601 985050 485481 -121771 376303 561165
6666 561165 453409 419017 276857 296817 458940 342458 330510 483260 355723 379005
6656 379005 606002 467512 537078 447793 -95175 -199962 -289089 -66661 -147699 12469
6646 12469 -222678 125482 350106 215712 100726 298327 256675 -17894 -401727 -78629
6636 -78629 41037 -346125 -101731 162217 317123 445924 394550 88691 -118186 -350565
6626 -350565 4180 18930 -72037 7048 -87424 -228030 -519041 -455823 -194920 -183167 -48384
6615 -48384 -174237 -184960 -489515 -238984 600586 410143 42986 101984 -234677 -504972
6605 -504972 -433429 108395 -389912 -311515 -60433 -132470 -40203 -122375 -163508 38239 -183492
6594 -183492 -168370 -293338 -316613 -345834 -217555 301095 160812 -63574 430775 92617
6584 92617 142362 40870 -24458 312319 198722 163120 -328713 -355090 -77147 -84268 -21692
6573 -21692 155669 295878 243559 357192 62662 40420 -185476 -537207 -491757 -346866
6563 -346866 -176543 120528 -107779 146075 227247 -136566 -390377 -186637 2897 -416226
6553 -416226 -377392 -594288 -262721 237079 170424 100412 765 151618 -300496 -319270 -393962
6542 -393962 -371964 -245692 -616399 -489352 -155361 -110014 -221140 -236820 -84764 40387
6532 40387 -2777 279 -299582 -159844 102612 75172 -568073 -186916 -100913 6034 -45966
6521 -45966 244790 253955 -179233 -210473 -122751 -260246 -298015 -318179 -45526 -324012 -638237
6510 -638237 -235608 -46404 -135668 -2377 116834 -48287 -311715 -285327 -266873 -378858
6500 -378858 -511927 -266041 -243176 -350434 -222317 -201621 -268846 -339061 -73286 -328210
6490 -328210 -287084 -421242 -263656 306693 196785 -218865 -149251 180633 173867 -172939
6480 -172939 -210391 -290437 -424507 -444011 -535449 -523926 -521628 -425072 -244865 -314468 84467
6469 84467 181955 -285127 -425481 -509372 -704671 -526381 -333545 -421104 -218953 -627822
6459 -627822 -412300 -63691 -253177 64496 -8785 -450934 -459340 -548869 -506011 -559336 -620785
6448 -620785 -568294 -784032 -830980 -656745 -250926 -330130 -188502 -68868 78727 341195
6438 341195 62481 -14628 -44208 239387 337242 -55322 -354180 -276128 92035 1657 -205420
6427 -205420 102035 147474 407274 -38808 -234876 -54607 -346027 25231 -23165 -16528
6417 -16528 -45801 -234567 186975 171932 -12465 -12868 -162409 63201 237956 46319 -101398
6406 -101398 -224105 -36967 299892 324729 -230511 -335079 -400898 -471717 -56149 -445660
6396 -445660 -806233 -565690 -493355 -707222 -177361 -42396 -303934 -458369 -701617 -283599
6386 -283599 -315932 -273650 -628434 -679609 -394555 -107689 -374508 -471635 21792 -370716
6376 -370716 -804408 -928886 -317756 31628 154052 211266 -114658 -261120 -293919 -302704
6366 -302704 -7446 -38537 69650 -93323 -144454 54858 -397713 -865063 -743901 -637562
6356 -637562 -255391 -80432 -274485 7321 588598 366943 -141728 -345619 -90122 -183548
6346 -183548 -455982 -236625 -651083 -988587 -668760 -668857 -769380 -698874 -378002 -956582 -869429
6335 -869429 -658370 -450875 -433355 -532059 -159207 -320664 -461330 -630417 -263654 -69077
6325 -69077 -511242 -412774 -355747 -458513 -250687 -198786 -150728 -299515 -287018 37646 24090
6314 24090 -103707 -66313 -305081 -540128 -386988 -469366 -611334 -467504 -226817 -367720
6304 -367720 -218611 -50515 -235438 -16977 122225 217071 -223228 -783083 -794521 -364206
6294 -364206 -190428 -174883 -47434 -360421 -414053 -364978 -253162 -191085 -256387 -32160 -129594
6283 -129594 -235066 -841523 -815259 -344515 -525206 -181288 37437 -23129 129283 -229242
6273 -229242 -372327 -268790 -296287 24279 737933 384472 -620836 -524947 -473702 -300651
6263 -300651 -393171 -521788 -533856 -477351 -444780 -325330 -236779 -238273 -65776 173524 205227
6252 205227 103293 -29991 -135623 -604347 -626409 -122517 -466193 -436887 -346680 -200126
6242 -200126 -598278 -462796 -574465 82100 200201 45910 179551 8153 -323257 18025
6232 18025 250936 -216652 -475209 -280569 -544217 -298356 -209838 -193031 -156885 -113959 -360939
6221 -360939 -264423 -66780 -453644 -584797 -660227 -877994 -456850 -10728 -26152 6688
6211 6688 -46957 261547 -335387 -475049 39329 -168479 -275906 -577707 -843937 -484413
6201 -484413 -368053 -261699 -5881 220977 39933 116043 448998 229427 -84321 186249
6191 186249 -22669 -165548 -90144 -102382 -208412 -50230 -369429 -118453 106326 304860
6181 304860 248854 -262776 69963 -225760 -322238 -481187 -317320 -371109 -578785 -467259
6171 -467259 -403220 -29465 -41540 24508 -453479 -310433 25902 -73311 -348319 -358542 -440950
6160 -440950 -387785 -436627 -238264 -303311 -724896 -458401 -42481 28240 344603 209394
6150 209394 145190 100442 46407 20201 -258165 -506370 -748629 -483202 -277695 -336521 -590933
6139 -590933 -703041 -257852 -555756 -334030 -637589 -205766 -120282 -559383 -647057 -199617
6129 -199617 -74577 -714004 -662808 -500145 -342709 -276554 -461371 -384709 -318902 -543525
6119 -543525 -694248 -762111 -813278 -588757 -219252 -276827 36511 46079 -254849 -41771 78380
6108 78380 -423066 -498962 50182 173128 141163 170189 -90706 243916 204179 183696 -67409
6097 -67409 -325823 -157378 120124 -143297 -434608 -407726 -430612 -613151 -573309 -112895
6087 -112895 -67978 -179867 -349401 -375346 -540174 -418855 -517925 -321089 -230646 -148914 -31675
6076 -31675 -296975 -124196 -327020 -465880 -483830 -597592 -505365 -438404 -334584 -312129 -775708
6065 -775708 -431024 -451861 -20699 283184 144931 44828 236286 -123550 23395 -25651
6055 -25651 -621164 -686140 -77436 -154471 -339609 -531267 -705297 -293941 -249638 103699
6045 103699 -280770 -238610 -286909 -448788 -161507 -93224 305483 322065 -365566 -659588
6035 -659588 -498394 -627361 -133503 -387794 -285945 -160697 -103318 18786 -376752 -414672
6025 -414672 -231851 29534 -34971 -65516 -297291 -191148 -441623 -160517 107048 156117
6015 156117 -125852 -202647 232519 -177471 -173948 86698 49214 -140784 110426 -83061
6005 -83061 181021 138679 -311681 16525 278833 84757 -88755 -167774 -383677 -410889
5995 -410889 -230123 -448141 -319472 -382532 -463246 -223769 -572951 -530985 -372559 -470875
5985 -470875 -453302 41784 -139103 -662969 -204041 -66559 -228200 -504017 -459099 -406187
5975 -406187 -641874 -613091 -527895 -487259 -258992 -283840 -223247 -82498 117753 -318411 -913156
5964 -913156 -578929 -272915 -265756 -449161 -324490 -186313 -383260 -486066 -196929 -372237
5954 -372237 -173914 225521 285644 -126289 -237223 -369055 -607719 -686713 -268107 -288438
5944 -288438 -225794 -272887 -1036 -358052 -403116 -484400 -393577 168511 156478 -105394 -450440
5933 -450440 -270632 -306805 -512399 -349464 14407 102188 -153704 16047 -352635 -511013
5923 -511013 -748019 -285009 -245143 -223631 242328 145682 52114 54514 -180707 -590907 -624880
5912 -624880 120941 138363 79185 366764 96708 -288890 -209902 -146496 -257334 -239272 -290221
5901 -290221 -96021 -369329 -503912 -334335 -469018 -203029 99696 157467 -153148 -214341
5891 -214341 -376136 -447457 -84929 122570 -431555 -539989 -64818 -154434 191912 332322
5881 332322 -261970 -195381 -350746 -458740 -268689 -257140 -250526 -199500 -280319 -382842 -196525
5870 -196525 -372499 -398551 -807656 -585948 -725391 -593703 -562198 -371583 -331730 -316300
5860 -316300 -116758 91802 -244082 -39270 -44332 -458795 -679350 56096 -378624 -66106
5850 -66106 9660 -415691 -466836 -324845 -188340 -46285 262901 95266 -53944 18933
5840 18933 230966 -62142 88417 475051 -139769 -255473 -428381 -488224 -222810 801
5830 801 -29397 -98168 -290607 -234460 -327053 -166987 327163 194634 -56677 -307026 -261752
5819 -261752 -37659 176111 3465 -318384 106888 46031 -380509 -254746 -267392 54275
5809 54275 3666 38923 -141341 -461906 -139180 -148671 -261081 132958 -24948 60451 86764
5798 86764 -243831 -348252 -29487 168761 -90658 -286699 47395 -156715 -257425 -13634
5788 -13634 -8824 217270 -25010 -71265 407273 242602 267451 283093 259748 188977 -202969
5777 -202969 -173868 -113136 -350570 -375560 -325185 -382406 -31881 29723 -215661 -128537 -259689
5766 -259689 -397783 -220841 -338612 -410016 218731 25950 -413558 -54464 -364189 -486020
5756 -486020 -222293 -284007 132714 -205293 -143486 -360384 -282822 220419 461980 200839
5746 200839 302431 250675 202238 -476315 -339911 -156353 -5075 -100247 -314146 -230131
5736 -230131 183171 437669 27885 159744 249269 -179438 -137298 141701 -295155 -75132
5726 -75132 17679 -19688 84314 102112 -91400 -150111 -100613 -3413 -105773 -123085 -240288
5715 -240288 133142 327105 -58072 66439 34560 -430676 -371449 -410145 -162114 -87550
5705 -87550 -14579 283468 -105939 -790 137351 255610 260197 38009 -139406 37264
5695 37264 396614 247815 259952 354598 126143 67433 226672 -1757 -72836 166951 -321212
5684 -321212 -401874 23326 546362 -158720 -203760 -50179 179622 219145 -408546 -339788
5674 -339788 -115672 86171 162793 576351 189527 555959 321714 406882 784286 1018041
5664 1018041 967676 649662 584693 786015 434814 354447 301061 538968 359262 198253
5654 198253 260132 366071 334583 270202 127020 372351 581582 367729 507785 734154
5644 734154 711193 294215 388038 242872 463763 291260 452644 231113 -195335 145822
5634 145822 349100 504745 433918 330299 612718 561067 210709 14681 31272 223185
5624 223185 725172 1149562 1003632 819314 1118906 1106195 873733 1065666 1380905 1611882
5614 1611882 1490626 1589498 1685357 1578671 1334038 1639151 1844161 1938062 2084463 2115954
5604 2115954 2860850 2698736 2087054 2427725 2666755 2547168 2065273 2512181 2509566 2420210
5594 2420210 2235141 1991389 2101969 2091057 2290277 2678565 2811761 3250106 3372935 3104161
5584 3104161 3435507 3837615 4401806 4003759 4109595 4104733 4058340 3802915 3692818 3178024
5574 3178024 3058660 3468893 2965956 2914809 2762456 3037203 3000232 2583226 2228388 2222588
5564 2222588 2257583 2277953 2425715 2555019 2483304 2721927 3044244 2895518 2854407 2618202
5554 2618202 2528643 2391054 2270946 1873057 1769219 2029923 1981131 1604049 1504666 1094897
5544 1094897 1072956 1103975 972292 1020548 823842 618205 819918 978366 992987 487882
5534 487882 298116 733354 650655 124668 210052 765179 807295 645490 591017 1086474
5524 1086474 860881 633213 835813 837204 1008438 357723 392606 688228 927745 486834
5514 486834 52071 100542 382690 852548 860467 495469 627883 653434 682196 478362 223752
5503 223752 180221 321011 282693 226807 704573 687426 597992 273940 545236 531723 670214
5492 670214 79146 112690 308425 349402 585341 551720 459363 101625 19519 190764 256562
5481 256562 454658 863309 999525 870655 664649 565605 309333 186705 109577 219461
5471 219461 359875 688606 434130 289233 710309 630430 505864 283003 289890 227019
5461 227019 -220356 -56728 199706 354510 318256 93657 787093 1073730 526258 327583
5451 327583 590219 352891 21488 227025 569517 755777 986717 639289 1083012 1352693
5441 1352693 1238459 1082207 645836 933799 1273757 925430 1019039 1328943 931080 326960
5431 326960 256312 706192 772847 669378 82041 300674 428691 402089 329401 175716
5421 175716 81003 320143 483311 724564 946975 808687 492439 681442 597535 633414
5411 633414 570407 691032 824316 1035315 883218 557134 721910 630033 565335 252846
5401 252846 378845 674002 623133 665121 427587 684549 1024402 957665 987021 867528
5391 867528 668970 653676 839295 1106012 1315404 1081457 1381773 808396 586001 967691
5381 967691 590180 466591 900324 816510 1087350 1043711 646182 662141 691752 285316
5371 285316 209063 353667 534829 702854 723500 810012 500770 195908 440445 873871
5361 873871 595703 866225 1004626 783426 923282 1210854 1236377 917868 1342836 987025
5351 987025 902789 907267 975799 553431 325634 381914 433247 974891 916873 528975 562379
5340 562379 693991 717206 675831 729698 779348 946115 911771 1085572 1101539 1201945 1011650
5329 1011650 913928 782342 1034526 1032956 1028660 982202 649486 631221 615612 566438 564351
5318 564351 771866 756456 747812 715527 638977 665382 610281 405383 599768 640574 744246
5307 744246 419543 378302 194275 265244 723757 850533 640473 816813 887840 1061245
5297 1061245 836691 750592 848051 1076533 895211 690177 433537 373622 603666 611058
5287 611058 423515 855422 646951 896137 894059 819331 744817 868261 934707 846631 883136
5276 883136 511914 325048 549273 626469 536496 826859 512792 381244 866966 847055
5266 847055 698967 316863 870447 905461 716194 944052 798911 943911 845765 747810
5256 747810 967640 1019207 979349 850794 637046 482169 409877 439436 631782 911257
5246 911257 691415 818437 761257 849088 838102 1199243 1251078 1022174 630938 449835
5236 449835 494874 771642 971209 703435 973350 787282 672547 1069607 722003 532251
5226 532251 648123 513662 551658 688675 730253 793260 944914 673798 428685 459198
5216 459198 703117 1001930 953334 1082691 860588 975476 771142 509095 264697 559648
5206 559648 734731 813158 811913 970386 831944 968278 906048 680346 802885 830016 832856
5195 832856 636039 882105 876186 607314 1063917 1020721 993469 1247973 869634 512124
5185 512124 726196 736685 736097 613901 569146 464612 959494 1439826 1301792 1531739 1475163
5174 1475163 1503083 1701683 1313507 1197095 1103340 1112234 1501488 1256754 1262300 1275521 1429229
5163 1429229 1786426 1685542 1590229 1476839 1209121 1063403 1042204 1194437 1540728 1596211
5153 1596211 1541256 1775788 1544841 1772149 1784991 1290696 1187082 1901229 1754273 2113132
5143 2113132 2150978 2118833 2494963 2852865 2926988 3037136 3384296 3614755 3971559 3745263
5133 3745263 3732799 4062179 4223280 4041357 3880589 3790756 3869225 3762196 4048448 4340416
5123 4340416 4334481 4428797 4592467 4671000 4549623 4775015 5276854 5439965 5356614 5499685
5113 5499685 5661491 5834282 6038131 5843048 5868570 5547803 5467815 5274036 4734880 4664593
5103 4664593 4252071 4006504 4028369 4066816 3953887 3731084 3791486 4137465 4813572 5032027
5093 5032027 4368373 4649400 4737233 4229394 3887092 4112365 4162297 4288840 4123635 4421331
5083 4421331 4375424 4459886 4509336 4509717 4894253 5428366 5381233 5270727 5048875 5138091 5558799
5072 5558799 5443557 5579613 5777277 5895989 5456142 5524832 5611149 5595301 5383785 5204496
5062 5204496 4576935 4185585 4315312 4034220 4146044 4117656 3796902 4157491 3724521 3498320
5052 3498320 3519523 3728620 3772938 3906009 3759651 3953821 3809826 3740535 4151489 4299237
5042 4299237 4597921 4415300 4039044 3576643 3079278 3340367 3617018 4098169 3699725 3619827
5032 3619827 3343010 3508133 3411431 3013375 2798885 2966577 3117281 2709493 2607418 2518569
5022 2518569 2455733 1840980 2043353 1888061 1988713 2107180 2010625 2051399 1863370 1949112
5012 1949112 2040224 2239288 1882003 1638462 1830589 1825436 1786601 1794531 1916056 2387047 2805266
5001 2805266 2840033 3109466 3015165 3469855 3315418 3305267 3201262 3178569 3431603 3300296
4991 3300296 3814684 3837023 3934051 4027373 3811818 3817829 3327681 3133209 2962594 2937322 2778065
4980 2778065 2391618 2322658 2134649 1456353 1770568 1499226 1753123 1874230 1820329 1953159
4970 1953159 1874959 1187527 1162244 1158064 963788 955798 739650 1024162 1319243 734738 726224
4959 726224 1193725 1168808 833165 927503 1015131 775370 647504 667506 1012325 742012
4949 742012 712968 592643 1209930 1078185 836646 890577 1086583 918580 1084887 631846
4939 631846 738715 816770 984747 824773 933727 1058878 816628 1118970 1233839 938743
4929 938743 473994 558442 633663 1034271 736205 841699 650519 666480 783932 851845
4919 851845 863441 960160 1151347 1259468 1181931 1461111 1259994 870007 1224631 911695
4909 911695 451800 359491 711775 1028952 1400596 762073 610202 463990 406051 660257
4899 660257 902798 530172 659402 248429 499802 759570 771772 825407 561079 323577
4889 323577 320443 709773 360784 607042 729151 656253 1120522 1406172 1239678 1393349
4879 1393349 925375 418779 727410 753031 846965 1294758 1081645 955033 842983 493101
4869 493101 347658 751061 1069746 1111410 1057131 898734 770485 979353 1084438 1098528
4859 1098528 1001394 1078593 1204733 849080 1268110 1743907 1519204 1138963 1053207 901452
4849 901452 1378411 1499098 1361519 1465672 1257971 1484054 1637679 1548796 1148225 1498061
4839 1498061 1421353 1337516 1279897 1351764 1351316 1243663 1569757 1394106 1440708 1909438 1661803
4828 1661803 1615669 1805927 1530344 1561600 1743541 1333281 1145399 1471841 1830246 2199220
4818 2199220 1614028 1550326 1899334 1947026 1796514 1746848 2097210 1952403 1978843 1772459
4808 1772459 1799629 2185358 2574687 2112486 1619610 1845662 1749903 1956038 1819049 1719423
4798 1719423 1594907 1712971 1587186 1630712 1891131 1935205 1886968 2134365 2643087 2939485
4788 2939485 2882699 2874165 3341634 3059914 2836910 2571830 2772133 2298438 1996140 2115532
4778 2115532 2312301 2521590 2101347 1815938 1442442 1495518 2180963 2270496 1717845 1393619
4768 1393619 1659347 1583124 1391156 1628268 1492202 1392519 1807765 1708480 1360961 1225386
4758 1225386 1194669 1212099 1469215 1800887 2054983 2167210 2045536 1924310 2109628 2170271
4748 2170271 2041811 2476223 2683324 2904137 2956208 2332552 1961088 1942634 2400066 2177967
4738 2177967 1911333 1654562 1889086 1978504 1716117 1827564 1527215 1599680 1880474 2304094
4728 2304094 2309868 2196198 2255448 2125502 2000952 2227320 2350479 2523056 2341280 2654254
4718 2654254 2879915 3003735 3127544 3025696 3106781 2542275 2252640 2540066 2217792 2032967
4708 2032967 1909565 1812004 2068812 2009720 2103810 2228761 2031404 2142876 2050320 1879411
4698 1879411 1926004 2069351 2104476 1717434 1664780 1880161 1654011 1547747 1565109 1818294
4688 1818294 1688036 1329784 1143380 1069136 1207105 1562804 1181445 1206456 1136875 1215952
4678 1215952 1173546 1314076 1443632 1518286 1556353 1410262 1820502 1757265 1536958 1482767
4668 1482767 1360341 1464349 1407903 1535327 1159448 1006791 1075348 1043772 1411010 1550064
4658 1550064 1528735 1687671 1818514 1537091 1785058 1406389 1434130 1381007 1242432 1562684
4648 1562684 1947759 2151408 1934251 1595936 1438025 1696001 1489619 1339544 1739765 2186589
4638 2186589 2185642 1698896 1655882 1924725 2089379 2106830 2166080 2169627 2035201 2120982 2295833
4627 2295833 2047297 1747250 1771745 1733779 1475093 1657257 1654953 1414970 1313078 1534090
4617 1534090 1569915 1935187 2059497 1640384 1439938 1510337 1681655 1670481 1610361 2042105
4607 2042105 2178156 2006586 1643115 1282606 1404828 1451145 1586764 1761149 2076243 2228406
4597 2228406 2338868 2066020 1883283 2245011 2157831 2151431 1961063 1979486 2077477 2009720 1883863
4586 1883863 1449743 1723968 2132839 2157163 2098151 2096431 2087138 2087792 1916893 1948568 2129471
4575 2129471 2095514 2013752 1831864 2462385 2298349 2052861 2184037 2228045 2028042 2372823
4565 2372823 2447158 2263020 2469813 2650748 2962968 2698554 2979555 2827841 2550794 2447286
4555 2447286 2716816 2477987 2373234 2466066 2458286 2811735 2794638 3004236 3228742 3581693
4545 3581693 3348502 3018169 3139584 2922825 2976661 3165403 2906534 3053177 3257231 3153905
4535 3153905 3284713 3140025 3178302 3550783 3332836 3335960 3406629 3560701 3691398 3680479
4525 3680479 3473688 3534297 3779334 3651322 3570618 4050752 4637428 4471305 4674759 4968232
4515 4968232 4906557 4789970 4706303 4897450 4784675 5002206 5528314 5622175 5261300 4559454
4505 4559454 5245956 5648670 5400224 5582705 5593783 5518524 5784124 6323884 6423275 6759873
4495 6759873 6844788 6835332 6937473 7206107 7244973 7125315 7369371 7672218 7936787 8372871
4485 8372871 8640833 8823467 9343289 9612655 9656125 10370513 10752898 10550972 11437551 12297502
4475 12297502 13251651 13848233 14577897 14999528 16131638 17374136 18219082 19563803 21270987
4466 21270987 22326182 23594998 24537605 25458775 25922158 26074347 26471745 26687619 26429414
4457 26429414 26946801 27010119 27769016 28553082 28349618 28951373 29631806 30258888 30394990 30692608
4447 30692608 30677406 30915172 30689930 31091239 31559108 31790135 31751566 31933316 31653790 31665140
4437 31665140 31393289 31378073 31034620 30774175 30160337 29557848 29148770 28735595 29013340 29163793
4427 29163793 29775628 31165213 32106263 33551300 35891840 36721742 37326925 37799014 38318786
4418 38318786 38750147 39417113 40034299 40628260 40873789 40834991 40604213 40295360 39344562 38565585
4408 38565585 37902828 36579551 35298800 33378030 31261105 28821965 26977963 25216158
4400 25216158 23533731 22164842 20913182 19932590 18616551 18179735 17525679 16226734 14984262
4391 14984262 14393870 13967814 13572130 13274601 12943179 12637259 12391331 12242418 12314044 12727325
4381 12727325 12939892 12503483 12195672 12360244 12445116 12378855 12905425 12682290 12502240 12378380
4371 12378380 12297283 12645635 12847473 13117251 13208413 13576712 13687911 13610893 13483516 13847791
4361 13847791 14243790 14557819 14518715 14626999 14889554 15128335 15534133 15623134 15827813 16249226
4351 16249226 16598076 17018476 17878757 18629560 18661164 19852831 20584746 21595081 23002154
4342 23002154 24423304 25954761 27527524 29251433 31127079 33258377 35437027 37494319
4334 37494319 39578329 40746986 41839096 43121601 44089229 44375672 44930988 45307322 45491408
4325 45491408 45136163 44793739 44233653 43520853 42940143 42343812 41532492 40438354 39350499
4316 39350499 38155233 37160005 35905717 34569712 34026680 33942576 33994252 34450115 34814276
4307 34814276 35217536 35329934 35688228 35546457 35609099 35243698 35055006 35013402 35267075 35154714
4297 35154714 35152126 34721173 34315170 34131275 34070000 34375435 34436949 33748912 33263121 33098827
4287 33098827 32614874 31917535 31150760 30884861 30641011 30575357 30738726 30345173 30117553 29614890
4277 29614890 28861441 28156511 26952443 25126984 23892070 22653554 21618201 20422774
4269 20422774 19460390 18457666 17704359 17094950 16643201 15821772 15438467 15440644 14982001 15093520
4259 15093520 14719215 14636543 14832598 15032802 14902291 14814080 15027744 15277378 15241123 16032376
4249 16032376 16485184 16782613 16870788 16771058 16426662 15949766 15750859 15745962 14855689 14502757
4239 14502757 14212633 13990789 14178453 14545037 14907528 15135463 15404319 15297305 15361689 15121096
4229 15121096 15040251 15477417 15394436 15886751 15823400 15492729 15421282 15277439 15147747 14988495
4219 14988495 14202083 13642046 13803911 13356090 13509356 13360577 13581621 13361629 13234358
4210 13234358 13227267 13378233 13304823 13279059 13429516 14135394 14094066 13977916 14433766 14894136
4200 14894136 15092788 14966860 15004967 14843942 14922659 14587693 14865017 15425862 15377766 15493091
4190 15493091 15888542 16646728 16758813 16523449 16601155 16861484 16700377 16211232 16217289 16634639
4180 16634639 16644804 16752060 17114754 17258426 17351602 17092808 17145638 17439225 17092204 16791961
4170 16791961 16963223 16941179 17104660 17857833 18516533 18861385 19119178 19049658 19211423 19274360
4160 19274360 19524841 19676351 19664184 19848393 19350004 18685601 18639074 18460438 18338289 17833680
4150 17833680 17304898 16587229 16592165 16992949 16979007 17199185 17498066 17802890 17963677 17821658
4140 17821658 17940119 18089977 18142655 18409116 18395861 18923534 19094846 19563358 20334699 20980035
4130 20980035 21466540 21712476 21712567 22225499 22313491 21914427 22096330 22327368 22948269 23382763
4120 23382763 24553274 24865972 25897218 27128236 27664264 28590326 29242416 29735651 29581158
4111 29581158 29693695 29668309 30007959 30474059 30391494 30594608 30980031 31554183 32480155 33093216
4101 33093216 33593433 34811310 34992446 35700525 36270268 36724330 37729597 38914517 39814494
4092 39814494 40846615 42542309 44144312 45732787 47313051 49163822 51741213 54548112
4084 54548112 57398383 61050490 65540374 70823648 76252133 82867347 90316239 99346420
4076 99346420 109920843 122802983 137736308 154404787 171117964 188965763 208213346
4069 208213346 226443368 239986939 243394364 233681148 212971006 190543611 172499198
4062 172499198 160106782 152283721 149358573 148895187 147774346 141626047 128793972 114674107
4054 114674107 102859266 94351817 88495198 84062375 80698975 78020952 75695110 73360566
4046 73360566 70545029 67818639 65609456 63765987 61876001 60480361 59673900 59024083
4038 59024083 59247115 60068166 60904872 60529810 60610658 60319809 59363771 58311863 56638633
4029 56638633 55065301 54184150 54042978 54140530 55136020 56034838 56820092 57181887 56193673
4020 56193673 54436502 51944841 49716236 47745242 45354859 43715660 41616460 39859781
4012 39859781 38607711 37422622 36381489 35659976 35029789 33979322 33858741 33681525 32618908
4003 32618908 31712730 31172822 30565806 29770453 28839207 27742336 27289420 26591469 25333268
3994 25333268 24544057 24859863 24401226 23382490 22804923 22454499 21605317 20653395 20110052
3985 20110052 19816429 19334804 18376350 18064313 17938352 17895872 17513682 17448629 17570798 17324620
3975 17324620 16761762 16630207 16085803 15867392 15799165 15255309 15493808 15310419 15160602 15211343
3965 15211343 15315612 15519958 15821023 15927006 15720402 15561319 15726046 15192132 15221643 15260058
3955 15260058 15198384 15314903 15021491 14644276 14535757 14011405 13968896 13761210 13152846 12642318
3945 12642318 12698923 12560056 12668541 12692934 12433295 12844831 12333269 12524764 13041985 12855530
3935 12855530 12954284 13160387 13191209 12929814 13271165 13852414 14030597 14485258 14877965 15490967
3925 15490967 16391893 17114937 18047548 19225195 19533027 19232172 18869146 18185929 17301419
3916 17301419 16691865 15600329 14830873 14554296 14207982 13783408 13349472 13138680 13262291
3907 13262291 12932594 12916813 12705305 12216804 11619785 11456107 11974467 12236944 11799726 11803172
3897 11803172 11656238 11471272 11729048 11802552 11502934 12034819 11936095 11852002 11944471 11841976
3887 11841976 11924571 11596058 11814957 11652559 11503250 11510012 11645884 12238167 12493168 12453155
3877 12453155 12076652 11998917 12291256 12634624 12754142 12392104 12186965 12044525 12026970 12314419
3867 12314419 12547786 12466880 12539325 12506546 11993691 12090779 12318919 12090855 12326083 12227936
3857 12227936 12213875 12689673 13068649 12922252 12740474 13327341 13836428 13975798 13812407 14311852
3847 14311852 14119386 13791796 13978110 13672581 13623247 13809481 13958410 13645165 13031366 13374033
3837 13374033 13736799 13936717 14060331 14354110 14561115 15032719 15164869 15122348 15401345 15122947
3827 15122947 15027655 15196131 15661633 16214260 16556520 16578625 16636978 15924007 16071557 16544007
3817 16544007 16587497 16777083 16487047 16270313 16656022 16838377 16835108 17093703 17092017 16950559
3807 16950559 17245425 17568179 17671740 17792702 18049881 18391254 18705919 18989080 19329407
3798 19329407 19288570 19681004 19660813 19694041 20317951 20644754 21188216 21353907 21717055 22493955
3788 22493955 23124452 23415090 24215622 25340452 26220320 26826726 27738056 29412619 30806540
3779 30806540 32075083 33522412 34848463 35361425 36808900 37498541 38624669 39810889
3771 39810889 40717931 42303063 43420334 44372189 45129974 45641600 46771821 47836540 48207168
3762 48207168 48777626 49242114 49678428 50072101 49955124 50301998 50742763 51238692 51942640
3753 51942640 52877629 53510922 54553670 55317319 56861742 58474840 59342985 61190890 62548913
3744 62548913 64510630 66917061 69374381 71945629 74628682 77279247 79548250 81637030
3736 81637030 83265928 84198165 84385169 84042872 82928302 81980894 81055943 80205696 79101808
3727 79101808 78248105 77483943 77169689 76768232 75597755 74505260 72646744 70500284 68347231
3718 68347231 65437621 62088363 59151265 55711459 52213358 49252874 46686928 43992017
3710 43992017 41391624 39586754 37847972 36681680 35440858 34074451 33938250 33306931
3702 33306931 32758420 31908686 31234310 30460244 29689857 29166858 28885742 29054483 29425020
3693 29425020 29179017 29248999 29580241 30054335 30170962 30493752 30730450 30651176 30846107 31126880
3683 31126880 31156176 30732402 30721132 31298443 31193630 31026883 31120280 30580437 30157952 30124640
3673 30124640 30144441 30267026 30912967 31104745 30340077 29992514 29341391 28573496 27933566 27967956
3663 27967956 27577568 26530429 26199115 26234780 25392428 24814762 24720009 24270373 24659597 24377598
3653 24377598 23798686 23603778 23500732 23050303 22993874 23057643 23265179 23215012 23173847 23170846
3643 23170846 23054742 23089785 22849666 22619863 22562557 23476066 23439499 23462270 23688827 24037294
3633 24037294 24114584 24492645 25547009 25758939 25709112 26244289 26761475 26901410 27079224 27437707
3623 27437707 27948730 28453739 28629208 29681221 30637017 31362699 32734508 34037718 34956732
3614 34956732 36695609 38758339 40657916 42756769 45067917 47197975 49724438 52457171
3606 52457171 54627005 57590463 60669488 63647151 66380143 68996953 71604603 74356005
3598 74356005 77161710 79584971 81819523 83846753 85045663 85832442 85798827 86110239 85228541
3589 85228541 83523446 81438343 79434392 77087435 74848757 72984813 71232064 69292000
3581 69292000 68067760 67193993 67324884 67016592 67157465 68303833 69835110 71366031 73159183
3572 73159183 74799874 76584799 78379689 80530950 82356856 83435840 85112574 86822233
3564 86822233 88407300 90730303 93797300 96681428 100021798 103590438 108165685 112393808
3556 112393808 116444791 119657908 122379098 124038651 125063916 125865224 125508013 124613990
3548 124613990 123321471 122256918 120913945 118857191 116524514 114849778 113116222 110999564
3540 110999564 108838875 106096764 103031087 99931402 96494602 92383062 87846077 83847736
3532 83847736 79591959 75282963 70928794 66859601 63685408 60523094 57254461 54510734
3524 54510734 52246187 50229642 48918545 47437024 46877014 46719538 46343545 45996917 46321864
3515 46321864 46751516 47712630 48263040 48340737 49015013 49774406 50507512 50952586 50952773 51007206
3505 51007206 51185072 50454406 49880361 48857024 47598151 46479909 45346542 43629074 41894732
3496 41894732 40504282 38547485 37225165 35839309 34712679 33797629 33111148 32787553 31701546
3487 31701546 30977098 30751387 30077782 29259673 28491139 28011579 27112993 26463840 25481770
3478 25481770 24751005 24214909 23422714 22924743 22164449 21502655 20499830 19887241 19102801
3469 19102801 18733709 18471768 18201465 17729860 17334590 17424796 16802822 16628642 16775747 16697080
3459 16697080 16385873 16663508 16319854 15953281 16405774 16018966 15570003 16210293 15562832
3450 15562832 15693469 15769472 15472724 15341741 15347731 15469132 15035385 14978979 14918393 14987597
3440 14987597 14805395 14574195 14410529 14396530 15082162 15107314 14990510 14914449 14936424 15071611
3430 15071611 14998551 14856925 14904095 14927606 15122681 15471223 15311390 15053603 15083686 14975580
3420 14975580 15134021 15298409 15830010 16177136 15817243 16027108 16204524 16359370 16822556
3411 16822556 16919848 17011271 17541210 17617411 18354366 18555221 19540381 20339742 21061327 22046741
3401 22046741 23228118 24806380 26206519 27861862 29138245 29933326 28403084 26393704
3393 26393704 25552514 24844510 24208317 24201688 24948646 24892962 25172366 25219368 25813555 26282613
3383 26282613 26700195 26837516 27079645 27403155 27976276 28798806 28883226 29381303 29956483 30447076
3373 30447076 30898592 31478815 31767649 32085643 32500952 32538066 32434402 32792526 33164394 33418901
3363 33418901 33914665 34300825 35155083 35534211 35870952 35829002 36542972 37196113 37444252 37926541
3353 37926541 38674962 39807683 40626173 41282880 42024387 43025261 43871484 45073347 46448360
3344 46448360 47692289 48927994 50336144 51190003 52216393 53817343 55022315 55519167
3336 55519167 56298832 57710302 59592547 61063651 62314540 63505415 65260488 67489763
3328 67489763 69820584 71676313 74023275 76773404 79210063 81893639 84813127 87657257
3320 87657257 90955459 94235419 96946396 99500900 102723474 105143979 106742923 108300003
3312 108300003 109764741 110971891 112158515 113368438 114502116 115966149 117819224 119925386
3304 119925386 121321837 123135773 125478096 126917527 128079712 129213994 129788685 129873692
3296 129873692 129565922 129394290 128953311 128499320 127271332 125883136 124348270 122740354 121200598
3287 121200598 119938958 118655092 117087190 115403744 114753305 113926715 112426288 111419439
3279 111419439 110477288 109174061 107438244 106085843 103651673 101101695 98575810 95994215
3271 95994215 93149429 90074391 87069434 84817825 82910923 80613245 79080647 77845571
3263 77845571 77349507 77425505 77832595 78629490 79399072 80202490 80945902 80903037 80998145 81041226
3253 81041226 80218111 78895418 76943679 75018716 72600939 70522822 68650120 66830024
3245 66830024 65434682 64414257 63583991 62754725 62043448 60856194 59902114 58629267 57460288
3236 57460288 55783360 54424297 53153127 51561738 49897354 48513803 47146569 45807289
3228 45807289 44850270 43789720 43410244 42251294 41434435 40817408 39941711 39170560 38297725
3219 38297725 37564212 36586519 36066811 35169952 34381082 33668454 32672050 31787387 31019702
3210 31019702 29999904 29374027 29057546 28201447 27026271 26459878 26910024 26613596 26429500
3201 26429500 26135549 25789800 25697312 25329438 25022826 25132930 24765658 24324154 24116748 24166197
3191 24166197 23628049 23553669 23818896 23913655 23887178 24285407 24655891 24768370 24892714 24992809
3181 24992809 25136161 25528302 26139812 26608860 27249183 28223350 28903578 30043995 31186029
3172 31186029 31968301 33452771 35116558 36864633 38419637 39997727 41593054 43556625
3164 43556625 45280470 47429491 49583934 51529107 53479048 54787711 56124965 57715218
3156 57715218 58656474 59480115 60911113 62075977 63019237 63986945 65226707 66618911 68111349
3147 68111349 70947357 74350393 77430252 81246970 86054495 90656969 95557220 99821470
3139 99821470 103511054 106931602 109341938 110926619 111245186 110443571 108346477 104737441
3131 104737441 100248071 95051427 89255039 83414298 77763612 72129316 67370992 63111312
3123 63111312 59074579 55860486 53273894 51127331 48951393 47120178 45525814 43477573
3115 43477573 41701987 40232740 39190585 37522145 35819621 34385564 32741192 31194297
3107 31194297 29179751 27847105 26403693 25137928 24251561 23723290 23084698 21655749 20993804
3098 20993804 20132135 19594687 19277009 18239060 17635842 17557326 17267553 16860211 16517526
3089 16517526 16223279 15789110 15424173 15231285 14835213 14794883 14598786 14722157 14386648 13843951
3079 13843951 13928499 13855340 13577942 13040246 12985160 12982645 12729040 12771026 12703125 12314929 12481539
3068 12481539 12164645 11926295 11614475 11705302 11752001 11498778 11409772 11047872 11057039 11312733
3058 11312733 11073472 10461533 11109987 11182396 10642005 10459493 10406638 10676161 10402863 10430511
3048 10430511 10572622 10454817 10453356 10373971 10456221 10140398 10095795 10422380 10840094 10488191
3038 10488191 10389977 10378086 10108856 10400579 10334556 10176120 9949783 10295744 10451396 10362547
3028 10362547 10431090 10629001 10707260 11028284 10822194 10523046 10538782 10652814 10573781 10182098
3018 10182098 9923891 10097760 10556557 10358251 10436803 10506742 10747828 10692030 10540673 10739102
3008 10739102 11132760 10923509 10908956 11047737 11048739 11092904 11349500 11291607 11007710 11416672
2998 11416672 11763855 11632212 11946467 12054387 12034439 12155814 12342728 12171235 12092124 12261253
2988 12261253 12178235 12479241 12660541 12807478 12769037 12828404 13100171 13171640 13055749 13235472
2978 13235472 13292681 13286791 13552165 14265595 14032628 14109123 14582915 14725645 14902316 15267228
2968 15267228 15730382 15749756 15794840 16114283 16650415 16468999 16544141 16817333 17575222 17854450
2958 17854450 18335480 18674858 18476910 19029377 19139583 19378044 19634680 20335830 20826890
2949 20826890 21178491 21594441 22447160 23249721 23516019 24427636 25306045 25928341 26880770
2940 26880770 28025090 29017278 30416540 31278348 32098249 33064599 34016382 35307663 35841748
2931 35841748 36174014 36527467 36498539 37088241 37675928 38514164 39260747 39845584 40342492 40875850
2921 40875850 41459794 42309766 43549925 44807247 46183983 47257908 48537935 49961777
2913 49961777 51381924 53216643 54980611 57761448 60940353 64256262 68238922 72285228
2905 72285228 75710631 77466496 77044033 76267686 75943856 75864077 76433357 78131232 80579824
2896 80579824 83233600 86626997 90621191 95492164 101010946 107269566 115164725 124912051
2888 124912051 136376371 149519603 163483412 176712870 185278550 187651151 183258742
2881 183258742 175820340 168889332 164411332 164221966 166358803 170859683 176215662 180771992
2873 180771992 184213283 186739977 189655631 194748020 203044168 215329498 232620280 254221934
2865 254221934 280833786 313520223 350298795 387592252 419716923 439699910 441247824
2858 441247824 420691121 382345281 337259066 294946678 259377153 232197188 211212209
2851 211212209 195976955 184716153 175928045 168793482 162991955 157053214 150828515 144133870
2843 144133870 136305982 127207213 117022838 106664433 97602038 90157955 83362802 77687158
2835 77687158 72646076 68411779 64517275 61112637 57784614 54760122 52091524 49766624
2827 49766624 47905624 45876396 44078591 41822709 40401679 38899391 37122974 35910836
2819 35910836 34781702 33893375 32591552 31477127 30542095 29346820 28283637 27235204
2811 27235204 26781709 26109518 25364932 24855345 23663749 22638612 21965655 21620099 21272324
2802 21272324 20976402 20701347 19842006 19104074 18661045 18469548 17745905 17237971 17208298 16949666
2792 16949666 16681977 16475588 16341113 15713331 15119069 14851243 14509286 14470605 13972758 13467497
2782 13467497 13121139 12837156 12777223 12670980 12557225 12274030 11889501 11445050 11138130 11102806
2772 11102806 11142309 10412318 10468742 10075072 10091481 9672124 9421090 9219429 9205755 9307829
2762 9307829 9073364 9022207 8625334 8537952 8521750 8153997 8252723 7766330 7754114 7739736 7552764
2751 7552764 7191568 7236509 6833971 7148047 7248691 7097583 7333043 6942125 7113606 6831152
2741 6831152 6330266 5950618 5783019 5924370 6248396 6128535 5788548 5401183 5333990 5551983
2731 5551983 5471108 5139372 5112573 5201958 5530239 5431736 5139273 4874571 4757634 4783187
2721 4783187 5078416 5168478 5158332 4822719 4556532 4093807 4052125 3944918 3988717 4199478
2711 4199478 4124233 3826737 3451074 3317558 3080473 3572255 3540596 3730112 3714565 3563219
2701 3563219 3221400 3303229 3056734 3253935 3306272 3259538 3092526 2886098 3014890 3096455
2691 3096455 3239491 3129597 3152067 3156844 3228552 2650312 2091318 2104319 2475099 2736770
2681 2736770 2821036 2644795 2557408 2641234 2683449 2513624 2798812 2486181 2745691 2687409
2671 2687409 2447520 2311719 2361483 2422242 2475218 2276680 2460221 2418156 2397659 2510861
2661 2510861 2170597 2034269 2166466 2214455 2291069 1919759 1729103 1796029 2252842 2348774
2651 2348774 2463417 2699367 2454869 2372702 2518733 2619903 2394267 2361318 2332929 2041054
2641 2041054 1585246 1715587 2114420 2137704 2148049 1853679 2163256 1968138 1867267 2128367
2631 2128367 2234159 2543019 2486519 2244365 2156031 1645043 1614131 1854832 1652196 1828232
2621 1828232 2070137 2316811 2328297 2337690 2424221 2318800 1960956 2374405 1894547 1671393
2611 1671393 1738320 1895189 1945621 1660102 1820229 1825976 2067227 2406862 2470941 2670039
2601 2670039 2660122 2790326 2500329 2316231 2398048 2276816 2301847 2449921 2169439 2485574
2591 2485574 2454534 2201705 2107593 2441701 2683562 2441736 2787634 3502448 3067001 3131206
2581 3131206 2986814 2697833 3052999 3380805 3658103 3622807 3536453 3034534 3011994 2647565
2571 2647565 2716151 2545768 2338769 2207752 2251817 2208182 2238373 2356208 1926716 2006531
2561 2006531 1738984 1691532 1868447 1698450 2168429 1550435 2007377 1971485 1754524 1613392
2551 1613392 1615543 1710881 1370371 1496413 1458921 1342712 1293948 1215458 934091 738809 846844
2540 846844 1141551 1076775 1008898 736393 927483 1121174 970416 1115040 1153180 908109
2530 908109 663423 650282 1099380 1154461 1094157 878566 786792 805659 923123 994973 1159852
2519 1159852 1007623 879950 757369 655368 1039519 1123871 907614 653689 547997 1044771
2509 1044771 980726 833238 878286 929780 609390 869191 827741 854649 412498 917627
2499 917627 1082844 784052 1157764 997012 915505 846757 840341 895994 601859 561539 1167945
2488 1167945 1019405 717226 911526 922883 660608 808841 1185975 800773 640173 774652
2478 774652 779315 720384 733232 990220 746717 469856 586874 744423 805581 764834 973079
2467 973079 530619 352337 994101 964899 584621 850719 634521 471636 1011704 876402
2457 876402 1184337 820910 608860 651718 960551 769558 810124 598787 637814 1031199
2447 1031199 1193657 562643 448305 631588 824327 1072714 1214967 1300468 876303 755522
2437 755522 547852 497881 833177 699606 536409 435302 904229 755248 370872 615740
2427 615740 850515 791291 380879 806427 958099 1036674 1131959 1247277 1395560 909674
2417 909674 893657 1106271 1198339 1348432 1002109 818810 1152197 1101966 967576 730769
2407 730769 1000194 934265 473537 990643 1258160 1156217 1346099 937979 586670 508186
2397 508186 468146 556756 528371 663903 875790 782322 612401 427625 307269 568128
2387 568128 478852 371068 530884 599653 743552 729540 848991 834179 759688 891735 838724
2376 838724 686560 834462 982430 1232471 1656356 1538522 1081225 984185 1056902 1154495
2366 1154495 856167 1137486 1122714 797145 904113 1215877 1327144 665719 490179 725712
2356 725712 449943 379935 488370 500430 298287 -1232 -20205 195596 544213 248205
2346 248205 268487 340235 532946 298414 444640 439520 455064 475984 605131 683862 748082
2335 748082 339481 726692 976242 538517 374461 465805 704730 929282 575455 520161
2325 520161 697008 192446 -2521 33837 -136470 146458 893962 1040600 613521 984603
2315 984603 1217351 964358 509299 943330 903995 757040 752409 493445 426195 520635 775551
2304 775551 600282 514988 537745 400553 587962 690915 497180 559707 490692 343509
2294 343509 721578 734605 484951 321007 668248 1013580 950166 1466543 1335239 903347
2284 903347 910795 1019132 969728 668386 1073233 1035862 712832 760331 986527 1173537 689456
2273 689456 734850 1043520 1290573 1137685 1273236 1370553 1265122 1153663 1129043 1045677
2263 1045677 1255282 1051053 1307844 1180105 1407054 1382308 1126774 1143107 1280151 1254777
2253 1254777 1115325 1096908 1259759 1108370 1356917 1395054 980444 754533 1156437 1263897
2243 1263897 1098004 1422756 1211261 1403544 1427484 1175002 1498421 1596972 1840041 2021287
2233 2021287 1463238 1276647 1431543 1213507 1642850 1885969 1339126 1381445 1187871 815062
2223 815062 917342 1227574 824227 1246609 1541356 1389576 1843154 1431844 1446949 1630957
2213 1630957 1735069 1691995 1766646 1513933 1497654 1410376 1994883 2052695 2211056 2638355
2203 2638355 2719387 2171616 2046846 2187966 2252043 2659585 2665715 2348999 1970481 2389590
2193 2389590 2370183 2723529 2338617 2201817 2631477 2329809 2328936 2627672 2543081 2805565
2183 2805565 2458129 2242931 2183864 2464164 2585068 2625574 2861406 2629194 2411642 2821348
2173 2821348 2944689 3264868 3086120 3470088 3413039 3185350 2916437 3095351 3881637 4041634
2163 4041634 4155279 3977488 3880030 4434553 4864360 4829203 4789127 4574967 4598388 4965200
2153 4965200 5362620 5377298 5340578 6020148 6564339 6414958 6696601 6915737 6594706 7059368
2143 7059368 7509471 7537394 8172692 8412100 9116842 9724372 10249169 10463189 10248965 10674586
2133 10674586 10783845 10988649 11461411 12008821 12435792 13130537 13880795 14300787 15032262
2124 15032262 16363874 17123896 17691757 19441876 21688325 23778574 25583374 26851355
2116 26851355 27974193 29342235 31646619 34859947 39955286 45773488 53700404 63681518
2108 63681518 77860409 95544727 118430882 147022188 175443774 193977480 173389330
2101 173389330 128571866 94503990 73270831 58982955 48840074 41796168 36530775
2094 36530775 32816684 29657537 27432871 25518828 23882959 22693966 22071265 21180378
2086 21180378 18581871 16179852 14599130 13717904 12658357 11927165 11243420 10729470 10386239
2077 10386239 9728895 8911800 8668861 8282247 8068222 7956521 7506274 6802210 6340175
2068 6340175 6538548 6226077 6170085 5923619 5779486 5321535 5148040 5277476 4952724 4806259
2058 4806259 4417826 4283762 4369963 4265611 4195277 4087906 3634498 3762056 3853019 3495174
2048 3495174 3438406 3449577 3304854 3379864 3141846 2673695 2960354 3116334 2711117 2555997
2038 2555997 2747643 3123446 2789463 2641986 2614247 2350131 2172737 2354691 2264407 2035799
2028 2035799 1938648 1980895 1912409 2003045 1904278 2100350 2236328 2043903 1924912 1819205
2018 1819205 1909000 1678566 1668119 1611042 1743526 2028572 1733913 1386110 1146759 659637
2008 659637 663602 927957 1447303 1288753 1402064 956165 884691 866480 1099280 745442
1998 745442 954327 966622 1034298 909600 957231 1265052 1162735 1070692 1238186 1073370
1988 1073370 1026894 1298824 1473629 997217 887984 1205988 847900 767484 971883 892846
1978 892846 1051715 936101 671256 673400 679716 422592 411735 596317 735946 926678 242782
1967 242782 589736 855583 735546 633784 620069 361207 571434 697015 725014 704899
1957 704899 534377 62131 157260 408875 421898 119115 227885 368951 31671 -179162
1947 -179162 222214 382375 539216 377059 650319 693021 509663 697644 698033 701505 500891
1936 500891 762328 337119 467707 768579 159084 279768 503855 609825 611369 258065
1926 258065 241637 563063 720900 455286 224042 337399 364215 260640 327192 238488
1916 238488 152029 -2256 97875 53691 541686 456659 366199 224712 188481 495616 312253
1905 312253 -215098 12138 298492 48839 67484 36603 36672 -179336 -124943 81489 -23081
1894 -23081 116191 -70690 5576 278946 -181942 153635 -143396 33003 -360602 -161261
1884 -161261 -99102 81541 272547 9531 226812 221881 121159 -42563 8032 80782 -204117
1873 -204117 -416507 -82974 131655 14596 466682 701851 303495 -84955 290593 312242
1863 312242 411781 132486 -142534 -214001 -143445 405034 259030 325343 470229 331412
1853 331412 206585 80166 34756 187526 455846 849352 673393 668979 591112 217231
1843 217231 368 39488 400027 530196 240350 852481 449574 535877 1059128 1037494
1833 1037494 1546752 1631759 1311427 926739 672011 173058 518937 403219 261517 496790
1823 496790 385102 271999 301086 322434 244730 310895 -48534 164096 35226 -194558
1813 -194558 116083 99079 237746 139981 -165785 205839 410006 322375 252801 426499
1803 426499 376193 607625 536034 604272 334461 150979 -123849 -200256 138990 269595
1793 269595 248326 115221 185137 175900 82581 -128353 -266003 331352 -8519 325199 71909
1782 71909 -81542 138588 -61480 -165128 172311 217650 29822 -393246 -293652 -158551
1772 -158551 296428 26319 142366 358711 149477 205299 15039 62120 -139244 268480
1762 268480 124157 -163964 -120751 157466 -218277 -351868 -332701 -191275 -112618 -324492
1752 -324492 -112098 -88765 -255535 -36015 211530 262549 -17637 -110922 -39149 306403
1742 306403 460061 297017 197148 -12636 -122746 -140387 -132124 -119122 -165178 -45992 -466001
1731 -466001 73306 493594 322395 -281552 -166033 -124557 -141262 -17390 164270 281510
1721 281510 183541 268542 358115 338582 533669 292558 143187 103875 75086 193566 -37156
1710 -37156 159431 68853 -8182 356279 309826 -127895 -228858 294613 521570 663521
1700 663521 508247 605834 353067 337990 -418490 -309709 117585 201558 129366 317783
1690 317783 222586 271977 239072 118913 39084 -209134 -31449 -18097 7640 -233923 -176469
1679 -176469 153567 -250279 -158761 -315220 -221814 -106300 -272002 -156911 129774 213883
1669 213883 326896 199865 218550 336983 341097 282949 36028 467779 624138 533172 33438
1658 33438 -83686 198844 153571 374267 39995 58274 156163 -288749 319615 -103619
1648 -103619 -68317 252232 -75560 -372495 -508195 -407302 -127281 -397982 -254372 275824
1638 275824 500516 100158 28798 -240863 24238 1501 -150033 -139106 46902 3018
1628 3018 -11362 -130045 -265995 -547342 -197516 -65708 -327050 -488309 -276450 45256
1618 45256 342062 369548 121239 -131602 -141778 -420235 -88894 67400 -102241 -273377
1608 -273377 -14031 -150046 -274179 -255806 -97921 -284418 -167721 -30051 -133347 -151685
1598 -151685 -196431 135045 214610 90047 -141501 -207490 94125 85187 -130077 -524930 -408290
1587 -408290 -45634 200677 147773 -86168 -250288 -476817 -80597 186625 38323 -47647
1577 -47647 128348 322682 744097 364718 93444 159892 101620 270822 -76109 -261291
1567 -261291 -22705 140872 247353 30927 113793 -551351 -510497 96223 -284459 -444128
1557 -444128 -285080 -216306 -3357 -86563 106480 -324648 -151213 -155556 -44841 -138332 -219190
1546 -219190 -415259 -321504 -452441 -345835 -21466 -80390 -40244 -203254 -463932 -363525
1536 -363525 186583 320553 -84029 -178738 163483 -75919 -204565 -114418 6543 16804
1526 16804 16283 -64287 -326148 190552 570558 199283 -27995 -21986 -607189 -452896 -208635
1515 -208635 -122041 216140 346878 -235010 10813 83263 56994 9377 385071 422573 -128692
1504 -128692 41509 129304 -121013 -603014 -366267 -150090 190765 370365 337029 360789
1494 360789 666725 274463 -277691 -363140 -659226 -355987 -123045 389132 75133 -370932
1484 -370932 -300793 -636859 -477964 -298515 23293 -95435 -16584 -157519 -270878 61367
1474 61367 214625 127448 158324 73248 93850 198820 -172042 -101550 52538 15438 -340242
1463 -340242 -522669 -393274 -189114 117079 10048 -278759 -14384 -90901 -79339 152783
1453 152783 -289388 -628420 -706317 -579016 -115940 -193404 -82100 140588 -48259 307977
1443 307977 -70161 -244752 -369574 -693804 -969406 -471335 53199 140087 118557 228407
1433 228407 -211424 -247597 -220813 -141650 -91010 -73241 -55142 -510982 -128913 -257470 -63173
1422 -63173 1436 -28658 127360 -247063 -504528 -421140 -365882 -211451 -11226 -434329 34038
1411 34038 50059 -71371 -100727 32917 22633 -132931 -104670 156990 -88224 -756792 -379849
1400 -379849 -23506 -188735 -494667 -569002 -515309 -491799 -164801 -181279 -235640 -341204 -445470
1389 -445470 -9 -148680 -338688 -284818 -186869 -290182 -451653 -561297 -467414 -155631
1379 -155631 -133860 -4330 -153069 -454554 -366610 -118202 -102894 63499 436257 598776
1369 598776 137956 -452219 -181274 49215 -153126 -10309 -235012 157448 -23681 -225317
1359 -225317 -54931 97696 -19793 84125 140379 -30167 -144148 -340916 499369 544625
1349 544625 -285899 -815675 -168419 -1184 44139 57197 -282109 -52236 -511177 -539326
1339 -539326 -267748 -264732 -253722 324342 490734 -68146 618205 440207 122158 501721
1329 501721 109529 -387940 -132288 -4480 -248972 -354086 59082 382593 111140 80635
1319 80635 93834 116909 -90950 -441277 -338587 -606881 -279315 -518948 -502550 -382919
1309 -382919 300871 181646 -137591 170180 317459 242777 -219631 -124626 -64712 186064
1299 186064 105675 176937 54320 448509 328202 342877 67765 -144221 -48593 -301766
1289 -301766 49211 -239017 117334 -2397 -25016 110896 257944 253878 396155 240040
1279 240040 -220850 -139765 -50287 -75312 19974 -186552 38207 -196604 -80190 -111424 61637
1268 61637 159040 133378 -79206 -229477 -126153 -514259 -498208 -125230 157372 210638 173713
1257 173713 -456575 -289774 -222428 48861 117019 147374 322459 78861 -351308 -279956
1247 -279956 -256564 -370139 -484431 171591 237310 -294858 -647895 -396035 -233195 -351094
1237 -351094 -368859 -182311 -33884 -337349 -56484 101595 199674 -238750 -6961 51401
1227 51401 -442690 -408107 -242193 117210 81808 519974 45042 -514929 -121325 294110
1217 294110 138611 -151912 -59333 159710 -233434 -303802 -325189 -32854 -3188 115532
1207 115532 -288537 -529763 -476982 -646780 -486034 -395640 -332211 -196197 92073 294656
1197 294656 334963 409701 85486 -195885 -372809 -495322 -502090 -279499 -251189 -214262 -186322
1186 -186322 -210520 -155475 -443952 -347117 -337660 -181882 -340707 -287818 -216762 -428590 -297917
1175 -297917 -73681 -280701 -42917 -436528 -119191 97649 81171 7069 -46589 -44773 -50228
1164 -50228 -95611 -314745 -169059 -374067 -354678 -103314 -192600 -46945 -426124 -256670
1154 -256670 -85137 24728 -181854 -527837 -332446 -378743 -36379 -4064 -136225 -404134
1144 -404134 -2888 415026 -164431 -533251 -284849 -45563 -138981 -326291 -308711 -229348
1134 -229348 -293420 -530165 -192945 -139241 -330503 153426 298400 131971 -14988 -155738
1124 -155738 138136 184077 169833 -216087 -90119 -308009 -298128 -313188 -409261 -361161 -403239
1113 -403239 -255631 -372127 84260 89821 28792 -254676 -527514 -663030 -635304 -660823 -280124
1102 -280124 -28180 -169770 83569 48393 -140592 -459624 -47860 -176357 -393525 -302872
1092 -302872 -368691 -213405 -596196 -181381 -104320 -472871 -195372 -110873 -279631 -76872
1082 -76872 107325 35229 258053 3851 174218 326070 -38766 -9906 110852 195950
1072 195950 590023 386624 -14440 72161 291111 347420 352513 310284 318180 152903 -221412
1061 -221412 -444684 -353176 -251171 -161965 -176430 -351277 -450929 -539127 -327128 -10376 -183142
1050 -183142 -14063 -167892 -444384 -298009 -260486 -163909 21215 -99280 -193161 -1273
1040 -1273 91659 145100 140796 128029 -198183 -276102 -279544 156423 -43034 -48838 -395403 -15469
1028 -15469 411224 -237574 -632153 -139578 56865 -49716 386150 527092 259708 282486
1018 282486 93351 -284048 -431795 -621850 -322117 -149801 -307321 142146 7933 -149743
1008 -149743 -50154 -4839 505375 207223 -10756 -128001 -337036 -400189 -26522 370965
998 370965 -150715 -464393 204396 619979 -154263 -481130 223936 94765 -90501 87480
988 87480 449925 472 -186647 126307 -358420 -210573 208049 115807 -21738 368995
978 368995 208971 157416 18543 -54049 85855 -18873 -531931 -417057 -491711 -605801
968 -605801 -506050 -485587 -529072 -376405 94508 71991 74978 -262524 -182624 -457501 -524269
957 -524269 -558005 -390318 153662 250100 -177400 -106024 256477 -58261 -354738 -330639 -364369
946 -364369 -408286 -673582 -884690 -468718 -94636 57317 180538 84553 -26476 -30748 75641
935 75641 -63382 -177037 -180209 -657096 -564170 -75457 -329410 -145689 93360 164208 231899
924 231899 242374 -60464 20648 299199 27562 -7500 -1230 -135839 135773 212220 156071
913 156071 173746 206832 235659 129700 -77174 -438502 9386 -31061 -215164 -292605 -226807
902 -226807 123003 -196729 -36252 284305 1508 -250773 -569467 -378814 -242301 28032
892 28032 195251 -478215 -125292 -347875 130558 194253 -461541 -656331 -309260 74267
882 74267 398059 430269 454424 294224 -103255 4358 -115243 -192605 101625 11282 63425
871 63425 97886 -21206 -2305 -102711 -154981 208370 497459 339416 326786 544849 50006
860 50006 5432 576781 539567 -180087 -326525 -211566 -201858 -120304 81176 201601 254019
849 254019 281297 171449 213061 -228780 -434747 -384957 249671 144736 110245 -274255 297981
838 297981 258141 -90505 -195176 43032 -266617 -207123 -260398 -413619 -221294 -280534 -150591
827 -150591 63870 137339 -187744 38973 370075 92941 12967 25015 -4530 181684 45503
816 45503 32618 -111447 -220111 -13102 -296448 -385565 207742 397545 118208 486450
806 486450 289206 169969 -238536 -504185 -129357 -299134 -397106 -101050 208651 269040
796 269040 229551 -105733 -199786 87602 -60690 -190994 319541 15217 -310666 -177750
786 -177750 -406024 -1047051 -700072 -217716 51230 319620 345070 260085 213702 252
776 252 135995 261183 -113877 46476 57769 -43900 -78953 -243461 -199574 172223 278244
765 278244 86031 -146366 -165064 173832 130476 341305 148293 219219 479604 173520
755 173520 18219 -71429 -18680 150667 71636 -420036 -453611 -446830 -296985 118995 117385
744 117385 -259482 -202463 -546407 -244639 -60945 -240387 -146352 -292476 -365862 -454047 -161614
733 -161614 196176 178480 365985 441835 47772 181127 63280 -379698 -221748 -339284
723 -339284 -518219 -219903 28682 287483 -17883 168486 162454 106066 321800 316249 282260
712 282260 457627 464624 21323 -430286 138653 64520 13973 -43495 -24044 12095 32123
701 32123 194074 2902 -337400 -278734 -320039 180534 284770 -80645 377304 351261 222017
690 222017 239747 -337533 -169491 174830 326022 450230 712186 508343 197369 118117
680 118117 203400 441229 21860 24729 182445 526091 592870 26804 186167 159611 83782
669 83782 183949 96475 20901 190945 -114883 -304297 183473 92339 -137870 -644124 -145376
658 -145376 640144 390695 442345 515337 244525 197452 136944 277396 196628 -249720 -207625
647 -207625 -5188 -171382 -212517 -133873 382586 217476 233853 378217 653960 148876
637 148876 -354895 -611867 -355081 -205612 320570 158982 -250115 -307449 -410534 -397458
627 -397458 -24291 -84384 -122581 -73866 67120 403445 20325 -41959 2192 -31920 57577
616 57577 88076 17783 -62924 201832 344296 392079 -631 277881 489636 -148862 -8592
605 -8592 163917 619292 728562 230971 -254182 -660434 -779519 3646 50271 74430 493017
594 493017 32170 -153403 145008 -89787 102385 -176764 -245129 -60537 -101707 272763
584 272763 250380 137181 -146208 -44319 387097 192775 -62501 -77825 -120075 -227769
574 -227769 -320104 70050 318595 173722 -217019 -720938 -293271 73358 135576 -56159
564 -56159 -104554 288700 498605 319194 491834 341109 510262 -127725 -254028 -38906
554 -38906 42353 195292 -26843 -27443 -247563 -316422 -479447 -520349 -418941 -162748 586363
543 586363 325812 -388419 -364275 -288749 -253539 -283403 442650 326814 41158 63079 21747
532 21747 111514 117227 77025 88466 -84711 30047 -112436 118881 -202092 -190240 185975
521 185975 -139416 -400227 -71208 119458 -130685 -443857 -170779 -195902 -130034 -106825
511 -106825 108226 236952 430111 296594 126374 241132 -48671 117453 -103904 -222771
501 -222771 -258977 -58558 508453 445902 337040 138890 63762 5328 115840 30084 -9797
490 -9797 195852 -58744 -140511 -155773 63919 -147420 14715 70592 6851 -212436 96252
479 96252 -36366 216304 44874 347494 77633 -178813 -204120 -7582 62200 -94768
469 -94768 160431 73094 394921 312652 -17537 7127 -104972 16320 205446 131015 272027
458 272027 512741 275831 -29570 -445157 -97387 159812 260164 324335 478370 835707
448 835707 299975 412784 447066 560843 395127 470938 615446 376287 350358 39615
438 39615 -148323 -102998 -210 358629 24561 -405045 -172398 71936 218797 55026
428 55026 -171668 -176197 -231911 346780 303810 478186 297961 -37914 197750 206720 92269
417 92269 62269 40902 -187725 -210132 -145758 278876 103257 -279722 -111952 267850 -42629
406 -42629 -21201 384787 221510 92678 124868 225189 29142 23959 -159684 -146085 -347945
395 -347945 -251605 -239193 -307895 -9345 -183582 -68026 35720 148455 104141 323980 784975
384 784975 891398 233469 -207574 -256038 -5227 466450 843715 1004456 669952 247088
374 247088 176959 262562 -101872 255307 317499 394769 157974 -341187 -347088 -30762 30870
363 30870 -15242 353442 156672 128392 75728 151647 -29376 40333 73276 -289088 -212061
352 -212061 -140626 102060 6044 -237297 -179467 133496 516958 77027 52059 519692 13078
341 13078 -190592 -72294 -315966 -156637 229429 326914 538471 511451 -55171 -228883
331 -228883 58709 169048 213922 51634 119364 -292413 -226960 67080 172297 -122556
321 -122556 -123229 8448 163789 435282 727845 310669 234885 144577 73413 203105 -378496
310 -378496 -224012 146127 58165 -36082 -234168 -320462 -270791 -75547 218688 351557 529291
299 529291 19901 -274537 289622 380695 -92095 -30438 256912 493004 111548 -208444
289 -208444 -418444 -153464 426954 325533 290701 -262853 -407979 -332444 -373902 147197
279 147197 374350 90844 52890 -66598 193246 380017 375271 405960 230319 273875 335302
268 335302 547247 417284 377739 86849 432528 340302 708024 551158 494885 403721 -122201
257 -122201 -198596 -44591 -367739 -390074 -123658 -91964 210270 -154463 -374877 33843
247 33843 -61547 136510 209438 336109 207482 134054 271032 -12326 2888 -36326 4446
236 4446 361634 66991 -292772 -163775 55362 408096 492860 242147 128874 92104 359675
225 359675 40133 121970 137844 401157 237407 -367 12014 -79542 -212145 -115020 -3787
214 -3787 -193093 30168 226363 366939 189138 -14625 436402 453110 -166919 36769
204 36769 -240023 -248171 -52316 -4011 232743 190704 -169428 117623 -139686 -337050 58112
193 58112 200857 40268 457599 572511 340693 73170 141473 7385 166826 269471
183 269471 610332 506595 465437 537161 453022 186172 -185216 -75871 11502 -67931 -195158
172 -195158 -5045 286952 -75584 -143319 -228927 95459 464580 471347 472707 295839 77600
161 77600 -255660 -178273 17389 83165 142706 497278 373554 194080 345236 399691 276112
150 276112 93992 -225861 -102942 253900 296911 408465 399328 244388 186673 100259 51550
139 51550 22670 23373 292418 315329 256692 139245 239559 5474 239282 353008 28884
128 28884 88003 45742 -238975 -116522 -305430 -37265 280974 93599 157177 104157 -14553
117 -14553 -126704 88531 41150 66799 215836 192119 -365077 -290606 244565 146324 -93229
106 -93229 97190 298911 391828 289497 -16487 -183617 -212988 38058 335242 -34587
96 -34587 119907 198645 86988 18352 126973 155577 -16630 -208764 92195 575019 449397
85 449397 466914 401110 267875 225827 95328 43575 231554 454819 294860 109684 45421
74 45421 133457 -13361 257360 6967 224090 443262 278024 387278 354895 212741 376221
63 376221 359510 260616 283651 240694 21698 28030 -142346 27841 331795 232916 180126
52 180126 227823 278112 19690 -24985 -116525 -17142 27738 27921 307041 313523 149780 -56740
40 -56740 -147070 -76187 -203204 33252 -53936 15723 372706 311136 43811 150336 287016
29 287016 478465 434663 573183 371319 286293 105199 -57575 201488 23000 49523 381663
18 381663 352090 261896 388676 377333 7916 72104 133306 31113 39201 51503 29404 -97256
6 -97256 -13427 170690 226927 204472 302162 201859
0 201859
$$ Imaginary data points
##PAGE= N=2
##DATA TABLE= (X++(I..I)), XYDATA
16383 -2942609 -2607425 -2783872 -2599426 -2188302 -2032892 -1981653 -2491720 -2358478 -2283111 -2334269
16373 -2334269 -2290399 -2122567 -2117087 -2213501 -2141154 -2118085 -2365025 -2239266 -2001626 -1840313
16363 -1840313 -1814602 -1769902 -1854789 -1708928 -1538659 -1395786 -1432894 -1396653 -1290738 -1361002
16353 -1361002 -1304315 -1306834 -1533331 -1253504 -1381282 -1629621 -1635284 -1410974 -1275989 -1326730
16343 -1326730 -1181850 -1014062 -1292515 -1457235 -1286002 -1211170 -1056060 -961273 -943676 -1130702
16333 -1130702 -1181104 -1182457 -1006280 -1005397 -982384 -1099350 -1157474 -1081070 -864614 -817730 -760559
16322 -760559 -602544 -421347 -445678 -311582 -363110 -589108 -618988 -208670 -216331 -359835
16312 -359835 -447060 -352110 -304018 -106802 -108374 -116307 251967 359230 418657 202917 250571
16301 250571 369766 485372 197718 -50295 68276 337018 557154 -42616 -118914 190457
16291 190457 424307 188884 184307 400313 549917 611714 396244 245870 401189 595908
16281 595908 857585 790604 750362 574798 788912 898961 659169 705119 601885 784434
16271 784434 792875 1056941 1171830 1014411 976791 850940 836188 1018630 1008976 1052178 1266030
16260 1266030 1202489 781445 1265025 1269684 902638 1024543 995321 1272654 1135864 894920
16250 894920 796152 929940 1590744 1570685 1578917 1873169 1648217 1555320 1602833 1794249 1811715
16239 1811715 1675018 1403876 1362177 1722344 1724746 1420849 1678571 1441026 1113644 1712454
16229 1712454 1782381 1871463 1823194 1916697 1882413 2233717 2299944 2287160 2119214 2215787 2562357
16218 2562357 2638976 2524005 2112857 1753074 1809593 1946669 2054589 2056821 2146270 2099091
16208 2099091 1873335 2033266 1950268 2003821 2033906 1915510 2211307 2115889 2337969 2281187
16198 2281187 1902421 2144496 2232317 2433132 2739341 2869983 2748772 2446253 2701393 2120399
16188 2120399 2153148 2354032 2539732 2509896 2116995 2295806 2557138 2493535 2323727 2421040
16178 2421040 2795348 2812242 2583029 2446039 2710316 2670695 2482658 2372829 2393718 2688999
16168 2688999 2613701 2953720 2577885 2949176 2763598 2629932 2538542 2779430 2323184 2366153
16158 2366153 2198211 2182623 2410585 2533142 2521617 2625940 2531685 2677669 2656187 2617201
16148 2617201 2812201 3067619 3153518 2872825 2773801 2809778 3287950 2953200 2883574 2745739
16138 2745739 2889133 3293110 2998691 2959700 2908324 3022697 3460852 3273249 3132255 2880192
16128 2880192 2719750 2507887 2252255 2938111 3256082 3128060 2601794 2815267 3270705
16119 3270705 3277049 3352149 3211364 2959395 2715819 2618728 2765774 2594891 3412170 3703852
16109 3703852 3431446 3176233 2823212 2773344 2726191 2787952 2665529 2785161 2812631 3283820
16099 3283820 3428547 3484319 3071201 2715119 2989979 3212484 3138531 3043717 3279688 3379556
16089 3379556 3206624 3025643 2883758 3273396 2944856 3087252 3042930 2942948 2860666 2745605
16079 2745605 2715593 2414540 2256079 2638351 2591711 2991937 3412068 3753487 3362458 3542711
16069 3542711 3471489 3048568 2879610 2470466 2685003 2726556 2676357 3082822 3261279 3615348
16059 3615348 3319469 3339519 3429127 3447401 3427058 3268911 3081995 3146478 3275686 2862078
16049 2862078 2263999 2502025 3131254 3377395 3279806 2942120 3208415 2798147 2940652 2826405
16039 2826405 2760602 2806922 3050015 3127063 3322354 3425415 3287374 2886290 2734745 2993967
16029 2993967 3436950 3335028 3209749 3018332 2578564 2564471 2696218 2864497 3179099 3282908
16019 3282908 3267395 3086375 2717355 2733790 2831659 3239854 2935738 2565531 2499458 2547617
16009 2547617 2786952 2581507 2714004 2558897 2850174 3007580 3127985 3112141 2862102 2873421
15999 2873421 3160137 3566689 3249972 3354399 3345687 3101019 3527719 3312268 3335319 3239496
15989 3239496 3120196 3271141 3235757 3113496 2737337 3209830 3489168 3049954 3017936 2910329
15979 2910329 3154012 3564414 3381609 3255858 3148241 3241081 3201939 2717314 2712445 2903233
15969 2903233 2918268 2651604 2770992 2737748 3004655 3047743 2599018 2700148 2715454 2838219
15959 2838219 2653984 2857925 2944227 3015309 3033578 3115563 3450302 3936423 3314297 3071044
15949 3071044 3138077 2863019 2743793 2941533 2705244 2396995 3044843 3097100 3049943 2772311
15939 2772311 2808804 3042823 3331687 3338142 3248431 3228530 3119941 2811896 3127302 3478517
15929 3478517 3625555 3732975 3916618 3994925 3783627 3324954 3502073 3509380 3172864 2990147
15919 2990147 2641021 2777411 2863434 3305171 3290652 3075640 2709463 2792310 2948207 3149247
15909 3149247 3318301 3231676 3097956 3212492 3466337 3169804 2934584 3307175 3464212 3093399
15899 3093399 3146362 3116407 3357292 3536978 3475215 3163730 3155163 3637129 3612410 3111199
15889 3111199 3417893 3032628 3124578 3209306 3191250 3312579 3077907 2800064 2877359 2846255
15879 2846255 2955359 3159295 3382694 3651001 3430878 3242917 3112338 3228863 2895747
15870 2895747 2722542 3220117 3412551 3219880 3385410 3157152 3154360 3086873 3545437 3670909
15860 3670909 3490746 3567611 3421325 3227849 3141055 2937825 2857710 2841292 3129391 3301455
15850 3301455 3314667 2958372 3086350 3595763 4105833 3663387 3292422 3226857 2976172 2968137
15840 2968137 2956217 2987719 3357308 3290353 3389037 3377592 2791709 2767526 3044825 3327150
15830 3327150 3333570 3544688 3439212 2691465 2653021 2746916 3005651 2884609 3223402 2644907
15820 2644907 2433516 3221236 3459231 3547269 3377990 3004329 3020785 2918155 2945475 3386987
15810 3386987 3418979 3419461 3338693 3067580 3487232 3456937 3065417 2831398 2922941 3083769 2970730
15799 2970730 3092296 3046107 2923817 2943532 2859990 2990179 3058124 3132953 3329355 2984459
15789 2984459 3014837 3510135 3119723 2769267 3161016 2892048 3185917 3041398 3509343 3058955
15779 3058955 3282255 3612386 3539141 3161102 3285572 3028643 2783167 2866573 3047491 3092548
15769 3092548 3153978 3193668 3175425 2858704 3025977 3271856 2944487 3371099 3586868 3298676
15759 3298676 3050433 3360768 3446432 3124024 3065572 2920315 3294638 3458753 3148105 3133216
15749 3133216 3139262 3054953 2932297 3126377 3070703 3155060 3349675 3310898 3036072 2857932
15739 2857932 2888636 3034887 2958153 3164284 3291768 3026832 3020457 3214850 3083165 3122519
15729 3122519 3069386 3272862 3521395 3021722 2966739 3300716 3415642 3526683 3384309 3066227
15719 3066227 2991880 2998303 3326477 3308441 3131895 3313190 3598616 3151646 3012948 2929604
15709 2929604 3329238 3622415 2964318 2949148 3086081 3249846 3240932 3519408 3511344 3251355
15699 3251355 3293042 3074487 2859623 3072143 3432566 3348781 3169851 3012222 2859576 3147185
15689 3147185 3386095 3497627 3248415 3022985 3318869 3473405 3146839 2939208 3151435
15680 3151435 3310805 2882881 2782537 2894617 2889115 3033368 3114711 3055430 3298651 2952740
15670 2952740 2840681 3149003 3612677 3318494 3231846 3485082 3559700 3380608 3267184 3402800
15660 3402800 3811628 3542188 3098252 2981112 2968942 3279450 3576958 3416752 2967937 3290231
15650 3290231 3462154 3587148 3568001 3280685 3127883 3607869 3809627 3587060 3091184 2801188
15640 2801188 3012546 3040875 3103720 2760700 2740510 3187861 3312632 3197280 3118942 3348338
15630 3348338 3479454 3479738 3580047 3526441 3372964 3461766 3544456 3371942 3070713 3700872
15620 3700872 3776914 3224197 3116847 2683231 2680382 2957905 2982104 2763819 2829584 3037030
15610 3037030 3159646 3217857 3216280 3180254 3258119 3272030 2763048 3030007 3068511 3104001 3339990
15599 3339990 3150214 3242771 3174332 3116333 2934510 3332491 3370565 3236407 3044445 3104714
15589 3104714 3194359 2819030 2918725 3464726 3496046 3120424 3221763 3193078 3420790 3751959
15579 3751959 3521490 3361883 3265870 3351531 3332841 3222214 3165694 2848601 2910449 2917101 2751130
15568 2751130 3001468 3213927 3121185 2833592 3060957 3308681 3429099 3543322 3522743 3523941
15558 3523941 3438986 3144442 3455002 3432540 3336509 3497630 3113257 3354619 3568429 3579684
15548 3579684 3084029 3420109 3456243 3267594 3263613 3522768 3774771 3296748 3215605 3615373
15538 3615373 3382139 3358167 3276568 3554921 3486638 3145091 3158898 3137871 3102682 3122030 3243039
15527 3243039 3073221 3259966 3165363 3116139 3313654 3476572 3480536 3350998 3594566 3451500
15517 3451500 3238503 2980413 3135997 3618463 3525619 3294457 2980902 3043798 3663666 3725469
15507 3725469 3649659 3243190 2859179 3239007 3301490 3406975 3119494 3294438 3563580 3638373
15497 3638373 3693253 3262116 3117247 3115313 3100567 2934919 2809608 2855010 2972136 3257766
15487 3257766 2853239 2912341 3379205 2670782 2811038 2971389 2681595 2977245 2651264 2648561
15477 2648561 2835792 2602625 3004149 3468721 3434532 3436165 3232115 3454800 3313746 2900456
15467 2900456 3269803 3332285 3325614 3305712 3527819 2909956 2907776 3280294 3006808 2905781
15457 2905781 3118826 3149330 3133997 3208550 2872658 2982301 3108403 2971070 3211923 3323549
15447 3323549 3069163 3183670 3402929 3495558 3280523 2740254 2768447 3091776 2983638 3067917
15437 3067917 3492285 3371424 3030834 3001017 3622697 3660001 3537058 3453599 2971914 3421864
15427 3421864 3353605 2932363 3029152 3545023 3082086 3159941 3808221 3885276 3882798 3514824
15417 3514824 2986084 3264397 3489681 3292631 3403695 3227266 3215554 3487716 3179534 2746457
15407 2746457 2812392 3065330 2924242 3004908 3612483 3541475 3169913 3311771 3306197 2977647
15397 2977647 2855898 3366311 3196589 3119570 2814924 3126783 2826928 2803059 3008972 2918133
15387 2918133 3088017 2803382 2794108 2971223 3332993 3649876 3300322 2987166 3167884 2975599
15377 2975599 3095934 3274386 3481701 3280314 3218595 3344594 3305872 3248492 3336403 3415543
15367 3415543 3288705 3300034 3186058 2989071 3116741 3702827 3494279 3583963 3339249 3163983
15357 3163983 3421778 3338727 3131790 3368729 3289449 3282870 3145558 3206386 3209511 2825356 3021454
15346 3021454 3321996 3310728 3190463 3118665 3164058 3494396 3059519 2735718 3097661 3130837
15336 3130837 2981015 3418776 3404298 3142878 3351473 3475259 3087002 3214563 3012119 2951479
15326 2951479 3416681 3537415 3473329 3858655 3591280 3143433 3201786 3582714 3325835 3089414
15316 3089414 3178308 3005778 3390919 3576065 3164968 3489306 3382450 3156031 3131207 3394997
15306 3394997 3473062 3595046 3443042 3372647 3118843 3208771 2671882 2572395 2615632 2865831
15296 2865831 3084794 3260368 3218384 3044235 3404336 3164145 3199365 3712956 3831660 3496664
15286 3496664 3316684 3372340 3392914 2946859 3396270 3371626 3111422 3351836 3178310 3215795
15276 3215795 3350258 3618656 3645358 3554668 3537196 3691444 3668037 3606682 3770646 3342921
15266 3342921 3311752 3391234 3546911 3245162 3219458 3547799 3461444 3443782 3670351 3549438
15256 3549438 3205032 3242028 3330945 3623018 3492989 3672737 3295246 3095137 3218325 3225142
15246 3225142 3557548 3713997 3674747 3034184 2965160 3155462 2927865 3212245 3397507 3402325
15236 3402325 3308193 2770574 2982370 2857791 2969016 2664603 3086373 3529165 3374101 3527290
15226 3527290 3252778 3010679 3267055 3298285 3429412 3208830 3488496 3444333 3702198 3413141
15216 3413141 3244915 3297721 3360196 3624021 3271259 3638771 3415782 3226387 3655205 3973155
15206 3973155 3506912 3347651 3295700 3090553 3060345 3099240 3369260 3662452 3481486 3419085
15196 3419085 3554668 3534958 3487158 3599247 3619373 3977955 3504077 3136159 3003736 3139235
15186 3139235 3524400 3313343 3128818 3179338 3307823 2840043 3015719 3372307 3659520 3384797
15176 3384797 3510602 3457575 3134101 3453518 3417464 3408851 3410972 3238857 3378947 3564796
15166 3564796 3804657 3261277 3305834 3535037 3674098 3467408 3523564 3373461 3088813 2820029
15156 2820029 2944035 3621992 3692412 3396885 3019024 2930625 3269453 3338158 3211721 3127359
15146 3127359 3092015 3216310 2834246 2985982 3197271 3437892 3691577 3352365 3076863 3142815
15136 3142815 2903865 3152537 3199918 2661498 3048356 3462203 2994573 3067860 3357380 3230390
15126 3230390 3709786 3585354 3212485 3250151 3196376 3024033 3344548 3795612 3512343 2926602
15116 2926602 3197687 3329266 3736846 3440432 3183691 3705432 3356424 3715916 3158825
15107 3158825 3426401 3550459 4154161 4111969 3790674 3174506 3141927 3814749 3743172 3549628
15097 3549628 3374964 3666405 3519760 3537893 3547342 3521923 3316299 3328720 3658644 3447419
15087 3447419 3447458 3636195 3772754 3695810 3597233 3902606 3925632 3509900 3409670 3625179 3605500
15076 3605500 3353616 3169371 2958270 3473308 3963430 3408302 3032245 3391009 3305567 3123768
15066 3123768 3363482 3598104 3358637 3278298 3343921 3276289 3602891 3674812 3438483 3351187
15056 3351187 2916625 3395056 3079196 3190878 3235743 2982155 3096858 3260263 3218168 3118608
15046 3118608 3260473 3379942 3457652 3457027 3596665 3727037 3949662 3994864 3596544 3255680
15036 3255680 3624647 3586388 3276199 3101953 3576380 3626202 3410403 3551857 3472927 3360406
15026 3360406 3438112 4016691 4023845 3533725 3448249 3325904 3373971 3356749 3318567 3284455 3448862
15015 3448862 3219374 3619656 3463742 3199947 3390041 3153652 3300059 3314830 3306510 3670104
15005 3670104 3593882 3266258 2822864 2975841 3217551 3437328 3382401 3306842 3647496 3718239
14995 3718239 3346769 3659695 3289537 3270197 3278182 3232687 3019279 3375824 3343501 3574070
14985 3574070 3407888 3810043 3911446 3852781 3707576 3142961 3431808 3580660 3814013 3239775
14975 3239775 3121794 3222976 3246105 3477380 3594146 3655227 3626148 3618454 3686703 3291094
14965 3291094 3241362 3622734 3483486 3366305 3853828 3425994 3101737 3455415 3599427 3331797
14955 3331797 3391977 3221152 2997957 3254015 3373373 3562347 3469444 3033785 3098820 3316448
14945 3316448 3616961 3352157 3484148 3635516 3389660 3380128 3319906 3737323 3687891 3374945
14935 3374945 3336960 3219523 3378923 3157787 2732913 2554965 3221976 3529799 3656071 3492190
14925 3492190 3418091 3173370 2831392 3133356 3097435 3232986 3648090 3940374 3686136 3727476
14915 3727476 3994220 4053749 4071172 3483340 3418743 3356053 3192520 3255656 3117792 3638598
14905 3638598 3635446 3554150 3376176 3513611 3594891 3536872 3636399 3315208 3340416 2975246 3055857
14894 3055857 3373819 2948374 3358482 3469960 3596887 3333071 3138103 3238406 3123585
14885 3123585 3379329 3489131 3919838 3419587 3424685 3617624 3853840 3841236 3850704 3813823
14875 3813823 3626219 3667394 3468543 3499224 3536426 3511563 3522077 3448647 3535490 3558085 3329588
14864 3329588 3271358 3417496 3556629 3655352 3784630 3143994 2962389 3383095 3201223 2924654
14854 2924654 3260200 3805632 3813587 3846642 3777098 3861856 3713190 3688848 3496763 3404206 3482389
14843 3482389 3344132 3561688 3369653 3506132 3679346 3452673 3601136 3861344 3393659
14834 3393659 2820079 3093340 3672061 3771680 4046840 3828170 3221132 3471366 3593268 3502721
14824 3502721 3416303 3121446 3015045 3223961 3330617 4030855 3468693 3883873 3922544 3932321
14814 3932321 4118227 3700563 3636582 3476892 3412053 3310385 3038965 3330055 3837814 3508692
14804 3508692 3238763 3505891 3451377 3532350 3961002 3950747 3250709 3263190 3796003 3874940
14794 3874940 3810580 3674858 4103326 3775489 3800077 3708013 3686671 3169730 3075458 3828036
14784 3828036 3704377 3201254 3892956 3516214 3046186 3318033 3345789 3319601 3672274 3539995
14774 3539995 3527226 3773529 3686767 3710519 3892208 3853359 3900742 3476567 3133614 3428358
14764 3428358 3830885 3835375 3846447 3760551 3913248 3793742 3468081 3259211 3450564 3552756
14754 3552756 3678056 3854764 3587544 3491300 3777226 3933891 3930170 3962954 3348600 3311819
14744 3311819 3322227 3237879 3203085 3294096 3430524 3933652 3778431 3389022 3543207 3653423
14734 3653423 3788833 3757837 3479920 3372636 3335941 3313069 3332197 3234639 3633330 3875003
14724 3875003 3585756 3284372 3312783 3413940 3736816 3334056 3282074 3386122 3786296 3861756
14714 3861756 3397645 3263100 3719945 3803409 3599388 3512046 3422916 3367077 3397822 3916973
14704 3916973 4401846 3835728 3338724 3413451 2867977 3280979 3717681 3659831 3505184 3695286
14694 3695286 3655773 3554557 3560703 3644822 3629657 3481518 3318750 3134465 3403973 3658587
14684 3658587 3339816 3643762 3730884 3391807 3290597 3780875 3779226 3637881 3347288 3422620
14674 3422620 3633407 3580217 3516616 3483655 3222018 3264184 3526668 3549638 3423680 3220477
14664 3220477 3334552 3700372 3868736 3688257 3682118 3868959 3588601 3769234 3826574 3810048
14654 3810048 3873137 3779256 3817938 4205393 4024237 3863907 3811086 3596955 3824191 3760125
14644 3760125 3474467 3424528 3774553 3490992 3365186 3559349 3764872 3585739 3402466 3426422
14634 3426422 3705703 3856440 3724157 3499027 3348947 3996412 3665028 3601924 4147707 3629322
14624 3629322 3168416 3403310 3827759 3901046 3653683 3660092 3629926 3503134 3656724 3879931
14614 3879931 3866451 3718431 3977678 4033373 3826346 3925411 3671543 3182396 3709650 3835893
14604 3835893 3602240 3814442 3688054 3619795 4062557 4353575 4083790 3650104 3231870 3070941
14594 3070941 3425500 3436971 3681033 4093751 3646720 3388935 3183349 2899913 3177163 3266159
14584 3266159 3923441 3557646 3572061 3597132 3855250 3675538 3238478 3291747 3342181 3611129
14574 3611129 3388672 3551512 3822437 3924077 3800960 3636569 3702748 3797903 3995824 3599386
14564 3599386 3332972 3828714 3794597 4050925 3473974 3162663 3364129 3329199 3268675 3342541
14554 3342541 3433568 3781385 3705013 3588385 4039266 4019781 3632438 3716816 3836287 3757735
14544 3757735 3623633 3396722 3588500 3652368 3510825 3486637 3691712 4076630 3890167 3706714
14534 3706714 3711940 3647920 3554526 3202602 3275399 3359117 3293180 3556824 3617182 3567397 3748275
14523 3748275 3621241 3419431 3125500 3068787 3366055 3847050 3928800 3846894 3822173 3750305
14513 3750305 3147011 3468015 3670155 3683382 3327270 3424653 3641417 3286855 3255280 3579063
14503 3579063 4136219 4025994 3266396 3543420 3855047 3475828 3510937 3719438 3946229 3485551
14493 3485551 3319014 3541492 3664307 3761063 3847242 3963354 4094117 3877030 3905506 3698830
14483 3698830 3805756 3644476 3745683 3785244 3935958 3656321 3793099 3308167 3241985 3370693
14473 3370693 3172352 3297689 3322407 3783157 3395740 3747941 3785206 3905531 4085028 3661775
14463 3661775 3642943 3825833 3514539 3564880 3474237 3491001 3477770 3383242 3759872 3666825 3453204
14452 3453204 3634749 3623943 3520451 3849358 4071026 4228815 4340137 3907524 3587413 3363445
14442 3363445 3497162 3599876 3847058 3859822 3534124 3668127 3964128 4024671 3640526 3500167
14432 3500167 3337094 3726211 3533572 3405648 3435930 3774429 4158638 4151245 4150595 4092082 3971831
14421 3971831 3821055 3870605 3597536 3668119 3709531 3522588 3654267 3867588 3732828 3839965
14411 3839965 3918765 3726555 3805391 3756806 3950524 4077205 3745587 3756334 3777656 3909203
14401 3909203 3767307 3539568 3366358 3163315 3051070 3527870 3792147 3573544 3464251
14392 3464251 3255492 3402605 3500214 3267440 3752534 3787783 3634680 3864088 3300471 3443216
14382 3443216 3523550 3595486 3522036 4062711 3722891 3584431 3664890 3843912 4063944 4016660
14372 4016660 4076421 3904966 4422649 4085238 3619424 3633448 3476657 3699025 4142237 3752710
14362 3752710 3277716 3654877 3518199 3544646 3665536 3663253 3488045 3625190 3937959 3506467
14352 3506467 3635204 3298623 3336145 3582123 3895969 4075369 3545784 3537099 3724566 3811345
14342 3811345 3838114 3575108 3727183 3826295 4075910 4274171 4027948 3778803 3713038 3529219
14332 3529219 3774184 4091504 3542580 3656187 3917398 3842782 4173439 4022740 3736944 3744240
14322 3744240 3873239 3719017 3452593 3406963 3528485 3741368 3705585 3542497 3719105 3710149
14312 3710149 3404488 3727219 3722079 3592599 3787215 3807672 3712806 3867800 3998994 3896424
14302 3896424 3851103 3673851 4049109 4168573 3978523 3696618 3285632 3547084 3599270 3679402
14292 3679402 3451676 3502683 3913354 3868047 3666387 3445535 3815419 3552942 3139515 3488504
14282 3488504 3449086 3469088 3563082 3451083 3809609 3271914 3423889 3741851 3831367 3586441
14272 3586441 3463259 3594393 3395993 3357580 3497405 3805619 3806865 3662676 3617021 3695228
14262 3695228 3575343 3640001 3672358 3271181 3218753 3312442 3285275 3365745 3780449 3804799 3550041
14251 3550041 3481319 3510635 3655455 3374336 3472172 3752678 3534941 3613522 3612212 3647985 3949822
14240 3949822 4006364 3634358 3433335 3534931 3301941 3553778 3809761 3443894 3623863 3697976
14230 3697976 3571835 3521310 3416384 3005837 3456236 3723862 3773356 4293400 4068238 3832065
14220 3832065 3571809 3607330 3518466 3646953 4088566 3977309 4226173 4111090 3727188 3898745
14210 3898745 3765561 3396882 3712830 4032526 4120419 4201195 3983299 3719119 3461946 3498512
14200 3498512 3726351 3761060 3851712 4047730 3688233 3725467 3819099 3977894 3698342 3428421
14190 3428421 3394915 3774006 3760760 3441230 3426119 3877004 4033381 4203633 4086003 4043729
14180 4043729 3837674 3817413 3564117 3713294 3303786 3475066 3590295 3633335 3556416 3740454
14170 3740454 4013258 4132032 4212720 3713998 3182203 3866793 4434954 4460828 4457726 3933361
14160 3933361 4010239 3944474 3840806 3898035 3774598 4124289 4112838 3657492 3667784 3588475
14150 3588475 3655882 3351120 4070299 4103212 4141678 4222988 3941341 3640555 3696507 3680625
14140 3680625 3215566 3180980 3735279 4095167 3744537 3581758 3593520 3907595 4190271 4140772
14130 4140772 4534837 4486368 4341842 3962497 3860645 3872174 3714780 3835316 3603488 3652993
14120 3652993 3719609 3914129 4084172 3878739 3651565 3561631 3827439 4085750 3948428 3528133
14110 3528133 3718155 3971931 4250748 3996914 3775542 3874970 3809419 3552461 3664241 3560460
14100 3560460 3643462 3704857 3534904 3515736 4040638 3743845 3746354 3923151 4137269 4232182
14090 4232182 3767016 3712957 3760058 3539153 3730290 3821338 3548836 3928118 3979835 3529197
14080 3529197 3490076 3688719 3776392 3954884 4370486 4255596 4270401 4193197 4178161 3923682
14070 3923682 3931458 4021892 3732917 3811073 3720809 3731685 3785603 3754740 3811689 3931598 3708294
14059 3708294 3929052 3570880 3669001 4182279 3995096 3851648 4049149 3982939 3991401 3966003
$$ [...]
##END NTUPLES=NMR SPECTRUM
##END=
