##TITLE=1H_CG-1170
 DMSO
 8 sc, 
 25.11.2022
##JCAMPDX= 6.0         $$ Bruker NMR JCAMP-DX V2.0
##DATA TYPE= NMR SPECTRUM
##DATA CLASS= NTUPLES
##ORIGIN= UXNMR, Bruker Analytische Messtechnik GmbH
##OWNER= root
$$ XWIN-NMR		Version 3.5
$$ Fri Nov 25 13:52:42 2022 Russian Standard Time (UT+4h)  she@DPX200
##.OBSERVE FREQUENCY= 200.1313499994
##.OBSERVE NUCLEUS= ^1H
##.ACQUISITION MODE= SIMULTANEOUS
##.ACQUISITION SCHEME= undefined
##.AVERAGES= 8
##.DIGITISER RES= 18
##SPECTROMETER/DATA SYSTEM= spect
##.PULSE SEQUENCE= zg30
##.SOLVENT NAME= DMSO
##.SHIFT REFERENCE= (INTERNAL, DMSO, 0, 15.7524)
##AUDIT TRAIL= $$ (NUMBER, WHEN, WHO, WHERE, WHAT)
$$ ##TITLE= Audit trail, XWIN-NMR		Version 3.5
$$ ##JCAMPDX= 5.01
$$ ##ORIGIN= Bruker BioSpin GmbH
$$ ##OWNER= she
$$ F:/spectra/data/she/nmr/H-F/1/pdata/1/auditp.txt
$$ ##AUDIT TRAIL=  $$ (NUMBER, WHEN, WHO, WHERE, WHAT)
(   1,<2022-11-25 13:51:18.96 +0400>,<she>,<DPX200>,
      <created by zg, POWCHK disabled, PULCHK disabled
       configuration hash MD5:
       00 E9 B6 7A A2 85 ED C7 34 08 36 98 17 FE 4E 26
       data hash MD5: 16K
       D0 B5 17 3F 31 E0 F9 D9 85 5B 50 BD 8A 9D E5 1F>)
(   2,<2022-11-25 13:51:23.46 +0400>,<she>,<DPX200>,
      <Start of raw data processing
       efp BC_mod = 2 LB = 0.24 FT_mod = 6 PKNL = 1 PHC0 = -18300.07 PHC1 = 7.20072 SI = 16K 
       data hash MD5: 16K
       34 88 33 AD 16 91 A2 14 96 B0 16 F4 F7 37 7A F5>)
(   3,<2022-11-25 13:51:42.71 +0400>,<she>,<DPX200>,
      <pk PHC0 = -96.18729 PHC1 = 7.4 
       data hash MD5: 16K
       67 BA 9C 6E 58 50 00 EE 44 B8 18 E5 F9 E2 D8 6F>)
(   4,<2022-11-25 13:51:46.01 +0400>,<she>,<DPX200>,
      <abs ABSG = 5 
       data hash MD5: 16K
       26 BC 81 9C 59 73 15 C5 76 89 4C BB F6 B5 F8 41>)
$$ ##END=
$$ 
$$ hash MD5
$$ 29 F5 44 62 BF CD 81 E2 5E 42 8D 7C 5A 32 FD A8
##$RELAX= 
##$RELAX= 
##$RELAX= 
##$RELAX= 
##$RELAX= 
##$RELAX= 
$$ Bruker specific parameters
$$ --------------------------
##$DU= <F:/spectra>
##$EXPNO= 1
##$NAME= <H-F>
##$PROCNO= 1
##$TYPE= <nmr>
##$USER= <she>
##$AMP= (0..31)
100 100 100 100 100 100 100 100 100 100 100 100 100 100 100 100 100 100 
100 100 100 100 100 100 100 100 100 100 100 100 100 100 
##$AQSEQ= 0
##$AQ_mod= 1
##$AUNM= <au_zg>
##$AUTOPOS= <>
##$BF1= 200.13
##$BF2= 200.13
##$BF3= 200.13
##$BF4= 200.13
##$BF5= 200.13
##$BF6= 200.13
##$BF7= 200.13
##$BF8= 200.13
##$BYTORDA= 1
##$CFDGTYP= 0
##$CFRGTYP= 5
##$CHEMSTR= <none>
##$CNST= (0..31)
1 1 145 1 1 1 1 1 1 1 1 1 1 1 1 1 1 1 1 1 1 1 1 1 1 1 1 1 1 1 1 1 
##$CPDPRG= <>
##$CPDPRG1= <>
##$CPDPRG2= <>
##$CPDPRG3= <>
##$CPDPRG4= <mlev>
##$CPDPRG5= <mlev>
##$CPDPRG6= <mlev>
##$CPDPRG7= <mlev>
##$CPDPRG8= <mlev>
##$CPDPRGB= <>
##$CPDPRGT= <>
##$D= (0..31)
0 1.2 0 0 0 0 0 0 0 0.06 0 0.03 0 0 0 0 0.0002 0 0 0 0 0 0 0 0 0 0 0 0 
0 0 0 
##$DATE= 1669369878
##$DBL= (0..7)
120 120 120 120 120 120 120 120 
##$DBP= (0..7)
150 150 150 150 150 150 150 150 
##$DBP07= 0
##$DBPNAM0= <>
##$DBPNAM1= <>
##$DBPNAM2= <>
##$DBPNAM3= <>
##$DBPNAM4= <>
$$ [...]
##$SUBNAM3= <"">
##$SUBNAM4= <"">
##$SUBNAM5= <"">
##$SUBNAM6= <"">
##$SUBNAM7= <"">
##$SUBNAM8= <"">
##$SUBNAM9= <"">
##$SW= 18.0517283424941
##$SWIBOX= (0..15)
0 0 2 0 0 0 0 0 0 0 0 0 0 0 0 0 
##$SW_h= 3612.71676300578
##$TD= 16384
##$TD0= 1
##$TE= 0
##$TE2= 300
##$TE3= 300
##$TEG= 300
##$TL= (0..7)
0 120 120 120 120 120 120 120 
##$TP= (0..7)
150 150 150 150 150 150 150 150 
##$TP07= 0
##$TPNAME0= <>
##$TPNAME1= <>
##$TPNAME2= <>
##$TPNAME3= <>
##$TPNAME4= <>
##$TPNAME5= <>
##$TPNAME6= <>
##$TPNAME7= <>
##$TPOAL= (0..7)
0.5 0.5 0.5 0.5 0.5 0.5 0.5 0.5 
##$TPOFFS= (0..7)
0 0 0 0 0 0 0 0 
##$TUNHIN= 0
##$TUNHOUT= 0
##$TUNXOUT= 0
##$USERA1= <user>
##$USERA2= <user>
##$USERA3= <user>
##$USERA4= <user>
##$USERA5= <user>
##$V9= 5
##$VALIST= <valist>
##$VCLIST= <CCCCCCCCCCCCCCC>
##$VD= 0
##$VDLIST= <DDDDDDDDDDDDDDD>
##$VPLIST= <PPPPPPPPPPPPPPP>
##$VTLIST= <TTTTTTTTTTTTTTT>
##$WBST= 1024
##$WBSW= 4
##$XGAIN= (0..3)
0 0 0 0 
##$XL= 0
##$YL= 0
##$YMAX_a= 153987
##$YMIN_a= -105149
##$ZGOPTNS= <>
##$ZL1= 120
##$ZL2= 120
##$ZL3= 120
##$ZL4= 120
##$ABSF1= 15.7524
##$ABSF2= -2.299449
##$ABSG= 5
##$ABSL= 3
##$ALPHA= 0
##$AQORDER= 0
##$ASSFAC= 0
##$ASSFACI= 0
##$ASSFACX= 0
##$ASSWID= 0
##$AUNMP= <proc_1d>
##$AZFE= 0.1
##$AZFW= 0.1
##$BCFW= 0
##$BC_mod= 2
##$BYTORDP= 0
##$COROFFS= 0
##$CY= -3
##$DATMOD= 1
##$DC= 0
##$DFILT= <>
##$DTYPP= 0
##$F1P= 0
##$F2P= 0
##$FCOR= 1
##$FTSIZE= 16384
##$FT_mod= 6
##$GAMMA= 0
##$GB= 0
##$INTBC= 1
##$INTSCL= 3.70164e-10
##$ISEN= 128
##$LB= 0.24
##$LEV0= 0
##$LPBIN= 0
##$MAXI= 10000
##$MC2= 0
##$MEAN= 0
##$ME_mod= 0
##$MI= 1.114404
##$NCOEF= 0
##$NC_proc= -7
##$NLEV= 6
##$NOISF1= 3.799351
##$NOISF2= 2.8
##$NSP= 0
##$NTH_PI= 0
##$NZP= 0
##$OFFSET= 15.7524
##$PC= 1
##$PHC0= -18396.26
##$PHC1= 14.60072
##$PH_mod= 1
##$PKNL= yes
##$PPARMOD= 0
##$PSCAL= 0
##$PSIGN= 0
##$REVERSE= no
##$SF= 200.130003830457
##$SI= 16384
##$SIGF1= 3
##$SIGF2= 2
##$SINO= 5.538805
##$SIOLD= 16384
##$SREGLST= <1H.CDCl3>
##$SSB= 0
##$STSI= 16384
##$STSR= 0
##$SW_p= 3612.71676300578
##$SYMM= 0
##$S_DEV= 0
##$TDeff= 16384
##$TDoff= 0
##$TI= <>
##$TILT= no
##$TM1= 0
##$TM2= 0
##$TOPLEV= 0
##$USERP1= <user>
##$USERP2= <user>
##$USERP3= <user>
##$USERP4= <user>
##$USERP5= <user>
##$WDW= 1
##$XDIM= 16384
##$YMAX_p= 315310629
##$YMIN_p= -956802
$$ End of Bruker specific parameters
$$ ---------------------------------
##NTUPLES= NMR SPECTRUM
##VAR_NAME=  FREQUENCY,     SPECTRUM/REAL,   SPECTRUM/IMAG
##SYMBOL=    X,             R,               I
##VAR_TYPE=  INDEPENDENT,   DEPENDENT,       DEPENDENT
##VAR_FORM=  AFFN,          ASDF,            ASDF
##VAR_DIM=   16384,         16384,           16384
##UNITS=     HZ,            ARBITRARY UNITS, ARBITRARY UNITS
##FACTOR=    0.220516191357247, 1,           1
##FIRST=     3152.52795204154, 0,            0
##LAST=      -460.188810964235, 0,           0
##MIN=       -460.188810964235, -956802,     0
##MAX=       3152.52795204154, 315310629,    0
$$ Real data points
##PAGE= N=1
##DATA TABLE= (X++(R..R)), XYDATA
$$ [...]
8235A208126j83563K41642l2416K1530k98089j48004o36J12802r4934k06112j00868
8224E19478K1916L92980J05295j07262L20381l87098j66030k87835j23543K08107
8214D96389j41535J74162Q0183k89705L6661K14246k51633J25493N2010j31320
8204C64951o4205O9981m1098J85574j69138O7532J80965K42235m22170k5336j87560
8193B01731J207256Q61383j491772p09383J42134K04355k7455k34686K68855k15657
8183B06761n762L92962k12177j98157j20143P9664m2666m7572L68975J79324j97077
8172D04132k32185m4685J97721L0819L24225k05630l11444j18898M8498J65328
8162B57881K05374j94994j64736J05622Q4235o0058J74676j25282k459j85708
$$ plain form
8235 1208126 1024563 1266205 1233789 1255319 957230 809226 808590 921392 826458 620346 519478
8224 519478 541394 934374 1039669 932407 1252788 865690 699660 411825 288282 496389
8214 496389 354854 529016 609199 319494 356155 570401 318768 444261 496271 364951
8204 364951 300746 370727 329629 515203 346065 413597 594562 836797 414627 389291 201731
8193 201731 1408987 2270370 778598 69215 211349 415704 388249 153563 422418 206761
8183 206761 200999 593961 381784 183627 63484 143148 100482 52910 421885 601209 404132
8172 404132 171947 127262 324983 355802 680027 474397 162953 44055 92553 257881
8162 257881 463255 268261 103525 209147 293382 233324 408000 282718 280259 94551
8152I4551k00531K05782n6635j38378j16222K08407J88220m8592l49876k73485
8142d86759K32704J36165K16589n5182j66313P8661K23584J74175k09170j9666
8132A24788J63426m33525J95030N6336j9756J54408j5579j00617k8388j39576
8122d3453J01473j51712l27557J45477k37825M47609R9261m614j07741K56135
8112A77053J51279q8030O4115o7049j34278R9627j46168k21548L4253J12688R2520
8101G4462K85469o6381q0590k12462P3402j08411j22871R3524R1125j43396j08914
8090b25043K27536L09293P5789l61740N4367r7814L62746p8067l37206o5465L148
8079a32456r7264P8799Q1908M6642L07710j88087m5439n459J37267k69815j61271
$$ plain form
8152 94551 -105980 99802 43167 -95211 -211433 -3026 185194 136602 -213274 -486759
8142 -486759 -254055 -117890 98699 43517 -122796 -44135 179449 353624 144454 124788
8132 124788 288214 -145311 49719 106055 86299 240707 225128 124511 96123 -43453
8122 -43453 58020 -93692 -421249 -275772 -513597 -65988 33273 28659 -79082 177053
8112 177053 328332 240302 304417 237368 103090 202717 56549 -164999 -130746 -18058 74462
8101 74462 359931 293550 212960 498 73900 -34511 -157382 -63858 27267 -116129 -225043
8090 -225043 2493 311786 387575 25835 80202 -17612 345134 267067 -70139 -135604 -132456
8079 -132456 -229720 -150921 -69013 -22371 285339 97252 51813 46354 183621 -86194 -247465
8068b47465K55041P3225K50318l17451k19410j93088K49868L40400J76410m4833
8058C23015j17814J39326M1544j881k39647N3970M1797J57142L152l22299J94143
8047B72448L75752k95626J54436j11345r4685j24942j12157J62938R3928K0890
8037C41637j44939k26304R9234j71172k32400P8957j0688Q5946L37292J59783
8027C17346p4279k26898k4114r894O4475j23990j10961J56147K25874M9433M6852
8016B89991k3828l2169J61588l03097l6420k9366j26932M1506L7612J49586K2020
8005A50491k55305J23252j98413l5378J80613J47659K93321m0170m15072J61608
7995A12606j58634K22039l23049J00655q811j34312m6113k51550l6047N44856
$$ plain form
8068 -247465 7576 80801 331119 13668 -205742 -398830 -148962 191438 367848 323015
8058 323015 205201 344527 386071 384190 144543 198513 240310 397452 400604 78305 272448
8047 272448 648200 352574 507010 395665 300980 176038 63881 226819 320747 341637
8037 341637 196698 -29606 69628 -101544 -333944 -254987 -265675 -179729 157563 317346
8027 317346 243067 16169 -7945 -17839 46636 -77354 -188315 -32168 193706 243139 289991
8016 289991 266163 233994 395582 92485 56065 26699 -100233 -58727 -21115 128471 150491
8005 150491 -104814 18438 -179975 -215353 -34740 112919 406240 366070 -49002 112606
7995 112606 -46028 176011 -147038 -46383 -55194 -189506 -235619 -487169 -523216 21640
7985B1640k3851L4961k90455k47268L51057q8241q1638k65357Q6574K36215j78004
7974d44367J14322K17657j0990K12100m5190J52737j56599l24066k78063L28544
7964b33915o2695l00603K73713K90138n65034J66710M45011j06871j23221R6157
7954a20610J58069j49872N8457K31179j50747K0952j43763J80018L3785l62178
7944b44710L77914j15284j35838J53111k12301l00913k5071j32322J21449K80265
7934b33700k08698K81275Q5349j06498J80119j58510L3059j81092R8353K57854
7924D7511p7242j4807K13872m4563m02120l65278L90417L17528l59476R4000K50968
7913E0810J46086j55285k34775J13147l1915R252q0674K28935l11198j54057L12693
$$ plain form
7985 21640 -2211 32750 -257705 -504973 -153916 -242157 -323795 -589152 -502578 -266363 -444367
7974 -444367 -330045 -112388 -123378 88722 43532 196269 39670 -284396 -562459 -233915
7964 -233915 -296610 -597213 -323500 -33362 -598396 -431686 13325 -93546 -216767 -120610
7954 -120610 37459 -112413 -53956 177223 26476 47428 -96335 83683 117468 -244710
7944 -244710 133204 17920 -117918 35193 -177108 -478021 -503092 -635414 -513965 -233700
7934 -233700 -442398 -161123 -75774 -182272 -2153 -160663 -127604 -308696 -210343 47511
7924 47511 -29731 -44538 169334 124771 -277349 -642627 -252210 65318 -294158 -200158 50810
7913 50810 196896 41611 -193164 -80017 -111932 -102680 -183354 45581 -265617 -419674 -106981
7902a06981N4941N3271j30073j13343K28235j42524M8801J37766q5534M6279J47674
7891A38512r2648p624j92777j72185R1693l37085K35329l02113j63801j5282M24387
7880c93594j92007k64168J36741j2919j44305M89183J34427m0813K03668r6989
7870a80776m6407q7997n4447j9744j43006l2755J55197l7650J52172n1452j22035
7859d68900j49886K05284K32316j55851n1535r8596L34942K31490j30917j90891
7849b42544K68380M7811m25522R7903K19486l63654L81216N263j92695k25299
7839d29655P0101K60941n8215j69757j21470j4520l7756R5060j5037l0238m9224
7828d99770J80489N221j64017K7372J30931L7872j78038R6849L42255k9420M118
$$ plain form
7902 -106981 -52040 1231 -128842 -242185 -13950 -156474 -107673 30093 -55441 -9162 138512
7891 138512 45864 38240 -154537 -326722 -235029 -572114 -336785 -638898 -802699 -817981 -393594
7880 -393594 -585601 -849769 -713028 -725947 -870252 -381069 -246642 -287455 -83787 -180776
7870 -180776 -227183 -315180 -369627 -389371 -532377 -565132 -409935 -447585 -295413 -346865 -468900
7859 -468900 -618786 -413502 -181186 -337037 -388572 -487168 -152226 79264 -51653 -242544
7849 -242544 25836 73647 -351875 -253972 -34486 -398140 -16924 -11661 -204356 -429655
7839 -429655 -359554 -98613 -156828 -326585 -448055 -462575 -500331 -405271 -420308 -450546 -499770
7828 -499770 -319281 -314060 -478077 -450705 -319774 -281902 -459940 -363091 -20836 -50256 -46138
7817d6138J26659j93934l24616J62313m94628M51367L75444o4119j63298k43846
7807d14796M1077J24257j85807k1102M12660j79519N2504L0115l39833p8278P6308
7796d82414J99157K19547j60238K2372L1170q6703K17153k90420l6110l21756
7786f88242M51405K82930l8493k89251J07823N4799o0727L4600K05497J79049
7776B39390m56744k87807J79422M9265O8166K83610l91884J63618N407k05226
7766c52783m0294r1204Q8065j12150J19598J43263Q3290j83407j48063J06324
7756c87361j69921n9168J59106L57794k2666J78948m95040j16128L09655l9149
7746b83930J68250j67797J32825k78858j85864M64378n8770L0947j04294J34909
$$ plain form
7817 -46138 80521 -113413 -438029 -275716 -770344 -318977 56467 -7652 -170950 -414796
7807 -414796 -373719 -249462 -435269 -456371 -43711 -223230 -170726 -140611 -480444 -558722 -482414
7796 -482414 -283257 -63710 -223948 -201576 -170406 -257109 -39956 -330376 -366486 -688242
7786 -688242 -236837 46093 7600 -281651 -173828 -119029 -179756 -145156 60341 239390
7776 239390 -217354 -505161 -325739 -276474 -208308 75302 -316582 -152964 -147557 -352783
7766 -352783 -393077 -484281 -396216 -508366 -388768 -245505 -162215 -345622 -493685 -387361
7756 -387361 -557282 -616450 -457344 -99550 -122216 56732 -438308 -554436 -244781 -283930
7746 -283930 -115680 -283477 -150652 -429510 -615374 -150996 -209766 -178819 -283113 -148204
7736a48204K88626k14833j56386N7542k92943n7733L3150K7504N00278k49721
7726b12720j59215R8107j70343P6011o1732J4133n0866J16396K35367O3351r5628
7715a47139J75936j49982m3072J32651K4473J52586n5395k8489k65633j82920
7705c86984J33309k04531R8623p1487l0906q1896J06415L22828J77805j78546
7695a15370R0451j00276k46589J59039J45333N9497r6808K5762m69272K48701
7685b99532J73800p0233m2861P1474j05205J4032Q1181N9061Q1664J58718j59290
7674c7191j71841J83748l10907j7283o576l4309J09912L98574p3912m40800J01469
7663b99116l5829j50645J06016K46623l58153L54163o4138K13754l9713l35021
$$ plain form
7736 -148204 140422 -74411 -230797 -173255 -466198 -523931 -490781 -463277 37001 -212720
7726 -212720 -371935 -273828 -444171 -368160 -429892 -415759 -466625 -350229 -114862 -51511 -147139
7715 -147139 28797 -121185 -164257 -31606 -7133 145453 90058 61569 -204064 -386984
7705 -386984 -253675 -458206 -359583 -431070 -461976 -543872 -437457 -114629 63176 -115370
7695 -115370 -24919 -125195 -371784 -212745 -67412 -7915 -104723 -78961 -548233 -299532
7685 -299532 -125732 -195965 -238826 -167352 -272557 -258525 -177344 -118283 -36619 122099 -37191
7674 -37191 -209032 -25284 -336191 -353474 -360050 -394359 -284447 114127 40215 -400585 -299116
7663 -299116 -334945 -485590 -379574 -132951 -491104 -136941 -201079 12675 -27038 -362059
7653c62059R4526j44613R8189j22302J07393O5227J99179j23266j29808j44255
7643d61789K2867K63108k5570J93784r1497l83743N7167j59915M8822O539L05268
7632b24959J51115L2848j93389j13493R5855o1935k320P2309j4674M0537n62623
7621g80729J69222K72118k79255n1634K34782K27121n2169k96083J44803J45222
7611b66602j00982l52847P3602K01866p0696L58490K2806o9077j98279n1252n5153
7600e08124K77960O8440k12163K13088N2405k33513K31227K5220k05093j80241
7590d70794J31685l6278J37668O5840J16564n08930J48861K98320l67912L27730
7580a57246J20142k83655P1649R3881r0774J09477J5975l55562J81447M8244L8070
$$ plain form
7653 -362059 -267533 -412146 -313957 -436259 -328866 -263639 -64460 -187726 -317534 -461789
7643 -461789 -438922 -175814 -201384 -7600 -99097 -482840 -425673 -585588 -536766 -530227 -224959
7632 -224959 -73844 -40996 -234385 -347878 -252023 -313958 -316278 -243969 -258643 -218106 -780729
7621 -780729 -611507 -339389 -618644 -670278 -435496 -208375 -260544 -556627 -411824 -266602
7611 -266602 -367584 -720431 -646829 -444963 -515659 -157169 -134363 -203440 -401719 -452971 -508124
7600 -508124 -230164 -161724 -373887 -160799 -108394 -341907 -110680 -85460 -290553 -470794
7590 -470794 -339109 -375387 -237719 -171879 -55315 -564245 -415384 -117064 -484976 -157246
7580 -157246 -37104 -320759 -249110 -155229 -246003 -136526 -120551 -476113 -294666 -246422 -208352
7569b08352J47654j28797J64795J09228j49598j25178k30114l6459L18513N2529
7559h5779p2522j14997j10680M8214k9569j97599J85428J08441m5775K67988j30235
7548a77085j32310R0082J30352J13526Q6157k24851j68433L39008j47577k73145
7538c64276J37206K69673P5223k47774k52068j28524M306K0580j27441J05383
7528e07712j3230P7708J64883q3655n3818J81921j78629J515r9023K5645p3727
7517e58122L42090L05039j09098K15243m5670q0479l14684j89650J41304L8227
7507b55800k94823K17838l3063Q3960N2098k50376j58802K91342K33955R9828
7497a3843l52046J76475J82625j51944j78328j52328L91352j47397r6828j58954
$$ plain form
7569 -208352 -60698 -189495 -24700 84528 -65070 -190248 -420362 -456821 -138308 -85779
7559 -85779 -158301 -273298 -383978 -335764 -365333 -562932 -377504 -269063 -314838 -46850 -177085
7548 -177085 -309395 -219313 -88961 24565 110722 -114129 -282562 56446 -91131 -364276
7538 -364276 -227070 42603 117826 -129948 -382016 -510540 -506234 -485654 -613095 -507712
7528 -507712 -520942 -443234 -278351 -362006 -415824 -233903 -412532 -411017 -510040 -484395 -558122
7517 -558122 -216032 89007 -20091 195152 149482 69003 -245681 -435331 -294027 -255800
7507 -255800 -550623 -332785 -365848 -281888 -229790 -480166 -638968 -347626 -113671 -13843
7497 -13843 -365889 -189414 -6789 -158733 -337061 -489389 -98037 -245434 -342262 -501216
7487e01216J17941J30157n496o6887J42527J60335k92725l2916K5437K34877K69564
7476A81598j01499m57318q4859J58492j31775J76453k0943o7998N0651K56297
7466d0901j00624j83279j17219K31919J28846q3682j51421l1266J91832K14474
7456E8679l27910q3321J29625k0954r1517J3479L18640O6578L90907L7778n27058
7445c5074O4343j53568K1125r3884m2524J35226j51016l96754k10265N34215J887
7434c26289l80952J87925O3678L97214K75720k58984P2673j79303q8120m8553
7424b84991J09313J2954n3124j6281j87168k5071K81836J78047k26568k26134
7414d37187Q5764J06029k27393o1019j61034k6213L00544j16572K70134K2636
$$ plain form
7487 -501216 -383275 -253118 -258614 -325501 -182974 -22639 -315364 -348280 -322843 -87966 181598
7476 181598 80099 -377219 -462078 -303586 -435361 -258908 -279851 -347849 -297198 -40901
7466 -40901 -141525 -324804 -442023 -210104 -81258 -164940 -316361 -347627 -155795 58679
7456 58679 -269231 -352552 -222927 -243881 -335398 -321919 -3279 63299 454206 491984 -35074
7445 -35074 29269 -124299 -103174 -197058 -239582 -104356 -255372 -652126 -862391 -328176 -326289
7434 -326289 -707241 -519316 -455638 -58424 217296 -41688 30985 -148318 -236438 -284991
7424 -284991 -175678 -162724 -215848 -232129 -419297 -444368 -162532 15515 -211053 -437187
7414 -437187 -351423 -245394 -472787 -533806 -694840 -721053 -420509 -537081 -266947 -244311
7404b44311J95963j17593j12684J42013P1278p4680k3244K04144k77647p1424
7394c08185J38773k5492L6338O5445Q6894R891M3600J02198j37686m3232j8371
7383d9827N7286k12415j9634l8344m4229R9400M9159K45711k29577j09636J51939
7372a00167q4247k35666O7318J8864o8884K68569L77014k04373q0532l65452L4877
7361c72679J22175j7144m6598J30851l17568k98768J21331M88673k4407l16442
7351e30576j15928K17633M12356J7047o4987n18716L27722l8961K00036j48193
7341b42567n7601P9133J57310J1845K04330J39413k32268l11463j53279j57344
7331e62491K76470J37183J14581N0251j85403j60148R0750M8775O6186K39642
$$ plain form
7404 -244311 -48348 -165941 -278625 -136612 -65334 -140014 -163258 40886 -236761 -308185
7394 -308185 -169412 -194904 -158566 -93121 -6227 3664 47264 149462 11776 -31456 -49827
7383 -49827 7459 -204956 -224590 -262934 -307163 -207763 -158604 87107 -142470 -252106 -100167
7372 -100167 -184414 -420080 -352762 -333898 -402782 -134213 242801 38428 -42104 -407556 -372679
7361 -372679 -250504 -267648 -314246 -183395 -500963 -799731 -678400 -189727 -214134 -530576
7351 -530576 -646504 -428871 -16515 532 -64455 -583171 -255449 -294410 -94374 -242567
7341 -242567 -300168 -221035 -63725 -51880 152450 291863 59595 -251868 -405147 -562491
7331 -562491 -286021 -148838 -34257 15994 -169409 -329557 -238807 -190032 -123846 115796
7321A15796k86820k82434m7403J60121j44983r7266L59696L18179j27817j64151
7311a97082j51399p2970j68760L34188k17441j03753L13107P089K76650L163k43826
7300b21034N3910R0614j94622k12212j91230p1024J09610J7600J23741L51908
7290a42739j97787n9985M2841p8815L75854k61310L591J32718j33964k16385m1572
7279e77553J7523m4022O113L00903j29673k23013j3188J03698R4800K4179j19056
7268e59289m6469Q8857j49555O2899K42638K2530j09318k71264K42944R7438n7044
7257d35633J23110m17847J39069J71058K63702k68216l30287O6709K56928M0056
7247c91351l58893K35740K83615K58054k72603k78037k330M58563J1981j49752
$$ plain form
7321 115796 -171024 -453458 -500861 -340740 -485723 -582989 -223293 94886 -32931 -197082
7311 -197082 -348481 -421451 -590211 -256023 -473464 -577217 -264110 -257021 19629 22792 -221034
7300 -221034 -167124 -76510 -271132 -483344 -674574 -745598 -635988 -618388 -494647 -142739
7290 -142739 -340526 -400511 -357670 -436485 -60631 -321941 -318350 -185632 -319596 -535981 -577553
7279 -577553 -560030 -604052 -597939 -297036 -426709 -649722 -662910 -559212 -464412 -440233 -559289
7268 -559289 -605758 -516901 -666456 -603557 -360919 -338389 -447707 -718971 -476027 -378589 -435633
7257 -435633 -312523 -730370 -591301 -420243 -156541 -424757 -755044 -688335 -431407 -391351
7247 -391351 -750244 -514504 -230889 27165 -245438 -523475 -525805 -67242 -55261 -205013
7237b05013j70510j22623j8908n3262k14310L2022M35211J68493J08055K30032
7227A89187j99590l02328L14897k27226k11881N5099K32434q127j02060L3445
7217b26150K71446j59253K33934j05295j95498j73151J59363k67979J62843j6898
7207c16638N8803J67203j62697K13867N4876J27942m3409j13321r8372o6013l5437
7196b13196P7401L10866j10582l95349J11284Q2601o0616Q0855k3731k62789j43104
7185e46360J35754j05841r3481K63431o3265M7606J74935K15842m06790n673M27785
7174D3943m6540O3788p0740J79839j79183l77627L731M4843R0018l47213K02194
7163c92947L92563j44881J80614K62692j51750j81021k56443J996k54259k216
$$ plain form
7237 -205013 -375523 -498146 -517054 -570316 -784626 -752604 -317393 -148900 -40845 189187
7227 189187 -10403 -312731 2166 -225060 -436941 -381842 -149408 -157535 -259595 -226150
7217 -226150 45296 -113957 119977 14682 -180816 -353967 -194604 -462583 -299740 -316638
7207 -316638 -257835 -90632 -253329 -39462 15414 143356 99947 -13374 -111746 -177759 -213196
7196 -213196 -135795 175071 64489 -330860 -219576 -136975 -197591 -116736 -140467 -403256 -546360
7185 -546360 -410606 -516447 -609928 -346497 -409762 -362156 -187221 28621 -378169 -383842 43943
7174 43943 -2597 61191 -9549 170290 -8893 -386520 -382789 -337946 -247928 -595141 -392947
7163 -392947 -384 -145265 35349 298041 146291 -34730 -291173 -289177 -543436 -545652
7153e45652L05945K6264J22668J32233j53339P8824k64168k68719K14656J39284
7143b12004k32213N0232M3957m820l6129l576N1N6686m6715M8772K47156R5106
7131F503j25972K5302K44824J62469l53178l62678L51072n2845l947N6572N6933
7120E055k01451j63509L63226J87507j1517o8939j66219k5532K5406k11329O639
7109b60663K03779r2370J54016k2567R3234j79990k54197J12491p408j54790m0032
7098d48497M4232J74346J94340o4037L3562j34207k12125K60360p763k12058p8441
7087d50288J71981J996K31439J19141m75963N8282L14929J21542K9026l64902
7077b42817J77J04729l74178J71655p3721j17564j710L2084N21489l9672k46356
$$ plain form
7153 -545652 -239707 -213443 -90775 41458 -111881 -33057 -297225 -565944 -351288 -212004
7143 -212004 -444217 -393985 -350028 -354848 -390977 -394553 -394502 -337816 -384531 -335759 -88603 6503
7131 6503 -119469 -94167 150657 313126 -40052 -402730 -51658 -104503 -108450 -51878 5055
7120 5055 -196396 -359905 3321 190828 179311 110372 -55847 -81379 -55973 -267302 -260663
7109 -260663 -56884 -149254 4762 -17805 75429 -104561 -358758 -246267 -253675 -408465 -448497
7098 -448497 -404265 -229919 -35579 -99616 -66054 -200261 -412386 -152026 -159789 -371847 -450288
7087 -450288 -278307 -276311 -44872 74269 -401694 -343412 -28483 93059 122085 -242817
7077 -242817 -242640 -137911 -512089 -340434 -414155 -531719 -533429 -501345 20144 -19528 -265884
7066b65884J75193j89976N6490K13161p8638j51592R4460m1387J9101m6903k30956
7055d46931L54515P388J24304K05527l32052J32015k27675J16267K38284j69772
7045A870j90445J76225k06757m2106r2414K75281J42125l40109k13739J48829
7035c41240K90282k6696J89214k48014p1831K02231j36822j8409p3912k70883
7025e06080n2629J25195k9617n8504J44360K1758J44092L0820K7787R3957M4713
7014a4148k34976L0926K1075J89373j53051k34588j01628l0671K10400P185K25536
7003h4567k043r0592j10347J29294L2458m0816K95882k02947r3330J27246j16074
6992a55836j51185K99718j07749J95895l60286K8867k35965K15167P2129k66338
$$ plain form
7066 -265884 -90691 -280667 -224177 -11016 -89654 -241246 -146786 -188173 -169072 -215975 -446931
7055 -446931 -92416 -85028 39276 244803 -87249 44766 -182909 -66642 171642 1870
7045 1870 -188575 -12350 -219107 -261213 -353627 -78346 63779 -276330 -490069 -341240
7035 -341240 -50958 -77654 111560 -136454 -208285 -6054 -142876 -161285 -235197 -506080
7025 -506080 -558709 -433514 -463131 -521635 -377275 -355517 -211425 -180605 -152818 -58861 -14148
7014 -14148 -249124 -218198 -197123 -7750 -160801 -395389 -497017 -527688 -317288 -310103 -84567
7003 -84567 -86610 -177202 -287549 -158255 -125797 -166613 129269 -73678 -167008 -39762 -155836
6992 -155836 -307021 -7303 -115052 80843 -279443 -250576 -486541 -271374 -199245 -465583
6982d65583L87298j18336m01295J72437K14389o7129J00709P3403J78521P5705
6972A50119j76348P0266J29469m42186k36853J48284K36009M2820k6307P0814
6962c3913l6050j72452j86314l30844L15677Q7003n7472j89805J00658K48297
6952b55215J06996L5573j88458L45462J14732j94436L9082q6783k02706k60683
6942e46436K09183L51183j12222J33885J93005j55215P9099m9723m38213j70134
6932e05588n9997p5644J18687O7265K14974j5665m4607j75121K73450J51693j79335
6921b29888l02678K92922o5857j37260J66571J52924p1940J42789m7497L3604
6911f6310N9607J88309p3064j35273k9903O4889J71018J22705J32844l98593j07947
$$ plain form
6982 -465583 -78285 -196621 -597916 -425479 -211090 -278219 -177510 -104107 74414 150119
6972 150119 -26229 44037 173506 -268680 -505533 -357249 -121240 -78420 -104727 -33913
6962 -33913 -69963 -242415 -428729 -759573 -443896 -356893 -414365 -604170 -503512 -255215
6952 -255215 -148219 -112646 -301104 44358 159090 -35346 3736 -83047 -285753 -546436
6942 -546436 -337253 13930 -98292 35593 228598 73383 152482 102759 -335454 -505588
6932 -505588 -565585 -641229 -522542 -455277 -240303 -255968 -300575 -475696 -202246 -50553 -229888
6921 -229888 -532566 -239644 -305501 -442761 -276190 -123266 -195206 -52417 -99914 -66310
6911 -66310 -6703 181606 108542 -26731 -56634 8255 179273 301978 434822 36229 -71718
6900g1718q0139p702P82J25691R8957j9201j58230J77495j32354l23972O5159
6889c25232J42564l96858K48817J13858J55307p7551j18051J36728J07550j58631
6879a71499l97082k01122L35821L7012O9880K83651k81074K78563k5021j35464
6869b06335K24497r3407j13318K26114J15931k77185j22322J06257j07843M8308
6859a99303p9026p3416L6766q4338J30374j94041M5856K35801J38861j85524p9634
6848c07624J15770M9841J06665l27952K0683J22445j33280m4097K5985J96471
6838a75093K29187l2167k55000J04022J84270l34247l02296P1623j02032L0113
6828e81620M86313q3437M9907M6503J75677n2195k34918j02915P2120K61790j84259
$$ plain form
6900 -71718 -151857 -159559 -158777 -33086 65871 46670 -111560 65935 -66419 -390391 -325232
6889 -325232 -182668 -579526 -330709 -216851 -61544 -139095 -257146 -120418 -12868 -171499
6879 -171499 -568581 -769703 -433882 -396870 -326990 -43339 -324413 -45850 -70871 -206335
6869 -206335 18162 -75245 -188563 37551 153482 -123703 -246025 -139768 -247611 -199303
6859 -199303 -278329 -351745 -314979 -399317 -268943 -462984 -417128 -181327 -42466 -227990 -307624
6848 -307624 -191854 -142013 -35348 -363300 -342617 -220172 -353452 -397549 -371564 -175093
6838 -175093 54094 21927 -233073 -129051 55219 -279028 -581324 -509701 -611733 -581620
6828 -581620 -95307 -178744 -128837 -82334 93343 41148 -193770 -296685 -224565 37225 -147034
6817a47034K63821o7307j93777l63953o5765J97848O7740l3934k8401q7094k86697
6806g44553K16442j8362M10057K33257j61895K6992q531j43349R205N0130n6276
6795a86883k76844L86205K90925r8963l02009k05827K23352k90405j60273M82924
6785a37798j49842k69620L97960j09539o3389n7862J89139o5027l03215L23831
6775b45362j12744l0274P8280P7372R9146k95536j78407J03546P4747L10060R3818
6764b5354J18680J1153k7829L30038j71450j08483l9428m07507q1333K30586R3747
6753g7180r8888J94707J09065l54885O7263L65749J24730m18159p6499j38475
6743c02572J74792j26161p0261L36294n8230j77252K55650j72628k14329R3988
$$ plain form
6817 -147034 116787 49480 -144297 -508250 -574015 -376167 -308427 -342361 -370762 -457856 -744553
6806 -744553 -528111 -546473 -136416 96841 -65054 -38062 -46593 -189942 -180737 -130607 -186883
6795 -186883 -463727 -77522 213403 114440 -187569 -393396 -170044 -460449 -620722 -137798
6785 -137798 -287640 -557260 -159300 -268839 -332228 -390090 -200951 -265978 -569193 -245362
6775 -245362 -358106 -388380 -310100 -232728 -133582 -429118 -607525 -503979 -429232 -119172 -25354
6764 -25354 93326 104479 76650 406688 235238 126755 87327 -320180 -401513 -170927 -77180
6753 -77180 -176068 18639 127704 -227181 -159918 205831 330561 -87598 -164097 -302572
6743 -302572 -127780 -253941 -324202 12092 -46138 -223390 32260 -140368 -354697 -260709
6733b60709j5326j94191J36181m8168J92901K35318J69743l1697m76301K00833
6723i1416J58974l0061J86746k64745k18931p8803R1424L54319l29897M3909K76810
6712I8329l50440J29295o3433k15761M3463J52578K43359o6395L75871j07252
6702B39614j31130l83830J46798n1705L46483k16071j52811M03838O3066L0076
6692B94328j85742l4370k40344j94155J99765J10344m8945J43490j04010N4289
6682e350j2122m18890P6048J26678j02999K18406J4016R2834k43502Q5828j63360
6671c32413L06676L94321l37535j03976k73758K22919K90706l94253K632J07602
6661a17079N6033J53643m46468K42585M5292m49246R4041M38248J39410m10148
$$ plain form
6733 -260709 -276035 -470226 -334045 -382213 -189312 46006 215749 184052 -292249 -91416
6723 -91416 67558 37497 224243 -40502 -259433 -338236 -246812 107507 -222390 -178481 98329
6712 98329 -252111 -122816 -186249 -402010 -358547 -205969 37390 -29005 346866 239614
6702 239614 108484 -275346 -128548 -180253 166230 -49841 -202652 201186 264252 294328
6692 294328 108586 74216 -166128 -360283 -160518 -50174 -99119 44371 -59639 -5350
6682 -5350 -17472 -436362 -360314 -233636 -336635 -118229 -104213 -11379 -254881 -169053 -332413
6671 -332413 -25737 368584 31049 -72927 -346685 -123766 166940 -227313 -224681 -117079
6661 -117079 -61046 92597 -353871 -111286 -65994 -515240 -421199 17049 156459 -253689
6651b53689K83490l26322K2179J34881J03467J34514o0119m3584J32609r8029
6641B9397L698J44099j38033k64251R7115N5932k19607J6492M3257K08524J224
6630b2153L96203j52375r3921j31203o940k1144J08587k58892l6044K56514R4324
6619A32956j54928k19236L71540K64973l77199k78371j23692j48597Q5541Q460
6609d38553L28652J8108m25376K24894K3645J9620L4588O8462o2721r605J14841
6598a03445J97540k0379j26565l71163L50610K22022m97878K84879k18221j28245
6588d10845K5727Q112J40231J04270L09487j66412M1032n0336m5464q4414J95280
6577F6668q5347q6914l9691O886L83887l20056L9592J4225j28676O6958L46441
$$ plain form
6651 -253689 29801 -296521 -274342 -139461 -35994 98520 38401 -5183 127426 29397
6641 29397 33095 177194 39161 -225090 -127975 -72043 -291650 -275158 -231901 -23377 -22153
6630 -22153 374050 221675 127754 -3449 -10389 -31533 77054 -181838 -217882 38632 132956
6619 132956 -21972 -241208 130332 395305 18106 -260265 -383957 -532554 -447013 -438553
6609 -438553 -109901 -91793 -517169 -292275 -268630 -249010 -214422 -145960 -208681 -218286 -103445
6598 -103445 94095 73716 -52849 -424012 -73402 148620 -349258 -64379 -282600 -410845
6588 -410845 -385118 -377006 -236775 -132505 176982 10570 51602 1266 -44198 -128612 66668
6577 66668 -18679 -105593 -145284 -138398 245489 -74567 -34975 -20750 -149426 -82468 263973
6566B63973j79909n2746j96004J63918N5693o5584k62498Q2286N890p3755J14298
6555a44438K96958P532k70562J90811j21577k31891l7937N4029J869j03969P3418
6544b85757M14820l38808r809J12215n4405r6339J48480N11211q9058m53661K27673
6533H6562L3362l01081K17628j13710m60R7977j02427R7828K97926m07058M0194
6522e3259P8877j51676j30929n6364l445l1571K56076L68283k77529O1992K7261
6511H7716n2969j72159j21896L1966L2573j98436J91111Q2171j20788L53529P8211
6500A91029j79009r0493J54304K12258j18646m56296l7925J1182K80805m1078
6490g3869j38773K17035K71342j48054p3493k27941J75467j40143J12376M19721
$$ plain form
6566 263973 84064 31318 -164686 -768 54925 -10659 -273157 -190871 -184981 -258736 -144438
6555 -144438 152520 160052 -110510 80301 -41276 -273167 -311104 -257075 -255206 -359175 -285757
6544 -285757 129063 -209745 -219554 -107339 -161744 -258083 -109603 401608 312550 -141111 86562
6533 86562 119924 -181157 36471 -77239 -77699 20278 -82149 15679 313605 -93453 -53259
6522 -53259 25618 -126058 -256987 -313351 -316796 -348367 -92291 275992 -1537 60455 87716
6511 87716 34747 -137412 -259308 -227342 -194769 -393205 -202094 -119923 -240711 112818 191029
6500 191029 12020 -78473 75831 288089 169443 -286853 -324778 -313596 -32791 -73869
6490 -73869 -212642 4393 275735 127681 54188 -173753 1714 -138429 -26053 393668
6480C93668J46696k88783l21727k17263O0387J11278l1983K78113j53511o5094
6470h8219k2802n6771K20664p1277l05682L05993J06178k62815k27855J4072M71403
6459H2889O486O3660j3542l30517O9377L21405j3419j02860k0954j0215j01975
6448d9665m0552K12788K1855J18928j74307R7396j89750r1883L26350q7856k49843
6437a06539J59312L42716j95102j95491k13355Q3319m3600O8277j76538m5908
6427c22909p2690r9184J30025L59917J2425l24883l4705n1250K5687K61855J9438
6416i6274J7551j42530J80585J14377r2923j39451j1045K62311L10602l00185
6406A03018J3342J30685P0350m14642m71694L67614J9055J37338L9646r4815q0450
$$ plain form
6480 393668 540364 251581 -70146 -287409 -227022 -115744 -147727 130386 -23125 -88219
6470 -88219 -111021 -167792 52872 -18405 -324087 -18094 88084 -174731 -402586 -388514 82889
6459 82889 89375 153035 139493 -191024 -121647 199758 186339 83479 62525 52310 -49665
6448 -49665 -90217 122571 144426 263354 89047 186443 -3307 -95190 231160 143304 -106539
6437 -106539 52773 395489 200387 4896 -208459 -125140 -168740 -100463 -277001 -322909
6427 -322909 -395599 -494783 -364758 -4841 7584 -317299 -352004 -403254 -377567 -115712 -96274
6416 -96274 -78723 -221253 -40668 73709 -19214 -158665 -169710 92601 403203 103018
6406 103018 116360 247045 317395 -97247 -568941 -201327 -182272 -44934 -5288 -100103 -180553
6395a80553K99679j04070j3090P7725J31578P9895k34550k34147J26636K10478
6385A59581m1936J6555O7534O9775j66128l4192j79024j90158l2885j34690j01439
6374e67007K07256K27945j46276K26040L3240q1632K52307l6272j83038Q3340
6364A5903J4940j198j55472M97518l43462k12862l9887J4936k4285J47544N7738
6353b8587K19211O7946k59872Q9034J49422Q2775j50226p1051K96686O6997n58065
6342i5730K05124J18046Q4099j98548n5654K23278L26727j56179j02731j09041
6332B39391r0210M00090k72455k47283Q0065J36477k27785J05607j29666P4887
6322F9118K4326l51590P2662Q2288K87172j14872j0510j21583k78577j37587J07134
$$ plain form
6395 -180553 119126 15056 1966 79691 211269 291164 56614 -177533 -50897 159581
6385 159581 117645 134200 201734 271509 105381 71189 -107835 -297993 -330878 -465568 -567007
6374 -567007 -359751 -131806 -278082 -52042 -18802 -100434 151873 115601 -67437 15903
6364 15903 30843 29645 -125827 371691 28229 -184633 -224520 -209584 -233869 -86325 -28587
6353 -28587 190624 258570 -1302 87732 237154 319929 169703 98652 395338 462335 -95730
6342 -95730 109394 227440 311539 112991 57337 280615 607342 451163 348432 239391
6332 239391 149181 549271 276816 29533 109598 246075 18290 123897 -5769 69118
6322 69118 93444 -258146 -185484 -103196 183976 69104 58594 -62989 -341566 -479153 -372019
6311c72019K39412Q3239l79555K51270Q2001j06188J16203j41298K44105J67954
6301A85124j08884k03447l9791K8743K59453J42683J32153j86071j65252l40393
6291b95682R2812J09007K19379n8180l16862P7265J07871J83171r3975j18027
6281i3221l1620O82833r9080k55623N3189l2318k12711j08132j21406j2819K59368
6270B8460L32708k15360l92204J18247K81709J25604O6076o3436k03246o135n6576
6259A5847P036M6911K07284k24298J15338J60424n9148J94865l11147l49728J89889
6248f727K95876l44267K49126m0617k57121K53427J47708l21991m59832K72499
6238b11919K75216J64606q6554j99805K40647k10660K47588K9619p6081L0200
$$ plain form
6311 -372019 -132607 -49368 -428923 -177653 -95652 -201840 -85637 -226935 17170 185124
6301 185124 76240 -127207 -166998 -138255 121198 263881 396034 209963 44711 -295682
6291 -295682 -202870 -93863 125516 67336 -249526 -172261 -64390 118781 24806 -93221
6281 -93221 -124841 557992 458912 203289 256478 224160 11449 -96683 -218089 -230908 28460
6270 28460 361168 145808 -246396 -128149 153560 279164 345240 281804 78558 72423 15847
6259 15847 22883 69794 277078 52780 168118 328542 269394 464259 153112 -196616 -6727
6248 -6727 289149 -55118 194008 153391 -103730 149697 297405 -24586 -484418 -211919
6238 -211919 63297 227903 141349 -58456 182191 -28469 219119 248738 172657 202857
6228B02857k00429J60165R7376k5347j36541R9908K15351Q2747l05653o7052j68054
6217d4672J77213j1994k26117k62073q6182K8658L55213l3392M7621K62965j38623
6206F8617j24008K09188n7336J9239J78619o07136j6976K70659J8087m7974J13399
6195B4378J58386L2092j52336k9284k11921J58643K73212n1830J54613k0502j59491
6184A75960O6300K41031j87518k61677m4685J14341n139J89567q3412k04480j02245
6173a01957K25618j49774k5924J37232J87543j662j45830J96729J5248j62756
6163A74467r0058K1859l79109k47596J14839M70984K99118J02140q8278Q5469
6153D63835k75963n2682j40455j84665L19361K82375l64416K8759j0256O6849
$$ plain form
6228 202857 2428 162593 259969 234622 98081 197989 413340 496087 190434 123382 -44672
6217 -44672 132541 120547 -105570 -367643 -453825 -425167 -69954 -103346 -55725 207240 68617
6206 68617 -55391 153797 96461 115700 294319 -312817 -329793 -59134 -41047 -89021 24378
6195 24378 182764 214856 62520 33236 -178685 -20042 253170 201340 355953 335451 175960
6184 175960 242260 483291 295773 34096 -10589 103752 98613 288180 204768 288 -101957
6173 -101957 123661 -26113 -52037 85195 272738 271076 125246 321975 337223 174467
6163 174467 84409 106268 -272841 -520437 -405598 65386 364504 466644 378366 463835
6153 463835 187872 135190 -5265 -189930 129431 411806 47390 76149 65893 132742
6143A32742J1010J2157K19119J30982j91607J60588l84888j89605r6090Q7754
6133a07838J2682q5061K9169L874L35216m9373M1000K1236j54206J19864K07694
6122C74257l32469m3803L2892j84067j52329K22509M57339j71937m19172J22953
6112i3827L19906k03997j10044K71485j80576q9742N7079L63200j97180j03963
6102C2341k84367L69564J1087j82949J50734J4739J61851Q1102m34106o7223L12730
6091A65503l7144j26317K16323j92605k11262O1789K93344J60901j0784L7412
6081C57160l8701j9117r207n3207j2261K4456o360K16709j43224k41301J25588
6070B00535j14610L63585k11258k70332o311M08090J14580m01909n3714J99280
$$ plain form
6143 132742 143752 155909 375028 506010 314403 474991 90103 -99502 -195592 -107838
6133 -107838 -95156 -180217 -151048 -147174 188042 138669 179669 200905 46699 166563 374257
6122 374257 41788 -2015 30877 -153190 -305519 -83010 374329 202392 -216780 -93827
6112 -93827 226079 22082 -87962 183523 2947 -86795 -29716 333484 136304 32341
6102 32341 -252026 117538 128625 -54324 96410 111149 273000 354102 -80004 -147227 165503
6091 165503 128359 2042 218365 25760 -185502 -123713 169631 330532 319748 357160
6081 357160 318459 299342 290135 236928 224667 249123 242763 459472 316248 74947 200535
6070 200535 85925 449510 238252 -32080 -38391 369699 484279 82370 28656 227936
6060B27936j56936p0613K14959o1745J41379N7790k3539P0849K64992j28530l30235
6049B06307n4277O6055o3149R130j25721r4923N161r812J75337p3565k28722N4451
6037a33728Q8803N11720n0680J28106l78453k4973J445j79980K01425Q4266m6642
6026B01309Q0915K4321j25610P492M3860J00209j49025J08301J71027j73024J68185
6015D57960K6357k22173k48501K74180J17333j48688q896l90808M6515K64750
6005A68029m500J40029N6032j40390j67002J96494o8455k0603k86531J28000k65243
5994b64140M96717J8976O3980j80148p9519N096J26133K87806j05357O98k9213
5983C41029j51275k50650J37670J91151p1879k12911K41217J4154r4389l11442
$$ plain form
6060 227936 71000 387 215346 153601 294980 352770 329231 400080 665072 536542 206307
6049 206307 152030 218085 154936 164066 38345 -56578 -51417 -61229 114108 40543 -188179 -133728
6037 -133728 -44925 466795 416115 544221 165768 140795 142240 -37740 163685 247951 201309
6026 201309 282224 306545 180935 188427 232287 332496 183471 291772 462799 289775 457960
6015 457960 484317 262144 13643 287823 405156 256468 247572 -143236 -96721 168029
6005 168029 163529 303558 359590 219200 52198 248692 180237 159634 -126897 1103 -264140
5994 -264140 232577 251553 315533 135385 55866 60962 187095 474901 369544 370242 341029
5983 341029 189754 -60896 76774 267925 196046 -16865 224352 238506 144117 -167325
5973a67325L66462J08726J94106k28878m3715j88798J02731J33362m3225J15151
5963C48597J23305k08978j64939M09712K6255l43649r8751O5621O15837k38594
5953E34416k49741q3528J79566L7061J18560m9123j4414r303j61869j31887q0497
5942H9241J95526j88893O7075M4553o7450M053r1136l2447K6122P8771K3949L39534
5930D88898M7861J17970r021n56567J36229k082J52379M77972J33972m44714J7969
5919E60866r9221j37887p9710J16037L3199q8038K39529k62467K23015j20567
5909C84756l31029M0530M635L30589L0676r4682k25327N4541k3053j58968L07680
5898C20348J44866L1753j5135L9103r9849j83479P9057j66030r0795J85640K09980
$$ plain form
5973 -167325 199137 307863 501969 273091 229376 40578 143309 276671 233446 348597
5963 348597 471902 262924 97985 507697 533952 190303 91552 157173 773010 534416
5953 534416 284675 201147 380713 417774 536334 487211 472797 463494 301625 169738 89241
5942 89241 284767 95874 162949 207502 140052 144105 52969 20522 46644 125415 149364 488898
5930 488898 536759 654729 645708 89141 225370 223288 375667 853639 987611 542897 560866
5919 560866 461645 323758 244048 360085 393284 305246 544775 282308 505323 384756
5909 384756 53727 94257 98892 429481 460157 365475 140148 194689 171636 12668 320348
5898 320348 465214 496967 481832 520935 421086 237607 316664 150634 59839 245479 455459
5887D55459j1243R8356q9554l96704J20468J02908N4139o1653q3110L1386j02361
5876A18091j19684O0785L75343L82391m35043J11956J9611n27994J59309M9720
5866A94485K64814J62703k85612k78378K76280J73158j25903J88004K8363j81240
5856D16674o03446N1494K13019M491L59853K18666k00704l65224n6574Q2888L48628
5845D69765q1893j45520K36200j42705k14117J67025J52046j77889j60086M2353
5835A45179j21152K90111j05748l2319N40923j70786n06598J60663K61240k2622
5825D38891l46059J84347N7067J97336P1181l25496K35126N0530R2226j75747
5815D79402j17465J26107j09708M2183q2938P4769l3541Q6778K48612j66964k17078
$$ plain form
5887 455459 444216 542572 453018 56314 176782 279690 333829 272176 189066 220452 118091
5876 118091 -1593 59192 434535 816926 381883 493839 513450 -14544 144765 194485
5866 194485 459299 622002 336390 58012 334292 507450 381547 569551 597914 416674
5856 416674 -186772 -135278 77741 82232 442085 660751 460047 94823 38249 121137 469765
5845 469765 387872 242352 478552 335847 121730 288755 440801 262912 102826 145179
5835 145179 24027 314138 208390 176071 716994 546208 39610 200273 461513 438891
5825 438891 92832 277179 334246 531582 602763 277267 512393 562923 655149 479402
5815 479402 361937 488044 378336 420519 337581 412350 378809 465587 714199 547235 330157
5804C30157J03590j13704L9511O4687m3277K26386J09951l11133o0171J39145
5794D85142N9386r1339j91665K72945N69J11634j34904r3665O5122k54193N182
5783B34214J79896P0718O0332J03685q1304j17799K8419j16815l02829N6858K88506
5772D03881L8359J9680Q0619j14237j33874J99721R8597l6279j96676l09206J03660
5761A54245J08244K7790K37408K7093K44379K7260j74158p6855K4764m3506p5839
5750D80825o9810K76916J04156j74227K73582o4713l06250J57272J88604n20956
5740C45399n3284K13129j5977J85080j57890j66681K30314j06374K25709K44022
5730I43447n27446J02065l9529N7850Q2895J29207r5684L558K01795k98817j75108
$$ plain form
5804 330157 433747 320043 359554 424241 380964 607350 717301 406168 345997 485142
5794 485142 544528 453189 261524 534469 535038 646672 511768 418103 483225 229032 234214
5783 234214 414110 484828 545160 648845 567541 449742 478161 361346 58517 115375 403881
5772 403881 442240 461920 542539 428302 294428 494149 592746 556467 359791 50585 154245
5761 154245 262489 290279 527687 554780 799159 826419 652261 575406 600170 556664 480825
5750 480825 411015 687931 792087 617860 891442 826729 520479 677751 866355 345399
5740 345399 292115 505244 489267 674347 516457 349776 580090 473716 699425 943447
5730 943447 416001 518066 478537 536387 619282 748489 652805 656363 858158 559341 384233
5719C84233J11512L42671K37759O4039n06847k21309N07844j5794J15683p861
5709A011930k25008l22013r6079L29707j0222J93359j70663J45348j38617q3223
5699F34519l3938k48273m6684J67794L17734J7779l14383J51083J70236K41538
5689A057405J45642m78892q8524K89554M3061j2597J31749n46884l8023K7648
5679E30139k32125l5022J33340K38623N1200l242L0357R0500J05004J4686j63763
5668G59697k88454K49959K50248R3458j73091P6760r0043r6117K18882k03247
5658G98052K6918r1508j97132J19658L16143N0080k86100J67221O4232L6200k34930
5647G68834M9771J591N4792n979l42223j46071Q090L38717j23745J30061k6607
$$ plain form
5719 384233 495745 838416 1076175 1140214 633367 412058 919902 904108 1019791 1011930
5709 1011930 786922 464909 368830 698537 688315 881674 711011 856359 717742 634519
5699 634519 600581 352308 305624 473418 791152 808931 494548 645631 815867 1057405
5689 1057405 1203047 724155 635631 925185 968246 955649 1087398 540514 502491 530139
5679 530139 298014 262992 396332 634955 686155 682913 713270 803770 908774 923460 759697
5668 759697 471243 721202 971450 1064908 891817 968577 878534 782417 1001299 798052
5658 798052 824970 733462 536330 655988 972131 1022211 736111 903332 967564 1003764 768834
5647 768834 818605 820196 874988 869009 526786 380715 388805 727522 603777 733838 707231
5636G07231K40946J23246R3146j45636q4785j19743q0744R0005j92702J95695
5626H26659L4626k51698o4654J35824L70508k62804J07092K92999k6503j10088
5616A051961l24419J52561K01156R6229p5719k8854R0120k06286k91219K61569
5606I27099J99230J04548j08246K3908j28135j38236j1473j05288J18631L77836
5596A259874K23071J69402j42090k49068l3848k65729K46415j67850L44956J02741
5586A487874O3747j00395p2145N2869O6497j44072k21431J73631J14236J12420
5576A533231k8361o2704N8151K14126R1389Q6140m62683j8257J31121p3771J88947
5565A657329l18377j73577K30698L8093l04273N4624L44954K63829o6801L263
$$ plain form
5636 707231 948177 1071423 1164569 1018933 934148 814405 733661 823666 630964 826659
5626 826659 861285 609587 544933 680757 1051265 788461 895553 1188552 1162049 1051961
5616 1051961 727542 880103 1081259 1177488 1101769 1072915 1163035 956749 665530 927099
5606 927099 1126329 1230877 1122631 1146539 1018404 880168 868695 763407 882038 1259874
5596 1259874 1482945 1652347 1510257 1261189 1227341 961612 1208027 1040177 1385133 1487874
5586 1487874 1551621 1451226 1379081 1431950 1498447 1354375 1132944 1306575 1420811 1533231
5576 1533231 1504870 1442166 1500317 1714443 1805832 1891972 1429289 1411032 1542153 1468382 1657329
5565 1657329 1338952 1165375 1396073 1434166 1129893 1184517 1529471 1793300 1726499 1729762
5555A729762q5695k25452P421Q1713M9984J27130k4366K11590K95064o18869j84799
5544A363483J96431J22570j04970M6130j99418M6027J41977k2709L1587Q2516
5534A703624K22950Q8761k66276Q2250j8636N7901p2117J60854L39150l26431
5524A972030k17930J0739J85583R9063K20363j82161K19670K42008l35188J61971
5514B376148l4442J25028K89329R2138k14399k40036L0352J59963j54034q0487
5504B349560k6162m2081J877Q7554k00292j03038J21976j70274m099l1196J3697
5493A997522K35617K18970k73136l7120J94457k9880j47959j15028K63271J84425
5483B491139l1325j80535P1491M57349j72057j9561M34976l55875O3761m1968
$$ plain form
5555 1729762 1644067 1418615 1426036 1507749 1557733 1684863 1660497 1872087 2167151 1548282 1363483
5544 1363483 1559914 1682484 1577514 1623644 1424226 1470253 1612230 1589521 1621108 1703624
5534 1703624 1926574 2015335 1749059 1831309 1812673 1870574 1798457 1959311 2298461 1972030
5524 1972030 1754100 1764839 1950422 2049485 2269848 2087687 2307357 2549365 2214177 2376148
5514 2376148 2341706 2466734 2756063 2848201 2633802 2393766 2424118 2584081 2430047 2349560
5504 2349560 2323398 2281317 2283194 2370748 2170456 2067418 2189394 2019120 2015021 1983825 1997522
5493 1997522 2233139 2452109 2178973 2141853 2336310 2306430 2158471 2043443 2306714 2491139
5483 2491139 2459814 2279279 2350770 2808119 2636062 2616501 3051477 2695602 2759363 2717395
5473B717395J20875R1969k39370l03811r3513J87024J00493K46756O9045j54872
5463B741991j92737L52632j949j23562l371k4637L16313K87786k62054k32972
5453B857440K27632O9612m7428L3334k71150n3144K42640J74804j3348N6028K5468
5442C301888K41716k44600o5014k0471Q012K16087m8671J62916J26341J78553
5432C856757K021n52535J42301J27405r9385j36046p51K00454J29926N4873l803
5421C721217j14116K71294K01693J38327q6343q9114j682J83288L10159j20082
5411D414641j30571l2533K34751L5901j37501Q8064R7835k45921J34923j63108
5401D296481M942K84163k3477K62959n5999n42714k6305K92220L80438j85541
$$ plain form
5473 2717395 2838270 2930239 2690869 2387058 2293545 2480569 2581062 2827818 2896863 2741991
5463 2741991 2549254 2901886 2899937 2776375 2773004 2748367 3064680 3352466 3090412 2857440
5453 2857440 3085072 3154684 3107256 3140590 2869440 2816296 3058936 3233740 3220392 3276420 3301888
5442 3301888 3543604 3299004 3233990 3213519 3221531 3437618 3388947 3551863 3678204 3856757
5432 3856757 3858778 3306243 3448544 3575949 3476564 3340518 3339767 3540221 3670147 3725020 3721217
5421 3721217 3607101 3878395 4080088 4218415 4132072 4042958 4041276 4224564 4534723 4414641
5411 4414641 4284070 4251537 4486288 4522189 4384688 4472752 4570587 4324666 4459589 4296481
5401 4296481 4301423 4585586 4562109 4825068 4769069 4226355 4200050 4492270 4872708 4687167
5391D687167J25589J54414O3490J84595k37940j29482j37973R0569M66712K11322
5381E478463L5919J19764j06919M4831j61781J73620K97258q1282J97623K3242
5371F020738k7337K35536J7419L30846M4874j37075j09437L52811O4161l51308
5361F441228j34581N007O19512L61118j04643M6762p4303k34823K56736J58588
5351G340601K93274K65615j23064Q8586K22092K78728j63396j58897L43600K31947
5341H619086L00490q6966P3817l6330K31665J98687O9387L11849M001l02803j16823
5330I266060M65017L49133j3535M32644K81127N33583j21976N4937K07717j86322
5320A1268385L53241K7988q5389J50866K26956J66277K85772J76063M7488K18367
$$ plain form
5391 4687167 4812756 4967170 5030660 5215255 4977315 4847833 4709860 4800429 5267141 5478463
5381 5478463 5514382 5634146 5527227 5572058 5410277 5583897 5881155 5799873 5997496 6020738
5371 6020738 5993401 6228937 6246356 6577202 6622076 6485001 6375564 6728375 6792536 6441228
5361 6441228 6306647 6311654 6931166 7292284 7187641 7234403 7160100 6925277 7182013 7340601
5351 7340601 7633875 7899490 7776426 7865012 8087104 8365832 8202436 8043539 8387139 8619086
5341 8619086 8919576 8832610 8906427 8870097 9101762 9300449 9369836 9681685 9685686 9382883 9266060
5330 9266060 9731077 10080210 10066675 10499319 10780446 11314029 11192053 11246990 11454707 11268385
5320 11268385 11621626 11649614 11564225 11715091 11942047 12108324 12394096 12570159 12617647 12836014
5310A2836014M18572K42773L21868K36303N5847P0592K01160M24942K39479J04588
5300A5152138L61536J92290j0831M57453J5552K43361K37447L70861K12521K23347
5290A7455675J84409K74598O60549K51571K65715J03231K76731K68812M08747
5281B0150038N26752L08213L54316M58071L66858L75578K13611M70089N03160
5272B3726686M35719M43985O01728K55071L11532Q59432M19160M09694P09752
5263B8172759j2728O84220N79208M86914Q90075R44243M24901N37259O56952P55948
5253C4119751Q48526R70667R82420O32951J057351Q95638J018961J017322P39592
5244D2283179R07656J284896J336534J170642J022648R80532J025102J138618
$$ plain form
5310 12836014 13254586 13497359 13819227 14055530 14111377 14181969 14383129 14808071 15047550 15152138
5300 15152138 15513674 15705964 15695133 16152586 16168138 16411499 16648946 17019807 17232328 17455675
5290 17455675 17640084 17914682 18575231 18826802 19092517 19195748 19472479 19741291 20150038
5281 20150038 20676790 20985003 21339319 21797390 22164248 22539826 22753437 23223526 23726686
5272 23726686 24162405 24606390 25208118 25463189 25774721 26634153 27053313 27463007 28172759
5263 28172759 28160031 28844251 29423459 29910373 30800448 31744691 32169592 32706851 33363803 34119751
5253 34119751 34968277 35938944 36921364 37554315 38611666 39507304 40526265 41543587 42283179
5244 42283179 43190835 44475731 45812265 46982907 48005555 48986087 50011189 51149807
5236E1149807J252209J274492J292366J414420J463600J238316J320810J588549
5228F1994569J467920J642816J714290J678730J594868J665495J943646J753113
5220G5455447J748170K172890J898839J966918K360812K588531J887817K108825
5212I2188249K903881K648740K973907K791038K925465L232069L369732L452048
5204A16485129L662200L814839L984150M458469M321344M373717N085287N021468
5196A51206603N168532N784393O037517O244611O464637O441428O524684P022524
5188B00894929O955793P525033P952899P791718Q025665Q219368Q113936P696959
5180B63176300P819823P869187P554513O838212O165208N624595M375060L199244
$$ plain form
5236 51149807 52402016 53676508 54968874 56383294 57846894 59085210 60406020 61994569
5228 61994569 63462489 65105305 66819595 68498325 70093193 71758688 73702334 75455447
5220 75455447 77203617 79376507 81275346 83242264 85603076 88191607 90079424 92188249
5212 92188249 95092130 97740870 100714777 103505815 106431280 109663349 113033081 116485129
5204 116485129 120147329 123962168 127946318 132404787 136726131 141099848 146185135 151206603
5196 151206603 156375135 162159528 168197045 174441656 180906293 187347721 193872405 200894929
5188 200894929 207850722 215375755 223328654 231120372 239146037 247365405 255479341 263176300
5180 263176300 270996123 278865310 286419823 293258035 299423243 305047838 309422898 312622142
5172C12622142K092213N96274p86204k466297m262514n761710o925812p978579
5164B87129513q699877r248097r892373r970979r985888j0049683j0026025r420245
5156B09836346q917180q643740q224425p782714p476141p126792o664668o504593
5148A48496093o384283n625235m922309n139000m988304m846096m677688l903442
5140A08009736l999520l748374l335874l154299l261598l179499k800884k508176
5132H2021512l053368k558662k381057k199878k170562k593256k117129k208112
5124F2739488j661994j356643j818580j961387j411637j745839j451403j275343
5116E0056662j540105j251696j559036n72144q00787j208690j142431j297744
$$ plain form
5172 312622142 314714355 315310629 314524425 312058128 307795614 302033904 295108092 287129513
5164 287129513 278429636 269181539 259289166 249318187 239332299 229282616 219256591 209836346
5156 209836346 200919166 192275426 184051001 176268287 168792146 161665354 155000686 148496093
5148 148496093 142111810 136486575 131564266 126425266 121436962 116590866 111913178 108009736
5140 108009736 104010216 100261842 96925968 93771669 90510071 87330572 84529688 82021512
5132 82021512 78968144 76409482 74028425 71828547 69657985 67064729 64947600 62739488
5124 62739488 61077494 59720851 57902271 55940884 54529247 52783408 51332005 50056662
5116 50056662 48516557 47264861 45705825 45133681 44332894 43124204 41981773 40684029
5108D0684029j367903n69684n25104j330814r20447q74975q09051o83178n24330
5099C3078543j003691q14186o16314p95319p28084m65400p25671n45828k85748
5090B7098302q03368o09632m71259o02323m68478l32748m24581m80269n32649
5081B2372995n58062k99877p53412l53570m54298m53293p9990n2939p44596k69360
5071A8353598J17226o81512p17425l0250j22816l84285m01071n18784O393m85863
5061A5135211r6938j48808n84970j50699j51995J26061m45749k64855j08259k70415
5051A3038584m9553j75543J23893j67928n08367n79202o123q7082j11466k32053
5041A1245160q617n06557l34945K74944o0117L1750j16732l25931q9347n73726
$$ plain form
5108 40684029 39316126 38746442 38221338 36890524 35970077 35095102 34286051 33602873 33078543
5099 33078543 32074852 31260666 30644352 29849033 29120949 28655549 27929878 27384050 27098302
5090 27098302 26294934 25685302 25214043 24611720 24143242 23810494 23385913 22905644 22372995
5081 22372995 21814933 21515056 20761644 20408074 19953776 19500483 19420493 19367554 18622958 18353598
5071 18353598 18470824 17789312 17071887 17041637 16918821 16534536 16133465 15614681 15621074 15135211
5061 15135211 15038273 14889465 14304495 14153796 14001801 14127862 13682113 13417258 13308999 13038584
5051 13038584 12989031 12813488 12937381 12769453 12261086 11681884 11675761 11588679 11477213 11245160
5041 11245160 11236543 10729986 10395041 10669985 10609868 10641618 10524886 10198955 10109608 9535882
5031I535882m4263Q3986k36191j78656k6149P9465k94213R1349p7476j40894k59417
5020H533423n7464Q387k30633o2892p1616O3025O7019j69398l96261j44729j57752
5009G381109J19406n8606j77534J31327J96887l10558j29061K51876l98366k10379
4999F796101j62831k18726J9468j35405J09078K1257L3629j79297K7277j50567
4989F159984k77980J58815j97802K98498j91930k1717m01008j89507L49175k8420
4979E658108L15043o200r8635j80451k02726k24046j43480K49105j0739N4873
4969E410852l81351J086k57911j47347j63270J09484q028k64346r3439o912k9378
4958D169440J30831l30688J13883J43123l6613L7364L00605Q4578m03496k2943
$$ plain form
5031 9535882 9491619 9575605 9339414 9160758 9134609 9214074 8919861 9011210 8933734 8792840 8533423
5020 8533423 8475959 8484346 8253713 8190821 8119205 8182230 8249249 8079851 7683590 7538861 7381109
5009 7381109 7500515 7441909 7264375 7395702 7592589 7282031 7152970 7404846 7006480 6796101
4999 6796101 6633270 6414544 6434012 6298607 6407685 6428942 6462571 6283274 6310551 6159984
4989 6159984 5882004 6040819 5843017 6141515 5949585 5927868 5526860 5337353 5686528 5658108
4979 5658108 5973151 5966951 5868316 5687865 5485139 5261093 5117613 5366718 5355979 5410852
4969 5410852 5029501 5030587 4772676 4625329 4462059 4571543 4563515 4299169 4205730 4198818 4169440
4958 4169440 4300271 3969583 4083466 4226589 4189976 4227340 4527945 4612523 4209027 4186084
4948D186084m22022K44186J48448k16880j8185J42520p0377l11970r0823J79772
4938C770753q9550n1184k32766l69991L84833J27151K63875R7598m16257j9728
4928C464734l326J39692k14256J22850l7477k05964K3252q1343N2081l8118l97208
4917B824917p6766L21124o9643J5837k81956o2464J69750p0586J58267j34047
4907B794433j25944k77502J87295P1865j68784k3790j58982k6576J20864j4904
4897B377975R6328r4959J89918j96963k58625n3519m0427M9250M4052p4762M42169
4886B480437P2537p1769l05002R3053n9446m3018N3562k62446O8396L89620L9926
4875B455850j42311l26134K39245M09392p3671l12302r3393j26465K52936o3952
$$ plain form
4948 4186084 3764062 4008248 4156696 3939816 3921631 4064151 3993774 3681804 3590981 3770753
4938 3770753 3681203 3630019 3397253 3027262 3412095 3539246 3803121 3900719 3484462 3464734
4928 3464734 3461408 3601100 3386844 3509694 3472217 3266253 3289505 3208162 3260243 3222125 2824917
4917 2824917 2748151 3069275 2999632 3015469 2733513 2671049 2840799 2770213 2928480 2794433
4907 2794433 2668489 2390987 2578282 2650147 2481363 2457573 2298591 2272015 2392879 2377975
4897 2377975 2474303 2379344 2569262 2372299 2113674 2060155 2019728 2068978 2113030 2038268 2480437
4886 2480437 2552974 2481205 2176203 2269256 2209810 2166792 2220354 1957908 2026304 2415924 2455850
4875 2455850 2313539 1987405 2226650 2636042 2562371 2250069 2156676 2030211 2283147 2219195
4865B219195l54858J46439q9128K7267O8241l9476m16099n9350j1938K76832l5354
4854A731771J22960j93934j26549j01901J52711l5314J10672M9462J70430L0766
4844A911074n4424K26855M3989j5505p1218N4206o8043k29697o8100J43329k47598
4833A624868l04603K86947j3859P1431J12445j67046J17665k33730j35303O57533
4823B016348j25364p072m68974J31406k00678j79779K28074n319k7883m72642
4813H88117K38683J45160K21795L8669k3299q8741j38489j4989j8203l8698K16199
4802A426204K4410k12729j55402k7867L04090p3769k91823J88190o1617J24505
4792A244192j2069Q7789j23627O9392j5210k34010J69352l70560L35021J88793
$$ plain form
4865 2219195 1864337 2010776 1921648 1948915 2017156 1977680 1561581 1502231 1490293 1767125 1731771
4854 1731771 1854731 1660797 1534248 1432347 1585058 1549744 1660416 1709878 1880308 1911074
4844 1911074 1856650 2083505 2127494 2111989 2040771 2094977 2026934 1797237 1729137 1872466 1624868
4833 1624868 1320265 1607212 1593353 1664784 1777229 1610183 1727848 1494118 1358815 2016348
4823 2016348 1890984 1883912 1414938 1546344 1345666 1165887 1393961 1388642 1360759 888117
4813 888117 1126800 1271960 1493755 1532424 1509125 1420384 1281895 1266906 1248703 1210005 1426204
4802 1426204 1450614 1237885 1082483 1054616 1358706 1284937 993114 1181304 1119687 1244192
4792 1244192 1232123 1319912 1196285 1265677 1250467 1016457 1185809 815249 1150270 1339063
4782A339063j55151p5734M1834j6987J48348J71703J65199j25599j40131j11801
4772A240744J14241r0567m1475p7581k15998P2706J80182o4401j62251P8803K19732
4761A254135K39481p9707n9918k92114K01176p2039k09494K45174R9728k7810
4751A298612l9453L9636q8513j2811Q9427P54k9455M4767J22277P9705p4900p6058
4739A353988k52351k72985K66383k05744J21855n6780P0427M0405n8152J03201
4729A110247J85179r2558m9721K6649K11062j53928k19308k99322N63269o5304
4719A216265k74611J44652J32717j01377l59168M4881L8428K50088k56657Q2268
4709I17486j40267k46153J43115M57030j51332j40845m825L15271J35469j91757
$$ plain form
4782 1339063 1183912 1108178 1150012 1133025 1281373 1453076 1618275 1492676 1352545 1240744
4772 1240744 1354985 1264418 1222943 1145362 929364 1002070 1182252 1117851 955600 1034403 1254135
4761 1254135 1493616 1413909 1353991 1061877 1263053 1191014 981520 1226694 1326422 1298612
4751 1298612 1259159 1298795 1210282 1197471 1286898 1287652 1258197 1302964 1425241 1504946 1430046 1353988
4739 1353988 1101637 828652 1095035 889291 1011146 954366 1024793 1065198 1007046 1110247
4729 1110247 1295426 1202868 1153147 1179796 1390858 1236930 1017622 718300 1281569 1216265
4719 1216265 941654 1086306 1219023 1117646 758478 803359 841787 1091875 835218 917486
4709 917486 777219 531066 674181 1131211 979879 839034 834209 1149480 1284949 1093192
4699A093192o2315L1695J7449j96476n8475P0270J57573j479L52168L3718l43657
4688A093663j50553J07750p080J27856J05776L5553M8951J06832n2583J29725
4678A545890K56918l02205l00547q2706O8917j00036m3810K30450j00983p9807
4668A092081R1196j49776K04848L70832j77770j19456l51249n7658J78264J46820
4658A228132r5363m89559K9759l07107K69519J19234l19555L2087j8495J16069
4648E64721J65936j46220m1281N0396L7335j78004J46993J49773N3970n108J30958
4637I29469k50520J47012N112j04240l7992k42052k9551M2356M14589J20190l53900
4626F40473j48308K25023n2200j54030J87689K10556M3136j38776J01283k34573
$$ plain form
4699 1093192 1030877 1062572 1080021 883545 825070 895340 1052913 1051434 1403602 1437320 1093663
4688 1093663 943110 1050860 1043780 1171636 1277412 1312965 1361916 1468748 1416165 1545890
4678 1545890 1802808 1500603 1200056 1117350 1186267 1086231 1042421 1272871 1171888 1092081
4668 1092081 1183277 1033501 1238349 1609181 1431411 1311955 960706 903048 1081312 1228132
4658 1228132 1132769 643210 672969 365862 635381 754615 435060 467147 448652 564721
4648 564721 730657 584437 543156 593552 630887 452883 599876 749649 803619 798511 929469
4637 929469 678949 825961 831073 726833 688841 446789 417238 459594 874183 994373 640473
4626 640473 492165 717188 664988 510958 698647 909203 952339 813563 914846 680273
4616F80273l27798r1184L62567Q0438J01947Q4664J61696L4554m39204k67739
4606C80214J0820l9725J77141K01439j11260K9561r7753l5989l0990R9686j41488
4595D41656K9310J25476L1568k16103r8453K87233K9714l03990R6101M74485k31336
4584F65661k45567K15794m71557J4266j66413L29194K33238J75099l15870j44543
4574B89302J73235O9253L30839J41133k75041N0180N8772p3376k52057k55373
4564B56867J3442K94655K07469O015j44150m10524r5820J35123K2054J74333L78874
4553H38338J48058k22575p4240J26833l07956J91535n6903j00186j14579J08018
4543E36343j6840L75086J7296p207l4801k35191l5598M5293J26427J94859k54111
$$ plain form
4616 680273 352475 261291 623858 704296 806243 890907 1052603 1087157 647953 380214
4606 380214 391034 351309 528450 729889 618629 648190 550437 514448 483458 583144 441656
4595 441656 470966 596442 628010 411907 313454 600687 630401 326411 422512 896997 665661
4584 665661 420094 635888 164331 178597 12184 341378 574616 749715 433845 289302
4574 289302 462537 531790 862629 1003762 728721 778901 837673 764297 512240 256867
4564 256867 270309 564964 772433 778448 634298 223774 127954 263077 285131 459464 838338
4553 838338 986396 763821 689581 816414 508458 699993 643090 542904 428325 536343
4543 536343 519503 894589 911885 904678 869877 634686 599088 644381 770808 965667 711556
4532G11556j11901j20798L9477J91543j82043K25701l5598n9983J1161K00117
4522H69232j09825l1590K16936L53926J65149j95367k8377k39158J0591j23978
4512H87539J41379j3913J28312M17528k54867k86008O2133R9561J61640k2171
4502A321133l39456o7558m533J15263L87821j66363k8051J21874m62776L41808
4492A219162J4309j34481Q504J20086K49208P6456k05380l0196j9867P3178j631
4481A369348k7195J48578M3476j1665m07391J93812m6831p2810K45445K29747
4471A664514k14309j31967K76614O7034j2292J48845K86041l00431n3559L07234
4461B037724k00639l526L3841J34801k6875l27613J20336K67045P8513J00814
$$ plain form
4532 711556 599655 478857 518334 709877 527834 753535 717937 657954 669115 869232
4522 869232 759407 727817 944753 1298679 1463828 1268461 1240084 1000926 1011517 887539
4512 887539 1028918 1015005 1143317 1560845 1305978 1019970 1082103 1181664 1343304 1321133
4502 1321133 981677 914119 909586 1024849 1412670 1246307 1218256 1340130 877354 1219162
4492 1219162 1233471 1098990 1107494 1227580 1476788 1553244 1347864 1317668 1297801 1370979 1369348
4481 1369348 1342153 1490731 1534207 1522542 1115151 1308963 1262132 1189322 1434767 1664514
4471 1664514 1450205 1318238 1594852 1661886 1649594 1798439 2084480 1784049 1730490 2037724
4461 2037724 1837085 1833559 1867400 2002201 1975326 1647713 1768049 2035094 2113607 2214421
4451B214421K64157k16462j52173O6690j57844J77040M00577k0080P8133K39601
4441B894060L99807J1047M4353k2782j51672K03908K68649l72890q3241K40597
4431C431836L56767M46980j770l0745n6345J12983o4336k04119L68995N66135
4421D926381l8475K2588M35619n3301J61695K91390j01908K75081j05435N04135
4411F317770K44684L095M23321J07106K73891N09230M20548K2463L23970J99223
4401H845301L56254O01279N88043O17115N00306O34370N39689Q26688Q04334Q69296
4391A5182675J016085J257195J441340J759846J673078K492042K451512K640729
4383B9914502L424112L518499L021253K138458J919135J883650K472129L404566
$$ plain form
4451 2214421 2478578 2262116 2109943 2176633 2018789 2195829 2596406 2576326 2654459 2894060
4441 2894060 3293867 3304914 3349267 3326485 3174813 3378721 3647370 3274480 3191239 3431836
4431 3431836 3788603 4235583 4233813 4203068 4146723 4259706 4195370 3991251 4360246 4926381
4421 4926381 4887906 4910494 5346113 5292812 5454507 5745897 5643989 5919070 5813635 6317770
4411 6317770 6562454 6565549 6988870 7095976 7369867 7879097 8299645 8322108 8646078 8845301
4401 8845301 9201555 9802834 10390877 11007992 11508298 12142668 12682357 13509045 14313379 15182675
4391 15182675 16198760 17455955 18897295 20657141 22330219 24822261 27273773 29914502
4383 29914502 33338614 36857113 39878366 42016824 43935959 45819609 48291738 51696304
4375E1696304M661969M316756L673071K090364P7891R3872N04543J424365L017928
4366G1557063L911960K956508P34416j900974l960412l807946k891457j532652
4358F5066506p07586n5781p55198k845613m542787m638257m092637l681705k572638
4349D1174304j772391j814846k497929k898795l017790l126951k917477k123921
4341B1004204k041461j932862j310187j081957j057906p11938o58088n59062n19180
4332A1131563o03249o36341k83996n96001k85236m18779l83519k1090m01591k46849
4322G254912j96844j66969k55665L7397k38011n63145k52650k39628m79096l32879
4312D567422J19043L7749k25112J79271k85133l50108j03064O6740M07805k68772
$$ plain form
4375 51696304 56358273 60675029 64348100 66438464 66516355 66610227 67114770 68539135 71557063
4366 71557063 75469023 78425531 79159947 77258973 73298561 69490615 66599158 65066506
4358 65066506 64358920 64303139 63547941 60702328 56159541 51521284 47428647 43746942 41174304
4349 41174304 39401913 37587067 35089138 32190343 29172553 26045602 23128125 21004204
4341 21004204 18962743 17029881 15719694 14637737 13579831 12867893 12209805 11650743 11131563
4332 11131563 10528314 9891973 9607977 9011976 8726740 8307961 7924442 7903352 7501761 7254912
4322 7254912 7058068 6891099 6635434 6672831 6434820 5871675 5619025 5379397 4900301 4567422
4312 4567422 4686465 4724214 4499102 4678373 4393240 4043132 3940068 4006808 4414613 4145841
4302D145841l22689o34484j86773J84185J10662J20099j03936j12470j50011Q3290
4292C133714j1612k86782m86381j89874J38485K60343j6482N5745p2958q9224
4282B434974J62545k18574k92059j08640j82635j73795j59800J29220J28550k17397
4272A502389N0569K4463j68716Q5256N0345k21622p7596M964j32565K3422J04312
4261A245221J79833l8704R5708q2058k29519j72748j08076J30537J4097J59359
4251A193650J12820k15383k45764R2574p0643j79144j97665k5352K30540r983
4241F85650L8909j08135Q2107J93319P646l94044n5041J24893k5991J63218L0808
4230G43339j01559j51957K57824R0551j70851j23389j0737r6048p1241L118J31442
$$ plain form
4302 4145841 3823152 3188668 3001895 3186080 3296742 3416841 3312905 3200435 3050424 3133714
4292 3133714 3122102 2835320 2348939 2159065 2297550 2557893 2541411 2597156 2524198 2434974
4282 2434974 2597519 2378945 2086886 1978246 1795611 1621816 1462016 1591236 1719786 1502389
4272 1502389 1552958 1577421 1408705 1493961 1544306 1322684 1245088 1250052 1117487 1140909 1245221
4261 1245221 1425054 1386350 1482058 1400000 1170481 997733 889657 1020194 1034291 1193650
4251 1193650 1306470 1091087 845323 937897 867254 688110 490445 465093 695633 685650
4241 685650 724559 616424 698531 891850 899496 505452 450411 575304 549313 712531 743339
4230 743339 641780 489823 747647 838198 667347 543958 533221 437173 365932 369050 500492
4219E00492K58180k92571j97835R5736J42700o5756j01333J71678L2662r2287
4209D51666m3267P114J22341r3951k42434r6421K28076J00120L03725q1137l64601
4198B91231J81783m9727k19578J77362J5680n3791r6607O5378K75525j16212j44218
4187C26826J33843j78028J01379M6894o6405R3856R2690J4061K05910o4318l0384
4176F76324q993j83978K11301j58731K681j87884j9164L2271J15530j92882R6027
4165C82502j5698J5403J28566k29883l83703L2303K84269p2422K60287K72357
4155F73981k54774L7131k44986M5394j72908P1002J9351K76852R538J51443j27564
4144D84460l50452J36448j7997j2778K39135j12143j03841K30641j56928p6030
$$ plain form
4219 500492 758672 466101 268266 364002 506702 440946 339613 511291 543953 451666
4209 451666 408399 415513 537854 443903 201469 105048 333124 433244 736969 655832 291231
4198 291231 473014 423287 203709 381071 396751 342960 246353 311731 587256 471044 326826
4187 326826 460669 282641 384020 430914 364509 458365 551055 565116 771026 706708 676324
4176 676324 667331 483353 694654 535923 538604 350720 331556 363827 479357 286475 382502
4165 382502 366804 382207 510773 280890 -102813 -70510 213759 141337 401624 673981
4155 673981 419207 456338 211352 256746 83838 154840 174191 451043 460581 612024 484460
4144 484460 134008 270456 252459 239681 478816 366673 262832 493473 336545 260515
4134B60515O4225L7454J39687j06243m0666J02731j18952J6332j98022J13177
4124B70238J67517n0354l22233K93632J01979k54110j60807j09148N9608O5487
4114F1809P878M5032n0390J10317K21471J14800m43292O5866j3302K00399L3371
4103C53959j92035j62141M2084K90985J26602l3594l0242j10652l13840M8139
4093A9265K97725k91780L05496P6502n64806l030L1280N6434k36061Q5376L96729
4082A73130j65849J9456J66215J62687j15009O2796p951m29916J20336K78434
4072B64329J01790j20141l7043L8307L70718j48976o2714q7595k04113L91156
4062E05718J83116j73326j88354K2181R0591J26099k10419K00505Q9167N8022
$$ plain form
4134 260515 324740 362194 501881 395638 354972 457703 338751 355083 157061 270238
4124 270238 437755 387401 65168 358800 460779 206669 45862 -63286 -3678 61809
4114 61809 69687 114719 64329 174646 396117 510917 67625 133491 120189 320588 353959
4103 353959 161924 -217 41867 332852 459454 425860 395618 284966 -28874 19265
4093 19265 316990 25210 330706 407208 -157598 -160628 -129348 -72914 -308975 -223599 173130
4082 173130 7281 26737 192952 355639 240630 303426 295475 -134441 -14105 264329
4072 264329 366119 245978 208935 247242 617960 468984 406270 318675 114562 505718
4062 505718 688834 515508 327154 349335 439926 566025 355606 556111 645278 703300
4052G03300J90493m28540r4034K90536J34137o5427m0542k4267o7232j50660j38094
4041C09670J57896j74514K81385m8594k59024N81771k05991j73716k22926k66713
4031b0756Q8242K80173K09312K74363J24740k92149r4755l73627m88802J89707
4021a03552J91422q0867j1272p6939M56688q1532j92871j24079j03419j00389
4011b26810K8597q528L4332L43674O2101K33688l54957k30386p4794K98845J67952
4000B73714J63210j82742q0164q6947j87226M13240j79479j43521M4893l8041
3990c063j48000j72412K67664R3883r1853J42173J55698k97335n7457j09612J95876
3979b4438L0790k9933n8142Q9901J16404l09475L5012K63768q1181j97049L6256
$$ plain form
4052 703300 893793 465253 371219 661755 795892 730465 689923 665656 598424 447764 309670
4041 309670 467566 293052 574437 525843 266819 848590 642599 468883 245957 -20756
4031 -20756 67486 347659 556971 831334 956074 663925 569170 195543 -293259 -103552
4021 -103552 87870 7003 -4269 -81208 375480 293948 101077 -23002 -126421 -226810
4011 -226810 -198213 -206741 -172409 171265 233366 467054 112097 -118289 -193083 105762 273714
4000 273714 436924 254182 174018 87071 -100155 313085 133606 -9915 34978 -3063
3990 -3063 -151063 -323475 -55811 38072 -53781 88392 244090 -53245 -110702 -220314 -24438
3979 -24438 6352 -23581 -81723 8178 124582 -184893 -149881 113887 32706 -164343 -128087
3968a28087R4225K0203P5055J3523J37403Q1915k5311k92588K61118K4203k61509
3957A50J17912M98626J61435l16718k90518l0518N2481M9794l28505k6331M08882
3946B96690j88494j1650l6977k5243K127Q0721k61671n6779j16207K00165K44593
3935A27275J21552l22072J26433K58785J07106j19728k9438M2212j74063J95679
3925C33741K01640k92502m4389p9819j87447q4151Q9909j55747j1106J92493P0805
3914C3427j60010j28792J68464N0165k04888J76483j25449l8027N2064J27274
3904d9289M7226J54815k26130K9469M23621j01827m58890j58573K72331l00004
3894c67251J58283J77176k10487q7317K30817n5870q6746N9j44320M7355L06503
$$ plain form
3968 -128087 -33862 -13659 61396 74919 212322 294237 268926 -23662 237456 261659 150
3957 150 118062 616688 778123 461405 170887 140369 192850 242644 -85861 -112192 296690
3946 296690 108196 96546 59569 34326 36453 117174 -144497 -201276 -317483 -117318 127275
3935 127275 248827 -73245 53188 311973 419079 299351 269913 312125 138062 333741
3925 333741 535381 242879 198490 118671 -68776 -152927 -63018 -218765 -229871 -37378 33427
3914 33427 -126583 -255375 -86911 -36746 -241634 -65151 -190600 -228627 -176563 -49289
3904 -49289 -2063 152752 -73378 -43909 379712 277885 -181005 -339578 -67247 -367251
3894 -367251 -208968 -31792 -242279 -329596 -98779 -154649 -241395 -241336 -385656 -338301 -31798
3883c1798K04156j19612P7683o458j15916o7473J23856K29817j20972k65325j1940
3872a03982J79557j28774J04656K88506o5443j45608m68217J1687J27750p7247
3862b77115J92860n2435o5603j38683L02938L2402K90517J28637k87838q2974
3852D2706J55699q3614o687k26850K49000j52510j69612j32395Q6195L36654p3681
3841B4905j55144j05091J94604j48921J94173M6610J4162K06628J8740P1425k42131
3830A19960j29741N045N9440k2762n8901R2804J20623K8159j50051m4510R6775
3819A16841k5996r575n2402J05969n9298R818n8790r2557k48027p0246L07581
3808g6682r4891Q3321K86573k10854k12302R8601L41220l61883j24057N4734J47927
$$ plain form
3883 -31798 172358 52746 130429 123971 8055 -59418 64438 294255 173283 -92042 -103982
3872 -103982 75575 -53199 51457 339963 274520 128912 -339305 -327618 -199868 -277115
3862 -277115 -84255 -136690 -202293 -340976 -38038 -5636 284881 413518 125680 42706
3852 42706 198405 114791 108104 -118746 130254 -22256 -191868 -324263 -238068 98586 24905
3841 24905 -130239 -235330 -40726 -189647 4526 51136 65298 271926 290666 362091 119960
3830 119960 -9781 -4736 54704 31942 -26959 65845 186468 214627 64576 20066 116841
3819 116841 90845 81270 28868 134837 75539 85357 26567 -65990 -314017 -384263 -76682
3808 -76682 -171573 -88252 198321 -12533 -224835 -126234 214986 -146897 -270954 -216220 -68293
3797f8293q6050k15888K51524Q483L25350k19205j60723R8461J18474k72576J37220
3786h3223M3200P9704q5583j35735K20464O225l1277J82867j38826Q589K12061
3775B78466j08424J69744n6005k57714l1704j47928J55774k3944R0268j0524Q2022
3764A40031K53681j16217k40038J1037p7116n3383o3951K89425p4791j75391K1527
3753h5186j97610j6710K87566K50317j62517j86791l2052K42133l48892l67K71466
3742B1357j31599o177K70650J11124k51480m38880l8395R8213K47639J00293Q4128
3731F6873L5921R8851j70149l04887M12758m33273q186L93321L4115l47976l17
3720b22949J57977Q2511j15973j69804L34312p2364J54191q408k03727J2372j28010
$$ plain form
3797 -68293 -154343 -370231 -118707 -110224 215126 -4079 -164802 -66341 52133 -220443 -83223
3786 -83223 -40023 39681 -45902 -181637 38827 45052 13775 196642 57816 66405 278466
3775 278466 170042 339786 283781 26067 -5637 -153565 2209 -21735 68533 58009 140031
3764 140031 393712 277495 37457 48494 -28622 -82005 -145956 143469 68678 -106713 -85186
3753 -85186 -282796 -299506 -11940 238377 75860 -110931 -142983 99150 -249742 -250109 21357
3742 21357 -110242 -116419 154231 265355 13875 -425005 -463400 -365187 -117548 -17255 66873
3731 66873 102794 201645 31496 -273391 139367 -293906 -302092 91229 125344 -222632 -222949
3720 -222949 -64972 17539 -98434 -268238 66074 -6290 147901 139493 -64234 -51862 -179872
3709a79872J1703J42447j80122r8260L69199l0108j30860j0373Q2085Q4995J64180
3698B25014k82540k00725N3870j31229K66671j456j05364j33584N6327K55401
3688B385J93604j18236k0998j21125P6768l165q122j43298L30497m6848j65369
3677b3907l63453j9817L97295R2865k24957Q6951K38800K5128k89040q7477K10539
3666D2927j23717r3754R8846L9883O6311J0173j28227j0552J86681J03650L0880
3655B23101J2930l15423K93597j13679k35870j41997M08074k82863M03506N670
3645B57046n33126P7784K35695j06374k87041N5527j58582K09077J22067L10693
3635A82766p6844k12488J41835j95231J72390o9428m9655k38385K22077J60920
$$ plain form
3709 -179872 -168169 -25722 -205844 -304104 65095 34987 -95873 -106246 -24161 60834 225014
3698 225014 -57526 -258251 -204381 -335610 -68939 -70395 -175759 -309343 -253016 2385
3688 2385 195989 77753 56755 -64370 12398 9233 1111 -142187 188310 141462 -23907
3677 -23907 -387360 -407177 -9882 82983 -141974 -55023 183777 208905 -80135 -167612 42927
3666 42927 -80790 -174544 -75698 -35815 30496 40669 -87558 -98110 88571 192221 223101
3655 223101 236031 -79392 214205 100526 -135344 -277341 130733 -152130 251376 257046
3645 257046 -276080 -198296 37399 -68975 -356016 -300489 -459071 -249994 -127927 182766
3635 182766 105922 -106566 35269 -159962 12428 -57000 -106655 -345040 -122963 37957
3625C7957j17605L63046l78554n5308q4864j04417K01216M16082p2532k85641
3615h0620J49163K15757j68689m8806J20982j2569j56829Q5163q9618j4949m6739
3604d7754j29197K31377j39465M4138N51557j33619l81671j92778K00333j5311
3594a2390j66332J87926m9337j07899k7347J16862K06667M0825k61902m8970P473
3583a14424K34437q882P6811j15932j43443L44795j3131l20816p1428K74632p3265
3572F9354p0201J25259j68742j99981R0536J03906M5606J38505k82991j35962
3562b84711K15623K24627J22604j58085j56731j34007j76777K32563J8875O330
3552h9689m1966p5395J55373J43113n1083k8884l4673k42996K02455l1786R4011
$$ plain form
3625 37957 -79648 283398 -95156 -150464 -235328 -339745 -138529 277553 205021 -80620
3615 -80620 68543 284300 115611 66805 187787 175218 18389 103552 13934 -1015 -47754
3604 -47754 -176951 54426 -85039 -40901 510656 377037 -4634 -197412 2921 -12390
3594 -12390 -178722 9204 -40133 -148032 -175379 -58517 148150 188975 -72927 -121897 -114424
3583 -114424 120013 111131 187942 72010 -71433 273362 260231 -60585 -132013 142619 69354
3572 69354 -847 124412 -44330 -244311 -153775 -49869 -4263 134242 -148749 -284711
3562 -284711 -69088 155539 278143 120058 -36673 -170680 -347457 -114894 -96019 -89689
3552 -89689 -131655 -207050 -51677 91436 40353 11469 -23204 -266200 -63745 -95531 -1520
3541a520l44932Q8467M3820L9887L33712L3384J4370j20881j50094k50449J47563
3530a66673J46163R1104j37251k1231L93090q086Q6907m32967r706N9049M2929
3519D3328J88125k47586j35942N4695j4974j52448l2107K97567K02479j17574
3509H5563K51806Q387j4997j19068l01384k65255N37431J2567k79056q9936J80788
3498F846J42859J03308j89640N9903K27970j4723o5570N1377k02350j16280J71449
3487A75149j3509J58961r7152p6391j85039L2744j18949k05203L72911j55767
3477a12245n9321K67426O7996K50246k08723j48779r3723L48955j24084J10563
3467B98311K95605m77545J72442l03977q5834j94309O7035K44554j42500J92399
$$ plain form
3541 -1520 -346452 -257985 -214165 -174278 159434 192818 207188 86307 -63787 -314236 -166673
3530 -166673 -20510 70594 -66657 -87888 305202 297116 384023 -48944 -58650 399 43328
3519 43328 231453 -16133 -152075 -97380 -112354 -264802 -296909 658 203137 85563
3509 85563 337369 345756 330759 211691 -89693 -354948 182483 195050 -84006 -173942 6846
3498 6846 149705 253013 63373 123276 351246 336523 270953 322330 119980 3700 175149
3487 175149 161640 320601 223449 147058 -37981 -5237 -124186 -329389 43522 -112245
3477 -112245 -171566 95860 163856 414102 205379 56600 -37123 311832 187748 298311
3467 298311 593916 116371 288813 -15164 -100998 -295307 -228272 16282 -126218 66181
3457F6181J74261k85368K5117J36321l7245P9133o5930m24160J79784K44664J47652
3446B40410M8518j53667k47304L2612K30872r3161K08848j07452J95746j1160
3436C44262k42746k03076J32570M1360K89108m3101k57884L1629L5313j27881
3426d46R7586j63223j06639J98352K07412j86803P047Q2560k53951J28591p2037
3415f1551o9749K32256M3779k07326r499P2395K02752J42151j70937L3860k3959
3404A84172l13261L6836K15432j5219M5947M6952j06913k19381J30551R4671j38262
3393c8475M2480q0411l01331J47346J05903l0792j71640K9220J22549J05193J18915
3382D8957r2146p8804K25826p9175j28678k5981J90180K24001J41472k71387J59
$$ plain form
3457 66181 240442 -44926 -19809 116512 79267 158400 92470 -331690 -151906 92758 240410
3446 240410 288928 135261 -112043 -79431 151441 58280 267128 159676 355422 344262
3436 344262 101516 -101560 31010 72370 361478 318377 60493 92122 127435 -446
3426 -446 97140 -66083 -172722 25630 233042 46239 53286 135846 -118105 10486 -61551
3415 -61551 -131300 100956 144735 -62591 -72090 305 203057 345208 174271 208131 184172
3404 184172 -129089 -92253 123179 107960 153907 200859 93946 -125435 5116 99787 -38475
3393 -38475 4005 -76406 -377737 -230391 -124488 -155280 -326920 -297700 -175151 -69958 48957
3382 48957 -43189 -121993 103833 24658 -104020 -130001 60179 284180 425652 154265 154424
3371A54424R2382k79177J73697j16234N2290p3463j0332j90892K37582J05832
3361A46109k14325M8105J06343L9388L7145K90566m63144j61249L5754J06487
3351b8821j53371j41719J91242J64466K84521l49166N9674R4847k3271m5009l3078
3340B0315q3743P0588j82929O1643R5157J33572m9607p9678l7514k0816k26637
3329b99649l67356L87014L24526n3735o2476L66024r6151q6362L34198M2576q7902
3318D00707j42387N1832j55253K64974j80229M8623j13529j06333k91568j34395
3308c57558L71610n4026J26798r661l27986l3685K39910j3791k13247L1120J18269
3297a22247j24491P8674J32484K61753R3959N240k3957o1982J2879j51535M7925
$$ plain form
3371 154424 246806 -32371 141326 25092 77382 3919 -6413 -197305 40277 146109
3361 146109 -68216 -20111 86232 125620 162765 453331 -9813 -171062 -135308 -28821
3351 -28821 -182192 -323911 -132669 31797 316318 -32848 26826 121673 98402 53393 20315
3340 20315 -63428 7160 -175769 -114126 -18969 114603 64996 -14682 -52196 -73012 -299649
3329 -299649 -667005 -279991 44535 -9200 -71676 294348 198197 111835 446033 488609 400707
3318 400707 258320 310152 154899 419873 239644 288267 174738 68405 -223163 -357558
3308 -357558 14052 -39974 86824 77163 -250823 -284508 -44598 -58389 -271636 -240516 -122247
3297 -122247 -246738 -168064 -35580 226173 320132 325372 301415 239433 252312 100777 148702
3286A48702n5088j22800K28039l33523P6338J39362K2177J29777j6781J42815
3276C59018m84902k3823L58246j56607J40827q1k39072p3694J70491N4696J79536
3265B84635n23875K31617J91112l6624Q498j58709n4297k36994O43657M1304m24613
3254c4289l961l693j56052M0807J01754j44065R7622O0842r6280q1795K08038
3243a1072K2697k17498J00535j8640K54163j42582k7442J41644L7233J16576j19430
3232A36184o1568p280K20638O8466q3802J34827M141o7824q3621O0128N1520l96235
3220b4426K10400O9354r0059o9958l864L0460O2335R2833m6450K60066q9909L805
3208D04587R5669p6048j79812Q3294J88667j58723k88080K32R9624j52447J24278
$$ plain form
3286 148702 93614 -29186 198853 -134670 -58332 81030 103207 232984 216203 359018
3276 359018 -125884 -149707 208539 51932 192759 192678 -46394 -120088 50403 105099 284635
3265 284635 -239240 -7623 183489 146865 155363 -3346 -57643 -294637 349020 390324 -34289
3254 -34289 -38250 -41943 -197995 -157188 -55434 -199499 -101877 -41035 -137315 -219110 -11072
3243 -11072 11625 -205873 -105338 -123978 130185 -12397 -39839 101805 139038 255614 136184
3232 136184 74616 67336 287974 356440 272638 407465 411606 343782 260161 320289 371809 -24426
3220 -24426 185974 255328 165269 95311 91447 121907 184242 277075 230625 490691 400782 404587
3208 404587 500256 424208 244396 327690 516357 357634 69554 69786 169410 16963 141241
3197A41241k08350J30693M1407k4396L09432j03636m61104K73228L07255j02765
3187C03005j17200k01307k8732J31508k47490n6748Q6884N5933L88031k8096o2791
3176B22997J61643k34313j72044M5052J15043O0693j42778k38859M0784L14642
3166A72860l74245O8714K3428k3134j30179J14818K09352J49101N6049J2538l73556
3155i4254k25939M08721J84558J60932R8831k90107l33395J06283J70780k53154
3145f6744N8600K13858P3970j8924k28106k26744o8909L26736J1570K6393K33336
3134C35036q4776K18155n2364k0273L71172r4414k43514q7420J3473L47098r3520
3123F08653j08667q016l26315K09995K4393k53865J28060J00346N1767j60054
$$ plain form
3197 141241 -67109 63584 104991 80595 390027 286391 -174713 98515 405770 303005
3187 303005 185805 -15502 -44234 87274 -160216 -216964 -130080 -74147 313884 285788 222997
3176 222997 384640 150327 -21717 23335 138378 199071 56293 -182566 -141782 172860
3166 172860 -201385 -132671 -109243 -132377 -262556 -147738 61614 210715 266764 279302 -94254
3155 -94254 -320193 88528 273086 434018 532849 242742 -90653 15630 186410 -66744
3145 -66744 -8144 205714 279684 260760 32654 -194090 -262999 63737 75307 101700 335036
3134 335036 250260 468415 416051 395778 766950 672536 429022 341602 355075 702173 608653
3123 608653 499986 491970 165655 375650 400043 146178 274238 374584 426351 266297
3113B66297k3490j38294l4283j10199r2308K57125J80337k31159l75066K28862
3103g2178R5432j01680K3320K21408k81698j73867J45052K09190J25844J12250
3093C03073k19587k50851k09385J81797J07219L8554L77629K47803q7701l69085
3083A19466p5534J28713o8681k76871J96142K49467k23924j21442J60462q66k02052
3072a15120R4850p2243q62J01541k9577j11343K9369K84158j36884j34174J00568
3061A0283K68381n1349j02962m5297l09170j17026O2078J11520N2410j32457j4502
3050b68091p6364J81143J84758l6515J5829K33962P7394N1902k02392p3024K9353
3039A17955N2798j23785l28915J94165N31369J0393m17505J91366k68452O7385
$$ plain form
3113 266297 242807 104513 70230 -39969 -132277 124848 305185 74026 -301040 -72178
3103 -72178 23254 -78426 -55106 166302 -115396 -289263 -144211 64979 190823 303073
3093 303073 83486 -167365 -376750 -194953 -87734 -49180 328449 576252 488551 119466
3083 119466 43932 172645 103964 -172907 23235 272702 48778 -72664 87798 86932 -115120
3072 -115120 -20270 -92513 -93375 8166 -21411 -132754 -103385 180773 43889 -90285 10283
3061 10283 278664 227315 124353 79056 -230114 -347140 -285062 -173542 -121132 -253589 -268091
3050 -268091 -344455 -163312 21446 -15069 760 234722 312116 364018 161626 88602 117955
3039 117955 170753 46968 -281947 -87782 443587 453980 36475 227841 -40611 26774
3029B6774j8935K67882j22481r2255j25526o4365K9077N2236j94888p7692M26170
3018A05997L8640k09375k04681K95382j93708J41302m17349N0936K48793J68405
3008B4342m8305R4749K58538q1676n4435J78893j57512n1138q7067l54831K24246
2997e4196K90615R8248l29759r4153j09860J07958k03856Q6048r302O3939J54392
2986G4R8240j21767J21090K83822j15587L7689j8386j96332j72754K97033J80373
2975C93495j65800p9973o9143k4397K7994m2524j78940k0980J10186j56332J01819
2964a04595j11758J28032j30366j38425K75888K89525k43537R6298J37032j85645
2954A2449j42524m4034Q5292J45255O1855k26155n2141N8446J88912q1765j45618
$$ plain form
3029 26774 7839 275721 153240 60985 -64541 -128906 -99829 -47593 -242481 -320173 105997
3018 105997 144637 -64738 -269419 25963 -167745 -26443 -443792 -392856 -144063 24342
3008 24342 -23963 70786 329324 247648 193213 372106 214594 163456 76389 -278442 -54196
2997 -54196 236419 334667 4908 -89245 -199105 -91147 -295003 -208955 -218257 -154318 74
2986 74 98314 -23453 97637 381459 265872 303561 285175 88843 -83911 213122 393495
2975 393495 227695 147722 78579 54182 82176 39652 -139288 -160268 -50082 -206414 -104595
2964 -104595 -216353 -88321 -218687 -357112 -81224 208301 -35236 61062 198094 12449
2954 12449 -130075 -174109 -88817 56438 118293 -107862 -160003 -101557 87355 5590 -140028
2943a40028O9883K13268J11721l01044r1560q1724m4679L11277m1634k16910m011
2932b15441j84372N85938J43710n80493K06586L43685k70637k33891j66140n986
2922c77041L84837j58314K11599K9735j3359j9627j4927p4296K54930k05267m3724
2911b5454K97411k5075j11729k48393k01227J56908r6884j99604M97770j16526
2901g2803j39739L46316j0682N0719j03299j75007K37625n0090p4600L5089K0822
2890F4351J953p6464j22389j89723J96128L59671L47903j57625j91482k81984
2880d9661L74875j74400j96375K58966k01424R2492l6639j2323j09996j54129
2870b08614j33355n1903N5042O2972N3048L2969R8247L04093m10701J24177k6939
$$ plain form
2943 -140028 -70145 143123 254844 -46200 -137760 -219484 -264163 47114 5480 -211430 -215441
2932 -215441 -399813 186125 329835 -250658 -44072 299613 28976 -204915 -371055 -377041
2922 -377041 7796 -150518 61081 90816 77457 57830 42903 -31393 223537 18270 -25454
2911 -25454 271957 246882 135153 -113240 -314467 -157559 -254443 -454047 43723 -72803
2901 -72803 -212542 133774 123092 173811 70512 -104495 133130 83040 8440 43529 64351
2890 64351 66304 -10160 -132549 -322272 -126144 233527 581430 423805 232323 -49661
2880 -49661 325214 150814 -45561 213405 11981 104473 67834 55511 -54485 -208614
2870 -208614 -341969 -393872 -338830 -275858 -222810 -189841 -91594 212499 -198202 -74025 -100964
2859a00964J55779L6096m4226k04591p6180K56027R1331K54180q5414j05647K0963
2848A97354l78540m6001J80616J07174J7979J70688j74462j20431J14413J47382
2838B16172K85407l51675O0853l34421j9691K97110K05814r9541l53681K33872
2828A40219j4814r7033j61283K55639L03391k68773p0768J73200O3278J50646
2818D73702j24961j94092j11707k48856j23916k82045L10162K20239J6304o3788
2808a28958R7382m3009J55119J47332k34646L2053J50533K4230R3861j58665q4587
2797E0645L1210j1006R8763r7660j18097j28916n9157J85318j31113k91850j0812
2786d82675N51511K4720k55196j84243j23551K74257j6542j46591J0493O39390
$$ plain form
2859 -100964 54815 90911 46685 -157906 -234086 21941 113272 367452 282038 176391 197354
2848 197354 -181186 -227187 -46571 60603 78582 249270 74808 -45623 68790 216172
2838 216172 501579 149904 210757 -123664 -143355 153755 359569 260028 -93653 140219
2828 140219 125405 28372 -132911 122728 426119 157346 86578 259778 323056 473702
2818 473702 348741 154649 42942 -205914 -329830 -611875 -301713 -81474 -65170 -128958
2808 -128958 -31576 -74585 80534 227866 -6780 25273 175806 200036 293897 135232 50645
2797 50645 81855 70849 169612 71952 -46145 -175061 -234218 -48900 -180013 -471863 -482675
2786 -482675 68836 93556 -161640 -345883 -469434 -195177 -211719 -358310 -347817 291573
2776B91573m16624j17085J15536J70662m7055j22784K22009R0826j44563N6776
2766I9271k00283j77367M1622Q4750J38394n960j98755K47o0326k5111L65427
2755F1909k38777J93664L78943j51301r0463K73757k01246L4588l59947r6473
2745a95346K54186L4937Q0287k55678j31622q2360M0204J48411j0954L6432R182
2734g2321N8588l41783K96167K79560j14709k88072J3082J48308k27409l0876
2724b79465J19556J57857l38936N4342M8693j388O7994Q9808p3321J52578L1017
2713B8735J0050J41987o6425k28105k12606J32946n426P4242L225K48045J38565
2702B65233J31241j25410k63290j43288K82616k15114J65964J68027k55472N5335
$$ plain form
2776 291573 -125051 -242136 -126600 44062 -2993 -125777 96232 187058 42495 99271
2766 99271 -101012 -278379 -236757 -152007 -13613 -19573 -218328 -218081 -278407 -303518 61909
2755 61909 -176868 16796 395739 244438 153975 427732 226486 261074 -98873 -195346
2745 -195346 58840 93777 174064 -81614 -213236 -295596 -255392 -106981 -117935 -81503 -72321
2734 -72321 -13733 -355516 -59349 220211 105502 -182570 -169488 -21180 -248589 -279465
2724 -279465 -159909 -2052 -340988 -286646 -237953 -239341 -171347 -81539 -154860 -2282 28735
2713 28735 38785 180772 114347 -113758 -326364 -193418 -198844 -124602 -121377 126668 265233
2702 265233 396474 271064 7774 -135514 147102 -68012 97952 265979 10507 65842
2692F5842j88255j34264k99875M51934N06206j0646r724j5104o0976K45906m69687
2681H1357k29573K88284K38685K84800l34598l40354K074J46537r4419j65374
2671a22581j5198M0009q6393Q9378l7467k08557J23367J03680K52247J70996p7919
2660B31562k90923J51572R8156j5038j54848j11149J527K2216k41878P9541J97766
2649c1496o1416K64283m34821j01576L34125K216r7223q8488L1655J71464j24917
2638a36194K51096j30076j18899K26192q9403q8908k99517K33061k3060K55688
2628G9980J60397l52141R4766K5879j06341m545J16272j68137k15446j88978j34935
2617f93229M60737l5293j22606K23403K0733J06645m13321J59528L25999j20780
$$ plain form
2692 65842 -122413 -256677 -556552 -104618 401588 390942 381218 366114 305138 551044 81357
2681 81357 -148216 140068 378753 663553 328955 -11399 -9325 137212 42793 -122581
2671 -122581 -137779 -97770 -184163 -94785 -132252 -340809 -217442 -113762 138485 309481 231562
2660 231562 -59361 92211 190367 175329 20481 -90668 -89141 -66925 -308803 -229262 -31496
2649 -31496 -92912 171371 -263450 -365026 -30901 -28685 -125908 -214396 -182741 -11277 -136194
2638 -136194 114902 -15174 -134073 92119 2716 -86192 -385709 -152648 -175708 79980
2628 79980 240377 -111764 -16998 8881 -97460 -102005 14267 -153870 -369316 -558294 -693229
2617 -693229 -232492 -267785 -390391 -166988 -146255 -39610 -452931 -293403 32596 -88184
2607h8184J09409j8620l35339j51731N3757J51297L81226L77419m83100m87756
2597d91622J91639l2343P3208o2526M5578L88066r2512r8576L9302l93809J3930
2586d19665K98649K18725j72082l02449J09045J31618l05547J25609L8539J77398
2576a00160J76030l55236l31889R4742j0191j67099L18156N2537J5927Q9360o4414
2565b82237p2686j20337K91832j2430j41607K50277J61932k17293k76200J66543
2555b52206J25902J61534q7285j21641l57129K8773R9927K03882J26054J0247
2545f1942l09888J87587M83019l09709k06524J36244M162j92378K46828n8139
2535h0740M1781M246k18402L46374N2910P3086j03749q5170m5273p4022j97417
$$ plain form
2607 -88184 21225 2605 -332734 -484465 -430708 -279411 101815 479234 -3866 -491622
2597 -491622 -299983 -332326 -259118 -321644 -276066 112000 19488 -79088 -39786 -433595 -419665
2586 -419665 -121016 97709 -74373 -376822 -267777 -136159 -441706 -316097 -277558 -100160
2576 -100160 75870 -279366 -611255 -516513 -526704 -693803 -375647 -323110 -307183 -217823 -282237
2565 -282237 -354923 -475260 -183428 -195858 -337465 -87188 74744 -142549 -418749 -252206
2555 -252206 -126304 35230 -52055 -173696 -530825 -502052 -402125 -198243 -72189 -61942
2545 -61942 -371830 -184243 298776 -10933 -217457 -81213 -77051 -269429 -22601 -80740
2535 -80740 -38959 -34713 -253115 93259 146169 219255 115506 30336 -14937 -88959 -286376
2524b86376L5023L01898M6530j24281j18433j61568n7141k51261L87262M70572
2514B42225j2889q2694n25485K78864M0729j18910J9547j9129k639J14176J3378
2503e2827n0074k03473j88773K16308K42594n68277Q4625L81320J05567J9534
2493a3476p8623l5241O5081j03308j78302l5839L06842J40217k94921R8423l3356
2482a62503p868K81136j52035o4997j74579L11473p4412n26628J43539p547j20393
2471e54814j71142L17934L06094j85273j62299K09843P123J39563o9544j63473
2461c25988j33173m063j80229J21498M8635K75619m8099k20867M16065P9324j95757
2450a67035K20339j11559k05956K26767j60389j8937J43615k10608K70548O0736
$$ plain form
2524 -286376 -251353 50545 97075 -27206 -145639 -307207 -364348 -615609 -228347 242225
2514 242225 229336 146642 -378843 -99979 -59250 -178160 -158613 -177742 -180381 -66205 -52827
2503 -52827 -102901 -306374 -495147 -278839 -36245 -604522 -519897 -138577 -33010 -13476
2493 -13476 -92099 -127340 -62259 -165567 -343869 -379708 -72866 67351 -227570 -129147 -162503
2482 -162503 -170371 110765 -41270 -106267 -280846 30627 -43785 -570413 -426874 -434421 -554814
2471 -554814 -725956 -408022 -101928 -287201 -449500 -239657 -232534 -92971 -162515 -325988
2461 -325988 -459161 -463224 -643453 -521955 -473320 -197701 -245800 -466667 -50602 28722 -167035
2450 -167035 53304 -58255 -264211 -37444 -197833 -216770 -73155 -283763 -13215 47521
2440D7521J26262j09331M8098k9403m42318k59662K24844L39279P6501K73471
2430B95262Q5334l55756n16369M12592j69262q7490m5824l12780J25970M2179
2420e26144Q7054N84929j9404k89542O8617Q9850l4575J71231m8781k69732J7664
2409a68833j1021O7725r0701R4614K3439j38373N4821j992J53094J28336k77095
2398a65986j11041K65791j4251K51826j89908k22304K5959k32602J42716J13535
2388a36265R8582p0245N9337j68358R9528P1632l44756r7459J72181K51121J35360
2377G0658r3992k53700N1566O6760r9544Q1245J29708K45988O7461j4317k42466
2366I367m68816L00285K74752j91660P3759J8840j27605K65572l12918J65114
$$ plain form
2440 47521 173783 64452 112550 83147 -359171 -618833 -393989 -54710 21791 295262
2430 295262 380596 24840 -491529 -78937 -248199 -335689 -381513 -694293 -568323 -526144
2420 -526144 -439090 145839 126435 -163107 -94490 -4640 -39215 132016 83235 -186497 -168833
2409 -168833 -179854 -112129 -202830 -108216 -84777 -223150 -168329 -170321 -17227 111109 -165986
2398 -165986 -277027 -11236 -25487 226339 36431 -185873 -159914 -392516 -249800 -136265
2388 -136265 -37683 -107928 -48591 -216949 -117421 -45789 -390545 -488004 -315823 -64702 70658
2377 70658 -23334 -277034 -225468 -158708 -258252 -177007 -47299 198689 266150 251833 9367
2366 9367 -459449 -159164 115588 -76072 -2313 16527 -111078 154494 -158424 6690
2356F690j49847Q4982k36849j40077L83005J2735j40792j36931K80557r2907k65820
2345c95254K37526N57162n795k29821k67937l1721N7995J42126j5578J36581j11806
2334G3478j01166o9804J00726J20905o6288k67016L79918k3780j17742j76682
2324a47451k0992J67638K0032k406r0270q0092Q0533K15264J68781o9447j12835
2313A28755k17647o773L01447j19424J27385l07221k22575l0856k9454l6111K58248
2302a54226M501J57104j11499L52740n32175J40943M12383k02037k05997k2024
2292a60287J784m1857J87476J29030k12886j770p1166k59129J73938j02961K87951
2281f9877k4879p5119M0631j68216K72048J91518L2005K36424l40052k34315j6063
$$ plain form
2356 6690 -143157 -58175 -295024 -435101 -52096 -39361 -180153 -317084 -36527 -129434 -395254
2345 -395254 -157728 399434 393639 163818 -104119 -135840 -77845 64281 48703 185284 73478
2334 73478 -27688 -97492 3234 124139 57851 -209165 170753 146973 29231 -147451
2324 -147451 -168443 -805 19227 16821 -73449 -153541 -73008 142256 311037 241590 128755
2313 128755 -88892 -95665 205782 86358 213743 -93478 -316053 -346909 -376363 -412474 -154226
2302 -154226 -149725 7379 -104120 248620 -283555 -142612 269771 67734 -138263 -160287
2292 -160287 -158503 -200360 -12884 116146 -96740 -98510 -169676 -428805 -254867 -357828 -69877
2281 -69877 -94756 -169875 -129244 -297460 -25412 166106 198111 434535 94483 -139832 -155895
2270a55895K49424P2661k62988r5866O2143J71298K28015j01903k21351j73672
2260b28134j66627J7987J49705J83019j28059j21880k2175k20180J43683M12823
2250B0162N4461j01270J66810k83163J23087J10509q7914j71822Q3438P1708j49319
2239a63313k53866J93883j02329M62666j72960J3167j33827k13658n0967L90514
2229c0690K16906j03116o6271l45895J9999L10706R9259k89669K0819K98377M9478
2218A79903j66716K20943l2788l52105j15174J0107p9616p4450J04761K02159
2208a02976m644L58784l14948j8721J0800k55101l05958J16366K49257L49175
2198H2034m6568K385j83355J87974J1069k15280Q8582J42343r6863j7695J20680
$$ plain form
2270 -155895 93529 166190 -96798 -192664 -130521 40777 268792 166889 -54462 -228134
2260 -228134 -394761 -376774 -227069 -44050 -172109 -293989 -316164 -536344 -392661 20162
2250 20162 74623 -26647 140163 -143000 -19913 90596 2682 -169140 -85702 -13994 -163313
2239 -163313 -417179 -223296 -325625 137041 -35919 -22752 -156579 -370237 -421204 -30690
2229 -30690 186216 83100 16829 -329066 -309067 1639 100898 -188771 -167952 130425 179903
2218 179903 13187 234130 201342 -150763 -265937 -255830 -335446 -409896 -305135 -102976
2208 -102976 -107620 251164 -63784 -82505 -71705 -326806 -632764 -516398 -267141 82034
2198 82034 35466 37851 -145504 42470 53539 -161741 -73159 69184 -27679 -45374 75306
2187G5306L8798j92567L3921M0987j80381K58280J41734m97912l3579K76779J30352
2176I1718k44334J05715J68635m29097J85943J44694l1682J15274n1054L04928
2166C60740R35n86441q9010M03602J40840j11338J36877J34670K45171j8002m00489
2155B17555k14401n8518k5158k2530R1841o4891J48506L19090j32344j44312j9551
2144I5287K15284m9869n5850N531J0537r3681r3767K52001j245k13449o3641J67707
2132A74845M46117k14682q8661Q7346m26916j49674r6996K93138J15530K4505
2122A64552J34607j0615J16462j18244j51036J33872M80R4839j8022Q1443L42602
2111G70940J63269l35933p7552L63272J65801r0971R6678K35101J44579L1219
$$ plain form
2187 75306 114104 -78463 -44542 -3555 -183936 74344 216078 -281834 -315413 -38634 91718
2176 91718 -152616 -46901 121734 -307363 -121420 23274 -8408 106866 55812 360740
2166 360740 361675 -224766 -313776 89826 230666 119328 256205 390875 636046 618044 217555
2155 217555 3154 -55364 -80522 -103052 -11211 -76102 72404 391494 259150 114838 95287
2144 95287 310571 260702 204852 210383 220920 127239 33472 285473 284228 70779 7138 174845
2132 174845 620962 406280 317619 404965 -21951 -171625 -268621 24517 140047 164552
2122 164552 299159 288544 405006 286762 135726 269598 270078 364917 346895 428338 770940
2111 770940 934209 598276 520724 883996 1049797 958826 1055504 1290605 1435184 1466403
2101A466403M360J27832L50859P1270k8555J25224J28930Q25138L62026L03280
$$ plain form
2101 1466403 1470763 1598595 1949454 2020724 1992169 2117393 2246323 3071461 3433487 3736767
$$ [...]
##END NTUPLES=NMR SPECTRUM
##END=
