##TITLE=1H_CG-1169
 CDCL3
 8 sc, 
 21.11.2022
##JCAMPDX= 6.0         $$ Bruker NMR JCAMP-DX V2.0
##DATA TYPE= NMR SPECTRUM
##DATA CLASS= NTUPLES
##ORIGIN= UXNMR, Bruker Analytische Messtechnik GmbH
##OWNER= root
$$ XWIN-NMR		Version 3.5
$$ Mon Nov 21 14:15:52 2022 Russian Standard Time (UT+4h)  she@DPX200
##.OBSERVE FREQUENCY= 200.1313499994
##.OBSERVE NUCLEUS= ^1H
##.ACQUISITION MODE= SIMULTANEOUS
##.ACQUISITION SCHEME= undefined
##.AVERAGES= 8
##.DIGITISER RES= 18
##SPECTROMETER/DATA SYSTEM= spect
##.PULSE SEQUENCE= zg30
##.SOLVENT NAME= CDCl3
##.SHIFT REFERENCE= (INTERNAL, CDCl3, 0, 15.7491)
##AUDIT TRAIL= $$ (NUMBER, WHEN, WHO, WHERE, WHAT)
$$ ##TITLE= Audit trail, XWIN-NMR		Version 3.5
$$ ##JCAMPDX= 5.01
$$ ##ORIGIN= Bruker BioSpin GmbH
$$ ##OWNER= she
$$ F:/spectra/data/she/nmr/H-F/1/pdata/1/auditp.txt
$$ ##AUDIT TRAIL=  $$ (NUMBER, WHEN, WHO, WHERE, WHAT)
(   1,<2022-11-21 14:14:28.68 +0400>,<she>,<DPX200>,
      <created by zg, POWCHK disabled, PULCHK disabled
       configuration hash MD5:
       00 E9 B6 7A A2 85 ED C7 34 08 36 98 17 FE 4E 26
       data hash MD5: 16K
       16 D3 74 28 83 BE 42 46 6E 0A D7 89 BD BE 8F 9A>)
(   2,<2022-11-21 14:14:31.42 +0400>,<she>,<DPX200>,
      <Start of raw data processing
       efp BC_mod = 2 LB = 0.24 FT_mod = 6 PKNL = 1 PHC0 = -18047.81 PHC1 = 32.8007 SI = 16K 
       data hash MD5: 16K
       0B AE A4 96 26 38 03 23 77 E1 20 BB 86 DC 7D 6F>)
(   3,<2022-11-21 14:14:34.93 +0400>,<she>,<DPX200>,
      <abs ABSG = 5 
       data hash MD5: 16K
       6F 5D 02 64 1D 88 E1 0E F0 AC 58 20 68 D3 80 9C>)
(   4,<2022-11-21 14:14:57.09 +0400>,<she>,<DPX200>,
      <pk PHC0 = 8.219709 PHC1 = -10.4 
       data hash MD5: 16K
       66 33 7B 71 53 BB 1F E3 1C BC B1 E7 4F 8E E5 B9>)
(   5,<2022-11-21 14:15:00.70 +0400>,<she>,<DPX200>,
      <abs ABSG = 5 
       data hash MD5: 16K
       82 AC 77 CF 8E 63 DA 46 3C 6A 99 AA 7E A6 40 DC>)
$$ ##END=
$$ 
$$ hash MD5
$$ 2C 27 01 59 C9 7B B0 C7 39 FC B8 8D 9E 9D 91 E0
##$RELAX= 
##$RELAX= 
##$RELAX= 
##$RELAX= 
##$RELAX= 
##$RELAX= 
$$ Bruker specific parameters
$$ --------------------------
##$DU= <F:/spectra>
##$EXPNO= 1
##$NAME= <H-F>
##$PROCNO= 1
##$TYPE= <nmr>
##$USER= <she>
##$AMP= (0..31)
100 100 100 100 100 100 100 100 100 100 100 100 100 100 100 100 100 100 
100 100 100 100 100 100 100 100 100 100 100 100 100 100 
##$AQSEQ= 0
##$AQ_mod= 1
##$AUNM= <au_zg>
##$AUTOPOS= <>
##$BF1= 200.13
##$BF2= 200.13
##$BF3= 200.13
##$BF4= 200.13
##$BF5= 200.13
##$BF6= 200.13
##$BF7= 200.13
##$BF8= 200.13
##$BYTORDA= 1
##$CFDGTYP= 0
##$CFRGTYP= 5
##$CHEMSTR= <none>
##$CNST= (0..31)
1 1 145 1 1 1 1 1 1 1 1 1 1 1 1 1 1 1 1 1 1 1 1 1 1 1 1 1 1 1 1 1 
##$CPDPRG= <>
##$CPDPRG1= <>
##$CPDPRG2= <>
##$CPDPRG3= <>
##$CPDPRG4= <mlev>
##$CPDPRG5= <mlev>
##$CPDPRG6= <mlev>
##$CPDPRG7= <mlev>
##$CPDPRG8= <mlev>
##$CPDPRGB= <>
##$CPDPRGT= <>
##$D= (0..31)
0 1.2 0 0 0 0 0 0 0 0.06 0 0.03 0 0 0 0 0.0002 0 0 0 0 0 0 0 0 0 0 0 0 
0 0 0 
##$DATE= 1669025668
##$DBL= (0..7)
$$ [...]
##$SUBNAM3= <"">
##$SUBNAM4= <"">
##$SUBNAM5= <"">
##$SUBNAM6= <"">
##$SUBNAM7= <"">
##$SUBNAM8= <"">
##$SUBNAM9= <"">
##$SW= 18.0517283424941
##$SWIBOX= (0..15)
0 0 2 0 0 0 0 0 0 0 0 0 0 0 0 0 
##$SW_h= 3612.71676300578
##$TD= 16384
##$TD0= 1
##$TE= 0
##$TE2= 300
##$TE3= 300
##$TEG= 300
##$TL= (0..7)
0 120 120 120 120 120 120 120 
##$TP= (0..7)
150 150 150 150 150 150 150 150 
##$TP07= 0
##$TPNAME0= <>
##$TPNAME1= <>
##$TPNAME2= <>
##$TPNAME3= <>
##$TPNAME4= <>
##$TPNAME5= <>
##$TPNAME6= <>
##$TPNAME7= <>
##$TPOAL= (0..7)
0.5 0.5 0.5 0.5 0.5 0.5 0.5 0.5 
##$TPOFFS= (0..7)
0 0 0 0 0 0 0 0 
##$TUNHIN= 0
##$TUNHOUT= 0
##$TUNXOUT= 0
##$USERA1= <user>
##$USERA2= <user>
##$USERA3= <user>
##$USERA4= <user>
##$USERA5= <user>
##$V9= 5
##$VALIST= <valist>
##$VCLIST= <CCCCCCCCCCCCCCC>
##$VD= 0
##$VDLIST= <DDDDDDDDDDDDDDD>
##$VPLIST= <PPPPPPPPPPPPPPP>
##$VTLIST= <TTTTTTTTTTTTTTT>
##$WBST= 1024
##$WBSW= 4
##$XGAIN= (0..3)
0 0 0 0 
##$XL= 0
##$YL= 0
##$YMAX_a= 378796
##$YMIN_a= -501613
##$ZGOPTNS= <>
##$ZL1= 120
##$ZL2= 120
##$ZL3= 120
##$ZL4= 120
##$ABSF1= 15.73036
##$ABSF2= -2.321489
##$ABSG= 5
##$ABSL= 3
##$ALPHA= 0
##$AQORDER= 0
##$ASSFAC= 0
##$ASSFACI= 0
##$ASSFACX= 0
##$ASSWID= 0
##$AUNMP= <proc_1d>
##$AZFE= 0.1
##$AZFW= 0.1
##$BCFW= 0
##$BC_mod= 2
##$BYTORDP= 0
##$COROFFS= 0
##$CY= -3
##$DATMOD= 1
##$DC= 0
##$DFILT= <>
##$DTYPP= 0
##$F1P= 0
##$F2P= 0
##$FCOR= 1
##$FTSIZE= 16384
##$FT_mod= 6
##$GAMMA= 0
##$GB= 0
##$INTBC= 1
##$INTSCL= 3.70164e-10
##$ISEN= 128
##$LB= 0.24
##$LEV0= 0
##$LPBIN= 0
##$MAXI= 10000
##$MC2= 0
##$MEAN= 0
##$ME_mod= 0
##$MI= 1.114404
##$NCOEF= 0
##$NC_proc= -6
##$NLEV= 6
##$NOISF1= 3.799351
##$NOISF2= 2.8
##$NSP= 0
##$NTH_PI= 0
##$NZP= 0
##$OFFSET= 15.74909
##$PC= 1
##$PHC0= -18039.59
##$PHC1= 22.4007
##$PH_mod= 1
##$PKNL= yes
##$PPARMOD= 0
##$PSCAL= 0
##$PSIGN= 0
##$REVERSE= no
##$SF= 200.130004491284
##$SI= 16384
##$SIGF1= 3
##$SIGF2= 2
##$SINO= 5.538805
##$SIOLD= 16384
##$SREGLST= <1H.CDCl3>
##$SSB= 0
##$STSI= 16384
##$STSR= 0
##$SW_p= 3612.71676300578
##$SYMM= 0
##$S_DEV= 0
##$TDeff= 16384
##$TDoff= 0
##$TI= <>
##$TILT= no
##$TM1= 0
##$TM2= 0
##$TOPLEV= 0
##$USERP1= <user>
##$USERP2= <user>
##$USERP3= <user>
##$USERP4= <user>
##$USERP5= <user>
##$WDW= 1
##$XDIM= 16384
##$YMAX_p= 310924938
##$YMIN_p= -816864
$$ End of Bruker specific parameters
$$ ---------------------------------
##NTUPLES= NMR SPECTRUM
##VAR_NAME=  FREQUENCY,     SPECTRUM/REAL,   SPECTRUM/IMAG
##SYMBOL=    X,             R,               I
##VAR_TYPE=  INDEPENDENT,   DEPENDENT,       DEPENDENT
##VAR_FORM=  AFFN,          ASDF,            ASDF
##VAR_DIM=   16384,         16384,           16384
##UNITS=     HZ,            ARBITRARY UNITS, ARBITRARY UNITS
##FACTOR=    0.220516191357247, 1,           1
##FIRST=     3151.86549139938, 0,            0
##LAST=      -460.851271606402, 0,           0
##MIN=       -460.851271606402, -816864,     0
##MAX=       3151.86549139938, 310924938,    0
$$ Real data points
##PAGE= N=1
##DATA TABLE= (X++(R..R)), XYDATA
$$ [...]
7898 102076 184926 15689 -31566 -32891 28320 -73057 -198157 -262125 -205948 29160 -189168
7887 -189168 -172810 821 116381 -2230 -128470 -117942 -147613 -9050 133763 155111
7877 155111 132600 146052 81622 23251 -60500 -52389 646 131533 102904 -84905 970
7866 970 166648 75126 105164 106993 97562 71633 174009 125234 130412 232741 221093 388039
7854 388039 292907 252074 151787 2695 203515 306022 113823 98123 121294 118702 250627
7843 250627 257506 350124 456838 444961 364340 301222 525135 414257 442604 367818 382230
7832 382230 436609 342568 359844 316010 377866 491986 402321 294457 240648 361276 459037
7821 459037 499818 539408 440355 578634 687566 641629 641256 632285 567890 499331 394594 416880
7809 416880 302439 519365 693784 711377 768412 935554 987285 888473 957992 837014 1030028
7798 1030028 946407 743009 855361 831500 845419 924481 1098740 1161015 1167299 1198138 1308058
7787 1308058 1188211 1317111 1291211 1230537 1377978 1551132 1636012 1760203 1757283 1708136 1882270
7776 1882270 1969281 1992603 2046046 2139936 2177740 2325761 2487291 2632110 2796395 2863115 3106358
7765 3106358 3375331 3656545 3923464 4019428 4294726 4685014 5233839 5847815 6269973 6772058
7755 6772058 7207456 7696310 7933707 7889266 7700638 7803768 7830166 7850079 7978927 8015985
7745 8015985 7798676 7529503 7080818 6546925 5934345 5307879 4722652 4292472 4099225 3819740
7735 3819740 3529239 3429427 3312829 3124368 3127626 3009506 2982146 2826014 2770386 2671215 2766218
7724 2766218 2737860 2730421 2719764 2837198 2806796 2775115 2858239 2903339 2958219 2964915 3014050 2989217
7712 2989217 3091200 3176375 3317306 3306772 3183998 3319748 3501375 3535967 3635920 3865483
7702 3865483 3946909 4124188 4282181 4372549 4473019 4830697 4912838 5173971 5493966 5953571
7692 5953571 6249333 6688233 7024213 7333651 7881060 8560055 9289645 10049187 10937169 11908778
7682 11908778 13039493 14447924 16069698 17465571 18514470 19322477 19488021 18987456 18616654
7673 18616654 18366454 18233015 18114214 18002059 17758407 17114418 16088020 14688237 13140007
7664 13140007 11492987 10087221 8813591 7794083 7181577 6561805 6063833 5556846 5356426
7655 5356426 5078459 4835936 4638376 4344622 4106576 4084289 3930833 3803222 3698144 3459245
7645 3459245 3330144 3359394 3226429 3159832 3069408 3094286 3050111 3124875 2999367 2869916 2934573
7634 2934573 3042175 3095395 3210146 3168482 3109085 3139319 3410307 3561478 3555238 3573735 3627256
7623 3627256 3897243 3960322 4098966 4254598 4411041 4586936 4926471 5331769 5630608 6134021
7613 6134021 6592856 6935788 7653140 8387727 9194262 10028170 10846450 11427107 12056309 12148923
7603 12148923 11957570 11325891 10281424 9283462 8422774 7584486 6745678 6249331 5686682
7594 5686682 5263784 4991792 4724543 4560933 4303026 4180872 3997241 4156820 4163502 4025350
7584 4025350 4002883 3883584 3899678 3991729 4131016 4013920 4216312 4498134 4721967 4708910
7574 4708910 5013619 5312821 5666345 6199580 6698291 7052805 7428397 8060569 9004180 9862492
7564 9862492 10742504 11462122 12225307 12939251 13439536 13227043 12443059 11570610 10454879
7555 10454879 9323659 8239897 7313068 6464954 5981963 5484561 5042580 4612634 4206264
7546 4206264 4036205 3996686 3856734 3614541 3444993 3423451 3565157 3394525 3208147 3318500
7536 3318500 3329531 3529127 3642418 3920393 4188660 4470883 4624232 4777283 4855093 4622019
7526 4622019 4386048 4075866 3760673 3542561 3162427 2927954 2825268 2595317 2426981 2356941
7516 2356941 2152607 2184395 2165816 1971565 2029749 1879441 1812320 1970594 2108131 1966136
7506 1966136 1901084 1990695 1910400 1932630 2039635 1968847 2130228 2185613 2241010 2285919 2220390
7495 2220390 2288494 2593286 2847617 3083493 3376915 3618716 3805972 4189823 4707546 4979248
7485 4979248 5366813 5588237 5527787 5409806 5115227 4458567 4057699 3476397 3038233 2578562
7475 2578562 2162224 2023178 1833996 1768933 1473490 1331029 1213852 1106677 1031940 1101663
7465 1101663 835557 825837 739533 727848 657626 421532 676359 595329 622354 523019 610176
7454 610176 458594 454109 590654 413752 475419 575282 426390 316578 312768 297949 314192
7443 314192 248568 224497 257936 274412 260465 -44053 80848 105716 121821 214371 85718
7432 85718 42586 124384 -10118 -148185 -31299 23311 -11092 -36853 -4147 -61569 112477
7421 112477 112999 22356 119981 68285 138439 204788 104992 174278 160801 216156 60395 123867
7409 123867 145351 213723 49035 -121850 -87228 -32520 10415 55768 53073 -64619 69490
7398 69490 74041 34330 22859 -23214 -26717 26598 45741 77540 28500 28758 119942 -20342
7386 -20342 -40655 62623 75139 56369 -36698 48770 189584 127317 89789 96222 68131 79342
7374 79342 -23793 -53708 174059 92441 173829 244484 152879 280569 347479 257564 221985
7363 221985 293142 226071 71282 159925 238598 217804 245751 143014 175651 216008 292873
7352 292873 384082 292746 369436 338879 246092 232266 334050 387063 365911 375022 319756 343078
7340 343078 295350 116057 320695 462861 416587 291489 351006 409448 280268 366799 462980
7329 462980 570715 611132 616853 570809 749198 803156 728480 721940 725092 558574 703109
7318 703109 750584 669804 786419 808366 809163 896126 1001137 1064602 1148108 1276407 1155052
7307 1155052 1214587 1392950 1473469 1545468 1399166 1564295 1654925 1490164 1541161 1524667 1707073
7296 1707073 1825103 1660009 1701625 1885770 1884116 1762913 1638662 1771393 1734951 1637569
7286 1637569 1787877 1696171 1488153 1494330 1484354 1342411 1475445 1524268 1435664 1387065 1445490
7275 1445490 1389609 1245357 1161623 1366197 1270778 1283248 1180955 1031760 1090298 977568
7265 977568 1108522 1147582 954888 1105340 1060129 1092148 1253889 1143244 946688 792028
7255 792028 807102 849633 938354 1027698 1080159 1077096 1038841 905733 851353 832872 837386 834719
7243 834719 895585 877758 961240 982684 991779 941064 1048836 989714 985495 893024 977816 1105259
7231 1105259 986713 992877 1039646 1118032 1115722 1148590 1156605 1173294 1293294 1284261 1319554 1169630
7219 1169630 1291724 1367154 1292237 1225522 1262323 1328623 1352077 1424904 1412673 1501918 1493701
7208 1493701 1453907 1482931 1308085 1294979 1648420 1755666 1774382 1788892 1904658 1726835
7198 1726835 1635006 1626666 1785410 1972431 1886193 1845001 2192073 2221231 2319505 2417012 2313954
7187 2313954 2367802 2304149 2374351 2593483 2587765 2850920 2967211 3117730 3233390 3266145 3183463
7176 3183463 3396384 3401156 3486413 3626676 3662491 3769997 4001566 4266391 4352818 4465287
7166 4465287 4733651 5060254 5300875 5711123 5966226 6395307 6876779 7472416 7779720 8599990
7156 8599990 9380651 10262270 11140100 12282865 13568052 14771788 15816029 16433112 16679158
7147 16679158 16456981 16077633 15778248 15638189 15908570 16172371 15969442 15477486 14676572
7138 14676572 13561547 12294719 11164658 10200726 9446012 8624433 7942665 7562964 7308906
7129 7308906 6971393 6723672 6606102 6580443 6362041 6374621 6376247 6298629 6557514 6536710 6779621
7118 6779621 7104484 7276211 7361945 7725161 8198115 8586401 9087068 9777118 10556215 11350636
7108 11350636 11990021 12910140 13713957 14026795 14406895 14534446 14348709 14107273 14009041 14064663
7098 14064663 14091332 14004535 13596939 12776972 11837611 10677202 9565813 8639273 7848121
7089 7848121 7116124 6789919 6381587 6040334 6035479 5833907 5732325 5728407 5416737 5361315
7079 5361315 5311655 5346583 5316734 5290236 5353810 5381152 5522843 5689066 5745430 5688722 5696032
7068 5696032 5736275 5848952 5974602 6085673 6093970 6114939 6262940 6438155 6832312 6979277
7058 6979277 7038526 7180459 7235753 7431397 7587351 7836425 8135598 8226002 8394454 8594797
7048 8594797 8759355 8816282 8814334 9144513 9508902 9420708 9441527 9481806 9465893 9498114 9490020
7037 9490020 9537641 9591608 9585439 9383264 9431546 9243688 9082665 8992486 8843233 8725686 8637132
7026 8637132 8392081 8164417 7749567 7504645 7443194 7225439 7019587 6852348 6605548 6377158
7016 6377158 6156043 5921275 5743602 5456612 5314044 5263845 5207472 4969214 4775644 4528463
7006 4528463 4272788 4158630 3978900 3798475 3643056 3514772 3511442 3493445 3277653 3157453
6996 3157453 2890377 2751510 2675930 2561128 2562287 2528812 2584771 2490916 2488887 2356197 2263973
6985 2263973 2195605 2132876 2189305 2060744 1854939 1918024 1990573 1740043 1656183 1699902 1712324
6974 1712324 1799186 1807932 1656299 1443983 1300638 1373228 1594512 1342946 1274478 1318595 1104257
6963 1104257 1146587 1141453 1160616 1066597 1048149 962518 952056 877640 893908 1018707 815028
6952 815028 818263 968378 789691 753958 886534 705533 651542 778111 775520 790485 752827
6941 752827 720291 736163 558938 648846 739135 628412 579696 453207 540077 368097 344675
6930 344675 411676 441000 319491 353772 357062 398289 447966 198099 261007 322687 367911
6919 367911 414854 431439 271513 120201 42876 53052 142995 148273 218209 212452 160023 224631
6907 224631 252553 225830 251663 460841 456878 507403 434543 364368 198624 6294 151532
6896 151532 271473 218004 107644 125224 -45881 -42301 130289 -54079 -132141 -103027 -42428
6885 -42428 3414 -4258 -100917 -163545 -186182 -67711 -84249 -179789 -62453 -94797 -181393 -301010
6873 -301010 -230944 -198864 -140492 -96334 -327343 -267163 -199347 -143980 -240967 -319194 -417315
6862 -417315 -325975 -329014 -294853 -224352 -127720 -114685 -178512 -213933 -315432 -375928 -305124 -368584
6850 -368584 -268554 -270452 -298279 -51980 -209994 -287011 -260729 -338339 -573028 -433380 -372095
6839 -372095 -393694 -424903 -196392 -233574 -294797 -408260 -321018 -193682 -84736 -169274 -295306
6828 -295306 -48085 -145805 -178449 -177789 -89803 -194066 -459704 -340351 -49483 -94383 -116534
6817 -116534 -190489 -78906 -110415 -308934 -225421 -179747 -260604 -359501 -168198 -111185 -345551
6806 -345551 -288830 -393127 -328618 -358835 -468429 -479300 -463839 -264960 -239488 -334949 -288881
6795 -288881 -281527 -389109 -482294 -489456 -355758 -233333 -279872 -376384 -353882 -302226 -169218
6784 -169218 -189849 -241592 -195499 -156726 -165563 -109137 -65527 -35114 -153487 -85023 -162358 -321675
6772 -321675 -160708 -240575 -401990 -379588 -88553 42383 38998 80254 -135574 -80090 -166201
6761 -166201 -30742 2560 -10573 -133182 -8022 23311 -197064 -223865 -171760 -257098 -327132
6750 -327132 -277474 -199838 -177286 -36121 -86207 -136511 -45034 159589 115762 127151 141255
6739 141255 253500 254242 282568 560437 388038 566321 533643 558760 520882 430367 580591
6728 580591 740948 739210 838267 1008925 1180577 1236359 1264617 1219611 1226415 1306949 1553780
6717 1553780 1600664 1453523 1411226 1338111 1420595 1511007 1250778 1119379 1087475 1058897 993120
6706 993120 830848 872532 712397 578687 556076 414666 399646 347498 356401 288198 250828
6695 250828 72714 67700 120251 -11083 -138528 -189198 -130747 -110639 -181856 -65071 -122701
6684 -122701 -190174 -57426 -79114 15934 -137482 -225555 -192250 -163894 -165234 -255018 -261682 -350801
6672 -350801 -352708 -288405 -264217 -382179 -492038 -634849 -629932 -482969 -451491 -567253 -496350
6661 -496350 -591370 -535842 -494593 -648351 -629778 -607531 -425245 -497899 -512233 -500450 -410690
6650 -410690 -513337 -450223 -421606 -617438 -547967 -504202 -546984 -476853 -419689 -466147 -613438
6639 -613438 -642703 -462220 -485927 -543999 -584023 -449796 -404975 -432929 -631503 -537707 -416384
6628 -416384 -533901 -515521 -502267 -665234 -607430 -532552 -607947 -663616 -614266 -437140 -327989
6617 -327989 -382539 -423692 -410559 -540230 -545811 -483688 -529145 -633185 -498256 -421317 -411906
6606 -411906 -441925 -625945 -668210 -529740 -511411 -557630 -635505 -524344 -640730 -511018 -672087
6595 -672087 -704436 -669641 -677121 -399529 -449710 -393995 -474436 -614777 -635583 -406013 -380225
6584 -380225 -456159 -529189 -508839 -449746 -440499 -572410 -632267 -531267 -506324 -612577 -689123
6573 -689123 -775823 -629831 -499665 -619229 -723128 -816864 -536578 -403538 -575166 -703875
6563 -703875 -447080 -441321 -330463 -367831 -339300 -400679 -522403 -543153 -537714 -544154 -494729 -438315
6551 -438315 -454548 -594904 -478471 -497945 -592145 -609617 -481898 -355915 -463207 -654192
6541 -654192 -724937 -631893 -691483 -671779 -596477 -476355 -641953 -628604 -412011 -452757 -570530
6530 -570530 -699844 -622060 -655020 -721513 -719894 -549072 -403666 -492722 -592863 -662423 -418579
6519 -418579 -274552 -320240 -447877 -484072 -465754 -548111 -557226 -340769 -494133 -456542 -479798
6508 -479798 -566867 -494711 -498694 -721450 -670606 -616415 -615093 -691151 -612912 -487671 -555983 -446104
6496 -446104 -293848 -405556 -506167 -393813 -377558 -408641 -505799 -464347 -536400 -507832 -580148
6485 -580148 -662198 -593045 -454811 -371589 -528312 -454930 -574768 -584405 -653915 -622340 -690829
6474 -690829 -598624 -562027 -678225 -683785 -726715 -510318 -450544 -486373 -435524 -696925 -651944
6463 -651944 -546137 -427118 -353717 -427074 -515062 -662053 -645769 -748725 -766590 -651688 -648748
6452 -648748 -557987 -522188 -575626 -449706 -419798 -395147 -476077 -508727 -564492 -558075 -574565 -531002
6440 -531002 -472052 -511134 -592984 -638419 -659269 -630901 -654603 -637311 -641917 -618400 -595574 -781197
6428 -781197 -814586 -724604 -734690 -766004 -627422 -660590 -621362 -501673 -494076 -586797 -571640
6417 -571640 -370988 -403971 -479743 -551111 -554013 -439519 -260165 -440766 -485163 -396332 -432425
6406 -432425 -444468 -443681 -618431 -622819 -623088 -558574 -562414 -633166 -583300 -602666 -651191 -646868 -531214
6393 -531214 -705342 -755568 -668917 -563403 -378036 -623889 -615232 -710327 -567850 -411917 -479887
6382 -479887 -575854 -565671 -639102 -527840 -482878 -489408 -475774 -651831 -628532 -688520 -582526
6371 -582526 -607724 -517053 -465084 -396703 -563947 -566619 -552408 -536592 -433807 -577365 -663310
6360 -663310 -425242 -333851 -313615 -476024 -625911 -741291 -622323 -473689 -382225 -321484
6350 -321484 -424316 -486805 -437554 -497127 -455017 -566434 -486758 -437266 -322810 -414008 -451345
6339 -451345 -328254 -592152 -613536 -621675 -300179 -336044 -498057 -601016 -461561 -383995 -433318
6328 -433318 -505344 -552257 -589274 -547269 -551309 -482326 -483613 -583137 -496877 -440983 -555367 -441329
6316 -441329 -442921 -403485 -326438 -329954 -387549 -483305 -403414 -216180 -201902 -373030 -406654 -397147
6304 -397147 -414442 -473304 -399892 -306761 -497338 -418772 -229667 -306005 -440520 -422028 -358955
6293 -358955 -375669 -318907 -249066 -326047 -399219 -233938 -228175 -351141 -504288 -609646 -511779
6282 -511779 -439731 -556103 -579283 -528397 -456595 -501857 -495253 -556428 -555603 -471963 -479958 -612714
6270 -612714 -619425 -544906 -593434 -608053 -460025 -536106 -515585 -453052 -338709 -405483 -515219
6259 -515219 -461152 -520148 -583716 -575899 -363544 -297105 -308520 -393758 -544041 -387828 -354727
6248 -354727 -473365 -525526 -498339 -605581 -475952 -446229 -443052 -453902 -572201 -496319 -489072
6237 -489072 -647985 -733631 -535106 -456781 -433153 -465130 -520994 -550712 -442704 -421433 -439943
6226 -439943 -370698 -440326 -553366 -652516 -516605 -370927 -291053 -455955 -575548 -502676 -444616
6215 -444616 -506221 -544864 -388128 -587019 -507923 -369003 -369143 -239199 -206059 -374642 -546167
6204 -546167 -436239 -519141 -525407 -549625 -465364 -493948 -396152 -370898 -556136 -522782 -459271
6193 -459271 -315951 -342864 -424621 -428754 -362491 -487766 -532371 -456077 -462592 -555850 -359485
6182 -359485 -337730 -458709 -386996 -305472 -289799 -274094 -349934 -408518 -441336 -345157 -249144
6171 -249144 -176699 -191993 -213701 -130462 -3299 -205110 -416560 -353015 -268622 -207589 -277444
6160 -277444 -286559 -264204 -423401 -361706 -248081 -276352 -234598 -205265 -178322 -152162 -160282 -123044
6148 -123044 -86116 -88409 -150409 -125327 -223597 -140109 -156331 -139451 -82731 -134010 -262471 -181081
6136 -181081 -108087 -95966 -208819 -365872 -362920 -251465 -220235 -306714 -221094 -178265 -376757
6125 -376757 -442461 -422114 -449527 -433753 -398643 -305042 -569613 -444414 -269592 -428870 -344731
6114 -344731 -387390 -494052 -369030 -450543 -431426 -505395 -394872 -493208 -472165 -421368 -436564
6103 -436564 -406287 -321576 -349989 -410594 -198803 -173658 -224284 -253831 -307598 -229025 -346753
6092 -346753 -514056 -558526 -416795 -309850 -377325 -414902 -469845 -417574 -235112 -312472 -428197
6081 -428197 -350777 -386543 -370306 -290548 -143424 -197096 -229134 -178801 -330027 -477587 -451210
6070 -451210 -322640 -248891 -218185 -423395 -404669 -298095 -294326 -354399 -430144 -444296 -355624
6059 -355624 -379115 -448146 -382076 -300184 -233478 12139 -16405 -31236 -50556 -222885 -226689
6048 -226689 -81946 -116610 -272003 -199496 -231726 -282314 -228521 -163268 -155556 -85704 -84645 -117400
6036 -117400 -164825 -188391 -117309 12948 -46577 75357 54597 -26548 -57658 -145299 -259175
6025 -259175 -231587 -93118 -124918 -217802 -182615 -208488 -180022 -113360 -158151 -143518 -70411
6014 -70411 -118937 -270722 -262802 -249015 -222457 -29820 -60573 -70165 125328 79800 171871 135479
6002 135479 196184 960 70014 9673 -60004 76081 105471 69519 -16116 98410 73905
5991 73905 129720 -58188 164762 63559 -120583 -119073 -45582 14633 126926 135941 91639
5980 91639 68925 72487 -123537 -14072 114247 180871 266893 242274 338189 343525 303387 323431
5968 323431 399078 333342 309639 319597 405888 247143 95093 121161 268874 320613 205224
5957 205224 174866 294019 227404 136947 98768 51142 319145 311665 192310 284889 234641
5946 234641 159172 105405 212074 274146 92339 66145 252885 232063 286019 321669 247853
5935 247853 308189 255440 295201 301879 311512 288747 327185 180731 174171 268630 236013 109081
5923 109081 198328 236629 141519 172091 183727 234268 69313 89446 301794 332464 153154
5912 153154 142076 232004 275936 282983 248939 181337 185122 242652 262422 20258 258961 275939
5900 275939 316716 405965 300041 353405 401056 252564 205573 235196 298493 302887 543131
5889 543131 496949 437656 500952 588392 455912 351573 356472 322053 263826 398195 468570
5878 468570 537314 712468 706237 767863 709790 634147 612283 652265 727807 670651 612442 675742
5866 675742 600935 851311 907523 984419 994226 931353 867710 903259 743793 740571 635776
5855 635776 664996 801076 766606 628306 547239 527262 665488 678932 721203 641142 624934
5844 624934 824411 724512 731418 726597 610220 591533 597567 552607 510803 569718 618741 544357
5832 544357 423455 562769 778586 798456 676651 685733 633158 606342 786767 823392 798768
5821 798768 737787 789777 962130 1137772 888181 981802 1017820 1087081 1224822 1234191 1360844
5810 1360844 1564968 1730989 1680025 1833699 2126467 2351699 2666145 3024187 3276124 3628957
5800 3628957 4243860 5026200 5978619 6946920 7707672 8550869 8608523 7811333 6544708 5116865
5790 5116865 4137477 3348869 2848779 2484442 2362101 2058822 1843994 1956649 1819083 1705643
5780 1705643 1824446 1781138 1881554 1879146 1662578 1461132 1517276 1577591 1521570 1667617 1702859
5769 1702859 1931254 2175449 2282398 2179863 1942482 1755625 1524567 1292028 1139633 1014025
5759 1014025 752508 619579 464610 447344 555919 602290 523230 422732 464305 299130
5749 299130 399382 375422 293060 215224 188274 214914 332841 185756 157289 156756 204397
5738 204397 269058 321546 289611 168530 226828 313368 346333 97953 83284 189712 134684
5727 134684 287894 82660 -10981 75600 63300 40824 -85448 97517 265761 233641 209319
5716 209319 136922 179393 223055 30844 -34914 -77664 40444 83184 252525 231445 168052
5705 168052 176146 85839 91927 58641 201404 154644 188194 247877 190697 183930 165547 104154
5693 104154 57145 124442 91557 136199 64962 120278 128866 130778 237346 103546 26454 186941
5681 186941 300515 249784 127325 264881 176820 348773 398166 406949 310737 179504 278621
5670 278621 187327 157651 399858 383460 117407 88745 310177 335565 368529 232826 248056
5659 248056 267135 249286 170026 120506 283023 326187 379921 275496 286496 313079 332864
5648 332864 301644 349784 422741 429680 446418 474528 454470 441076 450154 551951 676424 719642
5636 719642 641608 688080 679200 692836 612939 699767 728481 782866 737492 687870 733518 658856
5624 658856 651388 636925 612179 740482 818236 786775 843705 822480 741819 767571 692641 636743
5612 636743 593306 657030 601339 671748 652035 820516 975532 994988 834656 925718 899393
5601 899393 812081 714224 833264 995287 866008 916037 1016771 1088275 1156138 1119678 1101315
5590 1101315 1392040 1363614 1367395 1363160 1502378 1439472 1424480 1536530 1755553 1778947 1707027
5579 1707027 1923049 1990040 1966281 2061229 2109625 2255361 2289057 2367802 2553333 2330421 2343614
5568 2343614 2367846 2383097 2555262 2676754 2753353 2761281 2734974 2842399 3048398 3056331 3257947
5557 3257947 3426200 3462486 3659639 3911099 4388363 4655488 4818319 5398323 6116616 6939881
5547 6939881 7887756 9172364 10651570 12540302 13806068 14024730 12863584 11005612 8935994
5538 8935994 7274704 6089749 5100429 4429836 3950474 3828038 3576205 3348004 3007308
5529 3007308 2853722 2799132 2758968 2770823 2477442 2481592 2342937 2301851 2415460 2454654 2563891
5518 2563891 2705810 2772960 2928680 3182654 3290798 3617250 3900135 4182887 4057381 3710520
5508 3710520 3272175 2768102 2562222 2351095 2160796 1853525 1502659 1496273 1450977 1424436
5498 1424436 1433342 1311183 1302651 1261265 1182221 1158542 1153619 1016761 877668 995148 1113440
5487 1113440 1112640 1107090 1063832 1103920 1077477 1061778 1055617 964243 989206 939109 1006537 1027560
5475 1027560 1010142 1058311 1026686 1018641 997495 974793 1067773 979512 974333 1008353 1097315 903864
5463 903864 914271 756449 719473 846244 911188 868574 803296 758558 814428 848335 928027
5452 928027 1021391 921468 788444 741406 922347 896838 710112 847279 791331 729304 951968
5441 951968 972234 921534 1009293 1127881 1083203 1066350 1139145 1252238 1167582 1116439 1085540
5430 1085540 1181290 1164532 1182395 1060011 1104582 1119468 1212600 1265244 1333582 1512408 1344868
5419 1344868 1308028 1181820 1110340 1156260 1254254 1171189 1105382 1119120 1112271 1218972 1159558
5408 1159558 1045507 1070304 1115123 1069768 1019409 1088386 1103676 1057805 988062 999992 1070425
5397 1070425 886855 903805 984816 975891 858883 802962 808600 819137 784490 964486 943349
5386 943349 917056 869502 933610 920689 869936 920258 821731 823779 771881 715558 861285 1002321
5374 1002321 818257 675523 822376 656824 659063 700231 675675 737827 756337 803723 668343
5363 668343 598250 608357 715878 809949 820763 728000 738309 721300 921548 1039056 931495
5352 931495 797887 763141 768695 759794 892328 535716 464513 661679 811958 860886 714745
5341 714745 766050 820476 816046 888906 841103 790466 787144 673144 715268 868626 754575
5330 754575 641240 717936 818258 757167 687424 792366 738339 624967 710231 1001673 877654
5319 877654 826918 915341 934206 970763 787398 782772 783971 747927 841684 741575 818220 840557
5307 840557 785316 788038 810981 802541 746010 783614 769005 712334 759981 998343 1142736 962796
5295 962796 858699 771860 840940 719880 794142 906231 931285 833154 846155 750633 707357
5284 707357 721364 810068 713860 676702 734204 888351 1044327 1025806 942243 970346 948077
5273 948077 871487 866529 863811 1075011 1062452 1035523 1050732 1133368 1030262 945868 1061721
5262 1061721 1126712 1147200 1166169 1162960 1054179 1206652 1192355 1029293 1083481 1224979 1055856
5251 1055856 1099198 1162544 1136251 1275302 1159610 1063745 1067749 1309745 1454717 1414732 1391710
5240 1391710 1399821 1440322 1543032 1516757 1607041 1527555 1677767 1511335 1483321 1768444 2167474
5229 2167474 2344306 2438836 2448069 2543292 2702997 3175998 3726996 4134247 4056506 3833923
5219 3833923 3342534 2855740 2417815 2139563 2009271 1872336 1767184 1634523 1486398 1462209
5209 1462209 1550000 1510451 1524005 1420923 1453563 1515162 1539148 1366045 1213091 1262686 1278866
5198 1278866 1308432 1301152 1195807 1267513 1298614 1284238 1258306 1317247 1411720 1287389 1312076
5187 1312076 1388099 1312790 1206126 1151987 1178457 1257091 1243350 1391366 1335954 1150673 1298408
5176 1298408 1297640 1293891 1189498 1226877 1210796 1340634 1345744 1338028 1320385 1214418 1200977 1268371
5164 1268371 1253351 1246050 1429082 1498728 1441341 1477674 1502516 1672547 1666307 1680311 1619112
5153 1619112 1578867 1535438 1695584 1807170 1823032 1784222 1784325 1888009 2060046 2256521 2337089
5142 2337089 2553514 2627769 2558311 2526803 2391860 2190892 2169103 2132402 2290213 2162882
5132 2162882 2208124 2034544 2009671 2283197 2168548 2021702 2053506 2105389 2212303 2219773 2101618
5121 2101618 2431870 2541815 2445896 2542459 2594020 2655305 2711496 2825138 2878642 2942318 2982426
5110 2982426 3229862 3441454 3336448 3370089 3536201 3760469 3788657 3757475 3837521 3724359
5100 3724359 3607587 3669512 3331807 3262982 3288401 3143174 2947837 2850960 2811162 2846597 2728945
5089 2728945 2799787 2777693 2734025 2784119 2806656 2946968 3072990 3247276 3311963 3418893 3517643
5078 3517643 3614853 3635630 3805017 3937356 3952786 3936606 3734215 3548749 3547118 3601578 3615936
5067 3615936 3680970 3760492 3696589 3626927 3621809 3681028 3814431 4035154 4094128 4225362 4300613
5056 4300613 4277217 4515003 4723819 5017986 5293538 5579434 5847490 6069968 6304852 6413868
5046 6413868 6305746 6125077 5930847 5727467 5513414 5170590 4895778 4639717 4353612 4132017
5036 4132017 4101437 3943875 3903148 3836888 3716243 3623536 3496804 3360818 3439016 3325193
5026 3325193 3303305 3459951 3478119 3530946 3464318 3274215 3170317 3334187 3396600 3395923 3341589
5015 3341589 3305330 3376586 3185561 3141033 3354217 3417286 3542533 3627284 3567857 3724955 3722298
5004 3722298 3966314 4092995 4206601 4349065 4328734 4229173 4124358 3979775 3827654 3791803
4994 3791803 3707952 3696996 3725703 3668947 3536804 3457255 3609674 3707971 3771025 3909716 4015024
4983 4015024 3773654 3672276 3703701 3646067 3783299 3769682 3707423 3805837 3882066 3918928 3925392
4972 3925392 3741864 3743657 3885850 3995869 3955587 3974361 3841711 3794411 3953551 3893866 3853687
4961 3853687 4058877 4113569 4038590 4151577 4213340 4220680 4301374 4394518 4364865 4450063 4463731
4950 4463731 4272431 4361206 4341194 4378514 4352568 4243288 4322660 4526358 4486134 4454199 4655656
4939 4655656 4735593 4711619 4870702 5051333 4967001 5022849 5027866 5027468 5147522 5325001 5428987
4928 5428987 5129012 5336161 5457001 5471578 5533117 5526194 5514236 5565266 5633376 5670856 5811417
4917 5811417 6032551 5991918 6134411 6217857 6287389 6321405 6271241 6294986 6542990 6616495 6656308
4906 6656308 6767251 6776144 6905987 6838856 6868181 7044278 7101329 7032049 7120197 6990303 6989944
4895 6989944 7090890 7231859 7443887 7410096 7343933 7563175 7819282 8078043 8152963 8257014
4885 8257014 8547650 8769707 8940067 9030962 9000672 9134472 9056844 9111568 9099384 9101701 9207471
4874 9207471 9350523 9493391 9571438 9623553 9591388 9922844 10085119 10116822 10205643 10421248
4864 10421248 10802066 11110506 11481673 11946538 12372465 12791329 13135847 13596595 13934403
4855 13934403 14077011 14197715 14572649 15020142 15428841 15792633 15952075 16296247 16534887
4846 16534887 16836233 17056963 17303820 17345292 17316512 17050524 16920247 16870782 16965349 16977010
4836 16977010 16886355 16884815 17073518 17192174 17378526 17644891 17815256 18129600 18497889 18621642
4826 18621642 18706309 19144395 19142249 19261634 19600251 19858123 20083324 20284678 20646072 21059055
4816 21059055 21334713 21723063 22117659 22840330 23297183 23902648 24642142 25192318 25525684
4807 25525684 25789651 26101455 26421648 26848577 27284302 27791191 28278049 28945955 29695781
4798 29695781 30439424 31077195 31887892 33022558 34243321 35208901 36108669 37381702 38894288
4789 38894288 40394767 41875346 43777573 45960059 48194002 50721524 53622355 56878353
4781 56878353 60222484 64184813 68640467 73407333 78949362 85166237 92535666 101298753
4773 101298753 111670643 123906913 138687845 156340965 176867376 199712624 222840154
4766 222840154 241828409 250176790 243357111 223399063 196896858 169459700 145249660
4759 145249660 125179693 108982281 95954820 85317982 76910412 69980819 64164559
4752 64164559 59221527 55161558 51670340 48561941 45957208 43806334 41725234 39999831
4744 39999831 38430328 37293383 36354376 35574923 34759114 33916491 33455988 32922605 32310776
4735 32310776 31734120 31333883 30877206 30538170 30277665 30282951 30060973 30102724 30172116 30320774
4725 30320774 30715112 31253140 31726179 32124249 32498571 32874741 33423408 33940466 34436857
4716 34436857 35070358 35900273 36687485 37632961 38793239 40107512 41730485 43196876 44931950
4707 44931950 47082294 49530152 52323697 55619232 59222845 63422805 68321332 74014892
4699 74014892 80933217 88744296 98001204 108710335 121418051 136457188 154323133 174435477
4691 174435477 195938244 216043969 230215312 233722799 224807806 205730104 181671229
4684 181671229 156952152 134293107 115149382 99366684 86706232 76390477 67974012
4677 67974012 60859298 55156002 50417401 46403914 43114644 40268372 37777540 35588347
4669 35588347 33752409 32278091 30921645 29668180 28630743 27896121 27351623 26838385 26633617
4660 26633617 26493644 26456651 26661413 26752376 26545072 26064348 24793985 22942456 21327391
4651 21327391 19628785 18344637 17221774 16165449 15274741 14519566 13733235 13112213 12684902
4642 12684902 12107331 11496404 11170821 10832363 10320548 10023146 9577534 9294204 9066698
4633 9066698 8870571 8624709 8459611 8192861 7933869 7594697 7370032 7253243 7050428 6886739
4623 6886739 6863795 6714557 6725402 6611978 6616771 6531727 6308319 6225118 6100248 5967873 5953121
4612 5953121 6007590 5996740 5881551 5571059 5588862 5574342 5429530 5272372 5137644 5001751
4602 5001751 4983491 4893777 4843467 4662823 4572521 4486191 4392962 4464005 4384037 4316023 4326053
4591 4326053 4161542 4049332 3976308 4061533 3998053 3830074 3735398 3767894 3656967 3485837
4581 3485837 3506288 3401935 3368838 3438325 3412069 3408068 3354603 3050824 3043763 3215512 3186535
4570 3186535 3248569 3230375 3108861 3048516 3042068 2995617 2890038 3062410 3042246 3122519 3173688
4559 3173688 3141988 3155440 2979884 2954840 2950977 2814750 2711552 2776560 2714874 2561438 2635221
4548 2635221 2780866 2601793 2605527 2663104 2794440 2692406 2676006 2525060 2441771 2486498 2486461
4537 2486461 2578992 2453146 2407551 2407205 2293101 2251203 2364209 2518947 2607635 2531759 2556523
4526 2556523 2352608 2439712 2537211 2410849 2373905 2344045 2272218 2328572 2301592 2277664 2434060
4515 2434060 2513046 2596059 2521986 2397008 2423103 2435715 2418357 2507682 2260123 2242089 2336751
4504 2336751 2277172 2030434 2098586 2264365 2139175 2038773 2033420 2012020 1973984 2033631 2096914
4493 2096914 2031293 1999984 2094777 2167419 2300483 2237228 2200886 2160986 2366126 2282373 2173726
4482 2173726 2264448 2341989 2271782 2350778 2349270 2245624 2266958 2317836 2318973 2207706 2359630
4471 2359630 2573477 2442271 2460436 2403551 2353331 2519485 2631497 2740162 2946037 3014361
4461 3014361 3001279 3168329 3321120 3511540 3709684 3819322 4134001 4274094 4654670 4771145
4451 4771145 4882853 5112230 5158705 5231192 5226919 5170844 4864683 4525397 4230125 4018653
4441 4018653 3797223 3668226 3506090 3303703 3190016 3176696 3092434 3246683 3104157 2746922
4431 2746922 2692700 2740204 2778374 2870603 3072458 3111022 2982843 3120053 3080731 3112524 3210865
4420 3210865 3282148 3124074 3099898 2999140 3046654 3005157 2822012 2795087 2784151 2884714 2781381
4409 2781381 2791668 2694834 2717271 2690509 2648790 2798875 2673013 2816116 2828593 2932822 3175059
4398 3175059 3113804 3001838 3071453 3219314 3246619 3212335 3132243 3303176 3269594 3307969 3214342
4387 3214342 3105716 3153927 3151561 3248412 3378258 3511859 3559674 3425800 3543876 3783669
4377 3783669 4006132 4016538 4264240 4329336 4396595 4412795 4436651 4373851 4256974 4256319 4161859
4366 4161859 3963651 3741310 3825794 3799595 3903861 4006638 3883745 3769745 3833274 3910925
4356 3910925 3969277 3876343 3978519 3986784 4105398 4202765 4297079 4283596 4303063 4348108 4357136
4345 4357136 4521784 4676391 4625619 4706277 4788608 4795111 4713251 4809478 4842798 4797068 4885543
4334 4885543 5033717 4914179 4951896 5054592 4977165 5046132 4982059 5048548 5039188 5128552 5130482
4323 5130482 5246588 5095035 5039855 4856982 4782224 5017428 5163286 5131657 5000513 4952579
4313 4952579 5114356 5311128 5030181 5061542 5117172 5015335 4991465 5086629 5236873 5241932 5197382
4302 5197382 5268329 5257557 5358867 5428744 5382232 5433624 5521109 5546422 5640815 5851774 5848454
4291 5848454 5861399 5933480 5927454 5956729 5936268 6157785 6291822 6431532 6467278 6461933 6607890
4280 6607890 6657770 6735752 6736125 6821453 6924458 7036513 7163110 7247154 7291256 7377679 7530798
4269 7530798 7828321 7798356 7982376 8202357 8458197 8642049 8834766 8913229 9056412 9314293
4259 9314293 9489859 9590653 9731871 10158265 10605964 10899903 11449455 12105349 12600536 13200535
4249 13200535 13671461 14426703 15058269 15457767 16053383 16570610 16715765 16822111 17016864
4240 17016864 17064837 16847791 16500354 16172781 15906612 15683179 15273708 14729275 14467816 14383416
4230 14383416 14184434 14064147 14141925 14175448 14369409 14667978 15073835 15425199 15991839 16813457
4220 16813457 17697075 18714510 19637773 20680449 21310536 21637545 21061963 20096263 19200227
4211 19200227 18263788 17375327 16561871 15905993 15418934 14985307 14511459 14335874 14254504 13954516
4201 13954516 13647089 13439370 13395595 13370599 13387959 13248843 13345261 13461216 13269966 13199554
4191 13199554 13260178 13386960 13344061 13410616 13643140 13838871 14109133 14354432 14483636 15029399
4181 15029399 15272834 15484818 15621107 15909261 16103374 16125521 16022907 15988028 15742425 15478130
4171 15478130 15387055 15477546 15434756 15412155 15423033 15381266 15577944 15524265 15386703 15524508 15526730
4160 15526730 15488978 15500123 15505480 15677750 15830202 15959233 15986557 16287999 16457735 16602609
4150 16602609 16898283 17014791 17242397 17588830 17555080 17760637 17854748 18053294 18293530 18402436
4140 18402436 18788248 19105052 19626600 20000936 20130575 20169355 20238367 20085760 19832933 19711168
4130 19711168 19565133 19277258 19221540 19266330 19334969 19319517 19143989 19267461 19562025 19603598
4120 19603598 19767145 20356319 20533709 20975878 21577370 21960620 22571071 22918315 23176554
4111 23176554 23148389 23119195 23234727 23438635 23850303 24159241 24550830 24772363 24984715 25408771
4101 25408771 25780066 26031623 26370585 26761758 27147699 27556503 27837448 28026822 28240005
4092 28240005 28609656 28906675 29300356 30125344 30976525 32129524 33324832 34730816 36003496
4083 36003496 36953344 37458398 37504714 36947014 35775804 34491258 33366975 32456990 32103448
4074 32103448 31645748 31329556 31187615 31367999 31582050 31891071 32450848 32977337 33838050
4065 33838050 34690077 35532233 36143399 36801616 37528550 38055638 38598685 38947552 39399796
4056 39399796 39799958 40089028 40615716 40821186 41327086 41959083 42382579 42729452 42976830
4047 42976830 43335738 43810388 44755060 45807839 46916603 48278583 49588503 50326676 50007086
4038 50007086 49381005 48301350 47106264 45951805 44715829 43431080 42230210 40925480
4030 40925480 39809811 38943856 38081462 37503657 37265337 36980623 36855272 36764776 36578812
4021 36578812 36316681 36058223 35404875 34817392 33959584 33106092 32573380 32137775 31703073
4012 31703073 31522049 31579451 31356212 31194074 30924901 30250500 29412829 28616671 27848042 27031329
4002 27031329 26399149 25797215 25263888 24927541 24514877 24111906 23988602 24065405 24114295 24063980
3992 24063980 24221000 24505267 24511638 24784577 25120610 25281535 25582297 25824478 25875421 25671419
3982 25671419 25235560 24793122 24046841 23289983 22468360 21580928 20816093 20097392 19516874
3973 19516874 19183979 18578989 18253883 17795221 17315319 17102218 16943643 16536359 16380284
3964 16380284 16218061 16185136 15993080 15941997 15961083 16099264 16307429 16411205 16511508 16683337
3954 16683337 16980166 17255461 17562818 17918105 18233782 18531051 18916385 19188416 19323534
3945 19323534 19449447 19697982 19705051 19786714 19781400 19561467 19257463 19008927 18497269 17830061
3935 17830061 17266913 16702011 16152546 15639134 15175194 14781616 14500214 14485671 14051833 13941310
3925 13941310 13908399 13743638 13840802 13796551 13680369 13523578 13513501 13646590 13694753 13632970
3915 13632970 13642605 13704001 13564240 13525104 13462530 13331482 13204299 13045756 13007542 12866595
3905 12866595 12739342 12544711 12350679 12359207 12214264 12187415 12179920 12147594 12200040 12045061 11764838
3894 11764838 11799393 11703891 11584581 11469756 11362095 11311833 11394840 11173370 11025755 10981841
3884 10981841 10906247 11045535 11046038 10958464 10714524 10717816 10765977 10863328 10975337 10960366 11021952
3873 11021952 11065877 10875349 10900170 10996944 10904579 11037678 10888105 10882757 11100971 11164384 11122624
3862 11122624 10985926 11071865 11086876 11192202 11327167 11347806 11341989 11362342 11493720 11506888 11456836
3851 11456836 11545891 11542222 11574151 11599337 11811134 11723201 11835220 11911553 12014939 12080345 12178566
3840 12178566 12201860 12227910 12316285 12592882 12834848 12810626 12975177 13074344 13097657 13154519 13203581
3829 13203581 13395165 13688360 13765868 13778233 13863481 14181620 14351643 14581487 14764324 14867818
3819 14867818 15081660 15308621 15499870 15970451 15936088 16034888 16288436 16630614 17017498 17354465
3809 17354465 17731182 18008936 18129427 18453651 18884830 19039929 19498481 20138227 20636646
3800 20636646 21285186 21845475 22415052 23134515 24057162 25053240 26180023 27519282 28967650
3791 28967650 30611243 32485737 34517348 36603799 39080889 41559951 44074696 46615419
3783 46615419 48970571 51034660 52712922 53926392 54678471 55128848 55421598 55481915 55274563
3774 55274563 55004319 54804675 54505505 54400685 54107189 53818385 53514247 53201491 52567511
3765 52567511 51636432 50309580 48520419 46625119 44744031 42920554 40793965 38687579
3757 38687579 36692610 35056234 33621150 32244173 31057911 30215352 29447120 28665125 28018752
3748 28018752 27574777 27123372 26657574 26370953 26037877 25557855 24994142 24681954 24222496
3739 24222496 23825722 23686675 23494717 23231635 23053436 22744932 22589585 22367338 22156452
3730 22156452 21930440 21640248 21431415 21132332 20777562 20469597 20133331 19924094 19606296
3721 19606296 19277589 19065897 18793269 18593526 18467796 18331554 18017644 17857004 17752416
3712 17752416 17705971 17566294 17263186 17259346 17157705 16976839 16897492 16727249 16643648 16639835 16650698
3701 16650698 16468432 16506898 16700524 16758582 16615735 16699898 16846794 16784456 16953278 16983611
3691 16983611 17118660 17265423 17290243 17332574 17332475 17407902 17678613 17668539 17714496 17852792 17830027
3680 17830027 17952784 17916939 18088094 18173274 18348198 18665343 18954007 19090098 19205380 19361943
3670 19361943 19800863 19973503 20138223 20430627 20810206 21238602 21539913 21732022 21897952
3661 21897952 22118656 22435661 22533325 22787071 22974147 23015984 23181845 23442604 23451868 23538097
3651 23538097 23783247 24014237 24362383 24614822 24925377 25251791 25779469 26174532 26689793
3642 26689793 27359536 27791367 28399455 29079857 29761199 30479042 31127480 31827549 32568761
3633 32568761 33381475 34324505 35395064 36557569 37835084 39155541 40682481 42526583
3625 42526583 44380838 46277691 48598986 51170556 54009380 57247342 60872478 64626345
3617 64626345 69160043 74142705 79641461 85789864 92435420 99338044 106406051 113187919
3609 113187919 119160660 124085278 127387368 128746986 128425882 126170014 122180014 116768586
3601 116768586 110275333 103150202 95954417 88977698 82335632 76363493 70843283 65851736
3593 65851736 61486158 57679040 54433623 51590058 49234978 47134705 45326983 43862113
3585 43862113 42571030 41613345 40798783 40043643 39569091 39174772 38909265 38742353 38589135
3576 38589135 38485040 38437663 38370004 38368826 38380552 38098831 37688988 37249200 36914465 36365324
3566 36365324 35837904 35102595 34315940 33650757 33022491 32303677 31572042 30847279 30359695
3557 30359695 30018022 29502920 28897503 28285959 27644645 27188533 26658744 25974200 25286881
3548 25286881 24702690 24266656 23832001 23194504 22580405 22244583 21747342 21070110 20504370
3539 20504370 20130273 19833958 19441777 18949293 18700857 18461614 18003277 17571360 17288717
3530 17288717 16969780 16674831 16432994 16246522 16070301 15797542 15599652 15377892 15136598
3521 15136598 15057029 15001951 14851413 14753935 14722833 14552231 14394978 14358817 14349729 14316982 14297892
3510 14297892 14212733 14264970 14051841 13859420 13780092 13722395 13743893 13769213 13744908 13606580 13458844
3499 13458844 13373272 13256635 13188669 13064938 13068206 12951731 12798983 12776756 12672248 12555715
3489 12555715 12634486 12579065 12442253 12341699 12102986 11952648 11702169 11548675 11587629 11624259
3479 11624259 11526666 11342104 11086314 11124760 11135322 10987434 11067609 11023835 10875216 10762066
3469 10762066 10653759 10520033 10388964 10258243 10089768 10129422 10131415 10167059 10144654 10118320
3459 10118320 10258265 10249405 10265071 10478219 10369135 10464587 10505030 10407226 10320456 10377591 10464992
3448 10464992 10469163 10422234 10517405 10496747 10499320 10592347 10711616 10912151 10815400 10789146 10875713
3437 10875713 10686265 10716312 10870877 10944220 10986250 10981887 11085292 11273313 11430579 11379271
3427 11379271 11460683 11554142 11538837 11706674 11779566 11716734 11658606 11953250 12118743 12117019 12296385
3416 12296385 12285899 12444850 12763911 12928362 13009189 13018038 13175248 13421945 13624315 13915580
3406 13915580 14246965 14448022 14776732 15090086 15222883 15542711 15760388 16118278 16355493
3397 16355493 16824597 17307537 17705107 18072646 18612998 19280904 20018667 20567320 21059913
3388 21059913 21769570 22538778 23153024 23589783 24289755 25025573 25553249 25921184 26218273
3379 26218273 26565463 27108154 27242524 27408339 27659991 27790868 28013129 28360493 28648736
3370 28648736 28769888 29024444 29117188 29149899 29156006 29172759 29129561 29045435 28946418 28832287 28669945
3359 28669945 28541538 28433265 28143789 27966970 28040261 28183276 28414087 28627525 28797088 28943940
3349 28943940 29514968 30083892 30690835 31325341 31711520 32456154 33250390 34039618 35045168
3340 35045168 36127722 37251597 38617002 40355621 42342097 44398577 46408337 48536467
3332 48536467 50868575 53166435 55266663 57282332 59318327 61377247 63123806 64839114
3324 64839114 66586392 68118692 69344051 70580893 71699971 72782780 73688860 74615156
3316 74615156 75605311 76582043 77392907 78194497 78978510 79731849 80612975 81089713 81371184
3307 81371184 81138466 80680644 79651446 78395825 77079600 75853118 74813401 74121139 73790966
3298 73790966 73502199 73664480 74173134 74689549 75377894 76138073 76913055 77527179 77929658
3289 77929658 78235132 78247966 78134478 77860012 77620114 77490420 77366075 77342353 77257801 77000783
3279 77000783 76666050 76391774 75814405 75095055 74084616 72988655 71726375 70126955 68662751
3270 68662751 67008150 65352231 63938328 62537438 61383125 60237312 59381060 58682958
3262 58682958 58148327 57705898 57294150 57300706 57300962 57408778 57452260 57741572 58181131 58507237
3252 58507237 58826480 59515867 60483124 61504683 62637608 63866070 65378912 67100077 69003789
3243 69003789 71162352 73452540 76026709 79102903 82384918 85953380 89622405 93620630
3235 93620630 98308105 103072380 107955311 112949278 117714420 122219933 125832525 127947188
3227 127947188 128500394 127274990 123965933 118785409 112095335 104737275 97271933 89976424
3219 89976424 83374340 77416845 71980379 67355309 63246985 59647771 56432871 53519419
3211 53519419 51035349 48930387 46940535 45207250 43640893 42292061 41260647 40125478
3203 40125478 39027897 38226283 37387096 36545902 35719347 34689792 33915670 33184364 32438856
3194 32438856 31787898 31164473 30607455 30171010 29612610 28995247 28473040 28153083 27663945
3185 27663945 27318589 26917842 26578869 26279789 25976990 25877757 25643543 25459165 25390477 25413640
3175 25413640 25350955 25530875 25493563 25769234 25953332 25916135 26125185 26551772 26851431 27128862
3165 27128862 27766901 28123635 28751206 29457459 30087892 31106002 32145302 33317072 34591651
3156 34591651 35927785 37738004 39800516 41916263 44120400 46402769 48862507 51258012
3148 51258012 53542686 55805903 58130404 60825295 63530257 66335861 68632586 70622556
3140 70622556 72064128 72910468 73593497 73789007 73137693 71832893 70076675 67953900 65220355
3131 65220355 62039990 58658310 55101269 51594519 48283995 45088787 42376859 39982061
3123 39982061 37733208 35720381 34062393 32677437 31174167 29935801 28709508 27633330
3115 27633330 26696128 25689937 24968487 24198075 23398977 22727878 21967269 21259443 20756884
3106 20756884 20182934 19563302 19087108 18445802 17981989 17614329 17219216 16719742 16332330
3097 16332330 15943269 15609159 15243094 15066215 14673691 14248524 14010380 13790693 13629563
3088 13629563 13428094 13233047 13120276 13201853 13046104 13161048 13083237 12995294 12790003 12743707
3078 12743707 12556474 12388042 12288458 12136815 12097794 11854264 11560205 11580347 11359821 11129493
3068 11129493 10945618 10758645 10793059 10528754 10433033 10256859 10024528 9877009 9875383 9868394
3058 9868394 9699863 9531728 9579890 9524505 9438386 9299985 9164136 9161651 9332931 9218450
3048 9218450 9127645 9072419 9019396 8928261 8823275 8644246 8608343 8627677 8639200 8580773 8586172
3037 8586172 8519978 8386837 8445572 8273941 8199912 8089170 8008664 8073707 7929817 8036401
3027 8036401 8007030 8027175 8091159 8048077 7931563 7946962 7858755 7986279 8143995 8069519 7991257
3016 7991257 7855586 7786822 7895531 7822527 7988566 8017904 7845895 7854156 7833200 7893018 7990224
3005 7990224 8096031 7914544 7920823 8016585 8114834 8219435 8298181 8108143 8164173 8256170 8300498
2994 8300498 8384712 8482162 8634094 8852829 8875935 8823613 8911000 8789155 8748177 8736708 8787931
2983 8787931 9109853 9431268 9400477 9384267 9466565 9641482 9669748 9624577 9817789 9841860 9943852
2972 9943852 10019087 10146175 10336153 10367525 10466610 10514972 10484589 10595632 10646825 10873259 10911375
2961 10911375 11064017 11133722 11494738 11727906 11978610 12185292 12400919 12798897 13220002 13511887
2951 13511887 13752702 13961919 14181067 14454119 14702251 15075218 15366719 15620511 15813316
2942 15813316 16147688 16450744 16805112 17369640 17996758 18450486 18754105 19292158 19910228
2933 19910228 20256013 20657912 20988239 21288163 21641266 21739687 21922347 22222100 22393368 22900912
2923 22900912 23226142 23743862 24318098 24725292 25445749 26026413 26654946 27092206 27583834
2914 27583834 27965329 28584213 28978534 29582846 30152853 30599010 31142555 31658264 32207672
2905 32207672 32643684 33334750 34005882 34538627 35253438 36126326 36946840 37898999 38845672
2896 38845672 39832803 41119826 42669871 44082058 45756053 47571869 49577120 51701077
2888 51701077 53537628 55309407 56651763 57573279 58936273 60163329 61546780 63351123
2880 63351123 65609773 68146115 71105917 74182646 77671053 81347354 85252287 89750776
2872 89750776 94777758 100454233 106957140 114069975 122248524 131253724 141593993 153530760
2864 153530760 167436159 183981038 203491674 225932371 250735710 276226700 298380574
2857 298380574 310924938 307921685 289340439 261513496 231757015 204484200 181456597
2850 181456597 163465344 149433765 138389480 129671185 122492480 116085978 109826302 103515362
2842 103515362 96903917 90810437 85216164 80017475 75229025 71149835 67178939 63478831
2834 63478831 60193928 57381389 54861544 52459516 50250238 48222427 46326992 44534166
2826 44534166 42801210 41060536 39643209 38274963 36648048 35380803 34139608 32994981
2818 32994981 31861530 30745680 29769751 28765678 27863794 26998462 26077470 25305484 24465326
2809 24465326 23430690 22551367 22001595 21411869 20775168 20170121 19517259 18991027 18514142
2800 18514142 18149034 17791647 17383088 17008088 16708333 16433795 16234799 16132493 16013410
2791 16013410 15839165 15706289 15521346 15479394 15420809 15271180 15092566 15005560 14900846 14554229
2781 14554229 14143987 13896963 13762396 13506969 13130079 12686029 12560690 12373643 12189509
2772 12189509 12019859 11785783 11557918 11393836 11294772 11174141 10998587 10804900 10728992 10257796
2762 10257796 10013938 10015614 9642453 9471419 9391546 9313741 9106697 8995239 8746527 8665687
2752 8665687 8662988 8281976 8189512 8168854 7995784 7758313 7855062 7811854 7718906 7668262 7491402
2741 7491402 7514450 7522146 7341475 7161917 7069555 7036898 6914419 6731655 6692156 6505487 6424632
2730 6424632 6363760 6247548 6226027 6008655 5879271 5735066 5611593 5647908 5583545 5648526
2720 5648526 5685984 5668838 5644304 5591109 5626022 5633066 5730337 5714986 5898046 5769487 5625212
2709 5625212 5707598 5807661 5766948 5617793 5529495 5173867 4885325 4690468 4646710 4703247
2699 4703247 4556066 4454910 4304004 4153058 4038119 3908448 3724989 3753001 3678578 3323928
2689 3323928 3163638 3146566 3049056 2857607 2838201 2963656 3023861 2893526 2828397 2772016 2662692
2678 2662692 2486683 2384314 2461054 2438150 2375880 2447231 2230067 2087490 2054213 2270684
2668 2270684 2231289 2179008 2154621 2092725 2042028 1971722 2005929 2024399 1967656 1916087 1817400
2657 1817400 1635249 1752374 1939787 1900423 1824031 1680232 1745211 1693992 1602937 1544716 1579777
2646 1579777 1629836 1658100 1672637 1571055 1354633 1268609 1347441 1294187 1340687 1218209 1174436
2635 1174436 1310279 1272776 1204938 1210197 1168981 1225227 1229085 1204316 1238874 1310817 1203285
2624 1203285 1134106 1142641 1240716 1129633 1115217 1187768 1006789 1056773 1210833 987409 961417
2613 961417 999298 960201 1027352 1070015 1078215 1116755 1191691 1091688 1096600 1140913 1008972 973587
2601 973587 902968 953564 909620 1029277 1024935 1087867 962188 975598 1105643 1135491 1180635
2590 1180635 1138131 1055750 997768 1063701 970745 982810 1155228 1237088 1292489 1334946 1256440
2579 1256440 1306929 1426962 1500832 1674302 1863941 1984398 2108910 2012107 1767690 1745729
2569 1745729 1585231 1457258 1437960 1323849 1152403 941729 909556 925054 942104 991226
2559 991226 996543 883411 813283 733163 719300 817797 707535 530699 571504 653531 706751
2548 706751 409315 432948 540301 506107 520685 558072 537897 418420 418240 207708 243416
2537 243416 399185 522728 386187 178163 323079 406152 403147 261099 256373 420543 412048
2526 412048 220221 261362 281586 259117 337065 494785 397439 283658 120956 48277 201114
2515 201114 219658 258652 212902 99753 257066 344736 262293 240828 282945 219155 302843
2504 302843 217158 65562 47954 72694 5085 53806 141057 118802 145361 173442 -65545
2493 -65545 59246 239793 168554 247215 170845 153042 249115 325866 296910 67904 200026
2482 200026 203283 57008 80763 -12245 -61042 82856 193585 127451 78201 200431 217835
2471 217835 92891 67201 184300 250198 169608 94511 -17186 138545 90298 72071 185567
2460 185567 110515 -18230 9010 108718 89737 75255 154436 191729 176530 3140 -37045
2449 -37045 -16416 -97939 -40334 10192 88866 40303 33836 -1330 33989 -40247 -161136 -79822
2437 -79822 -70954 82075 19740 23672 26706 -24769 -113430 -177964 -18789 98316 -193419 -66815
2425 -66815 29580 63560 49568 -59740 -178670 -114092 -116514 -129989 -198460 -222877 -255092 -100511
2413 -100511 -33444 -20688 -98887 -138687 -15332 152494 78134 169188 122393 -39851 63768
2402 63768 -142665 -39852 87699 67570 58672 32963 -145831 -90755 164931 216330 -54363
2391 -54363 -153370 -131572 -86666 -66978 -31831 -81850 -36785 -113990 -261557 -58390 -96558
2380 -96558 -149255 -84026 27210 57674 17451 -74875 -71832 30617 60909 104838 308720
2369 308720 292188 103337 132278 222762 191827 118293 96315 108405 182391 85353 322162
2358 322162 384928 378320 436051 303464 102598 212703 342169 357406 119064 81402 -75271
2347 -75271 -29850 -28162 60491 77581 157864 113930 -3715 86364 1607 13469 37510 -71679
2335 -71679 -135809 -95383 -180099 -76010 -39728 -29303 -78527 -49218 -38509 8867 -7894 -154210
2323 -154210 -105173 -121541 -122800 8606 -105237 -166657 -124685 -194361 -64366 -17173 -186355
2312 -186355 -1249 124599 -15089 45160 153848 110492 93510 46234 93203 112280 -22524
2301 -22524 12053 -97424 -77039 -26757 -86376 -170210 -190377 110209 192681 91747 -169432
2290 -169432 -177447 14024 21019 178017 350349 268296 167223 124361 368893 195255 -56340
2279 -56340 -42051 -107223 -55519 30920 3718 -105953 -12131 -64638 4764 -7589 -16579 180928
2267 180928 199629 300243 146096 79371 97133 169827 68759 44206 16053 -43523 31212
2256 31212 187460 145871 50717 140431 -121502 -119978 54307 56290 -5025 65086 194034
2245 194034 241950 269350 119575 64279 267689 233188 343570 224866 44152 106335 231284
2234 231284 138849 231686 182652 177606 257477 257277 245518 165930 193336 307180 428730 327681
2222 327681 213908 147675 268602 351636 308307 295226 366942 342990 311238 425873 425113
2211 425113 368409 405616 461939 601024 713420 730159 639691 630011 571629 435103 402365
2200 402365 459403 500573 612091 570538 601311 526178 450579 700411 726181 543716 761823
2189 761823 814006 777741 896915 936639 918203 1041534 992051 1041369 1191531 1163843 1038497
2178 1038497 1134388 1242619 1126425 1223284 1381443 1398051 1537405 1436838 1410398 1363747
2168 1363747 1225680 1434073 1515433 1435505 1412223 1509305 1585383 1700665 1557679 1563255 1663120
2157 1663120 1663865 1633039 1840034 1899848 1933040 2018517 2079920 2098263 2192925 2143933 2107629 2143079
2145 2143079 2294502 2327980 2269576 2431545 2480587 2518000 2509542 2517252 2692543 2793361 2859201
2134 2859201 2909632 2908484 2997212 3045078 3203010 3427718 3547810 3624903 3983384 4368628 4549082
2123 4549082 4577245 4849036 5175627 5307922 5632360 5982243 6396136 6804933 7084116 7518520
2113 7518520 7875086 8415370 8937808 9659207 10292891 11094143 11976138 13047718 14346423
2104 14346423 15534519 16417383 17543395 18880926 20780843 22897049 25707523 28904978
2096 28904978 33599212 39404554 46289005 54700478 66104884 78184950 87474281 87887311
2088 87887311 75031341 60379599 47698226 38140442 31491582 26630071 22749292 19714770
2080 19714770 17481417 15993523 14703025 13797894 13008765 12365101 11762266 10771268 9822685
2071 9822685 9071443 8196462 7629780 7337225 6909700 6443878 6084182 5924686 5538817 5362295
2061 5362295 5106656 4842937 4658918 4514620 4265649 4071607 3811009 3709217 3522103 3327274
2051 3327274 3188594 3072960 2890006 2856574 2797748 2652442 2459909 2350044 2335234 2231811
2041 2231811 2042571 1939058 1754054 1655125 1623293 1521176 1395697 1476972 1419302 1375850
2031 1375850 1326628 1284538 1138503 1103392 1301227 1247067 1174800 1157761 1189719 1080513 1134390
2020 1134390 1139235 1223934 1111390 1044099 952086 941640 951882 842177 824056 794618 830340
2009 830340 951662 1077010 885618 723287 686086 704373 702854 638822 565048 594847 607345
1998 607345 721298 754314 708577 527800 522459 439991 454432 512719 497903 631939 489668
1987 489668 351038 279136 482721 539069 353080 371345 287184 235623 317925 145564 232707
1976 232707 299340 422315 376093 315416 300678 259974 261277 188972 302004 197772 299481
1965 299481 224773 204433 237464 274197 209951 194786 2334 94584 161063 210280 219596 235286
1953 235286 120839 196812 179018 111878 175121 132660 121810 91809 112264 -27378 24494
1942 24494 -39449 -53410 77444 164417 185999 140562 218266 149137 16037 71041 144338
1931 144338 209863 191771 143864 81026 198813 207939 171912 174142 103420 226313 150876 162514
1919 162514 32381 69748 167366 124101 10203 -45230 17873 64428 95457 64187 40091
1908 40091 -44134 111373 -174643 -135313 -67349 71272 88685 -114129 -210484 -225867 -69009
1897 -69009 76302 110106 70094 42217 77324 43656 42672 113095 14348 -64021 -144897 -105670
1885 -105670 -71683 -76170 112941 23613 -94497 -74913 55836 -18419 12940 35654 78696
1874 78696 -10121 -90936 -163373 -54025 88754 20199 -131208 -10346 -86465 -149547 -341568
1863 -341568 -478947 -223275 -29400 89643 23880 -129749 -30517 -231725 -306869 -176198
1853 -176198 -42267 -84256 -93107 42729 98856 96496 46322 118529 85498 115333 -27027
1842 -27027 76943 66999 969 -70502 1796 61455 66383 97452 21024 -64065 41447 25813
1830 25813 -27834 44649 73104 10220 -17297 276336 220981 86262 198224 184176 306520
1819 306520 123991 -25725 84684 35211 -125660 -276984 -269320 -151297 -216286 -284829 -26047
1808 -26047 57022 -173721 -190104 -157552 7769 -56081 -12501 8283 -89253 -146324 25475
1797 25475 17500 -118958 -128732 -64693 -126991 24908 52232 13457 -63729 -44114 -84680 -183987
1785 -183987 -159597 -143055 -137128 -92400 -1949 10808 -94846 -75201 -260316 -228602 -143060
1774 -143060 -1924 1076 -40890 -42107 11774 -97887 -118339 42635 78298 181861 37239
1763 37239 -47200 -207319 -109359 -161906 -251493 -423942 -216267 2730 -73797 -21871 -104355
1752 -104355 -105234 -40900 -94630 -20794 -80741 -26826 -97649 -61066 -118417 17971 -84816 -179419
1740 -179419 -175794 -125196 -238083 -253659 -231453 -219430 -127167 220 -65003 -251866 -200822
1729 -200822 -278714 -61016 -100035 -112454 116582 -27831 -93114 -98746 -189924 -66432 -142318
1718 -142318 -209729 -82537 -111189 -127663 -116830 -113016 -60736 -27578 -124337 -62793 -21775 -97841
1706 -97841 -117281 -18299 2064 47069 -30629 -67967 -160670 -251382 -65714 -195181 -272508
1695 -272508 -105110 -153923 -179747 -115510 -232468 -197389 -202942 -149197 -49067 -33042 -187708
1684 -187708 -166575 -118303 -182262 -50681 56898 78504 -392 73210 1699 -172770 -112593
1673 -112593 -99858 47479 -159690 -167716 -172845 -69249 -42460 -112247 -100543 -51794 -158075
1662 -158075 -192542 -44104 -24202 -189649 -275816 -224795 -258446 -132715 -141957 -200901 -177541
1651 -177541 -217843 -297667 -105967 -157162 -137739 -40457 -71634 -197712 -221171 -92884 -161796
1640 -161796 -288375 -236403 -52661 34584 -172369 -190854 -37921 -70234 21322 -89003 -126210
1629 -126210 -82458 -154118 -256251 -300248 -142251 -138979 -127173 -26048 -16793 -33705 -82052
1618 -82052 -57333 -130473 -222639 -175396 -139630 -27798 -47029 -13726 -148375 -194545 -114532
1607 -114532 -103357 -164348 -101091 -103308 36443 -67600 -206830 -143600 -147135 -104810 -137171
1596 -137171 -121494 -124577 -33507 -107944 -125239 -23929 -62655 -130387 -153161 -133302 -93295 -141205
1584 -141205 -223298 -119159 -147628 -43495 12703 -8404 -27405 -159658 -56162 -149885 16706
1573 16706 91462 -102993 -188631 -115214 -134022 -280386 -221751 -7850 105844 -56038 -82285
1562 -82285 -121177 -176911 -194618 -88913 -36997 -287720 -225460 -94559 -73670 -34668 -37196
1551 -37196 -173659 -222977 -345067 -163932 -176043 -85850 -9197 -63079 -11613 -164106 -62531
1540 -62531 -20229 -68363 -13847 -56156 -27836 -131292 -134822 -89503 -134798 -223789 -191231 -107513
1528 -107513 -57216 -94837 -131735 -76712 -161438 -85341 -251412 -172577 -70567 -95227 -36455
1517 -36455 -25428 -87479 -5733 2559 -39097 43735 -24024 -220246 -227075 -180344 -120062 -151023
1505 -151023 -23051 -24638 -32706 -90515 -125633 -116829 -167189 -112497 -184399 -292894 -221242 -56366
1493 -56366 31369 12249 78852 -65966 -178303 -122349 -70951 74327 -51962 -156180 -124421
1482 -124421 -264688 -129318 22003 -89987 95790 52495 -22747 -155182 -262890 -225009
1472 -225009 -71934 -80681 -129307 -141409 -176440 -246862 -148200 -168680 -322345 -297665 -251332
1461 -251332 -221571 -276637 -322470 -165046 -71702 -101818 -231335 -159177 -178576 -184956 -25720
1450 -25720 -104103 -38837 84230 54841 -89280 -95501 -36987 42882 32851 -83748 -139753
1439 -139753 -158605 -182328 -199514 -230206 -166158 -68765 -186334 -102402 -101751 -39643 25331 -66216
1427 -66216 -85729 -83706 -82020 -85177 -116641 -188028 -69212 -10114 -26952 -137797 -117210 -125252
1415 -125252 -140661 -116750 -38434 -38958 -106611 -76242 2781 202335 169564 141664 17959 -106656
1403 -106656 -42882 -4768 -174991 -105973 21513 -82745 -25620 -59001 -167395 -131807 -151610
1392 -151610 -126429 -156767 -236610 -351954 -376668 -252892 -127443 -10961 -153110 -61653 -137800
1381 -137800 -144069 -122754 -207050 -222855 -219835 -258315 -274981 -145787 -167303 -134122 81880 -14936
1369 -14936 -43763 -16008 40759 31503 -53898 -214989 -98858 -46633 -84734 -134186 -55871 13521
1357 13521 -109490 -89742 -102317 -107735 -151355 -188867 -81969 -139283 -36261 -63822 -98394
1346 -98394 34585 -77043 -79800 165000 121762 49197 169938 206770 201496 177350 38118
1335 38118 -112039 -63286 -167479 -308293 -275172 -312560 -272909 -262667 -231370 -245798 -232942
1324 -232942 -49480 -51462 -59625 -142168 -72577 -85047 -73228 53610 -23974 -130656 -35758
1313 -35758 53346 29657 -17893 -150033 -153250 -27744 29350 152285 -80297 -18368 -55222
1302 -55222 -172987 -173715 -90068 -104594 10231 -24247 -128615 -224577 -182661 -206752 -111065 105918
1290 105918 169310 35822 -83847 -46431 -91635 -9165 86199 -38457 -51921 -85917 -120057
1279 -120057 -113961 -97515 4017 118748 -21440 -57937 -6732 -65802 -165852 -200419 -285713
1268 -285713 -141912 -86111 -165483 -161049 -197435 -97936 -136905 -143684 -131409 -59104 -82467 -66809
1256 -66809 -73742 -153066 -21178 -65967 -247931 -182476 -42798 100678 95231 28364 -164385
1245 -164385 -15482 -55730 -60612 61770 108879 -26117 -119993 -237540 -115041 -34669 25372
1234 25372 18055 -104682 -71369 52686 177381 138030 65966 -14412 -159743 -121736 -207845
1223 -207845 -296695 -119060 -210379 -158209 -111625 -156155 -277983 -90183 -2565 -136660 -125293
1212 -125293 -146806 -80163 6 60850 34680 75603 43961 209549 130676 82698 77065 63036
1200 63036 70315 -12452 -110001 -60029 12466 -55064 39728 74966 89770 54407 102350 30333
1188 30333 -72885 -70596 57039 119301 18846 -28135 -129054 -51272 -120173 -139307 -66126
1177 -66126 -12713 -90754 -78353 -427 43091 -33642 10382 -40889 56782 -92312 -100755 -44949
1165 -44949 -257969 -91218 -61785 -88999 -227936 -142542 -200462 -155830 -74987 -73866 -97099
1154 -97099 -33474 56765 -23191 -59744 54278 69845 57034 128340 157886 100111 2785 -167960
1142 -167960 -175804 -181354 -108277 -52675 -43538 -84527 -194200 -168282 -83794 -76935 -157802 -221973
1130 -221973 -187502 -145433 -57456 -56386 3284 113283 30421 -29325 9210 -6255 -99996 -202118
1118 -202118 -29090 143051 204179 219892 159259 -10454 24918 99765 59748 73416 -63038
1107 -63038 -4862 7937 -19592 -32531 -136754 -174667 -56866 61771 85873 15002 72426
1096 72426 147924 172846 108585 77118 -55743 -162227 -138848 -99660 -220720 -97767 21258
1085 21258 33577 -29747 -14807 25660 -96900 -144278 -127900 16436 23266 -25307 57617 142391
1073 142391 -135601 -151959 -143776 30826 -17554 -172597 -3817 -123368 -129150 85431 9977
1062 9977 38504 160014 51620 -139396 -256249 -141159 -95563 52369 165992 109254 -19835
1051 -19835 8761 79096 -9353 74149 -57683 -191696 2650 -46034 -329059 -134123 -40967
1040 -40967 27358 91650 46623 39960 191161 112038 74471 -18539 -236497 -237048 -145935 -37462
1028 -37462 -49113 -54641 23268 77268 69054 -59470 -88768 64096 -8559 -104707 -136781 -68763
1016 -68763 66124 129235 31939 58120 4571 -50107 -9049 -56579 -200947 -172845 -215757
1005 -215757 -184766 -84117 -179145 -138276 -70650 57097 -27213 -61367 41266 142439 6531
994 6531 -63724 20618 11375 101057 16382 -25639 42825 367 -115105 -57539 -163166 -83662
982 -83662 -159953 -11079 14488 -121524 -88217 -203503 -156467 -3781 -13344 88597 63637
971 63637 -34243 85950 50243 175913 221948 30296 35867 174235 135099 53445 5095
960 5095 -89283 -16928 130349 19441 -218776 -73695 24715 -117049 -14388 206386 81668
949 81668 48950 -111050 -161258 -100248 -76880 -201524 -5531 113260 -41054 -14117 -158142
938 -158142 -141107 -149893 -33677 124813 -47357 -93924 -112822 -118530 -114856 16121 231937
927 231937 261065 191093 6943 -24383 49166 136585 116612 162878 195332 148993 22262
916 22262 18040 6481 -130372 -80976 -46513 -281967 -306035 -108706 -57158 27852 -12674 -100240
904 -100240 37099 32813 -14554 -37209 31476 -80326 14032 8379 -101415 -205408 -141438
893 -141438 9325 -18260 42040 -27792 22852 3525 131988 49074 -52701 57321 -32337
882 -32337 -62108 -10931 -13902 -77338 -17262 16373 -149250 -109697 107329 16657 -29492 7237
870 7237 39159 -41845 14893 -68978 -47903 10268 -20238 -119360 -154055 -10967 58932 -132141
858 -132141 -113887 -91342 9644 -6515 -108770 77322 54254 -86074 -91802 -183676 -94300
847 -94300 -76504 -113557 310 -7962 -99065 16166 54688 142985 102145 -7115 -51083 39013
835 39013 72301 107999 78158 -24322 6528 -20615 121828 62049 -32757 24493 140471
824 140471 203526 222318 31838 -73195 -66204 5407 -7479 84873 100629 -3979 8238
813 8238 107114 129158 109130 44806 107358 -31500 -82611 -98407 86041 74673 97191 72304
801 72304 -60949 5560 -14709 -40461 -9932 59355 51509 8124 70396 95451 -50600 -122026
789 -122026 -100925 83885 75879 -48504 22217 15380 -85521 -109069 52605 14187 -4237
778 -4237 41934 141102 138411 150594 157942 -17423 -57601 35132 -86782 -5322 103747 16684
766 16684 168503 264653 138546 89719 79161 135890 -102173 -202387 105523 89910 -21282
755 -21282 27277 -1828 51059 77159 37411 72738 -110445 -73285 -77078 61623 191292 152606
743 152606 1300 -35489 127964 210526 194211 127601 97794 -20027 29933 180746 230180
732 230180 220303 185799 175981 50118 -57078 -101315 -60846 4852 33321 178091 42163
721 42163 170528 73295 33934 66301 -13578 94481 -40004 -48492 -109049 -43349 -15962 104214
709 104214 28883 10163 83855 114761 72259 67311 85843 49454 131494 164216 102019 39325
697 39325 172704 138416 76834 118431 77654 -14148 48497 113608 108838 124056 36687 48344
685 48344 74636 -71289 -122979 -17480 20764 116129 127379 252468 205820 95043 -34230
674 -34230 -47062 -18423 -91622 -160696 246 97017 161620 219560 189830 128208 84956 61284
662 61284 117892 121216 110342 83937 144991 157906 -85238 127173 142410 -14877 -65027 -4660
650 -4660 21433 22327 -58538 34232 133275 58399 -61537 -123888 -23402 74168 162985 67996
638 67996 83070 95423 183153 -65654 -166235 -1907 155390 112423 129250 97053 108102
627 108102 231608 209706 39415 51187 104690 209716 111603 -1673 -18837 -134206 -125139
616 -125139 -67330 148864 173 85677 56393 79071 76751 57157 38140 136540 133693 46168
604 46168 125719 -113220 -108396 119937 58150 -13219 59449 258166 188152 112721 80699 144963
592 144963 232159 255761 73428 83974 -11727 -77197 -16079 24654 -30322 45125 32224 83774
580 83774 190852 125895 81277 73198 129801 161691 145983 142025 96606 155238 19941 74271
568 74271 63102 -137199 -35828 88284 142674 282428 172801 31198 65881 -116846 -49679
557 -49679 35609 112179 121835 150081 186614 259537 172025 167713 57907 120605 191318 77645
545 77645 4695 135557 48216 33327 118331 61350 149198 231369 353317 271847 159181
534 159181 214435 125539 101486 88608 82414 156169 58194 122228 183947 47107 -127070 -67367
522 -67367 -28840 54868 90775 84626 10476 -67407 6374 18580 -69966 -3791 56014 54402
510 54402 118709 32905 115394 -47005 34132 -54174 -81181 2674 189335 115345 47441 245724
498 245724 261531 221923 152181 73872 70980 244638 178611 251497 250465 182322 110518 -89018
486 -89018 81488 -8612 97328 296946 115511 70678 261943 59644 39431 103981 193099
475 193099 148612 178856 324500 192099 123902 10532 141693 111356 -32134 -91670 55362
464 55362 2967 29952 -58973 34235 2738 -24160 224112 113443 98673 222648 221213 173217
452 173217 174870 115997 125609 116814 -3141 62928 71914 7768 -51221 -123503 -76219 102191
440 102191 123184 84553 113193 100733 102526 173312 68381 123344 172759 -6522 2537 126298
428 126298 -78573 -26320 17462 74989 166922 90554 115852 252342 157296 36022 -50253
417 -50253 -32236 134383 71809 271310 326595 216337 297181 271420 166719 179276 133992
406 133992 239220 209198 129180 56346 -10402 279918 95281 80573 34748 -88985 120468
395 120468 193313 222532 218584 110387 104379 189141 100112 93304 171006 48318 -13152 -38884
383 -38884 -26013 -10436 62854 166299 10191 -63992 59904 -41202 67751 209356 189485
372 189485 173276 121392 215041 121440 89222 16600 150705 207691 37827 83975 -34260
361 -34260 -39230 59861 132322 185223 127856 150412 336961 360458 101046 90845 3117 81740
349 81740 81828 200140 48323 -32476 36678 126650 211554 128203 83180 167417 91262 110091
337 110091 132328 238204 373286 213637 209100 310408 291872 275898 314229 312369 200569
326 200569 105280 210212 63591 -76708 109766 241567 326811 399297 444121 248377 95370
315 95370 28171 27972 51946 87755 6014 66733 117355 52505 186767 94804 49806 52642
303 52642 89602 174501 102451 5808 71213 117681 5059 -7905 170085 192375 238739 231054
291 231054 195422 219987 107148 62550 64504 154426 110730 -39669 17723 -18691 117669
280 117669 165755 203286 170143 309284 149712 24855 196789 255771 193736 108213 76142
269 76142 29418 -48137 -5272 106817 222835 227290 68508 85690 -87650 523 115471
258 115471 -75249 113904 113509 36232 81162 75131 137480 41350 -94061 76484 22734 107667
246 107667 163121 149301 145374 173405 198134 76143 144581 209307 316411 291257 262637 157049
234 157049 61826 114455 160067 198063 282141 191253 240499 269389 129092 106888 158888 212597
222 212597 191946 198948 240594 254858 149677 155014 222285 209907 37635 -40631 -144589 -80929
210 -80929 -28936 65656 222073 206184 197097 207999 346184 141399 116848 141899 124650 178448
198 178448 249752 170525 101242 205755 248063 167034 63881 107778 80782 -14512 52240
187 52240 78757 -5535 111240 97944 180984 191102 79793 45523 176671 220759 98075
176 98075 140377 283408 311011 325630 338356 179810 141675 169482 261985 179545 113573 164929
164 164929 207021 50324 85730 138999 101537 102080 203130 55554 38411 44792 -22837 55823
152 55823 79787 80202 123961 214981 241823 95079 111813 199931 142800 49754 205831 149748
140 149748 72728 172512 176391 212631 48363 -19259 13548 150807 175864 179482 213386 111610
128 111610 205952 273205 247635 127731 45802 79287 65561 100362 158368 239365 194492 65849
116 65849 26985 141158 184658 145919 78892 169768 85354 149744 281233 292873 331974 273122
104 273122 250616 403382 350701 233767 157828 130946 157973 152174 155283 253058 191121 133300
92 133300 173929 226496 231505 234270 223529 60640 212666 225241 178390 198272 205413 202013
80 202013 166041 216003 193105 198509 48600 69166 262531 182389 77286 135127 18885
69 18885 27707 18828 95825 162312 76038 172500 165616 135140 121506 273383 303747 164154
57 164154 50563 165465 215233 137746 95262 211191 299935 183962 168665 206559 168101
46 168101 80717 135846 181505 107129 9585 21178 7892 138550 138043 115248 140228 23633
34 23633 86284 101280 124463 193709 142875 67259 68432 103793 130724 178863 282078 153763
22 153763 194079 267289 257756 259380 286295 245740 166088 266515 291657 139323 153602 163286
10 163286 165200 337793 198347 133026 50214 61125 94886 215888 264486 191023
0 191023
$$ Imaginary data points
##PAGE= N=2
##DATA TABLE= (X++(I..I)), XYDATA
16383 -1637096 -1640298 -1579904 -1425740 -1366920 -1378880 -1415480 -1312138 -1268298 -1338381 -1441510 -1366779
16372 -1366779 -1241855 -1220639 -1269970 -1239221 -1165554 -1220161 -1196677 -1199379 -1119540 -1111081 -1117683 -1005432
16360 -1005432 -896259 -847327 -923505 -860538 -866966 -824419 -685032 -681086 -605637 -604491 -746094
16349 -746094 -733759 -665734 -694618 -647982 -617359 -653171 -520195 -474872 -512110 -508136 -537683
16338 -537683 -476921 -391516 -378282 -367929 -266650 -231436 -370162 -232855 -171511 -163288 -238144
16327 -238144 -220874 -257637 -209149 -80662 -59748 -88152 31421 103079 23369 -32124 -41931
16316 -41931 60159 23074 178291 141118 188659 157576 222821 285214 272826 399085 349110
16305 349110 389167 382419 422015 426376 350418 441637 573319 532916 491014 479053 467850 620572
16293 620572 593836 726193 826170 769592 787741 904317 896730 906996 948251 881442 777343
16282 777343 852602 922861 948093 850349 824770 916603 895692 986904 1055931 1097484 1014008
16271 1014008 1082717 1113914 1070798 1143326 1131517 982652 1003167 974875 1181593 1387564 1434115
16260 1434115 1304350 1144366 1198749 1301743 1217446 1251637 1339155 1319028 1240946 1311066 1466669
16249 1466669 1295880 1270230 1359573 1592962 1608684 1550680 1531597 1580498 1553055 1498982 1597468
16238 1597468 1651152 1642798 1612504 1694418 1817983 1805996 1682566 1565173 1647767 1783918 1836958
16227 1836958 1685158 1705542 1730942 1607006 1620568 1601090 1604443 1597535 1687043 1714594 1702869
16216 1702869 1748650 1784888 1812741 1742319 1839346 1805313 1836148 1893417 1841627 1946457 2061307
16205 2061307 2116015 2084948 2000308 1999803 2048656 2112797 2060595 2091405 2095462 1923282 2059607
16194 2059607 2213641 2095113 2083577 2094925 1961837 2000234 2104065 2127442 2212955 2274623
16184 2274623 2207491 2144649 1987724 2045191 2195104 2224507 2033208 2030383 2022231 2039405 2099362
16173 2099362 2176077 2112936 2156690 2332195 2229968 2360872 2501770 2614125 2438240 2341372
16163 2341372 2312536 2269519 2222794 2167509 2163909 2164490 2360632 2348463 2254656 2256464 2327174 2361704
16151 2361704 2359316 2337539 2286776 2318338 2302444 2467109 2546315 2524826 2374071 2429583 2360384
16140 2360384 2217744 2445738 2476389 2546397 2446149 2360614 2340256 2489283 2434428 2494876
16130 2494876 2413283 2376937 2520091 2459574 2451815 2494814 2739122 2742945 2711960 2586141 2572027
16119 2572027 2419235 2498988 2672430 2616854 2619192 2473054 2475658 2744480 2750424 2621529 2548034
16108 2548034 2412689 2505895 2538104 2557266 2652955 2621378 2503632 2431199 2357717 2450289 2561744
16097 2561744 2352366 2365537 2588855 2626616 2706028 2531147 2589861 2569947 2489555 2416816 2502660
16086 2502660 2402365 2383201 2486260 2469542 2541342 2543495 2523200 2521400 2562553 2600221 2596169
16075 2596169 2511308 2606880 2625616 2529240 2503112 2538162 2589308 2779797 2745484 2733905 2501831
16064 2501831 2549220 2749391 2706769 2658093 2596865 2452933 2261693 2590653 2736198 2622458
16054 2622458 2602964 2568208 2670111 2630078 2614751 2649636 2561872 2463672 2467662 2650693 2680329
16043 2680329 2555433 2419977 2495633 2642424 2517625 2527792 2652108 2695790 2846552 2708479
16033 2708479 2508480 2604420 2503605 2517576 2543221 2627447 2594904 2631609 2530954 2542865 2542879
16022 2542879 2490396 2485454 2460501 2517206 2689229 2660462 2503663 2514344 2418312 2397404 2472744
16011 2472744 2447509 2595553 2534911 2584135 2539427 2423814 2739062 2759544 2606457 2605972 2754949
16000 2754949 2614115 2731252 2676452 2558039 2551497 2644425 2576147 2640707 2643814 2516324 2562805
15989 2562805 2598869 2671902 2765537 2634246 2649776 2699955 2544950 2572460 2473859 2631446 2801633
15978 2801633 2581314 2512772 2717674 2665148 2669809 2648130 2558484 2644757 2657254 2668003 2763440
15967 2763440 2654185 2581103 2723393 2696132 2667679 2702118 2819917 2726288 2578274 2753022
15957 2753022 2659895 2655842 2883530 2716712 2635516 2641520 2593883 2617252 2740587 2643591 2667365
15946 2667365 2707512 2798693 2868667 2785407 2784481 2654366 2574145 2515492 2737582 2803908 2852542
15935 2852542 2854870 2733402 2788799 2661640 2657026 2607947 2489921 2617461 2621020 2771901 2800559
15924 2800559 2619843 2631951 2615619 2666732 2612883 2581684 2588232 2534064 2594600 2629776 2818922
15913 2818922 2829488 2800088 2734563 2584887 2770825 2623436 2579236 2791688 2606252 2623518
15903 2623518 2679113 2603801 2775340 2805202 2819923 2963562 2834897 2806599 2858259 2720026
15893 2720026 2693649 2736798 2772006 2812658 2725315 2704193 2659552 2653924 2680334 2714205 2802951
15882 2802951 2851678 2692587 2635292 2702566 2653374 2643267 2709690 2660729 2657774 2636387 2621935
15871 2621935 2609461 2687332 2784022 2776502 2858793 2869603 2818477 2677241 2746291 2714804 2838686
15860 2838686 2953325 2882865 2816194 2895081 2899780 2777692 2703022 2668923 2716873 2743709 2743416
15849 2743416 2880347 2926184 2910042 2931273 2781217 2667955 2726035 2586532 2519513 2580079
15839 2580079 2655611 2718307 2595115 2720157 2775227 2938681 2900717 2636053 2619125 2574007
15829 2574007 2607344 2696469 2680402 2608648 2617344 2704312 2704056 2746003 2747851 2674858 2500961 2556474
15817 2556474 2471664 2602802 2756262 2679316 2864301 2810148 2741291 2601597 2602101 2712475 2758877
15806 2758877 2535803 2484485 2437718 2597288 2802890 2802298 2727222 2725123 2801145 2756384 2833192
15795 2833192 2844376 2884013 2800685 2681608 2599422 2676524 2752777 2794122 2774660 2819642 2746190
15784 2746190 2749797 2784452 2725792 2724045 2762570 2641905 2636488 2637172 2775021 2810344 2817131 2971301
15772 2971301 2844193 2854914 2598912 2585322 2775887 2784378 2871651 2758862 2659598 2640866 2717252
15761 2717252 2783498 2806250 2691847 2593838 2655636 2593805 2751382 2684059 2676991 2744376 2746133
15750 2746133 2637158 2673599 2673859 2624750 2560864 2633395 2617172 2536389 2716424 2871243 2956562
15739 2956562 2930176 2925300 2887113 2851084 2675123 2690894 2639043 2674374 2711942 2608968 2683576
15728 2683576 2783538 2708959 2783517 2773993 2751381 2893652 2860005 2767095 2736273 2762904 2857704
15717 2857704 2673721 2713073 2951812 2858001 2732872 2669974 2742175 2915018 2870229 2802654
15707 2802654 2733472 2817421 2700167 2618707 2735842 2572642 2689873 2670660 2719728 2808448
15697 2808448 2775691 2699964 2747709 2714716 2762183 2688965 2742871 2775598 2697292 2723084 2672285
15686 2672285 2770187 2883046 2874279 2738623 2819445 2741179 2802081 2814316 2960097 2806000 2794541
15675 2794541 2824230 2733355 2774445 2838264 2800999 2668388 2764079 2861378 2803613 2555857 2668704
15664 2668704 2657459 2440651 2583055 2593994 2720295 2721672 2771717 2781540 2691459 2842033 2766214
15653 2766214 2714059 2773564 2771343 2760540 2868474 2930124 2884169 2754675 2680311 2738875 2814986
15642 2814986 2578753 2722829 2745102 2774374 2740638 2898068 2851199 2782751 2941692 2705959
15632 2705959 2784458 2774554 2761483 2876023 2840225 2835366 2814070 2853195 2725268 2622488 2686465
15621 2686465 2885653 2842830 2764260 2776675 2778139 2803045 2686419 2852160 2774718 2646515 2694015
15610 2694015 2633327 2743847 2679546 2669578 2716454 2639865 2727917 2814619 2823866 2868294 2858208
15599 2858208 2820368 2866805 2932001 2775261 2643059 2810294 2744739 2750875 2693647 2640673 2860176
15588 2860176 2892380 2919413 2957322 2913529 2868064 2794917 2718260 2753414 2749374 2689632 2666919
15577 2666919 2651067 2727777 2877076 2850644 2848629 3033376 2875329 2772617 2852839 2892099 2751172
15566 2751172 2734734 2693904 2889513 3037156 2905123 2718563 2687122 2778634 2797149 2841044
15556 2841044 3006519 2969482 2912675 2894056 2857670 2937891 2899977 2945577 2945159 2881327 2807081
15545 2807081 2759092 2834236 2856470 2732645 2769656 2810180 2784127 2775779 2818444 2668153 2690801
15534 2690801 2759344 2673786 2649360 2672342 2676604 2731705 2759584 2683512 2629932 2608794 2676580
15523 2676580 2704691 2644145 2825338 3030097 2763849 2749302 2848741 2793262 2817153 2794193 2748937
15512 2748937 2757719 2892617 2854054 2839743 2780698 2824045 2923964 2851373 2802475 2804454 2745043
15501 2745043 2736270 2819780 2718752 2668361 2940296 2861948 2668458 2774141 2887512 2746382
15491 2746382 2794622 2835576 2885491 2858534 2844724 2827796 2623200 2737244 2779752 2746520 2814406
15480 2814406 2760851 2683182 2610446 2672813 2708404 2881544 2940877 2785435 2781422 2764846 2866904
15469 2866904 2647130 2707977 2685490 2746226 3034077 3016374 2858262 2698632 2703285 2663969 2711893
15458 2711893 2857710 2814383 2778348 2645713 2800830 2553846 2700116 2835353 2801413 2771280
15448 2771280 2975822 2972302 2889631 2825786 2792940 2955481 2797011 2706619 2667431 2712522 2646153
15437 2646153 2689894 2772275 2686449 2626759 2648037 2696985 2649570 2609826 2820059 3027893 2982925
15426 2982925 2983609 2916352 3012642 2853415 2693435 2693419 2675999 2653847 2707927 2845442 2858162 2943304
15414 2943304 2835511 2982507 2815464 2809256 2673783 2846507 2787637 2651437 2675122 2742759
15404 2742759 2775602 2884163 2802554 2797840 2899890 2913729 2905647 2910644 2666115 2664936 2783559
15393 2783559 2860353 3042506 3014954 2955963 2927534 2882237 2883570 2857054 2737938 2817376 2742016
15382 2742016 2750964 2858329 2921786 2923120 2766103 2751456 2870322 2931887 2861303 2787280 2829242
15371 2829242 2863212 2915657 2766416 2920557 2937076 2997322 3205970 3055115 2965676 2859276
15361 2859276 2922828 2915810 2888934 2892109 3031599 2907381 2843779 2958575 2884452 2700504 2755030
15350 2755030 2957353 2931687 2847731 2835073 2971431 2905665 2870216 2903388 2879038 2920582 2958779
15339 2958779 2825530 2789101 2772687 2759204 2889930 2965451 2900191 2874614 2841451 2929316 2879044
15328 2879044 2860584 3079842 2940647 2799740 2796464 2791440 2806611 2894292 2898117 2835861 2860849
15317 2860849 2782159 2818776 2836063 2843054 2887043 2883145 2889683 2852397 2959491 2955198 2837458 2883810
15305 2883810 2924469 2869912 2823385 2896946 2742519 2694225 2754378 2810353 2960452 2938330 2842476
15294 2842476 2927899 3010923 2952436 2853619 2914247 2806670 2909261 3021186 2909768 2936031
15284 2936031 2877094 2908961 2923420 2989005 3160350 3010733 3085163 2992340 2974710 2721499 2605349
15273 2605349 2801716 2916491 2898200 2841660 2978895 3115330 3017289 3024920 2962284 3000022 2868140
15262 2868140 2947233 2979191 3026948 3119961 2966359 2887275 2875893 2734837 2753967 2831055 2852586
15251 2852586 2949685 2837850 2734241 2766950 2902777 2871057 2754949 2675132 2789921 2748075
15241 2748075 2790173 2973378 2898906 2787063 2979770 2960826 2937415 3067642 3025357 3071561
15231 3071561 2983000 2812312 2772514 2753376 2932064 2981788 2948435 2720829 2706835 2909637
15221 2909637 3046398 2888717 2945355 2802566 2692502 2795234 2870810 2840481 2817548 2747693
15211 2747693 2733972 2793807 2851404 2855805 2682809 2722027 2906095 2891737 2864807 2883580 2928458
15200 2928458 2810708 2738999 2830567 2898443 2819139 2842983 2962356 3026020 3061039 2943154 2985177
15189 2985177 2851207 2790156 2917285 2858054 2884779 2954165 3028795 3138263 3182152 3015423
15179 3015423 2992651 2897426 2895492 2914706 2937041 2906447 2962938 2966164 2997571 2811816 2808860 2772170
15167 2772170 2784235 2802171 2807258 2775372 2819980 2764838 2853458 2994862 3051497 3018237 2875015
15156 2875015 2828553 2875278 2931062 2848153 2908788 2842828 2969594 2889817 2843627 2847255 2843439
15145 2843439 2788156 2919915 3059669 3085316 2889138 2835494 3066309 2986485 2988550 2918090 2875663
15134 2875663 2871283 2975316 3020470 2962761 2975647 2971624 3084921 3142581 3128768 3030287 2901643
15123 2901643 2871249 2939040 2848332 2856705 2890554 2953153 2764746 2916570 2965785 2925160 2861953
15112 2861953 2933892 2826442 2890739 3100877 3047918 3063591 3040150 2964955 2904861 2772154 2796042
15101 2796042 2766139 2854258 2873706 2860267 2856216 2769605 2777835 2968593 3017566 3146105 2984886
15090 2984886 2940989 2869398 2783067 2825143 3008044 2924297 2952541 3155103 3008272 2958532 2926921
15079 2926921 2780308 2725431 2934222 3002918 2962979 3039503 3055762 2924994 2996820 2937731 2881482
15068 2881482 3010807 2965928 2813837 2796522 2895176 2787666 2924255 3042593 2957889 2982406
15058 2982406 2923788 2983252 2990878 2977205 2970146 3150505 3143577 2988742 2935240 3015760 3027365
15047 3027365 3034161 2882665 2962520 2964941 3126091 3208788 3120447 3180265 3052220 3168074 3122343
15036 3122343 3005342 3167379 3293972 3152209 2998871 3012994 2964697 3041676 2842742 2899047
15026 2899047 2943281 2847492 2788138 2849233 2856888 2917050 2956120 2985897 3013441 3024140 2954863
15015 2954863 2937090 2960194 2922130 2870544 3037374 2974010 2844789 2905733 2952256 3042277 2932323
15004 2932323 2914095 2953889 3018938 3078780 3062186 3006243 2841807 2841572 2875537 2979207 3024028
14993 3024028 3035135 2975497 2911973 3039889 3045391 3037801 3126369 2943998 2909218 2940564 2821328
14982 2821328 2861236 2928941 3138957 3036878 2871713 2837473 3082631 3101580 3108906 3063447 2992863
14971 2992863 3010804 2969568 2948506 2814987 2856273 3002840 3052566 3003878 3042244 2943950 2895142
14960 2895142 2832915 2951819 3037769 3088952 3091621 2965412 2941379 3069226 3147574 2856188 2998874
14949 2998874 2990567 2907448 2944765 3026700 2997320 2866327 2813344 2811502 2828302 2782669 2880918
14938 2880918 2929438 2886219 2842635 2917800 3118921 3074689 2988212 2996540 2943070 3038882 2931007
14927 2931007 2918990 2969844 2953653 2998046 2969638 2990519 2800928 2807605 2973181 3101007 3104902
14916 3104902 3028485 3012925 3088524 3139417 2964181 3020063 3120278 2912672 2760354 2897272
14906 2897272 2906493 2791135 2851374 3138517 3122017 2962729 2849947 2904818 2978277 2885768 2952637
14895 2952637 3058047 3029257 2960290 2920137 2854650 3076257 2893933 2950905 3047173 3023321 3010264
14884 3010264 2984328 3014144 2989268 2899401 2814517 2844825 2888826 2894340 2984540 3042498 2954951
14873 2954951 3101046 3207865 3226971 3114443 3118892 3149987 3229447 3009063 2953472 2966291 3008555
14862 3008555 3013890 2920952 3008322 2932559 3002546 3115819 3005351 2951793 2991895 2979441 3056808
14851 3056808 3026376 3081558 3017319 2919461 2856567 2941503 2874719 2962029 2970072 2910609 2839438
14840 2839438 2792279 2878021 2825358 2972991 3125743 3071154 2999823 2887937 2862027 2934981 2926718
14829 2926718 2980540 2901225 2988769 2979682 2983943 3054544 2969132 2851481 2938455 3004876 3065554
14818 3065554 3010158 2875625 2904613 2878344 3057724 3096452 2991346 3073439 2995676 2966518 2959207
14807 2959207 2999557 3127924 3162313 3152244 2930174 2921004 2955103 3021990 3101508 3068658 3065699
14796 3065699 3119372 2975530 2963686 3072045 2921539 2961994 3119876 3181670 3157229 3023768
14786 3023768 3085954 3095847 2972373 3031169 3071629 3040284 3022415 3066850 2879936 2916284 2983627
14775 2983627 2961345 3047801 3117713 3115157 2964347 3079353 3166731 2997442 2836435 2958992
14765 2958992 3087226 3162728 3226239 3057715 3053084 3045955 2987147 2887955 2917913 3074452 2986248
14754 2986248 3019816 3083338 3128478 3209204 3149673 3164235 3108807 3174065 3113579 3134130 3187129
14743 3187129 3037951 3113862 3295417 3247849 3104139 3088034 3114663 3029527 2945164 2912326 2992901
14732 2992901 3126752 3087231 2925057 2901519 2947790 3092198 3058844 3053682 3041293 3079558 3161282
14721 3161282 3125394 2973651 2923989 3091230 3162228 3061838 3060428 3151709 3174100 3146924 3193491
14710 3193491 3170524 3187012 3199254 3234146 3237561 3263671 3164711 3222079 3172555 3211434 3170836
14699 3170836 3182704 3017210 3042842 3121781 3158894 3023119 3013042 3187394 3179001 3173314 3086580
14688 3086580 3262175 3059358 3150239 3104129 3178377 2999792 3061679 3073100 3200191 3217641
14678 3217641 3074007 2978408 2988797 3200302 3360220 3246862 3201239 3122631 3090889 2999405
14668 2999405 2841504 2974694 3052139 3143593 3067471 2945115 3148321 3148555 3049235 3009422 3064837
14657 3064837 3193532 3227172 3129699 3187650 3238766 3161394 3129275 3180319 3133010 3062173 3058027
14646 3058027 3069529 3065477 3107352 3116009 3064214 2897596 2993525 3174873 3027441 3122891 3102353
14635 3102353 3001726 2959250 3031331 3091830 3086014 3037536 3017130 3076157 3170120 3266684 3214113
14624 3214113 3213885 3200075 3096062 3142666 3146888 3048856 3081970 3235928 3086798 3030277 3083429
14613 3083429 2981075 2994168 2990806 2902766 2955360 3061195 3061984 3020677 2928430 2995830 3135592
14602 3135592 3204504 3181907 3299506 3392728 3349174 3102534 3180617 3231287 3220783 3153551 3109901
14591 3109901 3042414 2981114 3057830 3030077 3181770 3041803 3075794 3171264 3106784 3148949 3135183
14580 3135183 3001315 3032174 2984944 3094963 3000073 3005468 2910023 3026155 3121966 3113009 3108934
14569 3108934 3061814 3056367 3109290 3152861 3141364 3185944 3164277 3236872 3276033 3147362 3209186
14558 3209186 3098030 2970271 3065490 3159116 3217126 3191764 3146976 3203897 3041409 3113683 3103454
14547 3103454 2984371 3041296 2957626 3107419 3104399 3085690 3015693 2988444 3070449 3077522 3064787
14536 3064787 3011934 2994710 3141277 3198186 3154487 3023525 3051576 3197829 3135269 3125759 3276512
14525 3276512 3347607 3397037 3234796 3135371 3154781 3193932 3242916 3200056 3115220 3072464 3203617
14514 3203617 3163145 2983181 3188429 3250495 3188801 3051320 3120216 3179637 3099116 3220711
14504 3220711 3240777 3242041 3159353 3118429 3085722 3119683 3023234 3099525 3077725 3123738 3112295
14493 3112295 3053454 3254716 3275921 3211633 3215911 3192765 3046368 3062564 3039883 3082351 3223682
14482 3223682 3385161 3206024 3075687 3017486 3140638 3075366 3069118 3282188 3273869 3153429
14472 3153429 3122617 3114203 2939007 2957815 3014710 3104038 3056333 3313554 3398167 3263859 3353457
14461 3353457 3307118 3354297 3275782 3149211 3214065 3131183 3021492 2964928 2998801 3026885 3029465
14450 3029465 3039238 3076952 3112203 3137690 3085958 3064531 3074002 3118979 3232111 3165744 3214716
14439 3214716 3205848 3230693 3250747 3041144 3141259 3107721 2981280 3123898 3262434 3212939
14429 3212939 3163039 3036510 3049261 3215113 3131531 3191332 3239433 3217009 3117422 3253663 3335734
14418 3335734 3196367 3088790 3258034 3190764 3131615 3165400 3144357 3153886 3146576 3276469 3403163
14407 3403163 3274281 3255138 3263530 3183665 3169124 3181119 3118472 3079777 3203395 3274782 3064954
14396 3064954 2905885 2961023 3088402 3247510 3228233 3286088 3148725 3207516 3324923 3241550
14386 3241550 3059370 3290579 3411672 3164451 3126006 3205681 3263910 3175400 3234544 3273284
14376 3273284 3294351 3209544 3251754 3362642 3180086 3248659 3239636 3146362 3102181 3201255 3301347
14365 3301347 3223672 3131346 3097011 3145312 3225522 3268184 3144354 3127136 3026540 3247732 3486817
14354 3486817 3377550 3342614 3342515 3433148 3296619 3195052 3141032 3308899 3244329 3167862 3166300
14343 3166300 3076341 3250751 3250875 3164227 3107324 3252893 3334147 3266650 3237598 3344848 3459146
14332 3459146 3457493 3167662 3037812 3101726 3284882 3254384 3186913 3122629 3123564 3255641 3360499
14321 3360499 3397917 3282643 3221791 3140815 3159232 3026961 3133766 3360312 3247934 3306133
14311 3306133 3178151 3118698 3216714 3100151 3210315 3293647 3292298 3066647 3139938 3255725
14301 3255725 3045105 3131647 3326851 3082799 2977789 3110217 3199144 3105795 3172725 3219519
14291 3219519 3333736 3217662 3150125 3188803 3223394 3330788 3346019 3304321 3431781 3362007
14281 3362007 3149603 3308185 3371108 3279166 3163496 3203981 3220458 3232818 3221371 3147915 3269297
14270 3269297 3259238 3145157 3169782 3066942 3152014 3217856 3325946 3243943 3151019 3156479 3183502
14259 3183502 3315710 3239228 3105740 3142144 3115551 3159985 3091950 3034763 3047177 3095943 3139991
14248 3139991 3134774 3328111 3368334 3193525 3184903 3087868 3137387 3186511 3059284 3155809 3083622
14237 3083622 3176742 3161582 3168392 3143448 3312654 3451809 3269596 3155765 3164514 3178034 3079397
14226 3079397 3120876 3190343 3244503 3333266 3310603 3251643 3328739 3231297 3285220 3290514 3294872 3215933
14214 3215933 3135636 3155177 3225470 3278818 3208461 3182339 3139533 3232416 3226494 3245783 3122536
14203 3122536 3177252 3288260 3196609 3258671 3267058 3304646 3274804 3303361 3191644 3156857 3112991
14192 3112991 3200245 3394754 3319952 3374551 3195376 3106079 3209961 3300833 3267217 3173917 3274753
14181 3274753 3367940 3412339 3327387 3411240 3367412 3373341 3279196 3287742 3320085 3370079 3480153
14170 3480153 3380410 3327525 3321608 3179699 3294729 3386192 3223330 3279464 3472243 3301917
14160 3301917 3240560 3323445 3244036 3231870 3281551 3253177 3244531 3286202 3435553 3368191 3242754
14149 3242754 3292089 3512852 3378195 3218850 3275746 3283603 3210430 3279984 3346752 3274490 3432760
14138 3432760 3345905 3418743 3378252 3343664 3355102 3311604 3200714 3248853 3172062 3181702 3123070
14127 3123070 3126551 3250274 3192743 3058465 3066496 3054980 3077975 3151683 3146735 3245376 3534275
14116 3534275 3487659 3381294 3373077 3424734 3461783 3267169 3220425 3263564 3232582 3232564 3335124
14105 3335124 3217956 3123822 3258506 3233764 3243689 3390736 3455280 3407426 3462630 3447973 3401021
14094 3401021 3205155 3133745 3397819 3430096 3258903 3291467 3365427 3212059 3108003 3103093
14084 3103093 3244795 3445471 3394561 3166306 3131856 3309511 3395701 3405126 3425123 3513464 3491989
14073 3491989 3492509 3353186 3404317 3340607 3123380 3254243 3347656 3270710 3270200 3249392 3246485 3192136
14061 3192136 3226835 3403947 3290808 3299229 3315903 3289222 3362019 3372846 3235702 3312957 3345550
14050 3345550 3237167 3176822 3294542 3330916 3303521 3257910 3197404 3272181 3311601 3318145 3451323
14039 3451323 3392199 3445841 3433625 3329922 3427276 3488709 3406214 3336317 3361937 3407866 3514661
14028 3514661 3385554 3329050 3357133 3270780 3300535 3290122 3351054 3419889 3364205 3382278 3298650
14017 3298650 3306470 3398035 3332716 3283239 3211660 3399032 3452779 3448261 3565185 3569788 3549123
14006 3549123 3363668 3568540 3554929 3528020 3420233 3315861 3398480 3403002 3632757 3562402
13996 3562402 3461599 3330826 3305222 3331584 3397230 3305146 3296935 3465996 3371012 3360126 3428212
13985 3428212 3499338 3372610 3286924 3312750 3218906 3235643 3314034 3424876 3432836 3416376 3377069
13974 3377069 3320486 3431669 3421758 3456108 3435377 3307031 3406162 3326014 3260588 3183676 3221542
13963 3221542 3306542 3361059 3314603 3237709 3268877 3434501 3348190 3307719 3288024 3374545 3308433
13952 3308433 3308909 3630443 3357783 3288979 3216493 3260989 3413555 3264454 3299953 3378120 3317753
13941 3317753 3256885 3271402 3418698 3296585 3443647 3406054 3222207 3380962 3506284 3504393
13931 3504393 3366937 3270651 3157787 3220151 3104942 3390288 3576886 3430840 3431368 3398990
13921 3398990 3431608 3374926 3453562 3373867 3388366 3539163 3489399 3456286 3332462 3369065 3242771
13910 3242771 3352274 3238877 3107157 3252649 3304123 3419923 3350694 3300085 3380038 3369655
13900 3369655 3468758 3506565 3370016 3432357 3520069 3531653 3414756 3454614 3409879 3487329 3398571
$$ [...]
##END NTUPLES=NMR SPECTRUM
##END=
