##TITLE=1H_CG-1169-1
 CDCL3
 32 sc, 
 21.11.2022
##JCAMPDX= 6.0         $$ Bruker NMR JCAMP-DX V2.0
##DATA TYPE= NMR SPECTRUM
##DATA CLASS= NTUPLES
##ORIGIN= UXNMR, Bruker Analytische Messtechnik GmbH
##OWNER= root
$$ XWIN-NMR		Version 3.5
$$ Mon Nov 21 14:09:49 2022 Russian Standard Time (UT+4h)  she@DPX200
##.OBSERVE FREQUENCY= 200.1313499994
##.OBSERVE NUCLEUS= ^1H
##.ACQUISITION MODE= SIMULTANEOUS
##.ACQUISITION SCHEME= undefined
##.AVERAGES= 32
##.DIGITISER RES= 18
##SPECTROMETER/DATA SYSTEM= spect
##.PULSE SEQUENCE= zg30
##.SOLVENT NAME= CDCl3
##.SHIFT REFERENCE= (INTERNAL, CDCl3, 0, 15.7304)
##AUDIT TRAIL= $$ (NUMBER, WHEN, WHO, WHERE, WHAT)
$$ ##TITLE= Audit trail, XWIN-NMR		Version 3.5
$$ ##JCAMPDX= 5.01
$$ ##ORIGIN= Bruker BioSpin GmbH
$$ ##OWNER= she
$$ F:/spectra/data/she/nmr/H-F/1/pdata/1/auditp.txt
$$ ##AUDIT TRAIL=  $$ (NUMBER, WHEN, WHO, WHERE, WHAT)
(   1,<2022-11-21 14:08:41.60 +0400>,<she>,<DPX200>,
      <created by zg, POWCHK disabled, PULCHK disabled
       configuration hash MD5:
       00 E9 B6 7A A2 85 ED C7 34 08 36 98 17 FE 4E 26
       data hash MD5: 16K
       90 F2 61 E7 E5 B4 0C 93 A4 BC CE 3A 20 25 2A 7A>)
(   2,<2022-11-21 14:08:43.70 +0400>,<she>,<DPX200>,
      <Start of raw data processing
       efp BC_mod = 2 LB = 0.24 FT_mod = 6 PKNL = 1 PHC0 = -18036.44 PHC1 = 18.8007 SI = 16K 
       data hash MD5: 16K
       09 CE ED C7 ED EF 3A D2 CB C1 5C 4C 2A 49 DC BA>)
(   3,<2022-11-21 14:09:01.82 +0400>,<she>,<DPX200>,
      <pk PHC0 = -11.37474 PHC1 = 14 
       data hash MD5: 16K
       EE 4A 3F 82 F9 9F 6C 5A 10 12 EE 0D 99 9C 9B 4E>)
(   4,<2022-11-21 14:09:05.40 +0400>,<she>,<DPX200>,
      <abs ABSG = 5 
       data hash MD5: 16K
       67 D1 9E B4 AC EC DA BD E0 3D DD 9E A6 A1 1B 58>)
$$ ##END=
$$ 
$$ hash MD5
$$ C3 6D C0 A6 0E F5 59 8A D0 AE 2C C1 11 20 90 FF
##$RELAX= 
##$RELAX= 
##$RELAX= 
##$RELAX= 
##$RELAX= 
##$RELAX= 
$$ Bruker specific parameters
$$ --------------------------
##$DU= <F:/spectra>
##$EXPNO= 1
##$NAME= <H-F>
##$PROCNO= 1
##$TYPE= <nmr>
##$USER= <she>
##$AMP= (0..31)
100 100 100 100 100 100 100 100 100 100 100 100 100 100 100 100 100 100 
100 100 100 100 100 100 100 100 100 100 100 100 100 100 
##$AQSEQ= 0
##$AQ_mod= 1
##$AUNM= <au_zg>
##$AUTOPOS= <>
##$BF1= 200.13
##$BF2= 200.13
##$BF3= 200.13
##$BF4= 200.13
##$BF5= 200.13
##$BF6= 200.13
##$BF7= 200.13
##$BF8= 200.13
##$BYTORDA= 1
##$CFDGTYP= 0
##$CFRGTYP= 5
##$CHEMSTR= <none>
##$CNST= (0..31)
1 1 145 1 1 1 1 1 1 1 1 1 1 1 1 1 1 1 1 1 1 1 1 1 1 1 1 1 1 1 1 1 
##$CPDPRG= <>
##$CPDPRG1= <>
##$CPDPRG2= <>
##$CPDPRG3= <>
##$CPDPRG4= <mlev>
##$CPDPRG5= <mlev>
##$CPDPRG6= <mlev>
##$CPDPRG7= <mlev>
##$CPDPRG8= <mlev>
##$CPDPRGB= <>
##$CPDPRGT= <>
##$D= (0..31)
0 1.2 0 0 0 0 0 0 0 0.06 0 0.03 0 0 0 0 0.0002 0 0 0 0 0 0 0 0 0 0 0 0 
0 0 0 
##$DATE= 1669025320
##$DBL= (0..7)
120 120 120 120 120 120 120 120 
##$DBP= (0..7)
150 150 150 150 150 150 150 150 
##$DBP07= 0
##$DBPNAM0= <>
##$DBPNAM1= <>
##$DBPNAM2= <>
##$DBPNAM3= <>
##$DBPNAM4= <>
$$ [...]
##$SUBNAM3= <"">
##$SUBNAM4= <"">
##$SUBNAM5= <"">
##$SUBNAM6= <"">
##$SUBNAM7= <"">
##$SUBNAM8= <"">
##$SUBNAM9= <"">
##$SW= 18.0517283424941
##$SWIBOX= (0..15)
0 0 2 0 0 0 0 0 0 0 0 0 0 0 0 0 
##$SW_h= 3612.71676300578
##$TD= 16384
##$TD0= 1
##$TE= 0
##$TE2= 300
##$TE3= 300
##$TEG= 300
##$TL= (0..7)
0 120 120 120 120 120 120 120 
##$TP= (0..7)
150 150 150 150 150 150 150 150 
##$TP07= 0
##$TPNAME0= <>
##$TPNAME1= <>
##$TPNAME2= <>
##$TPNAME3= <>
##$TPNAME4= <>
##$TPNAME5= <>
##$TPNAME6= <>
##$TPNAME7= <>
##$TPOAL= (0..7)
0.5 0.5 0.5 0.5 0.5 0.5 0.5 0.5 
##$TPOFFS= (0..7)
0 0 0 0 0 0 0 0 
##$TUNHIN= 0
##$TUNHOUT= 0
##$TUNXOUT= 0
##$USERA1= <user>
##$USERA2= <user>
##$USERA3= <user>
##$USERA4= <user>
##$USERA5= <user>
##$V9= 5
##$VALIST= <valist>
##$VCLIST= <CCCCCCCCCCCCCCC>
##$VD= 0
##$VDLIST= <DDDDDDDDDDDDDDD>
##$VPLIST= <PPPPPPPPPPPPPPP>
##$VTLIST= <TTTTTTTTTTTTTTT>
##$WBST= 1024
##$WBSW= 4
##$XGAIN= (0..3)
0 0 0 0 
##$XL= 0
##$YL= 0
##$YMAX_a= 221319
##$YMIN_a= -243261
##$ZGOPTNS= <>
##$ZL1= 120
##$ZL2= 120
##$ZL3= 120
##$ZL4= 120
##$ABSF1= 15.73036
##$ABSF2= -2.321489
##$ABSG= 5
##$ABSL= 3
##$ALPHA= 0
##$AQORDER= 0
##$ASSFAC= 0
##$ASSFACI= 0
##$ASSFACX= 0
##$ASSWID= 0
##$AUNMP= <proc_1d>
##$AZFE= 0.1
##$AZFW= 0.1
##$BCFW= 0
##$BC_mod= 2
##$BYTORDP= 0
##$COROFFS= 0
##$CY= -3
##$DATMOD= 1
##$DC= 0
##$DFILT= <>
##$DTYPP= 0
##$F1P= 0
##$F2P= 0
##$FCOR= 1
##$FTSIZE= 16384
##$FT_mod= 6
##$GAMMA= 0
##$GB= 0
##$INTBC= 1
##$INTSCL= 3.70164e-10
##$ISEN= 128
##$LB= 0.24
##$LEV0= 0
##$LPBIN= 0
##$MAXI= 10000
##$MC2= 0
##$MEAN= 0
##$ME_mod= 0
##$MI= 1.114404
##$NCOEF= 0
##$NC_proc= -6
##$NLEV= 6
##$NOISF1= 3.799351
##$NOISF2= 2.8
##$NSP= 0
##$NTH_PI= 0
##$NZP= 0
##$OFFSET= 15.73036
##$PC= 1
##$PHC0= -18047.81
##$PHC1= 32.8007
##$PH_mod= 1
##$PKNL= yes
##$PPARMOD= 0
##$PSCAL= 0
##$PSIGN= 0
##$REVERSE= no
##$SF= 200.130008240254
##$SI= 16384
##$SIGF1= 3
##$SIGF2= 2
##$SINO= 5.538805
##$SIOLD= 16384
##$SREGLST= <1H.CDCl3>
##$SSB= 0
##$STSI= 16384
##$STSR= 0
##$SW_p= 3612.71676300578
##$SYMM= 0
##$S_DEV= 0
##$TDeff= 16384
##$TDoff= 0
##$TI= <>
##$TILT= no
##$TM1= 0
##$TM2= 0
##$TOPLEV= 0
##$USERP1= <user>
##$USERP2= <user>
##$USERP3= <user>
##$USERP4= <user>
##$USERP5= <user>
##$WDW= 1
##$XDIM= 16384
##$YMAX_p= 350872207
##$YMIN_p= -1035865
$$ End of Bruker specific parameters
$$ ---------------------------------
##NTUPLES= NMR SPECTRUM
##VAR_NAME=  FREQUENCY,     SPECTRUM/REAL,   SPECTRUM/IMAG
##SYMBOL=    X,             R,               I
##VAR_TYPE=  INDEPENDENT,   DEPENDENT,       DEPENDENT
##VAR_FORM=  AFFN,          ASDF,            ASDF
##VAR_DIM=   16384,         16384,           16384
##UNITS=     HZ,            ARBITRARY UNITS, ARBITRARY UNITS
##FACTOR=    0.220516191357247, 1,           1
##FIRST=     3148.11708265179, 0,            0
##LAST=      -464.599680353986, 0,           0
##MIN=       -464.599680353986, -1035865,    0
##MAX=       3148.11708265179, 350872207,    0
$$ Real data points
##PAGE= N=1
##DATA TABLE= (X++(R..R)), XYDATA
$$ [...]
5048A423184n2475J04707l1245k58085K19771J16868J79359J19870j43857j00333
5038A577764K9774J19068j00465m5185q8883j48323k7178K89358J46708k49309
5028A503329l3209L57038J86769k74086J13418k47509j35619J66143R708j65346
5018A480636l36444O5770K66322K14693n6416l7595o497j1878N2303J9847K51177
5007A901918l4437J12744j29190M7203l9981J3329L60202q6508J27418k50471
4997B022227k01141J03874j96624k06431L28952k35875K80798J51893k86827J46113
4987A906959J45108j87149K9773k55895p6779J41098K36389L178J6558Q434J30511
4976B098185R9982q7077K51411O0262k18587r1001o4301J00449M5033N7902j3183
$$ plain form
5048 1423184 1370709 1475416 1444171 1186086 1405857 1522725 1702084 1821954 1678097 1577764
5038 1577764 1607538 1726606 1626141 1580956 1492073 1343750 1316572 1605930 1752638 1503329
5028 1503329 1470120 1827158 2013927 1739841 1853259 1605750 1470131 1636274 1645982 1480636
5018 1480636 1144192 1209962 1476284 1690977 1634561 1596966 1590469 1578591 1630894 1650741 1901918
5007 1901918 1867481 1980225 1851035 1898238 1858257 1871586 2231788 2145280 2272698 2022227
4997 2022227 1821086 1924960 1728336 1521905 1850857 1614982 1895780 2047673 1760846 1906959
4987 1906959 2052067 1864918 1894691 1638796 1562017 1703115 1939504 1942682 1959240 1967674 2098185
4976 2098185 2198167 2111090 2362501 2422763 2204176 2113175 2048874 2149323 2194356 2252258 2239075
4965B239075p4518j41166L6618K43195J23810j44977j86875L69579j39245k61891
4955B063605M20922k766J68518Q0186J7259k63629k89446M05661K02067J39852
4945B942229m13692P1104j56189N5257K98018O8509k17757K60176J42073l85170
4935B664558J98878j70309L8777r4351P1246R9631j26299J07600m7432J71941
4925B914240K84204N4519j70914J44035j1630K28678R7917j62893K15358M7600
4915C641114j8455j06514L63639j41708l12773L14844R2350Q5361j6247K12920
4905D114531k84277M03550j05757O354O9223n8369K38384k1175K32169p8623J55142
4894D671152l30R7687J32159J29398j29126k02933J70256J21537K11299J89253
$$ plain form
4965 2239075 2164557 2023391 2060009 2303204 2427014 2282037 2095162 2464741 2325496 2063605
4955 2063605 2484527 2481761 2650279 2730465 2747724 2484095 2194649 2600310 2802377 2942229
4945 2942229 2528537 2599641 2443452 2498709 2796727 2865236 2647479 2907655 3049728 2664558
4935 2664558 2863436 2693127 2731904 2637553 2708799 2808430 2682131 2789731 2742299 2914240
4925 2914240 3198444 3252963 3082049 3226084 3214454 3443132 3541049 3378156 3593514 3641114
4915 3641114 3622659 3516145 3879784 3738076 3425303 3740147 3832497 3917858 3901611 4114531
4905 4114531 3830254 4233804 4128047 4134401 4203624 4145255 4383639 4362464 4594633 4516010 4671152
4894 4671152 4670822 4768509 4900668 5030066 4900940 4698007 4868263 4989800 5201099 5390352
4884E390352p1267k11139K09652K36007L59363l1539q5535M81809L93645k67337
4874F404011P7338J66540r3512K66898l2679J22612j23163j11263K52330J30161
4864G059273k3679j16570L98031q8204o760K63340L4163J90994J51372k61235
4854G600725l05622M7239k14303K84239L319l44001j5802J29039J54840j22611
4844G217062o1678K55152o9187l66765J7296J59641m26992R7386J26414o2094
4834F886235P742J33402N8076k35886k52144j2202j5267J05953k26011j82491
4824F267407l42834Q2107K84749j26994j29014j93758J1091k30539q1905l286
4814E537024r1596l5140M5334k41644L34847k18610K62783k4885k22129M65110
$$ plain form
4884 5390352 5319085 5107946 5317598 5553605 5912968 5881429 5795894 6277703 6671348 6404011
4874 6404011 6481349 6647889 6554377 6821275 6788596 6911208 6788045 6676782 6929112 7059273
4864 7059273 7035594 6919024 7317055 7228851 7222091 7485431 7519594 7710588 7861960 7600725
4854 7600725 7295103 7342342 7128039 7412278 7415597 7071596 7055794 7184833 7339673 7217062
4844 7217062 7155384 7410536 7341349 6974584 6991880 7151521 6724529 6821915 6948329 6886235
4834 6886235 6893977 7027379 7085455 6849569 6597425 6585223 6569956 6675909 6449898 6267407
4824 6267407 5924573 6006680 6291429 6164435 6035421 5841663 5852754 5622215 5540310 5537024
4814 5537024 5445428 5410288 5455622 5213978 5548825 5330215 5592998 5568113 5345984 5811094
4804E811094M782J47291l3532R9125l3824m41408p8055J00067j9427j21243J61436
4793E596306O903J56004J58373k25985K53828J74804M90012K89337J56296p2189
4783F983689L28002j2629k66371n86475l58955k56683n10494m3332j36008k93074
4773D847670N8987l36436k37574J45151L8876k45684m67012k57117K18729L89489
4763D155079l59091k03003k67866P2598L32284r8204p8492r8303K06057J62814
4753C823873j65034l2502m06925K2426K73486r387j41709j4670N4113j13092K1293
4742C311872m1109p5062q1967N0894J28796M0134J61300p6119J66572p5013J12544
4731C622842J21867l21172J66368J21192K1316J85520l2606l17291L07996M57383
$$ plain form
4804 5811094 5815876 5963167 5929635 6028760 5994936 5553528 5475473 5575540 5556113 5434870 5596306
4793 5596306 5603209 5759213 5917586 5691601 5945429 6120233 6610245 6899582 7055878 6983689
4783 6983689 7311691 7299062 7032691 6446216 6087261 5830578 5320084 5276752 5140744 4847670
4773 4847670 4906657 4570221 4332647 4477798 4516674 4270990 3803978 3546861 3765590 4155079
4763 4155079 3795988 3592985 3325119 3397717 3730001 3631797 3553305 3455002 3661059 3823873
4753 3823873 3658839 3626337 3219412 3241838 3515324 3505937 3364228 3349558 3403671 3290579 3311872
4742 3311872 3270763 3195701 3113734 3164628 3293424 3333558 3494858 3418739 3585311 3510298 3622842
4731 3622842 3744709 3423537 3589905 3711097 3732413 3917933 3885327 3568036 3876032 4333415
4721D333415J51411L53143J1512K19270P3654j68686j2368K28540L31484j6763
4711E504612J130P4670n6519K1176l19216l73528m47041k05989j05564j48125
4701C945606k85844l7756r678l48184M5292L9202k52433j62462J89102J00644
4691C223489N1689k01765l3608J04068k33112J5017j83066J85811L1643j33146
4681B827020r7045m1997J8676l6645P3930j01215J8949j99117L28810K31361L0246
4670C052973N3454L726l26698k60502K09026j65393n4316Q4838J80219P8664k17803
4659B638188j37083J83452j92590L03306m9189k15175J08850J45438R5744n1721
4649B829220j02906j92891J07980J23136K7977o9842O6361k76221J92992n8209
$$ plain form
4721 4333415 4484826 4837969 4849481 5068751 5142405 4973719 4961351 5189891 5521375 5504612
4711 5504612 5505742 5580412 5523893 5545069 5225853 4852325 4405284 4199295 4093731 3945606
4701 3945606 3659762 3622006 3612328 3264144 3309436 3348638 3096205 2933743 3122845 3223489
4691 3223489 3275178 3073413 3039805 3143873 2910761 2925778 2742712 2928523 2960166 2827020
4681 2827020 2729975 2687978 2706654 2670009 2743939 2642724 2661673 2462556 2791366 3022727 3052973
4670 3052973 3106427 3110153 2783455 2522953 2731979 2566586 2512270 2597108 2777327 2855991 2638188
4659 2638188 2501105 2684557 2491967 2795273 2746084 2530909 2639759 2785197 2880941 2829220
4649 2829220 2726314 2533423 2641403 2764539 2792516 2722674 2789035 2512814 2705806 2647597
4639B647597k19132k7266J68606j23518M266Q3275l1815j67661M05615J62247
4629B902214j67563p3095J37235M8123L13670m1428k27826K18733j7004K17557
4619C310616j56349m57012q1103j8823J94029K52452Q3717M8302J68698j19757
4609C224770j02714l63258K90788K39630p4184l03724n5097J73560J23823P377
4599C160971l19540N17463k04201J18842l65644k08021j41220M17404J93298L19865
4589C489217R982m36520j33540J13095J43464j83384k08781K13504J12151K52000
4579C371188K2666j5575j30782m52298j34672Q150K99367M5275O6008J9131O3928
4568C162386k42409Q3181K0640L282J29452j26728L13722J26670k29250J45727
$$ plain form
4639 2647597 2428465 2401199 2569805 2446287 2450553 2533828 2502013 2334352 2739967 2902214
4629 2902214 2734651 2661556 2798791 2846914 3160584 3119156 2891330 3110063 3093059 3310616
4619 3310616 3154267 2697255 2616152 2597329 2791358 3043810 3127527 3175829 3344527 3224770
4609 3224770 3122056 2758798 3049586 3289216 3215032 2911308 2856211 3029771 3153594 3160971
4599 3160971 2841431 3358894 3154693 3273535 2907891 2699870 2558650 2976054 3169352 3489217
4589 3489217 3499199 3062679 2929139 3042234 3185698 3002314 2793533 3007037 3119188 3371188
4579 3371188 3393854 3378279 3247497 2795199 2660527 2668677 2968044 3013319 3079327 3098458 3162386
4568 3162386 2919977 3003158 3023798 3027080 3156532 3029804 3343526 3470196 3240946 3386673
4558C386673k44008k379j41142J91733L1627K07886k04164O3417J9573j89331
4548C119885R0826K95186k21777k21320M0905j91390J07471J46190J9557J18033
4538C303566J42708l59454L01845L75404K145k64422l66399o5N24901r3469l674
4527C563086P9786J26697l18926K67631O1758k61614K33901j40930j74587n9013
4517C377789J27107j0068J48622K08733o90619Q9532L00422J30605M10838R7051
4507D190012k70145o6655p5919r4756K58447j5695J10886J90364K28279k15961
4497D238857k05213K79079J63602q2912J66975j47731k0742K14895l1169n7661
4487D517980L67757L35660m0815J91353J54263L54377J83845K4817J85984J36571
$$ plain form
4558 3386673 3142665 3140286 2999144 3190877 3222504 3430390 3226226 3289643 3309216 3119885
4548 3119885 3210711 3505897 3284120 3062800 3103705 2912315 3019786 3165976 3185533 3303566
4538 3303566 3446274 3086820 3388665 3764069 3766214 3501792 3135393 3135328 3660229 3566760 3563086
4527 3563086 3642872 3769569 3450643 3718274 3780032 3518418 3752319 3611389 3436802 3377789
4517 3377789 3504896 3494828 3643450 3852183 3161564 3251096 3551518 3682123 4092961 4190012
4507 4190012 3919867 3853212 3777293 3682537 3940984 3925289 4036175 4226539 4454818 4238857
4497 4238857 4033644 4312723 4476325 4393413 4560388 4412657 4391915 4606810 4575641 4517980
4487 4517980 4885737 5221397 5180582 5371935 5526198 5880575 6064420 6089237 6275221 6411792
4477F411792M71130K95888N2492N36411L22993M1181R7309O19515K10081O51742
4467I710534O24638K4886M35021j73853j80042j44804m59327n41842m51651p77202
4457H066358m43725j74630m84205l08286l75466l14598p0934R9014m7585j63511
4447E782432j70876m26758k02587J01788j03162l43981J42869r7883q8318j72922
4437D420602o2766J41851O021k34264N3324j11582n7730K71180n9846m02249M5052
4426D009593M04294k62157P3782N56310l63510k96063L18154M823j5640R4186
4416D523772j60481K48487k46646l73877K4870L32693J88528l89260J89899J14906
4406D452891J24084K67442J85935l06503j06792M1792k59239J23531L67459N2729
$$ plain form
4477 6411792 6882922 7178810 7231302 7767713 8090706 8131887 8229196 8848711 9058792 9710534
4467 9710534 10335172 10360058 10795079 10621226 10441184 10296380 9837053 9295211 8843560 8066358
4457 8066358 7622633 7448003 6963798 6655512 6280046 5965448 5894514 5993528 5945943 5782432
4447 5782432 5611556 5184798 4982211 5083999 4980837 4636856 4779725 4681842 4593524 4420602
4437 4420602 4357836 4499687 4505708 4271444 4324768 4213186 4155456 4426636 4366790 3964541 4009593
4426 4009593 4413887 4151730 4225512 4781822 4418312 4122249 4440403 4445226 4429586 4523772
4416 4523772 4363291 4611778 4365132 3991255 4016125 4348818 4537346 4148086 4337985 4452891
4406 4452891 4576975 4844417 5030352 4723849 4617057 4658849 4399610 4523141 4890600 4943329
4396D943329M8437o1512L6244k15999o3821j733J39471K191j79981O2924J12309
4385D821859J30168K58826j69915j97749J19496J58760l2468L27369J22432r4619
4375E444159j693M7857J66380P6177N34225j28828j53760k36445K69086q6440
4365E930718n3689j19093k00377j13412l11247J83789K3039q9619j84110Q1673
4355E147672J05973p0313o9627k07372J88874J54214K4748O9387l33573r1897
4345D918086M6616R2816R8115k04957K58675J03134k33718J11676p5011j22585
4335D992847K07375o0784j10289K11658J51564k34002j57055K10205J57024j53325
4325E215218r422J1044J22832J18076m25999P8091L55702k74988j31718J3155
$$ plain form
4396 4943329 4991766 4930254 4966498 4750499 4686678 4684945 4824416 4826607 4646626 4709550 4821859
4385 4821859 4952027 5210853 5040938 4843189 4962685 5121445 5088977 5416346 5538778 5444159
4375 5444159 5442466 5490323 5656703 5732880 6267105 6138277 5984517 5748072 6017158 5930718
4365 5930718 5877029 5757936 5557559 5444147 5132900 5316689 5339728 5250109 5065999 5147672
4355 5147672 5253645 5183332 5113705 4906333 5095207 5249421 5274169 5343556 5009983 4918086
4345 4918086 4964702 5057518 5155633 4950676 5209351 5312485 5078767 5190443 5115432 4992847
4335 4992847 5200222 5139438 5029149 5240807 5392371 5158369 5001314 5211519 5368543 5215218
4325 5215218 5205796 5216840 5339672 5457748 5031749 5109840 5465542 5190554 5058836 5071991
4315E071991L47156K41271l86167j6979j21781P3004k32089k371K39060j26871
4305E086224J08411J89359p3374j00049K88863j24254k4157J9050J8180L4673
4295E422926j01821R9089m1052M34008k29971k73717K05473K59896J13715M7469
4285E936015j22507k01470N9498L78873j83529j1649J99160l3986j84760K11910
4275F047555J3306n0684l5291m5163M83638N5195R4556K07957j72304K19426j98137
4264F620054l38323J78396M28215O1508k2199k44102K29402K08255j11597J3923
4254G023532l17970J98964L16628K17233l266j73747q4734K22789j94971R4828
4244G299286J44028l97371j09693K25845j88301K75534O2087j89440k211k2335
$$ plain form
4315 5071991 5419147 5660418 5274251 5257272 5135491 5208495 4976406 4974035 5213095 5086224
4305 5086224 5194635 5383994 5310620 5210571 5499434 5375180 5351023 5370073 5388253 5422926
4295 5422926 5321105 5420194 5379142 5813150 5583179 5309462 5514935 5774831 5888546 5936015
4285 5936015 5813508 5612038 5671536 6050409 5866880 5855231 6054391 6020405 5835645 6047555
4275 6047555 6060861 6010177 5974886 5929723 6413361 6468556 6563112 6771069 6598765 6818191 6620054
4264 6620054 6281731 6460127 6888342 6949850 6927651 6683549 6912951 7121206 7009609 7023532
4254 7023532 6705562 6904526 7221154 7438387 7435121 7261374 7176640 7399429 7204458 7299286
4244 7299286 7443314 7045943 6936250 7162095 6973794 7249328 7311415 7121975 7119764 7097429
4234G097429J8277K08389Q6930K13019l8127J82610j82942K8703k5192K9462P5965
4223G694523j75609M9265J02670J74676O4815L58332j26948j89967J76809K7056
4213H155622L76394j35500J24384O9659p7039K15808N6827R3103J28553l45356
4203H662455j83643K79446j01966k29489O15700K81966Q8703Q6426J30142J6795
4193I646535j00698R1653m2047Q1394k94635J54779L10805J19142N70130J15865
4183A0652923r0438k50881l75347J63564N73787J72083l19896J38819K74215K9426
4173A0968255N1818r1635K74504j6215R8673J52379O2598J01630K35479P7837
4163A1915323j77566K08808P7795K7263k65650J16592L2265J58875K52697k0248
$$ plain form
4234 7097429 7115706 7324095 7411025 7624044 7585917 7768527 7585585 7614288 7589096 7618558 7694523
4223 7694523 7518914 7568179 7670849 7845525 7910340 8268672 8141724 7951757 8128566 8155622
4213 8155622 8532016 8396516 8520900 8590559 8513520 8729328 8786155 8879258 9007811 8662455
4203 8662455 8478812 8758258 8656292 8426803 9042503 9324469 9413172 9499598 9629740 9646535
4193 9646535 9545837 9637490 9595443 9676837 9382202 9536981 9847786 9966928 10537058 10652923
4183 10652923 10562485 10311604 9936257 10099821 10673608 10845691 10525795 10664614 10938829 10968255
4173 10968255 11020073 10928438 11202942 11186727 11285400 11437779 11500377 11602007 11837486 11915323
4163 11915323 11737757 11946565 12024360 12051623 11785973 11902565 11934830 12093705 12346402 12326154
4153A2326154j69284K59319P0377J25234J9830J73613j72031L1452j5284K0028
4143A2669408j22399M22622l38865j99065J21027M290j1099J203J9808K22221
4133A2789151j33498R565J50002j98670q6252K8093L15883j60941k79600L05275
4123A2739008K6676O1690k62965j36439J38958Q9223J39804M6279J24293J28314
4113A3094841j50774l23682j0327J88756n6201J48426J95100k01891O6470J16858
4103A3067576J18498K93894R7050j4419K785K1452M5264K95521J90720L3067l175
4092A4148233J58110M50820J84430K51844K97277N54791L95037P80771P22638
4083A7943951J191525Q71969Q6046p39307n01197q67282n99550o17518r0999p5919
$$ plain form
4153 12326154 12156870 12416189 12486566 12611800 12631630 12805243 12633212 12664664 12649380 12669408
4143 12669408 12547009 12969631 12630766 12431701 12552728 12557018 12545919 12547122 12566930 12789151
4133 12789151 12655653 12665218 12815220 12616550 12530298 12558391 12874274 12713333 12433733 12739008
4123 12739008 12765684 12827374 12564409 12427970 12566928 12656151 12795955 12842234 12966527 13094841
4113 13094841 12944067 12620385 12610058 12798814 12742613 12891039 13086139 12884248 12950718 13067576
4103 13067576 13186074 13479968 13577018 13562599 13565384 13586836 13632100 13927621 14118341 14151408 14148233
4092 14148233 14306343 14757163 14941593 15193437 15490714 16045505 16440542 17221313 17943951
4083 17943951 19135476 20007445 20093491 19354184 18852987 17985705 17386155 16768637 16677638 16601719
4073A6601719k93750N7532K6482k81374L6622L15034r5608r3916L17884l22111
4063A6268514m25004j41328r212l95021k60454k08429l43408k5587J57149k31496
4053A4385724k65627l78871O4372l07205j86700j30996k59635l10744j84855K53774
4043A2679237j58401r757j53521J28268J43643K38915m47124j58091p6561k2889
4033A2163719K44914m3445n7916j02761j93241j76485r1871K59216P7246k0413
4023A2058963k47131M5080K1546m2072m16823J83875j2953q7287N07467k74493
4013A1736172k15850k45196R2938j22382J48549n5299k09426J57037P2567J11604
4003A1470714R4125Q2244k19228j3978L61146J78107j9321j69750o216P5748j72080
$$ plain form
4073 16601719 16307969 16365501 16391983 16110609 16147231 16462265 16366657 16272741 16590625 16268514
4063 16268514 15843510 15702182 15692970 15297949 15037495 14829066 14485658 14460071 14617220 14385724
4053 14385724 14120097 13741226 13805598 13498393 13311693 13180697 12921062 12610318 12425463 12679237
4043 12679237 12520836 12511079 12357558 12485826 12629469 12868384 12421260 12263169 12186608 12163719
4033 12163719 12408633 12365188 12307272 12204511 12011270 11834785 11742914 12002130 12079376 12058963
4023 12058963 11811832 11856912 11878458 11836386 11419563 11603438 11590485 11503198 12010665 11736172
4013 11736172 11520322 11275126 11368064 11245682 11394231 11338932 11129506 11286543 11359110 11470714
4003 11470714 11564839 11647083 11427855 11413877 11775023 11953130 11933809 11764059 11757843 11833591 11661511
3992A1661511k54915o6287q7447L63322r1230j3879N7577M2186k44842p4839J34070
3981A1425227j92422J21647k74432L07421j35020k79353p2170J15471J78476j06646
3971A1088199m82462L27889L56217Q3533o20209k97770l33848r0561K47419l32793
3961I945614m1835K42172Q9691k72820k90540J20874k6242K75167o8934o6763
3951I906384j78268k24448j6773R978k04964K42319O1824R7276m57715n2937M0930
3940I223606K02245K5020l82457L20473J1752k02907k14652K2299j80427l5729
3930H789223l1207j26227J24777N6485J34599k33855k13269m6005k21478K81069
3920H514112r0286k2886J32339j48213J7544l45124J53687R5118J57826j84984
$$ plain form
3992 11661511 11406596 11340309 11252862 11616184 11524954 11511075 11568652 11610838 11365996 11291157 11425227
3981 11425227 11232805 11354452 11080020 11387441 11252421 10973068 10900898 11016369 11194845 11088199
3971 11088199 10605737 10933626 11289843 11373376 10753167 10455397 10121549 10030988 10278407 9945614
3961 9945614 9903779 10145951 10235642 9962822 9672282 9793156 9766914 10042081 9973147 9906384
3951 9906384 9728116 9503668 9486895 9496873 9291909 9534228 9596052 9693328 9235613 9182676 9223606
3940 9223606 9425851 9450871 9068414 9388887 9400639 9197732 8983080 9005379 8824952 8789223
3930 8789223 8758016 8631789 8756566 8813051 8947650 8713795 8500526 8454521 8233043 8514112
3920 8514112 8423826 8400940 8533279 8385066 8402610 8057486 8211173 8306291 8464117 8279133
3910H279133k63889M96904j52546j09760l06182L37503k76686M46p9480L34789
3900H260232k69006k46616l2216P2348p1102J75813l22651M9819K09102L42975
3890H168698J83057j96687m24287q6465J70618q4170J34171R5713j0620k8536
3880G921492N6128n45096Q0695L08588m9014j89240j74831M75714l25943Q3977
3870G642470J82515P2597j77923Q4228J86076j25032J11993Q2142J14470k04201
3860G969335j71125J13596L13466k62550J030K03275j30524J52365K01602K9261
3850H419731J29040J163N8452k52651K25012o038P7681j08853k3269J8635M04535
3839H943438m9371q5529k00613k02032L40269j33258J10779Q7477J26124j40944
$$ plain form
3910 8279133 8015244 8512148 8359602 8249842 7943660 8281163 8004477 8004923 7925443 8260232
3900 8260232 7991226 7744610 7712394 7784742 7713640 7889453 7566802 7616621 7825723 8168698
3890 8168698 8351755 8155068 7730781 7644316 7814934 7730764 7864935 7960648 7950028 7921492
3880 7921492 7977620 7432524 7513219 7821807 7772793 7583553 7408722 7884436 7558493 7642470
3870 7642470 7824985 7897582 7719659 7803887 7989963 7864931 7976924 8059066 8173536 7969335
3860 7969335 7798210 7911806 8225272 7962722 7963752 8167027 8036503 8188868 8390470 8419731
3850 8419731 8548771 8549934 8608386 8355735 8580747 8574709 8652390 8543537 8520268 8538903 8943438
3839 8943438 8894067 8808538 8607925 8405893 8746162 8612904 8723683 8811160 8937284 8796340
3829H796340m5251m318J7021l00922l7308O2124p3567K41681j18484N803P0575
3818H613694M8979j73973J63778K3860l723m7587J76727K46396l33156k46879
3808H468116M39925j01286j24496R4746j25784j82552M9477J08076j3797j46296
3798H466129J72623Q8544K4930k03996k02468J62810L5012k19383K47796M62342
3788I034339o54329j76271K72773j24876k03456M00027m1768j50312J75877j22538
3778H409466L5380l7124K29161m9421j59602r1809L3821J71652p1704Q3385l2030
3767H521175k93410P0010l3724L48904r775K0435J8527L9234r3537L3197k2981
3756H598055p349K15485P229j00283r0760J67450O4228r7361j39649O7183j08156
$$ plain form
3829 8796340 8751089 8746771 8763792 8462870 8425562 8487686 8414119 8655800 8537316 8543119 8613694
3818 8613694 8662673 8488700 8652478 8676338 8672615 8625028 8801755 9048151 8714995 8468116
3808 8468116 8908041 8806755 8682259 8777005 8651221 8468669 8518146 8626222 8612425 8466129
3798 8466129 8638752 8727296 8752226 8548230 8345762 8508572 8543584 8324201 8571997 9034339
3788 9034339 8380010 8203739 8476512 8351636 8148180 8548207 8506439 8356127 8532004 8409466
3778 8409466 8444846 8407722 8636883 8587462 8427860 8336051 8369872 8541524 8469820 8553205 8521175
3767 8521175 8227765 8297775 8264051 8612955 8603180 8623615 8642142 8681376 8587839 8621036 8598055
3756 8598055 8590706 8806191 8813420 8713137 8622377 8789827 8854055 8756694 8617045 8684228 8576072
3745H576072K7324L85462k08626r0033L841n0434p820k94145m6703J13111J80592
3734H588641K918k16260j08523K09563K30032k9515m98641J23308J11545j6176
3724H396892l6935N7678k3383J45272k48333m5520K95390P5976L1731l50331J8411
3713H316848l508q6679J85736J00032k40492r4627K21209J84420J24193k36425
3703H470707J24028P2255j20354M24883M5877n62366K18177J0197j7542j20817
3693H545045J47168o6727l6813J18561J18331k40559M75388j41573j32964J95448
3683H981305J50300k37624J08959L10673J82626J05081k18472J90951K13458R5527
3673I882784r4186q4438l7730K02753L89283O68379m73996l20980J46873k27359
$$ plain form
3745 8576072 8603396 8988858 8780232 8690199 8694040 8643606 8635786 8341641 8294938 8408049 8588641
3734 8588641 8591559 8375299 8266776 8476339 8706371 8676856 8178215 8301523 8413068 8396892
3724 8396892 8359957 8417635 8394252 8539524 8291191 8245671 8541061 8617037 8648768 8298437 8316848
3713 8316848 8313340 8226661 8412397 8512429 8271937 8177310 8398519 8582939 8707132 8470707
3703 8470707 8594735 8666990 8546636 8971519 9017396 8455030 8673207 8683404 8665862 8545045
3693 8545045 8692213 8625486 8588673 8707234 8825565 8585006 9060394 8918821 8785857 8981305
3683 8981305 9131605 8893981 9002940 9313613 9496239 9601320 9382848 9573799 9787257 9882784
3673 9882784 9788598 9704160 9666430 9869183 10258466 10926845 10452849 10131869 10278742 10051383
3663A0051383J20900J60825j97478J27445K22733K80349k06094j17756q5877j28889
3653A0227541l0563k0202J62196K3591n6750J03196P1964J94657m66547N4451
3643A0263534R7916K24586J89960j77325L12889L61371k52186L88276j80411j30788
3633A1097822R0464o1980Q267j77382j79055j99943L0206n4798J12811k85575
3623A0380837n9970Q2320o0642j21739N8894J56692J08369j2249l4632L2796N7923
3612A0588599K14176k44626j42159J24266p2733M07599J25405j56944l78850J64422
3602A0629155k4217j90858O2111J20255O6734k90038L9558L1559r4424j76744
3592A0173091m7636m0279j25627m3477J53811j15611k18876k18443N3915m2321
$$ plain form
3663 10051383 10172283 10333108 10135630 10263075 10485808 10766157 10560063 10442307 10356430 10227541
3653 10227541 10196978 10176776 10338972 10362563 10305813 10409009 10480973 10675630 10209083 10263534
3643 10263534 10361450 10586036 10775996 10598671 10911560 11272931 11020745 11409021 11228610 11097822
3633 11097822 11188286 11126306 11134573 10957191 10778136 10578193 10608399 10553601 10666412 10380837
3623 10380837 10320867 10403187 10342545 10220806 10279700 10436392 10544761 10532512 10497880 10530676 10588599
3612 10588599 10802775 10558149 10415990 10540256 10467523 10875122 11000527 10843583 10464733 10629155
3602 10629155 10604938 10414080 10476191 10596446 10663180 10373142 10412700 10444259 10349835 10173091
3592 10173091 10125455 10085176 9959549 9916072 10069883 9954272 9735396 9516953 9570868 9528547
3582I528547M7229K4109p6233l0657J26654k22857q9719J47261j9480k3025q5124
3571I326705J11964k6382J620k36961l10984J09228N62782K08474k12099k63724
3561I270623m17152j01166J17929j3526j73600L64543J07289k18687k887p7589
3551H855777K41923j4797j19868K7376k80000L3332N0279m7723j45757j5190j04741
3540H480611k86230M38120J65453j19456j84524l36739q2434N2186J36694j22235
3530H141446m2507L89247Q8961J85493k34973K7201J44694L0961k75776k19953
3520H234794R2271J08560L02820K93492j47842m52127K04304l09679k02331N9584
3510H183846K97780N6770j78276J88317j17179l69476k16004L80991n5602J336
$$ plain form
3582 9528547 9575776 9599885 9523652 9492995 9619649 9396792 9307073 9454334 9434854 9411829 9326705
3571 9326705 9438669 9412287 9413907 9176946 8865962 8975190 9537972 9746446 9534347 9270623
3561 9270623 8853471 8752305 8870234 8856708 8683108 9047651 9154940 8936253 8933366 8855777
3551 8855777 9097700 9082903 8963035 8990411 8710411 8743743 8794022 8746299 8600542 8585352 8480611
3540 8480611 8194381 8632501 8797954 8678498 8493974 8157235 8074801 8126987 8263681 8141446
3530 8141446 8098939 8488186 8577147 8762640 8527667 8554868 8699562 8730523 8454747 8234794
3520 8234794 8327065 8435625 8738445 9031937 8884095 8431968 8636272 8326593 8124262 8183846
3510 8183846 8481626 8538396 8360120 8548437 8431258 8061782 7845778 8226769 8171167 8172503
3500H172503J75743O7912l49971O8200k63606m70214L59792j2064L8977J90556
3490G977828k43350Q4408L01490j55378p7958j51593j14830j54225J41402O6371
3480G674165o1871P6864k98682J72192o2116J20953P1563K64401m4533k6103n9955
3469G826878l93020L94699K45682j25002k89820j16129j34005J54414M41017j36583
3459G868131k16885K8098j72757n3773N26932K68155k40997M2995l74855J25430
3449G800474L56116J41095j44417l31654q5886J47392L60785j44306J89162j71573
3439H117188l61309L70942J09304j67414Q8756M7116j27872L14182j40117j69816
3429H080960L7909K69020K83657k66694j1892q420L62697K95687k02035p2218
$$ plain form
3500 8172503 8348246 8416158 8066187 8134387 7870781 7400567 7760359 7748295 7787272 7977828
3490 7977828 7734478 7818886 8120376 7964998 7887040 7735447 7620617 7466392 7607794 7674165
3480 7674165 7612294 7689158 7390476 7562668 7500552 7621505 7693068 7957469 7912936 7886833 7826878
3469 7826878 7433858 7828557 8074239 7949237 7659417 7543288 7409283 7563697 8004714 7868131
3459 7868131 7651246 7679344 7506587 7452814 7979746 8247901 8006904 8049899 7675044 7800474
3449 7800474 8156590 8297685 8153268 7821614 7735728 7883120 8243905 8099599 8288761 8117188
3439 8117188 7755879 8126821 8236125 8068711 8157467 8204583 8076711 8390893 8250776 8080960
3429 8080960 8118869 8387889 8671546 8404852 8392960 8384540 8747237 9042924 8840889 8768671
3419H768671L12016K23454j69458K3260J23278j26432O6361L21961J44073J85242
3409I872426n3168K46641j62304L0200R1074K55334P5563K94586j4560k55262
3399A0380530L58050L44680j46050L6135P4890M941J90033k33114J11705m64835
3389A0656965L673J77915j17039n3314J86121l5349K54333K90640O1480J68727
3379A1594152m994o3543j4165L76096R594j36742L2010K68518J37699J44139j11508
3368A2231256J70170N45432o54529K10382N95690q0181L13198j09752k36710M05310
3358A3390266M44630P3604J00281j03355J43811K06522n9268L95146K52549J53992
3348A4998178k4423j55067K85722K44746N6200J71494J20556O8213J42750q4618
$$ plain form
3419 8768671 9080687 9304141 9134683 9157943 9281221 9154789 9221150 9543111 9687184 9872426
3409 9872426 9819258 10065899 9903595 9933795 10024869 10280203 10355766 10650352 10635792 10380530
3399 10380530 10738580 11083260 10937210 10973345 11048235 11053176 11243209 11010095 11121800 10656965
3389 10656965 10660638 10838553 10721514 10668200 10854321 10818972 11073305 11363945 11425425 11594152
3379 11594152 11589158 11525615 11511450 11887546 11897140 11760398 11792408 12060926 12198625 12342764 12231256
3368 12231256 12401426 12946858 12292329 12502711 13098401 13018220 13331418 13221666 12984956 13390266
3358 13390266 13834896 13908500 14008781 13905426 14049237 14255759 14196491 14591637 14844186 14998178
3348 14998178 14973755 14818688 15104410 15349156 15405356 15576850 15697406 15765619 15908369 15823751
3338A5823751P0596M40656k88782N45918Q3861J02202L52485m66175K55814q8768
3328A6831558k06715K08398L13533j4120k94841K75213K84365o0125J38995P0371
3318A7546632n0334J50620L62082n9104q6538K27872q886j55008J02564j37170
3308A7892730n2536l7942M02438M65520J03711K08041j21741J87921M56724J99205
3298A9704071O6603O9429o1488k9472J1k716R3936p9617J37679L62271j11646
3287B0149061r9867J42213J59518M05131k19020K3621J32180K97243K89314M96443
3277B1775837L92400K15477j03957L16283M00653J58612M3988K45318O77449L77912
3267B4499972L19032N14056M63496K54016K79226L74454K04504K29589L37348
$$ plain form
3338 15823751 15894347 16335003 16046221 16592139 16676000 16778202 17130687 16664512 16920326 16831558
3328 16831558 16624843 16833241 17146774 17132654 16837813 17113026 17397391 17337266 17476261 17546632
3318 17546632 17496298 17646918 18009000 17949896 17863358 18091230 18082344 17927336 18029900 17892730
3308 17892730 17840194 17802252 18204690 18670210 18773921 18981962 18860221 19048142 19504866 19704071
3298 19704071 19770674 19840103 19778615 19749143 19749154 19746438 19840374 19760757 19898436 20260707 20149061
3287 20149061 20049194 20191407 20350925 20756056 20537036 20560657 20692837 20990080 21279394 21775837
3277 21775837 22168237 22383714 22279757 22596040 22996693 23155305 23199293 23444611 24122060 24499972
3267 24499972 24819004 25333060 25796556 26050572 26329798 26704252 26908756 27138345 27475693
3258B7475693O04358O88810N17920O45293L69741J510502J073687O52198J141864
3249C4680066P40997L54375N31153k9072M9156m30667j018869r12455j053734
3240C2910950j146595j066129p88313o82460n87673q48679p63546o72057q51350
3231B5504148l37086o06583j025530n80783n64954m07782n99994m68893l07744
3222B0604799l84483l20835n26755l40373q6970l92505k04634o4742j84300m16031
3212A7683171k44794k3123l90365M23742J6827m9193j16954P2349l1651M3584
3202A7383593k25423m35815j53183o44020q7535j26563j25861k6549k39713j37283
3192A5181648l46691J05819j57838M1664m2676j02518j48719Q434J05507k1970
$$ plain form
3258 27475693 28080051 28768861 29286781 29932074 30301815 31812317 32886004 33538202 34680066
3249 34680066 35421063 35775438 36306591 36277519 36326675 35896008 34877139 33964684 32910950
3240 32910950 31764355 30698226 29909913 29227453 28639780 27791101 27027555 26355498 25504148
3231 25504148 25167062 24560479 23534949 22954166 22389212 21981430 21381436 20912543 20604799
3222 20604799 20220316 19899481 19372726 19032353 18945383 18552878 18348244 18283502 18099202 17683171
3212 17683171 17438377 17415254 17024889 17448631 17465458 17416265 17299311 17371660 17340009 17383593
3202 17383593 17158170 16722355 16569172 15925152 15837617 15711054 15585193 15558644 15318931 15181648
3192 15181648 14834957 14940776 14782938 14824602 14781926 14679408 14530689 14539123 14644630 14622660
3182A4622660l14319j34263J46828l8364L41020l9067l20034n6856L82592o4266
3172A4525931j37008K52788J97346l58317j91575J95474o9759m82600j27951J01956
3162A3906285q9722q2383j79023j78061k19984J81218R711J7777r7477l00785
3152A2967556J87469j85381q0617k72468j64152M18025o2122j66933j13564k89520
3142A2238293k5603j52974l5862L9771J0082r8761q9477r1280L65507k30826n6034
3131A1872836l08622J30153R667k64728k30421j68728R1812L4389Q5681J3521
3121A1265560k80293J11086q7448j4235j24579k88755j29536n7033q4805j43225
3111A0166737j60277J5272O6012l9542J12641j11332l17670p8659K00072j53265
$$ plain form
3182 14622660 14308341 14174078 14320906 14282542 14623562 14584495 14264461 14207605 14590197 14525931
3172 14525931 14388923 14641711 14839057 14480740 14289165 14484639 14414880 13932280 13804329 13906285
3162 13906285 13816563 13734180 13555157 13377096 13157112 13338330 13348041 13365818 13268341 12967556
3152 12967556 13155025 12969644 12889027 12616559 12452407 12870432 12808310 12641377 12527813 12238293
3142 12238293 12212690 12059716 12023854 12063625 12073707 11974946 11885469 11794189 12159696 11928870 11872836
3131 11872836 11564214 11694367 11704034 11439306 11208885 11040157 11131969 11166358 11252039 11265560
3121 11265560 10985267 11096353 11008905 10994670 10870091 10581336 10451800 10394767 10309962 10166737
3111 10166737 10006460 10021732 10087744 10048202 10160843 10049511 9731841 9653182 9853254 9699989
3101I699989j09272j65705j32701j49214m2927N4206K12095k19073l40634l593
3091H803171k06353j80517K28219J757o9500n9426j07727j01985O3127r486j1141
3080H350139l20877k17703N8846M74054p5652l97092j24826L5739P9089o5301
3070G796416j15225j9674N3163n0283p9841K6847o2971j90271j62785n7341L7668
3059G175703k8369k72568J43369J65662K58673k41442j28502M1505l18623Q6532
3049F881940J49270k94855j72260J53199l2393n417J15336J1043k10569L42207
3039F937501m5753K90211k44416l62383K34053r3442m5566j72456Q1122j19004
3029F459867K61798j63646J13835K14265k16850J86919k32000j24271j57599L77229
$$ plain form
3101 9699989 9590717 9425012 9292311 9143097 9100170 9154376 9366471 9147398 8806764 8803171
3091 8803171 8596818 8416301 8644520 8646277 8576777 8517351 8409624 8307639 8370766 8361280 8350139
3080 8350139 8029262 7811559 7870405 8344459 8268807 7871715 7746889 7782628 7861717 7796416
3070 7796416 7681191 7661517 7714680 7664397 7584556 7611403 7548432 7358161 7195376 7138035 7175703
3059 7175703 7147334 6874766 7018135 7183797 7442470 7201028 7072526 7114031 6795408 6881940
3049 6881940 7031210 6736355 6564095 6717294 6684901 6679484 6794820 6805863 6595294 6937501
3039 6937501 6891748 7181959 6937543 6575160 6809213 6715771 6670205 6497749 6578871 6459867
3029 6459867 6721665 6558019 6671854 6886119 6669269 6856188 6624188 6499917 6342318 6719547
3019F719547n0176j33030J67332J15415j98832K24049l3025R670J90786O5381
3009G077117K21610j12217l98884K3750L79990j84281R2132j01504J16817j39356
2999F975174J31389P278Q6731K03405M34794j9736m3750j2815k16385R3315J99581
2988G838981l1209K14258j77199m8514K10432L76318K98144J53695j7249J40178
2978H957835k26417R3158k734J02825J29001L05892K64948J20542M7512J44454
2968I937016J37836j13649M90902J25136j35888l7549J60103J15747L40016J38528
2958A1158198J03893J75305K24520J36166L6698K727L82927q6586K8655k5975
2948A2136528J3062j06821M41175O8504K3229J51936l5113k24658J45307M705
$$ plain form
3019 6719547 6669371 6536341 6703673 6819088 6620256 6844305 6811280 6820950 7011736 7077117
3009 7077117 7298727 7186510 6787626 6811376 7191366 7007085 7099217 6997713 7114530 6975174
2999 6975174 7106563 7113841 7200572 7403977 7838771 7819035 7775285 7762470 7546085 7639400 7838981
2988 7838981 7807772 8022030 7844831 7796317 8006749 8383067 8681211 8834906 8817657 8957835
2978 8957835 8731418 8824576 8821842 8924667 9053668 9359560 9624508 9745050 9792562 9937016
2968 9937016 10074852 9961203 10452105 10577241 10441353 10403804 10563907 10679654 11019670 11158198
2958 11158198 11262091 11437396 11661916 11798082 11834780 11837507 12220434 12133848 12162503 12136528
2948 12136528 12149590 12042769 12483944 12552448 12575677 12727613 12692500 12467842 12613149 12617854
2938A2617854K2466Q8549J57427J86738K99396J07464R8397P9727L65174O6048
2928A4089240M8251M04573O14359J43160L7801L0361M8825N40041K60448j70404
2918A6046655K63836L39924L18448M56183M59167O97505K65163N05145L16333
2909A9668359N09564M72795J69237M92668O33689R7250P8852J00277O7904J72795
2899B2463390R0150L14609J06011m5488N14944N43424K93660O38134Q80186K97287
2889B6096307K48119L69165n6162J99567M04909M98647L98484N03215J48203r4362
2879B8716092l03964j93324k23599l21737o90629n43955q1194l37772m29453k06651
2869B5383814n22359k51101q0960k50247r681k94519l15485o70623m14108k97985
$$ plain form
2938 12617854 12640320 12728869 12886296 13073034 13372430 13479894 13578291 13658018 14023192 14089240
2928 14089240 14137491 14542064 15156423 15299583 15337384 15367745 15416570 15956611 16217059 16046655
2918 16046655 16310491 16650415 16968863 17425046 17884213 18581718 18846881 19352026 19668359
2909 19668359 20177923 20650718 20819955 21312623 21946312 22043562 22122414 22222691 22290595 22463390
2899 22463390 22553540 22868149 22974160 22928672 23443616 23987040 24280700 24918834 25799020 26096307
2889 26096307 26344426 26713591 26657429 26856996 27261905 27760552 28159036 28662251 28810454 28716092
2879 28716092 28412128 28218804 27995205 27673468 26982839 26438884 26357690 26019918 25590465 25383814
2869 25383814 24861455 24610354 24529394 24279147 24269466 23974947 23659462 22988839 22574731 22276746
2859B2276746J02689p3379k49240l99763j65113j08069l32849l41J95075m72549
2849B0773207p53592j09454k42192o63257l93752o6456m15788k66347l55740o50096
2839A6856533L05912j75035l46544m26565k46857K4478m54257j33706r7643p20656
2829A4585660k16033k71562j81655l53733k33500l69854j13547k95033k6489N3661
2819A2577915N0570j09408o02359K32942N1029k30098m58005o2613k70942m7380
2809A1131651N4373k51329j65800k7585q0428j69610j84044j76038j91044j14284
2799I825862O9343q4750q3573k87262J21267k19164J52068j71857r6095o9312
2789I156527j52977J82439j58421j60965q5749k22922j97544r688J14263l94855
$$ plain form
2859 22276746 22379435 22306056 22056816 21657053 21491940 21383871 21051022 21050681 21245756 20773207
2849 20773207 20019615 19910161 19667969 19004712 18610960 18544504 18128716 17862369 17506629 16856533
2839 16856533 17162445 16987410 16640866 16214301 15967444 15991922 15537665 15403959 15306316 14585660
2829 14585660 14369627 14098065 13916410 13562677 13329177 12959323 12845776 12550743 12524254 12577915
2819 12577915 12628485 12519077 11916718 12149660 12200689 11970591 11512586 11449973 11179031 11131651
2809 11131651 11186024 10934695 10768895 10741310 10660882 10491272 10307228 10131190 9940146 9825862
2799 9825862 9895205 9810455 9726882 9439620 9560887 9341723 9493791 9321934 9225839 9156527
2789 9156527 9003550 9185989 9027568 8866603 8780854 8557932 8360388 8350700 8464963 8070108
2779H070108l01673k58559L7805o0847R1242O5566k36944n7370M7393q606k19988
2768G168127P622m00895L8836J074k15625j45893L13695k6852K20562L3528n45375
2757F448804m36600K87939L69778k74007k55711K2489k7350q149J332k21288j44814
2746E762423O7639j13708p3890j42457O3760p5370l10163l00167P7643j62880
2736D792830K65896J15939m90k27134J5709M502M589l65510J1706m7343k06099
2725D364595K08859Q5455n4567N6728l56858j65787J30947M20683m1926l34262
2715D313867J62049r7985J87112k00200k14130J10052o8445m0042J73222n33812
2705C791688n7147J21097q2821N0267k20623N2530J45918R3788q939j87405j55406
$$ plain form
2779 8070108 7768435 7509876 7547681 7486834 7578076 7643642 7406698 7349328 7396721 7388115 7168127
2768 7168127 7175749 6774854 6813690 6814764 6599139 6453246 6766941 6740089 6960651 6994179 6448804
2757 6448804 6012204 6300143 6669921 6395914 6140203 6162692 6135342 6127193 6128525 5907237 5762423
2746 5762423 5830062 5716354 5642464 5500007 5563767 5488397 5178234 4878067 4955710 4792830
2736 4792830 5058726 5174665 5174175 4947041 4962750 4967252 4971841 4606331 4618037 4570694 4364595
2725 4364595 4573454 4658909 4604342 4661070 4304212 4138425 4269372 4690055 4648129 4313867
2715 4313867 4475916 4377931 4565043 4364843 4150713 4260765 4192320 4152278 4325500 3791688
2705 3791688 3734541 3855638 3772817 3823084 3602461 3654991 3800909 3894697 3885758 3698353 3542947
2694C542947N9132K15750k37868l82381J91742K30016j12588l7246J71767j52716
2684C488555J11672k29471k71327k71959j13189J97326J63733o1847M137J40004
2674C157634p4269O6483o7625q7725o1521m0710l41711M01802j98450J97410k66582
2663B684736l77149N18045M09042J5030n8181m48167J37748j41759k1789K02963
2653B920519K78352k02716l05813J08716K0611j4927k14998J70979j47928l00930
2643B311865K41070J08k85420j42457K30934K21085j4521J02051J40900j79946
2633B625669k76789N3936j61979k12285J38712J46879k86960J31976J84097p1736
2623B271520J56812O545k08390K85205N6382l5242k14152k64321q39K44471j90747
$$ plain form
2694 3542947 3602079 3817829 3579961 3197580 3389322 3619338 3506750 3469504 3641271 3488555
2684 3488555 3600227 3370756 3099429 2827470 2714281 2911607 3075340 3013493 3017630 3157634
2674 3157634 3083365 3149848 3082223 2994498 2932977 2892267 2550556 2952358 2753908 2951318 2684736
2663 2684736 2307587 2825632 3234674 3249704 3191523 2743356 2881104 2739345 2717556 2920519
2653 2920519 3198871 2996155 2690342 2799058 2819669 2804742 2589744 2760723 2612795 2311865
2643 2311865 2552935 2553043 2267623 2125166 2356100 2577185 2562664 2664715 2805615 2625669
2633 2625669 2348880 2402816 2240837 2028552 2167264 2314143 2027183 2159159 2343256 2271520
2623 2271520 2428332 2434877 2226487 2511692 2568074 2532832 2318680 2054359 2053520 2297991 2107244
2612B107244Q2133j94605l57590K90587N5142p0844k85684l35626j39083K45187
2602A396861L19841k92788K94073M0006n3112L64887q7243l30073k08987K724
2592A446189J45374M30723k13072l98757L1334M34732j49008j74391L60966k93030
2582A621060k82528n8413K50961P8371K1007j02730k76611K8615j26747O4301
2572A217286m1307J22468j87992J13457J73552J32906k84405j97248J95701o67
2562A243751j05743K29477q6904l7562K2658j4694K18178j20703o18011J88435
2552I18882P5813L25880J30456k33685l0009k543J8841j5343J79968k80585r1773
2541I95902j84451L03695L17927P2957j51814j68042l57759r3651k24222k3189
$$ plain form
2612 2107244 2189377 1994772 1637182 1927769 1982911 1912067 1626383 1290757 1151674 1396861
2602 1396861 1716702 1423914 1717987 1757993 1704881 2069768 1982525 1652452 1443465 1446189
2592 1446189 1591563 2022286 1809214 1410457 1441791 1876523 1727515 1553124 1914090 1621060
2582 1621060 1338532 1280119 1531080 1609451 1630458 1527728 1251117 1279732 1152985 1217286
2572 1217286 1175979 1298447 1110455 1223912 1397464 1530370 1245965 1048717 1244418 1243751
2562 1243751 1138008 1367485 1280581 1243019 1265677 1250983 1469161 1348458 730447 918882
2552 918882 994695 1320575 1451031 1217346 1187337 1184794 1203635 1188292 1368260 1087675 995902
2541 995902 811451 1115146 1433073 1506030 1354216 1186174 828415 734764 510542 487353
2531D87353K54221O5684P7218J49089P7369j13087k19236O6940J30162o7341l2995
2520H75377k7029n4810J02478j41834m3078j50476R3543L17405O7343j70394r7952
2509G70573l10129O4654J66818j79586Q1393L8711j34150K68720J34402L9916
2499I41322k40258J72275k75680l30796K03816o6211J70958q9978k27903K96260
2489E53805k8238J24388J75574j16557j49770m117J70716K34322m61668j00824
2479C97631R5440j84719M5706K87417J09722m3280j64413j23822K78083O9011
2469G66776o6337j58339K43479j89061o1876j05345j32222m2421J26687J13548
2459D94889j08013J73441K67274l24328k45613m8710k0819N04262J05088l04420
$$ plain form
2531 487353 741574 807258 884476 1033565 1110934 997847 778611 845551 975713 908372 875377
2520 875377 848348 793538 896016 754182 711104 560628 654171 971576 1038919 868525 770573
2509 770573 460444 525098 691916 512330 593723 632434 498284 767004 901406 941322
2499 941322 701064 873339 597659 266863 470679 404468 575426 485448 257545 553805
2489 553805 525567 649955 825529 708972 559202 555085 725801 960123 498455 397631
2479 397631 493071 308352 354058 641475 751197 707917 543504 419682 697765 766776
2469 766776 700439 542100 785579 596518 534642 429297 297075 254654 381341 494889
2459 494889 386876 560317 827591 503263 257650 208940 188121 692383 797471 493051
2449D93051p9681k07201J85368m8228K53367j70628j9773M889k82560M5988K52627
2438D27219Q702r3838J48344j20590J18526R0994Q0134K02016l49460m6669J05328
2427E70706q918l8311K0590J16680j51583k59149M95O8077J23285j15379K6489
2416C52982m7725N9587l761r3343J13971L110N2829k66706j69363K19922O7109
2405B88612m3076q5289M3920K77435O3434j88777J21566K75006l8159K8789J55562
2394H99023l55593k42947m1944M10814J47917m5566J11779K0821k98090L2205
2384F38419L9100Q3354K29751k21226m3837L81953M48986J91285O8550n9005M53303
2373B210633J24569j01031j98551k45187j65946l13315K9372J33206m37334k02100
$$ plain form
2449 493051 413370 206169 391537 343309 596676 426048 406275 411164 128604 174592 427219
2438 427219 435921 342083 490427 369837 488363 579357 659491 861507 512047 465378 570706
2427 570706 561788 523477 544067 660747 509164 250015 250510 318587 441872 326493 352982
2416 352982 305257 364844 361083 267740 381711 384821 437650 170944 1581 221503 288612
2405 288612 245536 160247 204167 481602 545036 356259 477825 752831 714672 743461 899023
2394 899023 543430 300483 258539 669353 817270 771704 883483 904304 606214 638419
2384 638419 677519 760873 990624 769398 725561 1107514 1556500 1747785 1816335 1757330 2210633
2373 2210633 2335202 2234171 2035620 1790433 1624487 1311172 1340544 1473750 1036416 834316
2363H34316l9819K48667k44317o4292r6061K98731m9025j29168r535m46762m0783
2352B61952N04907j81252l15405J47481J42068J36601L0423q6676k5146k4132
2342E90821j02137l36958J47784N0632M73184j12179M2682J75410o35801P5141
2332C68579J46306J35306j53427K35423J45040p0588p5048J60679j77938j88371
2322E25961k73038L73349J3225k91148r0076L56488K31876j01870k08732r3864
2312D42171L75691K1523k23982j23755N6571p8780J60264J75055j09112J65060
2302H60706k10623n1781Q7613K4029J01645j0909O694J70125k39296j74871L55443
2291I18775l6680m5121k06443K27843K39191m36072J64773J26016p1269r4440
$$ plain form
2363 834316 794497 1043164 798847 734555 638494 937225 888200 759032 749497 302735 261952
2352 261952 766859 585607 270202 417683 559751 696352 726775 640099 614953 590821
2342 590821 488684 151726 299510 350142 823326 711147 753829 929239 293438 368579
2332 368579 514885 650191 496764 732187 877227 806639 731591 892270 714332 525961
2322 525961 252923 626272 639497 348349 258273 614761 846637 744767 536035 442171
2312 442171 817862 839385 615403 491648 548219 469439 629703 804758 695646 860706
2302 860706 650083 598302 685915 709944 811589 800680 807374 977499 738203 563332 918775
2291 918775 882095 836974 630531 858374 1097565 661493 826266 952282 881013 786573
2281G86573j9455p614k8880N04995l44897J52687J72060j25364j0197R8708J8794
2270A197410j62760P2069l4708k56221J04225L80970K87409j40324J37710l5880
2260A549900j15300j6227k00809K33887K40378Q6963l53458j2616K33906J46226
2250A792850R7664j60727J63041L2318k592J27160k26545L24205m2914j06501
2240A997959j0670k46194j4462M17074J53754K45689K46679P2558J1064l61268
2230B512183K00474J90120r9493O0742K74766j23083M3144K32842j59616K5534
2220C157613J86533k51364L0782K2533L19825J84616k12756M6419K65001R8429
2210C847631J82323k42751L67754K19945P2173J71004K31097j68326m69929M21992
$$ plain form
2281 786573 767118 759504 730624 1235619 890722 1043409 1215469 1090105 1079908 1178616 1197410
2270 1197410 1034650 1106719 1072011 815790 920015 1300985 1588394 1448070 1585780 1549900
2260 1549900 1434600 1418373 1217564 1451451 1691829 1778792 1425334 1412718 1646624 1792850
2250 1792850 1890514 1729787 1892828 1925146 1922554 2049714 1823169 2147374 2104460 1997959
2240 1997959 1987289 1741095 1726633 2143707 2297461 2543150 2789829 2862387 2873451 2512183
2230 2512183 2712657 2902777 2803284 2864026 3138792 3015709 3058853 3291695 3132079 3157613
2220 3157613 3344146 3092782 3123564 3146097 3465922 3650538 3437782 3484201 3749202 3847631
2210 3847631 4029954 3787203 4154957 4374902 4447075 4618079 4849176 4680850 4210921 4632913
2200D632913L64114J81919j51854J65084N3735L81558J23072k9551l48055j32548
2190E240387m8517J20487L53086K04756J35001J59585k35155r8372J07323J46558
2180F085139n4454L73979K99295p1226J4482K58234j4213J58738N713P5953M72280
2169G603920o410l0131J76052K64613M65288J24716k347K75157J72760M28523
2159I472141K61072J56820N88273L95559R5166J21335M18052M79457M41691P25936
2149A3155502Q51165N30943Q11211R57051R26216P15919O29342J056013N90694
2140B0224056R01249J207565P30289J030864R36308P13989J444088J561540J214978
2131B9964926J584193J860120J624814J579731J950542K696188K936483M165520
$$ plain form
2200 4632913 4997027 5178946 5027092 5192176 5245911 5627469 5750541 5720990 5372935 5240387
2190 5240387 5191870 5312357 5665443 5870199 6005200 6164785 5929630 5831258 5938581 6085139
2180 6085139 6030685 6404664 6703959 6632733 6647215 6905449 6891236 7049974 7055687 7131640 7603920
2169 7603920 7597510 7567379 7743431 8008044 8473332 8598048 8595701 8870858 9043618 9472141
2159 9472141 9733213 9890033 10478306 10873865 10969031 11090366 11508418 11987875 12429566 13155502
2149 13155502 14006667 14537610 15348821 16305872 17232088 17948007 18577349 19633362 20224056
2140 20224056 21125305 22332870 23063159 24094023 25030331 25744320 27188408 28749948 29964926
2131 29964926 31549119 33409239 35034053 36613784 38564326 41260514 44196997 48362517
2123D8362517M634502M820605M518509M553368M830553N303938P252037R029592
2115I3305621J1994125J4777304J7577389K1971024K5854075L1586308M2357057
2108B59422903N4872902L6576402j0409341m2399922m9277163m7017138m0012592
2101A61756051k9758562k1263780j5879920j1860975r415753o794360n302704
2094F1479997m584534l029873k562081l447032m275563l460036l229537k611780
2086C4279561k569653k200865j791985j348592j554966j433261r64948j147173
2078B1268118r26917p42652j089218q30227n97798o71297p22766r80161p39259
2069A3967823k19436n33282o88192l47672k14717o43146q53464l89264j28228
$$ plain form
2123 48362517 52997019 57817624 62336133 66889501 71720054 77023992 84276029 93305621
2115 93305621 105299746 120077050 137654439 159625463 185479538 217065846 259422903
2108 259422903 314295805 350872207 340462866 298062944 248785781 201768643 161756051
2101 161756051 131997489 110733709 94853789 82992814 73577061 66782701 61479997
2094 61479997 56895463 53865590 51303509 47856477 43580914 40120878 36891341 34279561
2086 34279561 31709908 29509043 27717058 26368466 24813500 23380239 22415291 21268118
2078 21268118 20341201 19598549 18509331 17679104 17081306 16410009 15687243 14707082 13967823
2069 13967823 13748387 13215105 12526913 12179241 11964524 11321378 10467914 10078650 9950422
2060I950422k89370m88176l41874j13708m5917k93530q68815p0727j18799q5709
2050G233797k96104j87679J82860j15346m71015o2006M6567k05423k85302L8044
2040E878393Q1885j86314l51501k01293j24400N1797K02653l32803j44342l9511
2030D834564j99112k48461K06330l24372j88280k71905n0951o9996j93210O2569
2020C557176n0058j37884j25469K39006j19391j00576m83063o00062K80217L38866
2010B798762m09255J25376R0113P6041q9812m64533M4008k68708L7818K32983
2000B172793K10514k83112L1326k09068J08767L90107m46190p8560J27079j20270
1990A903386k62786J14226j69269P6547J55431p5262L1595Q7364k59915k48690
$$ plain form
2060 9950422 9661052 9172876 8831002 8717294 8671377 8377847 7509032 7438305 7319506 7233797
2050 7233797 6937693 6750014 6932874 6817528 6346513 6284507 6331074 6125651 5840349 5878393
2040 5878393 5960278 5773964 5422463 5221170 5096770 5148567 5351220 5018417 4874075 4834564
2030 4834564 4635452 4386991 4593321 4268949 4080669 3808764 3757813 3687817 3494607 3557176
2020 3557176 3507118 3369234 3243765 3482771 3363380 3262804 2779741 2179679 2459896 2798762
2010 2798762 2389507 2514883 2604996 2681037 2591225 2126692 2170700 1901992 1939810 2172793
2000 2172793 2383307 2100195 2131521 1922453 2031220 2421327 1975137 1896577 2023656 1903386
1990 1903386 1640600 1754826 1585557 1662104 1817535 1742273 1773868 1861232 1601317 1352627
1980A352627N9483r4596o5715j03961J66072J73281j32285q6577j39892j13233
1970A015204j8680L40820K16835o2161j19491j38911K4001Q8872r1936k54079
1960A000474j70449k90059J05378j4583K77033k00738o1607M56462K81205l97565
1950I85551l78556J97749j1193N2386k3465j94861q5728r2196K03084O448J06299
1939G65518Q1358k64446J87310k07329K41031K60158k58681l07324j10433K10169
1929E97331K683j81325Q6673O4128o3766p9670j09952R1180j47734M0419j81665
1918A18302J75735K02742q4217m7804l00166j51612K61951J29950P3747J57195
1908E35823l83375q0028N1958K29248J33235j18604j26780j15171K5212l3791
$$ plain form
1980 1352627 1412110 1317514 1251799 1147838 1313910 1487191 1354906 1268329 1128437 1015204
1970 1015204 996524 1337344 1554179 1492018 1372527 1233616 1257617 1346489 1254553 1000474
1960 1000474 830025 539966 645344 630761 907794 707056 645449 1101911 1383116 985551
1950 985551 606995 804744 793551 845937 822472 627611 541883 449687 652771 659219 765518
1939 765518 846876 582430 769740 562411 803442 1063600 804919 497595 387162 597331
1929 597331 600014 418689 505362 569490 505724 426054 316102 407282 259548 299967 118302
1918 118302 294037 496779 412562 364758 64592 -87020 174931 304881 378628 535823
1908 535823 152448 72420 124378 353626 486861 368257 241477 126306 151518 117727
1898A17727Q7513O5226R7709J26931p6635j88554J11349j47957j47986k27851
1888a82528n4341L24868J08379j55015k16766o9046N9846k1578m8123L42711O2704
1877A51111J89644k17611j04621Q6730J99949k56429L6020J1627j08539m0927
1867e3046k9643k857P2708q1284j01390L24812n0541j84316L51817K73378p9273
1856D40365l57854j65164P6404K05911J25691Q5263l811M32308k11703r1121J57269
1845F93558m38688n8654K89964K65385L50372J25264o0062J42710j64677j8923
1835A126249J16565k69474j93541j66878L1636K32448m43210o2992k93972l841
1825G2990j277J80398J63263j39049l47271L01042O5101j82394k9737Q2757j49044
$$ plain form
1898 117727 205240 270466 368175 495106 418471 229917 341266 193309 45323 -182528
1888 -182528 -236869 87999 196378 41363 -175403 -244449 -184603 -206181 -254304 88407 151111
1877 151111 340755 123144 18523 105253 305202 48773 84793 96420 -12119 -53046
1867 -53046 -82689 -85546 -12838 -94122 -195512 129300 78759 -105557 246260 519638 440365
1856 440365 82511 -82653 -6249 199662 325353 410616 406805 839113 627410 536289 693558
1845 693558 254870 196216 486180 751565 1101937 1227201 1167139 1309849 1145172 1126249
1835 1126249 1242814 973340 779799 612921 644557 877005 433795 370803 76831 72990
1825 72990 71713 252111 415374 276325 -70946 230096 295197 112803 83066 165823 16779
1814A6779J17354j08261j16752J75460P4195k08148j93399J26745L18403l22508
1804a20132P8271j30351m05172K76126J27477O1865m43727J65424L85932J52601
1794A48314o1575r4804j4807R9927l14736q8776J38556P7241r4976j18085j40078
1783d63799L88062K55858k44854N3447k70501j04739J43754K9358o2211j22884
1773c98509J39070K37168k9167j31064r2408M0159M6106k92948L8510K14777p7827
1762c06133J03151l40315J01442J32097j23401J72927J40171L323k71317j20683
1752e08738J03116k40200J74915K32987Q6431l1329j92047p6167j50730p1526
1742f73288K36222K57164j98075J36389k46621N8192M48746k4596n8677k76233
$$ plain form
1814 16779 134133 25872 -90880 84580 158775 -49373 -242772 -116027 202376 -120132
1804 -120132 -41861 -172212 -577384 -301258 -173781 -111916 -555643 -390219 -4287 148314
1794 148314 86739 -8065 -22872 77055 -237681 -326457 -187901 -110660 -205636 -323721 -463799
1783 -463799 -75737 180121 -64733 -11286 -281787 -386526 -242772 -213414 -275625 -398509
1773 -398509 -259439 -22271 -51438 -182502 -274910 -234751 -188645 -481593 -443083 -228306 -306133
1762 -306133 -202982 -543297 -441855 -309758 -433159 -260232 -120061 -116738 -388055 -508738
1752 -508738 -405622 -645822 -470907 -237920 -151489 -182818 -374865 -451032 -601762 -673288
1742 -673288 -437066 -179902 -377977 -241588 -488209 -430017 18729 -5867 -64544 -340777
1732c40777j95712K8434K05245J02629j48933r4416j4261R9909k08914L42067
1722b24729j55657j75931K29814N3369J46705Q152Q8925j7460m00424l24161j9511
1711g90908J12101L87404J20789j70353j06954J94706M7368m42497j65193J24961
1701f88576O3893P9477R6011J88880K10761k08066j91273l0557J7830J03376K4159
1690c34085J74856j60671l8849L48117j37443n7194O4975O8573M7677k97764J2413
1679c09395J56221k38812K66771k77266k38680J25568J34772R0721M9986M7746
1669a92368l10486n12041K91473M42810l41546J22752Q0430J7574J50501o8439
1659c19340j37588P5488J44894o7239L4662J49628m37375Q3184J11545j81752
$$ plain form
1732 -340777 -536489 -508055 -302810 -200181 -349114 -443530 -457791 -357882 -566796 -224729
1722 -224729 -380386 -556317 -326503 -273134 -126429 -118277 -29352 -46812 -447236 -771397 -790908
1711 -790908 -678807 -291403 -170614 -340967 -447921 -253215 -205847 -648344 -813537 -688576
1701 -688576 -624683 -545206 -449195 -260315 -49554 -257620 -448893 -479450 -461620 -358244 -334085
1690 -334085 -159229 -319900 -358749 -10632 -148075 -205269 -140294 -71721 -24044 -321808 -309395
1679 -309395 -153174 -391986 -125215 -402481 -641161 -515593 -380821 -290100 -240114 -192368
1669 -192368 -502854 -1014895 -723422 -280612 -622158 -499406 -418976 -401402 -250901 -319340
1659 -319340 -456928 -381440 -236546 -303785 -269123 -119495 -556870 -473686 -362141 -543893
1649e43893k3768J05010K51838m2480K905o0091j92275j61830J25286J6605o1108
1638e83801L4496L92218R4948j07165Q560n0176n5545n4854m8401P0528J743J53976
1626a43473P1143l31637j22657j04865q6951j1765N3242K8963K57287o2779J10300
1615c43192R4607o4078k18513j67169J22243J39181K61151j52727j53678k1041
1605e03216k51475J44175J16623k0225K57542P6682k64275k46264K47914K28932
1595b13587J2219j11750o1246o2902p9984J55061K85935k6623j84039J5252J58290
1584a13374J40641j31547m2933j17128K15189j49435L583P436O2205j44895K15404
1573e4854j45444j89444J72711K73732k04585k28590K99884q9475K03385K7587
$$ plain form
1649 -543893 -567661 -462651 -210813 -253293 -250388 -310479 -502754 -664584 -539298 -522693 -583801
1638 -583801 -549305 -157087 -62139 -169304 -160744 -210920 -266465 -321319 -369720 -299192 -297449 -143473
1626 -143473 -72330 -403967 -526624 -631489 -718440 -730205 -676963 -648000 -390713 -453492 -343192
1615 -343192 -248585 -312663 -531176 -698345 -576102 -436921 -175770 -328497 -482175 -503216
1605 -503216 -754691 -610516 -493893 -514118 -256576 -179894 -444169 -690433 -442519 -213587
1595 -213587 -201368 -313118 -374364 -437266 -517250 -362189 -76254 -102877 -286916 -271664 -113374
1584 -113374 27267 -104280 -147213 -264341 -49152 -198587 -195004 -187568 -125363 -270258 -54854
1573 -54854 -200298 -389742 -217031 56701 -147884 -376474 -76590 -166065 37320 64907
1563F4907j94053r560j23009n3923k2408L20232n11358j39869M9667J2048K43154
1552c64172j43521l9787J23981J49677m9646j73310K7777J93198j48433J36804
1542b87432r4662M7028J71989J10744l47958K50628K42427p0946k87219p9694
1532c45095M9388K03932p1320j16608n9876N4696J12197J14125m547k23530j31881
1521d18519J6103J511K18400R6415k21469M253M09943k89751o1990K88969l1001
1510A2864j42998k77607R8654o185j14280N1455K05225J61841k00666l4355o5051
1499c11103M3194K87728j0380j41500l14978Q5459J17728L3943j2617j08808r6017
1488d27351J71703J28001j4673j31843l25010J31199R4436O4025J31765m72308
$$ plain form
1563 64907 -129146 -138706 -261715 -315638 -338046 -17814 -529172 -669041 -619374 -607326 -364172
1552 -364172 -507693 -547480 -423499 -273822 -323468 -496778 -469001 -275803 -424236 -287432
1542 -287432 -382094 -335066 -163077 -52333 -400291 -149663 92764 21818 -265401 -345095
1532 -345095 -295707 -91775 -163095 -279703 -339579 -284883 -172686 -58561 -63108 -286638 -418519
1521 -418519 -402416 -400905 -182505 -86090 -307559 -303306 106637 -183114 -245104 43865 12864
1510 12864 -130134 -407741 -309087 -315272 -429552 -378097 -172872 -11031 -211697 -246052 -311103
1499 -311103 -267909 19819 9439 -132061 -447039 -361580 -243852 -209909 -222526 -331334 -427351
1488 -427351 -255648 -127647 -142320 -274163 -599173 -467974 -373538 -309513 -177748 -650056
1478f50056r938K24516O9289K25282k9620J80331n1305j12300m08370j02096J1086
1467f53181J58136L1663J70415K13167n13095l34889J68487M13939R8382L4717
1457b12259k43860m9002j0454J12942M0245p1486o4849L28264J89775m05472k40556
1446f26712J20656L24032k49761n4831K85496q5546Q3634L7969k34726l19418
1436g19207K4279M9713J88115J29310k59548o4989L01816n7245p9631m920M12323
1425g9984N2587k33852l56345k0549J62885O7597p5488m5312L88642m4392j11467
1414b95678K41170j61126k00085L31042j7030P4574k77195k0121J53393j42745
1404c13801J63031J59753k95373K13123J26517j82228j63105k6721j33078M9443
$$ plain form
1478 -650056 -659994 -435478 -366189 -140907 -170527 9804 -41501 -153801 -562171 -664267 -653181
1467 -653181 -495045 -463382 -292967 -79800 -592895 -927784 -759297 -345358 -246976 -212259
1457 -212259 -456119 -505121 -515575 -402633 -362388 -433874 -498723 -170459 19316 -386156 -626712
1446 -626712 -506056 -182024 -431785 -486616 -201120 -286666 -203032 -165063 -399789 -719207
1436 -719207 -694928 -645215 -457100 -327790 -587338 -652327 -350511 -407756 -487387 -492307 -79984
1425 -79984 -27397 -261249 -617594 -638143 -475258 -407661 -483149 -528461 -139819 -184211 -295678
1414 -295678 -54508 -215634 -415719 -84677 -101707 -27133 -304328 -324449 -171056 -313801
1404 -313801 -150770 8983 -286390 -73267 53250 -128978 -292083 -318804 -451882 -402439
1394d02439q5789j11653L9573M8866l4113j4227J16020O8900J29134j0675K56856
1383D53J80878p6665l21716L48302j93942l63630J8435N78627M973j22604j75431
1372a22320K133L00392k22042k46932o3055L42864O1825k30998O5264j21076j72761
1361d06706M8152K4842L02580p1272k44074j03721K69351k33644O3357r1803j09800
1350e52738J0923K17889Q4570K20139k367l0065K11899j04951r9002o00215P1871
1339e72047J50667k7428k0690R0864j08487K00019j53609j92564K75179J43260
1329b14836j42329j22481J1405J0652K65537j64660M70649L4250j32274j70265
1319a54352k85772J03925J23431J86143q2631k00209Q8571K34705r1316l6777
$$ plain form
1394 -402439 -488228 -599881 -560308 -511442 -545555 -559782 -443762 -374862 -245728 -256403 453
1383 453 181331 104666 -217050 131252 -62690 -426320 -407885 170742 175715 53111 -122320
1372 -122320 -120187 180205 -41837 -288769 -351824 -8960 52865 -178133 -112869 -233945 -406706
1361 -406706 -358554 -333712 -31132 -102404 -346478 -450199 -180848 -414492 -351135 -442938 -552738
1350 -552738 -541815 -323926 -239356 -19217 -21584 -51649 160250 55299 -43703 -643918 -572047
1339 -572047 -421380 -448808 -469498 -378634 -487121 -287102 -440711 -633275 -358096 -214836
1329 -214836 -357165 -479646 -468241 -457589 -192052 -356712 113937 148187 15913 -154352
1319 -154352 -440124 -336199 -212768 -26625 -109256 -309465 -220894 13811 -77505 -114282
1309a14282R6004j22907J7037j28647l81408J97875J15855L50246j11329k12216
1299b93772Q1178k2660j33534J0395L41768r9668k16111R0339K51597L16885l12056
1288A4361l1811l48957l8153J12445l4006M6371j83695M7414K43461L1965r1717
1277b32322j57279j24792m796O2705K50160M6518j28763j86241K76775l97521
1267e95556r0963K44032K5647l02933J61491L00316l5798K31816k22602M41925
1257A57375N7909m40834j0598k11500l0789K58189n1011K03867K57344m18627
1247b28675J27829k03401j48723j52362K48168K28319M8648n7743r9991J36129
1237a01802l5308j03866O9179j12671n1714r343K26655Q2810r9077r1304k6993
$$ plain form
1309 -114282 -18278 -141185 -124148 -252795 -634203 -436328 -320473 29773 -81556 -293772
1299 -293772 -212594 -235254 -368788 -358393 -16625 -116293 -332404 -242065 9532 326417 14361
1288 14361 -17450 -366407 -404560 -292115 -326121 -279750 -463445 -416031 -172570 -140605 -232322
1277 -232322 -389601 -514393 -519189 -456484 -206324 -159806 -288569 -474810 -198035 -595556
1267 -595556 -686519 -442487 -416840 -719773 -558282 -257966 -293764 -61948 -284550 157375
1257 157375 215284 -225550 -236148 -447648 -478437 -220248 -271259 -67392 189952 -228675
1247 -228675 -100846 -304247 -452970 -605332 -357164 -128845 -80197 -137940 -237931 -101802
1237 -101802 -137110 -240976 -171797 -284468 -336182 -345525 -118870 -36060 -135137 -226441 -253434
1226b53434J66398P843k33651J48450j19836l64038Q7202R758K00499Q8814k04907
1215d66902K6819n7291J17205K01433l7510j35705M586J43362j07940K06486J11891
1204F434J31014m0043o9992q5691l97599L8373K59032M1971L00155J16477n08369
1193b08238k26783L12966J94332k7375o9448J02075j69547j93296J34279j62492
1183c13527O0877J0906k10397J43450J19126K97255j72197m5153j23139j47962
1173c80761O9936Q5937l28551L11417K80756l58755j60538p5047N9999K672K99322
1162a93613L20020J90212k5990j07843j57944j59175J02178o3810j24036J53705
1152f6296M1155l89115R7911J00369j27522o6413N1985J62915K99548k07091j56196
$$ plain form
1226 -253434 -87036 -79193 -312844 -164394 -284230 -648268 -561066 -551308 -350809 -261995 -466902
1215 -466902 -440083 -497374 -380169 -178736 -216246 -351951 -347365 -204003 -311943 -105457 6434
1204 6434 137448 97405 27413 -58278 -455877 -417504 -158472 -116501 183654 300131 -208238
1193 -208238 -435021 -122055 72277 44902 -24546 77529 -92018 -285314 -151035 -313527
1183 -313527 -252650 -241744 -452141 -308691 -189565 107690 -64507 -109660 -232799 -380761
1173 -380761 -310825 -224888 -553439 -242022 38734 -320021 -480559 -555606 -495607 -492935 -193613
1162 -193613 126407 316619 290629 182786 24842 -134333 -32155 -95965 -220001 -66296
1152 -66296 -25141 -414256 -316345 -215976 -343498 -409911 -357926 -195011 104537 -102554 -258750
1141b58750M7434J02422J65317l0004J9536j5713p5869j71610l04004o950L79949
1130a48242l52253j44968K70167L6457Q6353J6670r5866q6337P0980K12248r9390
1119b34181j54534k18850l06467N92470J06599J53062K4580n4742k26342K61163
1109e7242J35568l38113J0123k61656P9422K77201j24733K48657q4157n381O5883
1098e4428l78753K15935Q3450r8400p5672J9929J71485k87296k45530J96106k35567
1087f88741J49986K67553K67638J14233Q4543k98969j00838R1656M3020o6950
1077a36869J17141k17704M8278m3410L80427K9410k75896m12714K47141R0950
1067a73246J24162L48455n1623r877K82556l74948j33529k61508j7066Q2922j27829
$$ plain form
1141 -258750 -211316 -108894 56423 26419 45955 30242 -45627 -217237 -521241 -528191 -148242
1130 -148242 -500495 -645463 -375296 -338839 -252486 -235816 -331682 -418019 -347039 -134791 -234181
1119 -234181 -388715 -607565 -914032 -321562 -214963 -61901 -37321 -92063 -318405 -57242
1109 -57242 78326 -259787 -249664 -511320 -431898 -154697 -279430 -30773 -114930 -120311 -54428
1098 -54428 -433181 -217246 -133796 -232196 -307868 -287939 -116454 -403750 -649280 -453174 -688741
1087 -688741 -538755 -271202 -3564 110669 195212 -103757 -204595 -112939 -69919 -136869
1077 -136869 -19728 -237432 -189154 -232564 147863 177273 -98623 -511337 -264196 -173246
1067 -173246 -49084 299371 247748 237871 520427 145479 11950 -249558 -266624 -183702 -311531
1056c11531R8662k67077M82582J31086j35845k2269j40886P2913k80405k70081
1046f42851K87963O3919K05291k28028m9317p5408M18180k5510j25959j08490
1036b80210j2295K21891n0181Q9895Q6958k88190j45026j6981O594K78067r6324
1025b05802K44270j44152j80244J02504k28696j71159J63870K23474K131q4786
1015b78590J17867J61434j8782k85035j02257K19290m86P3507p945j39625J28234
1004a32388K70291J80962k65896j15008k3869j45113K65963n25668K07067q0004
994c63663J97359J70713J00899k35817K4955Q6403r1169M9402q7613j52430J15692
983a85269K62878k14335Q2706j73960K8413K12477J28090k82289m1431M348j009
$$ plain form
1056 -311531 -212869 -479946 2636 133722 -2123 -24392 -165278 -92365 -372770 -642851
1046 -642851 -354888 -290969 -85678 -313706 -363023 -438431 -20251 -45761 -171720 -280210
1036 -280210 -292505 -70614 -120795 -30900 56058 -232132 -377158 -394139 -387545 -109478 -205802
1025 -205802 38468 -105684 -285928 -183424 -412120 -583279 -419409 -195935 -193804 -278590
1015 -278590 -160723 711 -18071 -303106 -405363 -186073 -186559 -113052 -120997 -260622 -132388
1004 -132388 137903 318865 52969 -62039 -85908 -231021 34942 -490726 -283659 -363663
994 -363663 -166304 4409 105308 -130509 -105554 -19151 -110320 -60918 -148531 -300961 -185269
983 -185269 77609 -136726 -54020 -227980 -199567 12910 141000 -141289 -182720 -178372 -179381
972a79381L30470k86918n6316J21477P4874P5215P7995o2968J31421K72788l62112
961A36545n1494N0640q6309r6623L58615m59380p3656L2356J16192k35223N9519
950b48818L99144j1627l4169j38282k13983J11688P3985j70541J67297J67466
940A02160Q4791j81170J91909J2772l30977j7841l5464R7787K98797j58947j54564
929i0747k05180J46839N0909M6053p2597N1188R1787P0693N6711k15372r7785
918a67501o1690j04991J22753l29j37056J03767J21167J59659j54984j61806R3068
907a87943M52805k28537j34568j80019O7798K59621L29488j79672k60938K17180
897A55215j22945K3313q1074j65618J76411L57920n5142p9216K49806j87695l16815
$$ plain form
972 -179381 151089 -135829 -192145 -70668 4206 79421 157416 94448 225869 498657 136545
961 136545 85051 135691 49382 -47241 311374 -148006 -221662 -189306 -73114 -308337 -248818
950 -248818 150326 138699 104530 -33752 -247735 -136047 -62062 -232603 -65306 102160
940 102160 186951 5781 197690 210462 -120515 -138356 -173820 -76033 222764 63817 -90747
929 -90747 -295927 -149088 -98179 -52126 -124723 -73535 18252 88945 145656 -69716 -167501
918 -167501 -229191 -334182 -211429 -211758 -348814 -245047 -123880 35779 -119205 -281011 -187943
907 -187943 264862 36325 -98243 -278262 -210464 49157 378645 198973 -61965 155215
897 155215 32270 55583 -25491 -191109 -14698 343222 288080 208864 458670 270975 -45840
886d5840K17610j83569K9613K23994j36762l59071J25513P060J14218r6786J15314
875A1294l4423l1270j59579K02766q4402K55653M5591k21591k24356J50521L94187
864C04391o8342j58513J62904j57789j79539l3799j84159L3071o4793L37428J8184
853I044k16767q554K96260k0311J69501Q8682k09643j28581J15001l41732J11949
842a35151O5552K19725j00633J10044J24229k39478k18056J11171n7571J62485
832D2317J78222M3835l9168n9728k56910J59579N055o7697m1240m404J2514m5188
820g2813L3038N0320j49603P1121k06814j22056L91801K19749m60567p7476L35752
809A2452P2394n9005n5464P3103M02905l13541n8155K62922m02907n1344k51602
$$ plain form
886 -45840 171770 -11799 17814 241808 105046 -254025 -128512 -121452 -7234 -104020 11294
875 11294 -23129 -54399 -213978 -11212 -95614 160039 205630 -15961 -240317 -89796 304391
864 304391 236049 77536 240440 82651 -96888 -130687 -314846 -281775 -346568 -9140 9044
853 9044 -207723 -216277 79983 59672 229173 317855 108212 -20369 94632 -247100 -135151
842 -135151 -69599 150126 49493 159537 283766 44288 -173768 -62597 -120168 42317
832 42317 220539 264374 225206 165478 -91432 68147 73202 5505 -35735 -40139 -27625 -72813
820 -72813 -39775 10545 -139058 -67937 -274751 -396807 -5006 214743 -245824 -323300 12452
809 12452 84846 25841 -29623 43480 446385 132844 74689 337611 -65296 -116640 -368242
798c68242K17793L68658K1389p035j43657j62184J73370k88007j76932p7996L93600
787d9243K40822o1729J6381j18648n79704O0732K55679M04194k30579J38480j04555
776b8170L91948r992k48460q241j32060K5524k27921p978M82139J617j81803j08403
764e1800J96095k8232l13626j1487K03229j36233k80195L38284J0837O9505P8525
753G4902l5413K86651P830l79329K68397p170j15794M13906r8070k14411j45299
742E6200n4180Q8688m47030J94333k02381J58807J64367K71964J67443j22593
732B75618q586K64582j37640k94390L03208j68241k22440P1141K82646L279l84839
721a5662O5666j11637q1751L14301K2700J6720j30924L62853j95152l84973j45531
$$ plain form
798 -368242 -150449 218209 239598 232563 88906 -73278 100092 -187915 -364847 -442843 -49243
787 -49243 191579 129850 146231 27583 -552121 -491389 -235710 168484 -62095 76385 -28170
776 -28170 363778 353786 105326 97085 -34975 -9451 -237372 -245350 236789 238406 56603 -51800
764 -51800 144295 116063 -197563 -209050 -5821 -142054 -422249 -83965 -73128 -3623 74902
753 74902 39489 326140 333970 -45359 223038 215868 100074 513980 415910 201499 56200
742 56200 2020 90708 -356322 -161989 -364370 -205563 -41196 230768 398211 275618
732 275618 267032 531614 393974 99584 402792 234551 12111 83252 365898 369177 -15662
721 -15662 50004 -61633 -143384 170917 193617 210337 79413 442266 247114 -137859 -283390
710b83390J8188Q7129k2886L12688R7280K53513k50657l32882j3624r7256K04091
699b7806L2578N5943k30746J05877J21174j22796J41194j57775J71065k62422
689a73714K41576J10689p5632j6897K92150k24326J08227O8361j85549J58287
679C03172l3839j48195J7685K17995j98732j93420q1892L48899j05823n366L7693
668A58177O5680K82639o7645k23070O2502k527j25685L02061Q2852M50J51950
657F87384k31104l28584M67q5735L2410J43688j20308p3447q2343J10708M24100
646D77236j80449j26986K83372j70826k8529J28975K7455k87282J33621J57843
636D14430l72346r9762L14744j61749q8067j30643j1162K17029M283J16378J46673
$$ plain form
710 -283390 -265202 -178073 -200959 111729 209009 462522 211865 -121017 -134641 -231897 -27806
699 -27806 4772 60715 -170031 -64154 57020 -65776 75418 -82357 88708 -173714
689 -173714 67862 178551 102919 86022 378172 153846 262073 330434 144885 303172
679 303172 269333 121138 138823 356818 158086 -35334 -117226 231673 125850 120484 158177
668 158177 223857 506496 438851 215781 278283 275756 150071 452132 534984 535434 687384
657 687384 456280 127696 128163 42428 74838 218526 98218 24771 -57572 53136 477236
646 477236 296787 169801 453173 282347 253818 382793 410248 122966 256587 414430
636 414430 42084 -57678 257066 95317 7250 -123393 -134555 82474 86757 203135 349808
625C49808k63013K13063J71984k41969J21950P8574m13275j17020J79510j61445
615h1833l45350L39287R2514J90388J89408J36855j22657k39401R7176k306K00044
604D54125j64226P1622j89455j03152p5845m0782M8113j93342M40967r3420k19086
593f4481l301J83945K21670m06176J02242j87276r6758K95253J29520q4707K9293
582A19224j14151q7957K80646j07834J22625J35146k74631J86236Q5667j08478
572B36493k50211m4114J00720K58255J66085p8782k6750l9906J11261J15730j98986
561C49795j18635j37277L54313J91661j75748Q7048p1952j84037R5345k36334
551A54179M1567P6852l90617M29987Q196J74287J98901l30793j14843K73102k8354
$$ plain form
625 349808 86795 299858 471842 229873 351823 430397 17122 -99898 79612 -81833
615 -81833 -427183 -87896 4618 195006 384414 521269 398612 159211 256387 254081 454125
604 454125 289899 361521 172066 68914 -6931 -47713 400 -192942 248025 154605 -64481
593 -64481 -67782 116163 337833 -68343 33899 -153377 -250135 45118 174638 89931 119224
582 119224 5073 -82884 197762 89928 212553 347699 73068 259304 344971 236493
572 236493 -13718 -57832 42888 301143 467228 388446 361696 321790 433051 548781 349795
561 349795 231160 93883 448196 639857 464109 551157 479205 295168 390513 154179
551 154179 195746 272598 -118019 311968 320164 494451 693352 362559 247716 520818 492464
540D92464k21725j25813P1404N3557k08983J84565p4934J17431Q7975K5829j29277
529B72493k77037n7736J64251L5031K04490K40661m12763l46076m6241R5713K81417
518A54203o7069k30942L42292l7033p0813K18757j55763O0513k76957j3649K49782
507A73321K80444K02648q8084K1702j70980q5966J48727J0705k43243J4864O7248
496C31386J5683J6029l71896K96572J19911j36982J59208j47328K45983k73933
486B54633L39668K72230l20949k34417p3858K06274l01496O7770j32661M5063
476A22257J25981k82648K45856o7104J23722K01717J19254m63676K42912L3689
466D01960m22725R2397J04906K46455p2789k4422J24214m5508k66949j03597K1654
$$ plain form
540 492464 270739 144926 216330 269887 60904 245469 170535 287966 375941 401770 272493
529 272493 -4544 -62280 101971 137002 341492 582153 169390 -176686 -222927 -127214 154203
518 154203 87134 -143808 198484 161451 90638 309395 153632 214145 -62812 -76461 173321
507 173321 453765 656413 568329 590031 419051 333085 481812 492517 249274 264138 331386
496 331386 347069 363098 -8798 287774 407685 270703 429911 282583 528566 254633
486 254633 594301 866531 545582 311165 237307 443581 142085 209855 77194 122257
476 122257 248238 -34410 211446 144342 268064 469781 589035 125359 368271 401960
466 401960 -20765 71632 176538 422993 350204 325782 449996 404488 137539 33942 55596
455E5596N6643P4373L46837j34226k78804j91957n2730N47157O714J61765L6951
444F28319l12074o1751p9311J68943K92868k48508n6755L19711j73133l591l37891
433A36827K54910P7166k93021K64012K03467j75368k6882M3838l3251j53925J39422
422D37195N00793j72566k08590j86421O5870K46361j95810j5965K63270k58999
412D75138l27621m4065L45369K20092N3455J2959j90876q0776J73795r5319j64029
401C78122p8286K0911K06596J0047k59815R563j13499J77474N0866m632J90251
390E87598j59744k12848J96950L00465r2397M2755M9111O245r3409l90791R2589
379C26524n3329P6234J05252Q9884j85996J26184J45992R1828j79534l15574Q0268
$$ plain form
455 55596 112239 186612 533449 399223 120419 -71538 -124268 422889 429603 591368 628319
444 628319 316245 254494 175183 344126 636994 388486 331731 651442 478309 474718 136827
433 136827 391737 468903 175882 439894 643361 467993 441111 484949 451698 297773 437195
422 437195 937988 765422 556832 370411 436281 682642 486832 470867 734137 475138
412 475138 147517 103452 448821 668913 722368 735327 544451 463675 637470 542151 378122
401 378122 299836 320747 527343 537390 277575 287138 173639 351113 401979 397347 587598
390 587598 427854 215006 411956 712421 620024 662779 711890 718135 624726 233935 326524
379 326524 273195 349429 454681 544565 358569 484753 630745 722573 543039 227465 307733
368C07733K88021J18656k57614k24159M05804J33705k28809K65563o2093N4672
358H01479l09690P3959k37628J35784R4850j39895q1283O2293p4493J95424J51081
347F71881K2458m94609l5835L71113J28946l38841p0513L05215O5760j96746P6577
336E05406k06924Q6679K80567j17509j76835K57174K10868l4641k29469L192J39828
325G18336J39910r3497J77328n07370M4586O4007j88051K89302j21684q3488k27154
314B12225K35996R2715J55668N8366P6822J4003k07492j57830K46145j33047J38921
303G32492j57214P4106q1323l24160L84490o3915n6930Q8866j56088j02459r9121
292B38744J93130Q5202m7131k56605J80767R1102K386j52156q5182P1682L39879
$$ plain form
368 307733 595754 714410 456796 232637 638441 772146 543337 808900 746807 801479
358 801479 491789 565748 328120 463904 558754 418859 337576 399869 325376 520800 671881
347 671881 694339 199730 163895 535008 663954 325113 254600 559815 625575 428829 505406
336 505406 298482 385161 665728 548219 371384 628558 839426 804785 575316 578508 718336
325 718336 858246 764749 942077 434707 479293 543300 355249 644551 522867 439379 212225
314 212225 448221 540936 696604 754970 831792 845795 638303 480473 726618 593571 732492
303 732492 575278 649384 568061 243901 628391 564476 507546 596412 440324 337865 238744
292 238744 431874 517076 469945 213340 394107 485209 487595 335439 250257 321939 661818
281F61818J23542j35111m32955k17814K337L20624K55992R2484j36683J39272
271F73506l64813J06214J90838K00423j75291j34975L80994j31847j96618L97240
261I45671l17839k39985J28783n9636K27702K963k42802P3075J8307q5585N6447
250E07101k16826M08017r3264M5662M0997p2593k43937J29187J28168k24270J7985
239D26227J49691J76529q669l25031O5570l313J94781K38071j78245n2368j49349
228E33894j78983M9330J70611K00419l1662M1375Q6208P2480q9670k29352k77405
217C47245K3531M0707k58048k3820K04601j46599J36437J99410K71594k07522
207E87536J4768J04654J35321j29632j53751P135K6793J18542n921J08815K4185
$$ plain form
281 661818 785360 650249 217294 -520 1817 322441 578433 670917 534234 673506
271 673506 308693 414907 605745 806168 630877 495902 876896 745049 548431 945671
261 945671 627832 387847 516630 456994 684696 687659 444857 517932 536239 450654 507101
250 507101 290275 698292 605028 650690 691687 619094 375157 504344 632512 408242 426227
239 426227 575918 752447 743778 418747 484317 481004 675785 913856 735611 683243 533894
228 533894 354911 404241 574852 775271 743609 784984 871192 943672 854002 624650 347245
217 347245 370776 411483 153435 129615 334216 187617 324054 523464 795058 587536
207 587536 602304 706958 842279 712647 558896 566031 592824 711366 705445 814260 838445
196H38445O1938k03999N9966j64738k15812J15351K91631O8453o2988r9601L845
185F92491m683l61305J21779J81096J49145j04014o12961R7286J95561K31393
175E85788j30094q3033L65679J87396j23768j30431J28867j29466m817p8844j1355
164E75922n8753n4768J5296r7097N6406K04991J18806l9874r0609r0258P1436
153F11498N7725k42486q0189N9363j0150q8011q7527K14091q7010K05888j17432
142D35760K4132J04934L7308N2112n308L00357n8485k40769k25833P4645J81732
131F80585J9507r235k6192J61570N5116q3264k84653K33939P8153j88515m03173
120B33838J36492K24394K7290K42312j66020p7425m7578J11369K0462M1732O0066
$$ plain form
196 838445 900383 696384 756350 591612 375800 491151 782782 851235 788247 688646 692491
185 692491 687808 326503 448282 629378 778523 674509 61548 158834 354395 585788
175 585788 455694 372661 738340 925736 801968 671537 800404 670938 666121 587277 575922
164 575922 517169 462401 477697 380600 437006 641997 760803 720929 630320 540062 611498
153 611498 669223 426737 346548 405911 395761 307750 220223 434314 347304 553192 435760
142 435760 459892 564826 602134 654246 648938 949295 890810 650041 424208 498853 680585
131 680585 700092 690857 664665 826235 881351 798087 513434 747373 825526 637011 233838
120 233838 370330 594724 622014 864326 698306 620881 573303 684672 705134 746866 806932
109H06932K19011L4600l07127k49230J18299L4315R5557k01218K99647K758l56275
98D97269J7549R1884P0118o4568J33293o3590j26860J9670J67789J04553j20058
87G27049N2870j11250K4287n1770O8818r6516K8128n9442j55233J41271L9062
76F07274k15139m6259L13919R7844P7368j43462j86946j22412K16254K16599l79984
65D35056J997J1356K27555j64076P6474K92231N9181j13203m68204n0918J92744
54E00193Q5928N1349N2030P4705n6562k7118J61912q0689R4259j58950J40366
43H37423K0844q1507q1395P3731m4799l01k16853R4800N8592J83002j31569k82097
31D29871J28365J99920J1904j13182N967K05981P2141m24889n9556J49082R8205
$$ plain form
109 806932 1025943 1060543 753416 504186 622485 656800 752357 551139 850786 853544 497269
98 497269 514818 606702 676820 612252 745545 681955 555095 574765 742554 847107 727049
87 727049 779919 668669 692956 641186 710004 613488 641616 582174 426941 568212 607274
76 607274 392135 345876 659795 757639 835007 691545 504599 382187 598441 815040 435056
65 435056 437053 448409 675964 511888 588362 880593 939774 826571 358367 307449 500193
54 500193 586121 637470 689500 764205 707643 680525 842437 761748 856007 697057 837423
43 837423 858267 776760 695365 769096 724297 723996 507143 601943 660535 843537 711968 429871
31 429871 558236 758156 770060 656878 662845 868826 940967 516078 456522 605604 703809
20G03809n2370l35856J12790j08740L41073O7413k06453J3156K22143L1092K5609
9H13666J05289q0303o470m2363r9095l9908M0380j661m2773
0F46762
$$ plain form
20 703809 651439 315583 428373 319633 660706 728119 521666 534822 756965 788057 813666
9 813666 918955 838652 832182 789819 690724 650816 691196 689535 646762
0 646762
$$ Imaginary data points
##PAGE= N=2
##DATA TABLE= (X++(I..I)), XYDATA
16383a256634l04849L3786K83132O8359K3304L05329K38413j61328l80951k08419
16373a359858P6780M2087J26258K78669r1550J20366j35640l4654J51941k76056
16363a101657k7305N8578L129J14728L4979J47609j2502o072O3559o564m267J81307
16351e54478N990J1114k33424Q477p6054N7553k900J51023J95553j45674n014
16340e87834K32449J36347R5573k55230l82664M2420R328M4036L01409j24957
16330d89123j19231r8076O5417L24170j65989J32236R4212J98938j4827k5502
16320i7775j25949m1223J33407J35659j48072l23508P2357J97041J61573k12402
16310b48892p8234J54510J52360J05775K7352J3113j46783q0538k2976R1300m0989
$$ plain form
16383 -1256634 -1561483 -1527697 -1244565 -1176206 -1152902 -847573 -609160 -770488 -1151439 -1359858
16373 -1359858 -1283078 -1240991 -1114733 -836064 -927614 -807248 -942888 -977542 -825601 -1101657
16363 -1101657 -1128962 -1070384 -1067255 -952527 -917548 -769939 -782441 -788513 -724954 -731518 -735785 -554478
16351 -554478 -548488 -537374 -770798 -762321 -838375 -780822 -783722 -632699 -437146 -582820 -587834
16340 -587834 -355385 -219038 -123465 -378695 -761359 -718939 -709611 -665575 -364166 -489123
16330 -489123 -608354 -706430 -641013 -316843 -482832 -350596 -256384 -57446 -72273 -97775
16320 -97775 -223724 -264947 -131540 4119 -143953 -467461 -395104 -198063 -36490 -248892
16310 -248892 -327126 -172616 -20256 85519 112871 125984 -20799 -101337 -124313 -33013 -74002
16299g4002J84186K8762k6851O6822K02316j79611k14153R2025J76181l58669
16289a02994J87873M0541R1082L40574J95058j71291k2210R5550k38234j00044
16279C15905R0552K03790r1202R884M8233k36025k31251L23719J41958j57697
16269D17866n1230P0965j86565k2399J39216J42542q1992P8745K47751K34076
16259I88975j36298p8424j92152K4353l4934J10749q2046n2574J60440j36789
16249E71300L1833L5646K69668K45978l11652m2561k09928o7209O0499j18401
16239D65173J37016L8221J97341j70241K8286o928K81147P3019k46625o9156M1952
16228G69205j4476K50416l01J62868k08850k87552j17904R8900J39012N1487O8120
$$ plain form
16299 -74002 110184 138946 112095 178917 381233 201622 -12531 79494 255675 -102994
16289 -102994 84879 125420 216502 557076 752134 580843 558633 654183 415949 315905
16279 315905 406457 610247 519045 528929 577162 341137 109886 433605 575563 417866
16269 417866 366636 437601 251036 228637 367853 510395 428403 507148 754899 988975
16259 988975 852677 774253 582101 606454 571520 682269 600223 547649 708089 571300
16249 571300 603133 638779 908447 1154425 842773 800212 590284 523075 583574 465173
16239 465173 602189 640410 837751 667510 695796 688868 970015 1043034 796409 727253 769205
16228 769205 754729 1005145 1004844 1167712 958862 671310 553406 652306 791318 842805 910925
16217I10925J27828R6611k16504m5076l920N2775Q0434k588K04890r2839m1296
16206A071240j8567l52911J54591J96268J47743j71370j28562j11237J56609j49637
16196G94167j42133L07307K73399o1755j72292J6153m3314J00129Q7134o3426
16186A095369J14900J62500j70226j39703j40054j5692J80672K75949q6193k74066
16176A003456J85829J42111J35230k65317j07703M03422M9148l6391N4893j62567
16166A402111j37141j88953l1705K35581l3930J00883L9509j27846K08625J53379
16156A620513j65652p0473J07126p201j53750k57641k71573J41437M18444r3931
16146A267299k76007K33037J81312R5360j18896j56947K27648m22208o4740M15409
$$ plain form
16217 910925 1038753 1135364 918860 873784 869864 922639 1003073 1000485 1205375 1112536 1071240
16206 1071240 1052673 699762 854353 1050621 1198364 1026994 898432 787195 943804 794167
16196 794167 652034 959341 1232740 1170985 998693 1014846 971532 1071661 1158795 1095369
16186 1095369 1210269 1372769 1202543 1062840 922786 907094 1087766 1363715 1277522 1003456
16176 1003456 1189285 1331396 1466626 1201309 1093606 1497028 1546176 1509785 1564678 1402111
16166 1402111 1264970 1076017 1044312 1279893 1245963 1346846 1386355 1258509 1467134 1620513
16156 1620513 1454861 1384388 1491514 1484313 1330563 1072922 801349 942786 1361230 1267299
16146 1267299 991292 1224329 1405641 1501001 1382105 1225158 1452806 1030598 965858 1381267
16136A381267J31061m7408k41540j00629R0199j97471K85553l7633j39958K21156
16126A344597Q7750k62333l22091K36961L94431j04819P6834j8435j09229J03912
16116A427578m8758j30514J2824j17517P3128J70358l12608L2506P1529J68430
16106A346956p2134P3600J67378j59784k28821J69124R5323j49348J96710K08029
16096A647033j31844P3722j26372k82332K64412K31444j98577n3940Q163J8303
16086A450012j20632K52023Q0473k22801J60022J13637l04409l4456J7912j69109
16076A222672J1794L13686k12733k88945L11923K41056j7654n6291j11286p7962
16066A336260m7152k56485K47998K72532j24303J18204L0304q6666J2869j73537
$$ plain form
16136 1381267 1512328 1464920 1223380 1122751 1212950 1015479 1301032 1263399 1123441 1344597
16126 1344597 1432347 1170014 847923 1084884 1479315 1374496 1451330 1432895 1323666 1427578
16116 1427578 1378820 1248306 1261130 1143613 1216741 1387099 1074491 1106997 1178526 1346956
16106 1346956 1274822 1348422 1515800 1356016 1127195 1296319 1391642 1242294 1439004 1647033
16096 1647033 1515189 1588911 1462539 1180207 1444619 1676063 1477486 1423546 1431709 1450012
16086 1450012 1329380 1581403 1661876 1439075 1599097 1712734 1408325 1373869 1391781 1222672
16076 1222672 1234466 1548152 1335419 1046474 1358397 1599453 1581799 1525508 1414222 1336260
16066 1336260 1289108 1032623 1280621 1553153 1428850 1547054 1577358 1490692 1503561 1330024
16056A330024J11452j52066J53938L8711n0800j73995J20289K69710l9577m10611
16046A197075n6319M25203J33325J91134o0648k27279l2127J55744m0242j26250
16036A559616r6366k41009J53809J96421l00372M9431L48806P064k89475J7765
16026A405690P0064L68856j48883l63776j07881m2065K91173j77924n8775L3857
16016A270336j04195j8991K21432n0787J97467M3719l23372J67507l087n2494
16006A347535K63433N794k33153j1997M3669J55827Q6599m5122J22333j71410
15996A563508J77927n8483l60304J08723j21175Q0268k06617N7644j54673J60682
15986A247500J09248o9815k23073J17618n2497L1450j7491J47838J45286J57382
$$ plain form
16056 1330024 1441476 1289410 1443348 1482059 1431259 1257264 1377553 1647263 1607686 1197075
16046 1197075 1140756 1565959 1699284 1890418 1829770 1602491 1570364 1726108 1685866 1559616
16036 1559616 1463250 1222241 1376050 1572471 1272099 1321530 1670336 1677400 1387925 1405690
16026 1405690 1475754 1844610 1695727 1331951 1224070 1182005 1473178 1295254 1236479 1270336
16016 1270336 1166141 1147150 1368582 1317795 1515262 1558981 1235609 1403116 1400029 1347535
16006 1347535 1610968 1616762 1383609 1371612 1415281 1571108 1657707 1612585 1734918 1563508
15996 1563508 1741435 1682952 1322648 1431371 1310196 1390464 1183847 1241491 1086818 1247500
15986 1247500 1356748 1286933 1063860 1181478 1128981 1160431 1142940 1290778 1436064 1593446
15976A593446O4617j11655J56175l96271l6685K91880K93370n1544J20919O228
15966A930480M8015Q1519k26485l88837k30023L10265j39400l62732K08388m8162
15956A183028J54060N0437j61342l6449K62237k8792N9184n6567K7009m5715o9423
15945A337667J72610O487l50629m897O68749r5226j95183l77797J88764K31960
15935A582505j15353Q1544O0454j28431K7790K89876k55410m43895L48527L65466
15925A813073M39300k49988l36779K4178m53830J61424j39923j88147J00716J99856
15915A369880J5725J47478N4943m75l3231k18597l26057R9821K3200P3354J76630
15904A382671J13386l4786L94531J06715k34046J20670j48854k01436k65216J68366
$$ plain form
15976 1593446 1658063 1546408 1702583 1306312 1269627 1561507 1854877 1803333 1924252 1930480
15966 1930480 1978495 2060014 1833529 1444692 1214669 1524934 1385534 1022802 1231190 1183028
15956 1183028 1337088 1387525 1226183 1189734 1451971 1423179 1482363 1425796 1452805 1407090 1337667
15945 1337667 1510277 1516764 1166135 1161238 1829987 1734761 1539578 1161781 1350545 1582505
15935 1582505 1467152 1548696 1609150 1480719 1508509 1798385 1542975 1099080 1447607 1813073
15925 1813073 2252373 2002385 1665606 1689784 1235954 1397378 1257455 1069308 1170024 1369880
15915 1369880 1385605 1533083 1588026 1587551 1554320 1335723 1009666 1109487 1132687 1206041 1382671
15904 1382671 1496057 1461271 1855802 1962517 1728471 1849141 1700287 1498851 1233635 1402001
15894A402001L30028j05l91491k27394L4701K14501L07059m5278j75174K03300
15884A652148r5092k22875K76322K55197j34570k21931k06827n0080J21950L7207
15874A411449r7966j20975J90359N176j3523J16920K26779j26809k24128m8258
15864A319024L55607j10709j60878p870J91251L27794m11032k0618j12222k60014
15854A110333J69192J28219j82812K60164L3534j32610R5066m091o1879k55652
15844A159464M17150J76512l43945j75716P3772J15736j3049J91653l32572M5452
15834A314457J43094p08J95948j28916k18492q224K13837K11279k94661Q2044
15824A509658K02389P2790j34315m30625J20926K67331n2335K7563L34387L3354
$$ plain form
15894 1402001 1732029 1731924 1340433 1113039 1147740 1362241 1669300 1624022 1448848 1652148
15884 1652148 1557056 1334181 1610503 1865700 1731130 1509199 1302372 1252292 1374242 1411449
15874 1411449 1313483 1192508 1382867 1388043 1374520 1491440 1718219 1591410 1367282 1319024
15864 1319024 1674631 1563922 1403044 1395174 1586425 1914219 1503187 1482569 1370347 1110333
15854 1110333 1279525 1407744 1224932 1485096 1518630 1386020 1481086 1476995 1415116 1159464
15844 1159464 1576614 1753126 1409181 1233465 1307237 1422973 1409924 1601577 1269005 1314457
15834 1314457 1457551 1456843 1652791 1523875 1305383 1297159 1510996 1722275 1427614 1509658
15824 1509658 1712047 1784837 1650522 1219897 1340823 1608154 1555819 1583382 1917769 1951123
15814A951123l82269j19705L29174J94407m62698k52734K95062l08983L41979
15805A585356Q1646k39564P5596j2274O0698M3994n5434m67213J88015l8268L12732
15794A535284M6503n95866N9521M50335j4261J02375J9394J8354P9390k13288
15784A487741j2238m7099j48042J23202K72292k11551j9995r1990j06693L40349
15774A585976k6702j04899j26027K46117J06088l46267j57052j70360L71580L80876
15764A759330l26636o4825P6335J51504J41354M2632l77917j42602M05246j83500
15754A480921O5956J81430O6679l6706k63098J4601O0790j02307r10M7181j21025
15743A393512q3775O2607j05942Q7984J49173M4047k71369p5560J43441L17969
$$ plain form
15814 1951123 1568854 1449149 1778323 1972730 1510032 1257298 1552360 1243377 1585356
15805 1585356 1667002 1427438 1503034 1490760 1551458 1595452 1540018 1072805 1260820 1222552 1535284
15794 1535284 1581787 985921 1045442 1495777 1481516 1583891 1603285 1621639 1701029 1487741
15784 1487741 1475503 1428404 1280362 1403564 1675856 1464305 1444310 1352320 1245627 1585976
15774 1585976 1559274 1454375 1328348 1574465 1680553 1334286 1177234 1006874 1378454 1759330
15764 1759330 1432694 1367869 1444204 1595708 1737062 1779694 1401777 1259175 1664421 1480921
15754 1480921 1546877 1728307 1794986 1758280 1495182 1509783 1570573 1468266 1467356 1514537 1393512
15743 1393512 1309737 1372344 1266402 1354386 1503559 1547606 1276237 1200677 1344118 1662087
15733A662087Q2233k57653j46185q1239R6073J46734J22111j48746k72503K44620
15723A447532J28592k56377J70184j48526l8064J68095J31419J0842q671J87074
15713A792100L9750L2384j45801l84559k03330J05726j95954J80044K4718K58860
15703A503938M3035q0708K53019j47416K21846J15422l64619k56940k65038L81390
15693A403929J88335J42681j26149l26484J64642j9869M1091r9133l52975P3228
15683A089296J98280K33382l645J9242K6257R70L0956l42982J70594r7982K2324
15672A346692L9577p0779L02818l5416j72193j40903j44061Q6431M48643O2548
15662A723357m5379R727l9392l13143q7490L55916j72477k56933J01577J80815
$$ plain form
15733 1662087 1744320 1486667 1340482 1259243 1355316 1502050 1624161 1475415 1202912 1447532
15723 1447532 1576124 1319747 1489931 1341405 1303341 1471436 1602855 1613697 1605026 1792100
15713 1792100 1831850 1864234 1718433 1333874 1130544 1236270 1040316 1220360 1245078 1503938
15703 1503938 1546973 1466265 1719284 1571868 1793714 1909136 1544517 1287577 1022539 1403929
15693 1403929 1592264 1734945 1608796 1282312 1446954 1427085 1468176 1369043 1016068 1089296
15683 1089296 1287576 1520958 1517313 1536555 1562812 1563782 1594738 1251756 1422350 1324368 1346692
15672 1346692 1386269 1315490 1618308 1582892 1410699 1269796 1125735 1212166 1660809 1723357
15662 1723357 1677978 1687705 1648313 1335170 1247680 1603596 1431119 1174186 1275763 1456578
15652A456578K61k2994j80271K67938r4563K77770j54688Q0259l4994j57195K40702
15641A678803K1678P5203M7737k13713j9876J34237Q0695O0918j61537m5024R5662
15630A754783L1573r114n6150k80632L11328K2204K65802l86145l06899O1035
15620A407785J53042R6614q7358p8753J04042J85474q5325k48365L01123l4851
15610A713428p1270k18306j41319J01490J28059L22678j71003j99060m96310O8405
15600A036792L92756K31134k81814m3957L19481O6784j94601k82052O5401J72913
15590A482837j02804n9222J23990K5697q7686k7450k21081N7821L43892K10887
15580A746881P1682k59373k230N4242N7446l6923l19184J63055L03597k12864
$$ plain form
15652 1456578 1456839 1433845 1253574 1521512 1426949 1704719 1550031 1630290 1595296 1438101 1678803
15641 1678803 1700481 1775684 1823421 1609708 1589832 1724069 1804764 1865682 1704145 1659121 1754783
15630 1754783 1786356 1777242 1721092 1440460 1751788 1773992 2039794 1653649 1346750 1407785
15620 1407785 1560827 1657441 1570083 1491330 1595372 1780846 1695521 1447156 1748279 1713428
15610 1713428 1642158 1423852 1282533 1384023 1512082 1834760 1663757 1464697 968387 1036792
15600 1036792 1429548 1660682 1378868 1334911 1654392 1721176 1526575 1244523 1309924 1482837
15590 1482837 1380033 1320811 1444801 1470498 1382812 1355362 1134281 1192102 1535994 1746881
15580 1746881 1818563 1559190 1556960 1611202 1668648 1631725 1312541 1475596 1779193 1566329
15570A566329J73270k656k18737k28113j07703M71935M427J44478l97997N12258
15560A917491k80679J87252K38689j91452m69447O4424j00728j71961N37326K03785
15550A934700l75102l7458K63871N9034k41985n39517L66891J1194j74988l026
15540A263614K00339N1957j15502j43655l992O6077K72705k18129m9006O1323
15530A385731j9392n0573K57965j46170L50282l0762j3002N6336K60219J82232
15520B232866l45988j09447m2540j9415J45212m7800p297k81642l17926j76730
15510A029293M64492M08992n7430j70345j13544m16235Q6093J25389J65434L24269
$$ plain form
15570 1566329 1739599 1736943 1518206 1290093 1182390 1654325 1658752 1803230 1405233 1917491
15560 1917491 1636812 1824064 2062753 1871301 1401854 1466278 1365550 1193589 1730915 1934700
15550 1934700 1559598 1522140 1786011 1845045 1603060 1063543 1430434 1441628 1266640 1263614
15540 1263614 1463953 1515910 1400408 1256753 1252761 1318838 1591543 1373414 1324408 1385731
15530 1385731 1366339 1315766 1573731 1427561 1777843 1747081 1734079 1790415 2050634 2232866
15520 2232866 1886878 1777431 1734891 1715476 1860688 1812888 1805591 1523949 1206023 1029293
15510 1029293 1493785 1902777 1845347 1675002 1561458 1145223 1231316 1356705 1522139 1846408
$$ [...]
##END NTUPLES=NMR SPECTRUM
##END=
