##TITLE=1H_CG-1168
 CDCl3
 8 sc, 
 15.11.2022
##JCAMPDX= 6.0         $$ Bruker NMR JCAMP-DX V2.0
##DATA TYPE= NMR SPECTRUM
##DATA CLASS= NTUPLES
##ORIGIN= UXNMR, Bruker Analytische Messtechnik GmbH
##OWNER= root
$$ XWIN-NMR		Version 3.5
$$ Tue Nov 15 15:48:31 2022 Russian Standard Time (UT+4h)  she@DPX200
##.OBSERVE FREQUENCY= 200.1313499994
##.OBSERVE NUCLEUS= ^1H
##.ACQUISITION MODE= SIMULTANEOUS
##.ACQUISITION SCHEME= undefined
##.AVERAGES= 8
##.DIGITISER RES= 18
##SPECTROMETER/DATA SYSTEM= spect
##.PULSE SEQUENCE= zg30
##.SOLVENT NAME= Acetone
##.SHIFT REFERENCE= (INTERNAL, Acetone, 0, 15.7326)
##AUDIT TRAIL= $$ (NUMBER, WHEN, WHO, WHERE, WHAT)
$$ ##TITLE= Audit trail, XWIN-NMR		Version 3.5
$$ ##JCAMPDX= 5.01
$$ ##ORIGIN= Bruker BioSpin GmbH
$$ ##OWNER= she
$$ F:/spectra/data/she/nmr/H-F/1/pdata/1/auditp.txt
$$ ##AUDIT TRAIL=  $$ (NUMBER, WHEN, WHO, WHERE, WHAT)
(   1,<2022-11-15 15:47:27.56 +0400>,<she>,<DPX200>,
      <created by zg, POWCHK disabled, PULCHK disabled
       configuration hash MD5:
       00 E9 B6 7A A2 85 ED C7 34 08 36 98 17 FE 4E 26
       data hash MD5: 16K
       7E D5 F1 DB 1A B1 05 AA EC D7 5E BA 6D F7 F3 CB>)
(   2,<2022-11-15 15:47:29.75 +0400>,<she>,<DPX200>,
      <Start of raw data processing
       efp BC_mod = 2 LB = 0.24 FT_mod = 6 PKNL = 1 PHC0 = -18041.68 PHC1 = 26.8007 SI = 16K 
       data hash MD5: 16K
       48 BF E4 2B ED 4F BC AF 98 94 CB 6C D2 CA BE 95>)
(   3,<2022-11-15 15:47:42.65 +0400>,<she>,<DPX200>,
      <pk PHC0 = -2.538058 PHC1 = 2 
       data hash MD5: 16K
       87 B5 74 DE F1 E5 BE 31 22 60 F5 B6 60 11 EC CC>)
(   4,<2022-11-15 15:47:45.60 +0400>,<she>,<DPX200>,
      <abs ABSG = 5 
       data hash MD5: 16K
       F4 17 C2 7F 12 6B AB 9F A7 E0 82 F7 9A B9 34 4F>)
$$ ##END=
$$ 
$$ hash MD5
$$ 84 9D F4 1D DC 89 9E 58 5A F3 A7 1C 66 8F FF 3A
##$RELAX= 
##$RELAX= 
##$RELAX= 
##$RELAX= 
##$RELAX= 
##$RELAX= 
$$ Bruker specific parameters
$$ --------------------------
##$DU= <F:/spectra>
##$EXPNO= 1
##$NAME= <H-F>
##$PROCNO= 1
##$TYPE= <nmr>
##$USER= <she>
##$AMP= (0..31)
100 100 100 100 100 100 100 100 100 100 100 100 100 100 100 100 100 100 
100 100 100 100 100 100 100 100 100 100 100 100 100 100 
##$AQSEQ= 0
##$AQ_mod= 1
##$AUNM= <au_zg>
##$AUTOPOS= <>
##$BF1= 200.13
##$BF2= 200.13
##$BF3= 200.13
##$BF4= 200.13
##$BF5= 200.13
##$BF6= 200.13
##$BF7= 200.13
##$BF8= 200.13
##$BYTORDA= 1
##$CFDGTYP= 0
##$CFRGTYP= 5
##$CHEMSTR= <none>
##$CNST= (0..31)
1 1 145 1 1 1 1 1 1 1 1 1 1 1 1 1 1 1 1 1 1 1 1 1 1 1 1 1 1 1 1 1 
##$CPDPRG= <>
##$CPDPRG1= <>
##$CPDPRG2= <>
##$CPDPRG3= <>
##$CPDPRG4= <mlev>
##$CPDPRG5= <mlev>
##$CPDPRG6= <mlev>
##$CPDPRG7= <mlev>
##$CPDPRG8= <mlev>
##$CPDPRGB= <>
##$CPDPRGT= <>
##$D= (0..31)
0 1.2 0 0 0 0 0 0 0 0.06 0 0.03 0 0 0 0 0.0002 0 0 0 0 0 0 0 0 0 0 0 0 
0 0 0 
##$DATE= 1668512846
##$DBL= (0..7)
120 120 120 120 120 120 120 120 
##$DBP= (0..7)
150 150 150 150 150 150 150 150 
##$DBP07= 0
##$DBPNAM0= <>
##$DBPNAM1= <>
##$DBPNAM2= <>
##$DBPNAM3= <>
##$DBPNAM4= <>
$$ [...]
##$SUBNAM3= <"">
##$SUBNAM4= <"">
##$SUBNAM5= <"">
##$SUBNAM6= <"">
##$SUBNAM7= <"">
##$SUBNAM8= <"">
##$SUBNAM9= <"">
##$SW= 18.0517283424941
##$SWIBOX= (0..15)
0 0 2 0 0 0 0 0 0 0 0 0 0 0 0 0 
##$SW_h= 3612.71676300578
##$TD= 16384
##$TD0= 1
##$TE= 0
##$TE2= 300
##$TE3= 300
##$TEG= 300
##$TL= (0..7)
0 120 120 120 120 120 120 120 
##$TP= (0..7)
150 150 150 150 150 150 150 150 
##$TP07= 0
##$TPNAME0= <>
##$TPNAME1= <>
##$TPNAME2= <>
##$TPNAME3= <>
##$TPNAME4= <>
##$TPNAME5= <>
##$TPNAME6= <>
##$TPNAME7= <>
##$TPOAL= (0..7)
0.5 0.5 0.5 0.5 0.5 0.5 0.5 0.5 
##$TPOFFS= (0..7)
0 0 0 0 0 0 0 0 
##$TUNHIN= 0
##$TUNHOUT= 0
##$TUNXOUT= 0
##$USERA1= <user>
##$USERA2= <user>
##$USERA3= <user>
##$USERA4= <user>
##$USERA5= <user>
##$V9= 5
##$VALIST= <valist>
##$VCLIST= <CCCCCCCCCCCCCCC>
##$VD= 0
##$VDLIST= <DDDDDDDDDDDDDDD>
##$VPLIST= <PPPPPPPPPPPPPPP>
##$VTLIST= <TTTTTTTTTTTTTTT>
##$WBST= 1024
##$WBSW= 4
##$XGAIN= (0..3)
0 0 0 0 
##$XL= 0
##$YL= 0
##$YMAX_a= 98850
##$YMIN_a= -102393
##$ZGOPTNS= <>
##$ZL1= 120
##$ZL2= 120
##$ZL3= 120
##$ZL4= 120
##$ABSF1= 15.77554
##$ABSF2= -2.276309
##$ABSG= 5
##$ABSL= 3
##$ALPHA= 0
##$AQORDER= 0
##$ASSFAC= 0
##$ASSFACI= 0
##$ASSFACX= 0
##$ASSWID= 0
##$AUNMP= <proc_1d>
##$AZFE= 0.1
##$AZFW= 0.1
##$BCFW= 0
##$BC_mod= 2
##$BYTORDP= 0
##$COROFFS= 0
##$CY= -3
##$DATMOD= 1
##$DC= 0
##$DFILT= <>
##$DTYPP= 0
##$F1P= 0
##$F2P= 0
##$FCOR= 1
##$FTSIZE= 16384
##$FT_mod= 6
##$GAMMA= 0
##$GB= 0
##$INTBC= 1
##$INTSCL= 3.70164e-10
##$ISEN= 128
##$LB= 0.24
##$LEV0= 0
##$LPBIN= 0
##$MAXI= 10000
##$MC2= 0
##$MEAN= 0
##$ME_mod= 0
##$MI= 1.114404
##$NCOEF= 0
##$NC_proc= -7
##$NLEV= 6
##$NOISF1= 3.799351
##$NOISF2= 2.8
##$NSP= 0
##$NTH_PI= 0
##$NZP= 0
##$OFFSET= 15.73257
##$PC= 1
##$PHC0= -18044.22
##$PHC1= 28.8007
##$PH_mod= 1
##$PKNL= yes
##$PPARMOD= 0
##$PSCAL= 0
##$PSIGN= 0
##$REVERSE= no
##$SF= 200.130007800266
##$SI= 16384
##$SIGF1= 3
##$SIGF2= 2
##$SINO= 5.538805
##$SIOLD= 16384
##$SREGLST= <1H.CDCl3>
##$SSB= 0
##$STSI= 16384
##$STSR= 0
##$SW_p= 3612.71676300578
##$SYMM= 0
##$S_DEV= 0
##$TDeff= 16384
##$TDoff= 0
##$TI= <>
##$TILT= no
##$TM1= 0
##$TM2= 0
##$TOPLEV= 0
##$USERP1= <user>
##$USERP2= <user>
##$USERP3= <user>
##$USERP4= <user>
##$USERP5= <user>
##$WDW= 1
##$XDIM= 16384
##$YMAX_p= 273201064
##$YMIN_p= -729691
$$ End of Bruker specific parameters
$$ ---------------------------------
##NTUPLES= NMR SPECTRUM
##VAR_NAME=  FREQUENCY,     SPECTRUM/REAL,   SPECTRUM/IMAG
##SYMBOL=    X,             R,               I
##VAR_TYPE=  INDEPENDENT,   DEPENDENT,       DEPENDENT
##VAR_FORM=  AFFN,          ASDF,            ASDF
##VAR_DIM=   16384,         16384,           16384
##UNITS=     HZ,            ARBITRARY UNITS, ARBITRARY UNITS
##FACTOR=    0.220516191357247, 1,           1
##FIRST=     3148.55929568232, 0,            0
##LAST=      -464.157467323456, 0,           0
##MIN=       -464.157467323456, -729691,     0
##MAX=       3148.55929568232, 273201064,    0
$$ Real data points
##PAGE= N=1
##DATA TABLE= (X++(R..R)), XYDATA
$$ [...]
5932B1885k14599J72240J32709p5085j18406N2475P9720k191j81316q1974J28006
5921h6536K9102J31019j9670k73447n4074J39568j510j28013K0328J058P3829
5910a68346J99262r194L144j96395n2737k6181K38793J2870k05099J29787M9117
5899b4979l8632j11497K53163j10576j78191M2554m6019O3871K46978k291j42991
5888d8610j1471J67737j6495r1915j49516N1771J22538l2885j5667q0861L1304
5877g4070J2884L6676m3996l7515J9204p3999p8661j3499J13271J16658j33623
5866a56670N0129P5953q0505L3286J50690J52278j19668k57090l074J03800k71986
5855c22857J9233K41616J09752J27628r4921k04698j5360R9482R3223l8648r6255
$$ plain form
5932 21885 -192714 -20474 112235 37150 -81256 -28781 50939 48748 -132568 -214542 -86536
5921 -86536 -57434 73585 53915 -219532 -273606 -134038 -135548 -263561 -243233 -242175 -168346
5910 -168346 30916 21722 24866 -171529 -224266 -250447 -11654 1216 -203883 -74096 -24979
5899 -24979 -63611 -175108 78055 -32521 -210712 -168158 -214177 -150306 96672 94381 -48610
5888 -48610 -60081 107656 91161 -754 -150270 -98499 24039 -8846 -24513 -105374 -74070
5877 -74070 -61186 -24510 -68506 -106021 -86817 -160816 -239477 -252976 -139705 -23047 -156670
5866 -156670 -106541 -30588 -111093 -77807 72883 225161 105493 -151597 -154671 -50871 -322857
5855 -322857 -303624 -62008 47744 175372 80451 -124247 -139607 -40125 53098 14450 -81805
5844h1805L8582M4334K0844K84805J7524R5935l7050k8191j73466k9788P5335
5833B27059L2185j11236K6217N0266J39132Q3636j34580J02077L1830q6302k9801
5822C30483K02707r3683R6809K92907J85241P4929J34030K17928L47195N20675
5812B309221M39083Q41050N98776K38774l28041o74971o98084m98699n09871o4379
5802A652859k06756l70213q9792j12486l04267O0600k0464j74342M09918J09270
5792I54327m7500p2629j2612p9912L2163J10028O1515j72453M7386Q6115Q556
5781I14984j34261k30261j30348j17496j75133J51614m0268j25407j90974K10316
5771A32766j8851J51551M2686j60579j4803J10548n6986Q6568j65975j23121j37809
$$ plain form
5844 -81805 -43223 1111 21955 306760 324284 420219 383169 354978 181512 151724 227059
5833 227059 259244 148008 174225 224491 363623 447259 312679 414756 446586 360284 330483
5822 330483 533190 439507 536316 829223 1014464 1089393 1223423 1441351 1788546 2309221
5812 2309221 2748304 3589354 4188130 4426904 4098863 3423892 2725808 2227109 1717238 1652859
5802 1652859 1446103 1075890 986098 873612 569345 629945 609481 435139 845057 954327
5792 954327 906827 834198 821586 741674 773837 883865 945380 772927 820313 906428 914984
5781 914984 780723 550462 420114 302618 127485 279099 238831 113424 -77550 132766
5771 132766 113915 265466 308152 147573 132770 243318 186332 272900 106925 -16196 -154005
5760a54005J4670r7185J6801p9780K215M0941J27724j88988J28398n4210J20585
5749a22834J44706R4821j8203j60424K17322m8784q6359q9914j67009j85210L56550
5738f5338K869k2980j492M3821j43253K07898n7396m5882M5781n0947n1942P1623
5726f7238m0361j9573k983J14788j10511q0855Q1154R9870j36506j0982R9986
5715g3211Q6472p1024k8542J8286l2079k9181r1249L2506J88174N7574j0890j16372
5703f9536L9530k3085n9499R089P364n5466q0969J51419P1955l8744j0975j28672
5691a87589j17291K2617J00603O7522P619o3439O4146m6145j1471J77181j12658
5680i8905J93632q634k40204n2046l105J90249J31185j16314j17576r4961l25076
$$ plain form
5760 -154005 -139335 -236520 -219719 -299499 -297284 -256343 -128619 -317607 -189209 -243419 -122834
5749 -122834 21872 116693 98490 -61934 155388 106604 20245 -69669 -236678 -421888 -65338
5738 -65338 -62469 -85449 -86941 -43120 -186373 21525 -35871 -81753 -35972 -86919 -138861 -67238
5726 -67238 -107599 -127172 -130155 -15367 -125878 -206733 -125579 -25709 -162215 -173197 -73211
5715 -73211 13261 -57763 -86305 -68019 -100098 -129279 -220528 -188022 152 57726 46836 -69536
5703 -69536 -30006 -53091 -112590 -103501 -96137 -151603 -232572 -81153 -9198 -47942 -58917 -187589
5691 -187589 -304880 -282263 -181660 -114138 -106519 -169958 -105812 -151957 -163428 13753 -98905
5680 -98905 94727 86093 -154111 -206157 -209262 -19013 112172 -4142 -121718 -216679 -541755
5669e41755J44378R7055J10650j8851r8344K468J82636N6919J8972P4926l6830
5658g776R9341P4730j9243j52681o7847K4666n626O7727j33452o0305L80232N5763
5646B55529j39793j7992l1248j96458Q4277J09011o8774r4901q9616k9815K54144
5635C4364J22263j07924n3484Q2062Q4968o4031q9527J9622r4584M766j3945J4771
5623f0679J47800J15775j3317l3431j68012R7130J6067p061j8549j69480K6218
5612f7539j8171J30897J69886j50559q599J20788k45740Q0285J34521q8923j42730
5601h5884R6126M7432J7167k0781K8051J20919K23239O6772M6419Q8406k99273
5590C28593J00823m3173J65346N8008r8566j53174Q6966m7913P1112R2307j17069
$$ plain form
5669 -541755 -397377 -300322 -189672 -208523 -306867 -304399 -121763 -64844 -45872 29054 -7776
5658 -7776 91565 166295 147052 -5629 -73476 -48810 -54436 13291 -120161 -180466 199766 255529
5646 255529 115736 97744 66496 -129962 -45685 63326 -5448 -100349 -189965 -219780 34364
5635 34364 156627 48703 -4781 77281 162249 98218 8691 28313 -66271 -61505 -75450 -60679
5623 -60679 87121 202896 189579 156148 -11864 85266 101333 94272 75723 -93757 -67539
5612 -67539 -85710 45187 215073 64514 55915 176703 -69037 11248 145769 56846 -85884
5601 -85884 10242 57674 74841 54060 82111 203030 426269 493041 539460 627866 328593
5590 328593 429416 386243 551589 609597 511031 357857 444823 396910 468022 560329 443260
5579D43260J83777K03000j50071j24677P2130J46809R4914K86989N46002K91811
5569A993944J41387M15394M99762M58657M18314Q52126J176355P29723k5594q14589
5559E845479j046201j062217m60598n18153o35213l87843k90306l59733Q5q5676
5549I99624j26917o2287j5892j36327N4946O2402k3303j031l90414r1719N7683
5538C26765K27409K03327j3894L27886P2971L5786J60625Q6575k94089j42672
5528I90689J4111r6288Q2540n4879m0476j64918j13414k04281k84363N5439M0214
5517B24374K17038j66627k61775K2613J78632j51983P0708K50103k38092n8352
5507H6639L5827k6852M0739J04957j60581J06040P8976j34441Q8512l5387j64109
$$ plain form
5579 443260 627037 830037 679966 555289 627419 774228 869142 1156131 1702133 1993944
5569 1993944 2135331 2550725 3050487 3509144 3927458 4779584 5955939 6685662 6660068 5845479
5559 5845479 4799278 3737061 3276463 2758310 2123097 1735254 1444948 1085215 1085300 999624
5549 999624 872707 810420 794528 658201 713147 775549 752246 751215 360801 269082 326765
5538 326765 554174 757501 743607 1071493 1144464 1180250 1340875 1427450 1133361 990689
5528 990689 1004800 908512 991052 936173 895697 730779 617365 413084 128721 184160 224374
5517 224374 441412 274785 13010 35623 214255 62272 132980 383083 144991 86639
5507 86639 122466 95614 136353 241310 80729 186769 265745 131304 219816 184429 20320
5496B0320M1766P447j5187o4225o5138J46474R0086j59840k6650M6695K18634
5485B40382L1428p092Q0915J5281k26384p4410k6563J4343J48762n9915k22604
5474h5857j05291j1508O7954K64930J72329r6392l04814J91209O9369p8863j06124
5463b3058m6241J01784o9804K0228L4061K98910k08726j52904j52522J07364K46296
5452A55388N1622J23366q6665j79652n4447L2507j22941J89537J66681J45208
5442D20604j80072j06555p2046K1100O5074j8839J01762j7569o5287j8720J83428
5431C12880l11225j10038l5031L7662J99410r4792j55111J47125J26632K8599
5421A46111J09294O2944j28329M1184n2372o4276n3841k10255R2741n0954J82963
$$ plain form
5496 20320 62086 69533 54346 -9879 -75017 71457 161543 1703 -24947 21748 240382
5485 240382 271810 264718 345633 360914 134530 60120 33557 47900 196662 136747 -85857
5474 -85857 -191148 -202656 -134702 130228 302557 206165 -98649 92560 161929 83066 -23058
5463 -23058 -69299 32485 -37319 -17091 16970 315880 107154 -45750 -198272 -90908 155388
5452 155388 207010 330376 243711 64059 9612 42119 -80822 108715 275396 420604
5442 420604 240532 133977 61931 83031 148105 129266 231028 213459 148172 129452 312880
5431 312880 1655 -108383 -143414 -105752 93658 -1134 -156245 -9120 117512 146111
5421 146111 255405 318349 190020 231204 178832 114556 60715 -149540 -56799 -107753 75210
5410G5210q409Q5475J5894q2955l1320j31439J52964K8169q1869R0314n357j01343
5398E334J58113J20380N2365K5124j64592m9432n261J10546r7352K8135j2028
5387A71332J36185o8682j41336o2509J52031j11898K34184k33198l61885q4627
5377c70403J89161o5031K31958K12500N5852J77353j99254j59286k4358J12589
5367A61081L4084j60413j17591K22927r3047R8054M3057P2260k24484j9318J03808
5356A20418p2612j16668J53685M7987N6755P8667j93264J3554K3142P2670o3372
5345A20962j33262k7024J46992L9489k65184K5098J19392K63626n3137K72368
5335E09320k07508k24513j24405P3596K4089j61291J8516q4209M4930J01347Q8286
$$ plain form
5410 75210 66801 152276 168170 85215 53895 -77544 75420 103589 21720 112034 106677 5334
5398 5334 163447 283827 336192 361316 196724 147292 142031 252577 155225 183360 171332
5387 171332 307517 238835 97499 34990 187021 75123 309307 76109 -285776 -370403
5377 -370403 -181242 -246273 -14315 198185 254037 431390 232136 72850 48492 161081
5367 161081 195165 34752 -82839 140088 47041 145095 188152 260412 35928 16610 120418
5356 120418 47806 -68862 84823 132810 189565 268232 74968 88522 111664 184334 120962
5345 120962 -12300 -39324 107668 147157 -118027 -92929 26463 290089 236952 509320
5335 509320 301812 77299 -47106 26490 50579 -110712 -92196 -176405 -131475 -30128 58158
5324E8158J81571R6754k23223K7871p3955J16039J30232k06298j2891K04210n2301
5313B46167j5432k2239k7879J28865n12J35655m9830j05104m4533K30114l5952
5302D39320j13208j55340M2619J636N7185j19344j12517Q1794k1492J0989N8475
5291A70117N6289N4687m941K8604l0959O0586j0490j70846J17523O2465n1790
5280B81245J7375q294k908k9899J8602K69268J81159j9697j64383J75037P6815
5269G94320j81785o0038j7630j96216l9254J91519q6260K5262j58416k65511J62384
5258A68375O7117J92958j43196j23168J21307m1344n8773K42313Q4401r2342N08
5247D18156L29795N4995q3200N6879M74334m7777M8532O0717j97097k58869o3691
$$ plain form
5324 58158 239729 336483 113260 141131 67176 183215 313447 107149 94258 298468 246167
5313 246167 230735 208496 180617 309482 308970 444625 394795 289691 245158 475272 439320
5302 439320 326112 170772 213391 215027 272212 152868 40351 122145 100653 111642 170117
5291 170117 226406 281093 276152 304756 273797 334383 323893 153047 270570 333035 281245
5280 281245 298620 290326 287418 257519 276121 545389 726548 706851 542468 717505 794320
5269 794320 612535 552497 534867 338651 299397 490916 404656 429918 271502 5991 168375
5258 168375 235492 428450 285254 162086 283393 242049 183276 425589 509990 417648 418156
5247 418156 747951 802946 719746 776625 1250959 1203182 1251714 1312431 1115334 856465 792774
5236G92774J00211r2477k46854j45104K7503j0371k6672p5224O1429J1113j47790
5225B48538q5475O6442R1302k2088J08247n9433J79239P4535k50419k04025J30836
5214B77699Q8075k22133M7693p7037P8472m2497r8147R3448N9558j704R3971k21467
5202G5931J16569q5001J11239j13019j3291J34311J18672Q1943j32189j07872
5192A87293m2622J47278J92470M5451k45814j46708j0594o5912J97261L4054k71115
5181B1042J25263N8912j60270J82825R7709K2942n0115l50741N0254K38453o591
5170B29683J44906M9548L5028J84915o6959j88270j24163J42314J44035N418j33691
5159D22764K72601J33071J5524j49960j2597l6795l7041k49067j47808J38219
$$ plain form
5236 792774 892985 800508 553654 408550 436053 425682 399010 323786 385215 396328 248538
5225 248538 163063 229505 320807 298719 406966 347533 526772 601307 350888 146863 277699
5214 277699 365774 143641 191334 114297 192769 150272 52125 145573 205131 203427 297398 75931
5202 75931 192500 107499 218738 105719 92428 226739 345411 427354 295165 187293
5192 187293 144671 291949 484419 529870 284056 137348 126754 60842 258103 292157 21042
5181 21042 146305 205217 44947 227772 325481 348423 298308 -52433 -2179 236274 229683
5170 229683 374589 424137 459165 644080 577121 388851 264688 407002 551037 556455 422764
5159 422764 695365 828436 843960 694000 681403 644608 607567 358500 210692 348911
5149C48911j9740J02966O7823J66562l236n6533L3364M5366j02595k20460L26709
5138F89137m7815r2753l1896J34086q6814N0145j90646o8322J26603j78739J04350
5127D07336M5532J8897j82947N8719k9403p387J30900J18753k54209Q5755J83014
5116E74960M574q1326P9525q1799j71261J22991J02701K3686k45342L1212L7897
5105C97818J33133K11013N8603M1763n3211k56892L2250J66071j07205J17330
5095G40673p9126O1083R022q4235M8952O612N721J06045J02604j33832m37554
5084C45965K63641l6558P4260M2652n0606j18017J34886J181M9162j50492j04062
5073D52012J15751J94711K3571n2667m6854j14898o1818J89835l7551j13837M0269
$$ plain form
5149 348911 329171 432137 499960 666522 663286 606753 640117 685483 582888 362428 689137
5138 689137 641322 548569 516673 650759 563945 614090 423444 355122 481725 302986 407336
5127 407336 452868 471765 288818 347537 318134 310747 441647 560400 306191 391946 574960
5116 574960 579534 498208 577733 495934 324673 447664 550365 574051 328709 359921 397818
5105 397818 530951 741964 800567 842330 789119 532227 564477 730548 623343 740673
5095 740673 661547 722630 731652 647417 696369 702981 708702 814747 917351 783519 345965
5084 345965 609606 573048 647308 689960 639354 521337 656223 657404 706566 556074 452012
5073 452012 567763 762474 786045 733378 686524 571626 509808 699643 662092 548255 588524
5062E88524J476j48522M1589j08094j19348P1167n1126p9279J36070J8430N1689
5051D02576o3k06614O5724r3481J24337j61549J8157j72456J36310R6714m6303
5040A63352P2333p8702j79517K78143M6830K15964J15275j17550j80758J36109
5030D71479Q594j15568j9434K22719K06953o8515k11486N5872r4220j01495J4575
5019C69474r6385M2304J48427o6741j9790k9371J30019j09430l8907R6858J19545
5008E46003k64177j38661J73554J55869j64686M1145L05014j38956k07803k63278
4998D4024J58385J61564L8338k56657j82816J7547J99095n6551j86553K41978
4988A78354p1472M2623J38591q0438k10588M2909J1617J36344k1232k06737j6916
$$ plain form
5062 588524 590000 441478 483067 374973 255625 326792 275666 196387 332457 350887 402576
5051 402576 402513 195899 261623 168142 292479 130930 149087 -23369 112941 209655 163352
5040 163352 235685 156983 -22534 255609 302439 518403 633678 516128 335370 471479
5030 471479 480073 364505 345071 567790 774743 706228 494742 550614 456394 354899 369474
5019 369474 273089 315393 463820 397079 377289 347918 477937 368507 329600 426458 546003
5008 546003 281826 143165 316719 472588 307902 349047 654061 515105 307302 44024
4998 44024 202409 363973 402311 145654 -37162 -19615 179480 122929 -63624 178354
4988 178354 106882 149505 288096 207658 -2930 39979 51596 187940 166708 -40029 -56945
4977e6945J2210O0441m7895Q8665J15001j12327J73458L8370l3070M467o6742
4966A75633P3677n8988Q4781j13652q0757K83108k9349j16648J2020j27863R6001
4955A97963l8458j1318m8820j5696k87927J03092J31280M8002M2136O8091M0345
4944B28690m4420J81453o7038j89164J38797j14710N2573o4960N4588J49126j41693
4933A83242r7231M1699j8250J37844K3239j01836R0656O7318j23561j71142R4342
4922A26320o3384J41189J47366p1241L8585J4076m5380k2593K4420k14624J01382
4911A76116n8496J45386n7656J51102M9691j26003K1300l3359j45051j07639j00410
4900h5019r4080O7712K04708p3394K03437j3628j2138O9632l6244J27213j94561
$$ plain form
4977 -56945 -44735 15706 -32189 56476 171477 59150 232608 270978 237908 242375 175633
4966 175633 249310 190322 275103 161451 80694 363802 334453 217805 229825 101962 197963
4955 197963 159505 148187 99367 83671 -204256 -101164 30116 78118 120254 188345 228690
4944 228690 184270 365723 298685 109521 248318 133608 186181 121221 175809 324935 183242
4933 183242 86011 127710 109460 247304 270543 168707 259363 326681 203120 31978 126320
4922 126320 62936 204125 351491 280250 318835 332911 287531 264938 289358 74734 176116
4911 176116 117620 263006 205350 356452 406143 280140 301440 268081 123030 15391 -85019
4900 -85019 -179099 -111387 93321 19927 223364 209736 197598 267230 230986 358199 163638
4889A63638l2200J59484j13304N8831N4443p5166j7262q6047q9829r0903L69676
4878C01361j16473j701N8004l9097O9736K2404M9013L44133r2519k55145J57031
4867D96747M7939j22604k23699J11177K81062j04088p1895k08606o9463l2575
4857A03995J3104M3694l1542P342K69266p573p390k29215O8478J02601j1066j01023
4845B20671p0390r9463K66538m4586P6080o3625J09997P3335j10708N2985j69521
4834B41313J4875Q4119j96144P4727J88253J29197J14094q5176P9608o3329m1791
4823E39746j16883n9316Q7651l0364O6096K7082L5592r9424j15483K44727o0297
4812E19127J28763M6055j46023M0996j530j04965J73245P9994J5283K5538J2550
$$ plain form
4889 163638 131438 290922 177618 236449 290892 215726 198464 112417 22588 -68315 301361
4878 301361 184888 183187 241191 202094 271830 294234 343247 687380 594861 339716 496747
4867 496747 544686 422082 198383 309560 590622 486534 414639 206033 136570 103995
4857 103995 117099 160793 129251 136593 405859 398286 390896 161681 230159 332760 321694 220671
4845 220671 150281 50818 317356 272770 348850 285225 395222 468557 357849 410834 241313
4834 241313 256188 340307 144163 218890 407143 536340 650434 565258 644866 581537 539746
4823 539746 422863 363547 451198 420834 486930 514012 549604 450180 334697 579424 519127
4812 519127 647890 693945 547922 588918 587388 482423 655668 735662 750945 776483 789033
4801G89033q3396Q4908J0528M26339j6221J53354N04534J96592K02575N51207
4791B819453K73551q5487p7201l65731k96448l22213k86353l60140l97287o3510
4781H38634M4922N3447o2871j22807n1324O3491l49322O117J37434M9677N6451
4770F63849L2400j66467k95334j8328J59649Q8538N6138O8574k36842O863K27470
4759E86510P036l8079J5934k84468K27902r6744J18825J78704M4666P567j52665
4748F15188k5365J65224L607k4306q291j05807N2660M8440m0616j28630K65919
4737H18023p3143N6385K33598k65827m713M1447J38816J94389O7285K92137L04876
4726A803273P6287L55780L67002p4782K46215j57447j95248k87553k47845m37205
$$ plain form
4801 789033 705637 790545 801073 1227412 1211191 1364545 1869079 2065671 2268246 2819453
4791 2819453 3093004 3007517 2930316 2564585 2268137 1945924 1659571 1299431 902144 838634
4781 838634 883556 937003 874132 751325 700001 763492 414170 420287 557721 607398 663849
4770 663849 696249 529782 234448 216120 375769 464307 520445 589019 352177 359040 586510
4759 586510 593546 555467 571401 286933 514835 418091 536916 715620 760286 767853 615188
4748 615188 589823 755047 758654 734348 726057 620250 672910 721350 680734 552104 818023
4737 818023 744880 801265 1034863 769036 764323 805770 944586 1138975 1206260 1498397 1803273
4726 1803273 1879560 2235340 2602342 2527560 2773775 2616328 2421080 2133527 1885682 1448477
4716A448477m28865j04218r310j30238Q0723R3869j58566L8275l55419J8941J02374
4705E96043J27508j48061k53650k9767K932O4200O8033J02285j51947L5983M8818
4694D62377N152J24511j48835l9227R7337n2378l7486k26250P4140P6187r8426
4683B37102Q79p3399o7289r3306L48522J21427J0178j09199m3823N1222k55238
4672A27076M6866J72580j32572K3106Q5182M364j32717Q4952m7905K267R6451
4661C29650p5407j56135K60086J28863k64628m8797m3811J38901Q7835k1633o9652
4650B65272L5527j4933O3630J04453Q8432o4743P693O6055N7920j37247k91474
4639A80585j00639K01787J26427P743p8606J17071r2697r1045l9283J13174m7183
$$ plain form
4716 1448477 1019612 915394 906084 775846 856569 950438 791872 830147 474728 493669 596043
4705 596043 723551 575490 321840 292073 295005 359205 427238 529523 377576 413559 462377
4694 462377 467529 592040 443205 403978 501315 448937 411451 185201 259341 335528 237102
4683 237102 237981 164582 97293 3987 352509 473936 484114 374915 331092 382314 127076
4672 127076 173942 346522 213950 237056 322238 326602 193885 278837 230932 233199 329650
4661 329650 254243 98108 358194 487057 222429 173632 129821 268722 356557 334924 265272
4650 265272 300799 285866 349496 453949 542381 477638 485331 551386 609306 472059 180585
4639 180585 79946 281733 408160 415903 337297 454368 361671 270626 231343 344517 297334
4628B97334n6377J60473P929j94266j8735r969P2477j44108J4928J84727M7716
4617C62129P2274m0442K466k68519r0288Q8990P7915N7662k6741K7021J85709
4606D48176M9388n4234l4549J37821N8184j82950J3093J58392k95397m6262J57555
4595D09217J17594K2047P5450k00006J6759r575k7894q7523M6294M6493k155J05968
4583E12669n6770m8288J29988q3025j73325J89743j0481L9059K1806j55428l3076
4572C32872l4582J55657P2876L637l6140n0339O757q2608n391J98521j4668n455
4560E41137K6003j72873J45878M2566k18317j7334M8015m3920J36306J82573r2312
4549E77722j3401J35562k61498O9310n1963K04089l1819k52214p3862k4381L57924
$$ plain form
4628 297334 240957 401430 409359 215093 196358 186389 258866 114758 129686 314413 362129
4617 362129 434403 393961 396427 127908 37620 126610 204525 262187 235446 262467 448176
4606 448176 497564 443330 408781 546602 604786 421836 434929 593321 297924 251662 409217
4595 409217 526811 548858 624308 424302 441061 431486 403592 316069 362363 408856 406701 512669
4583 512669 455899 407611 537599 454574 281249 470992 460511 499570 521376 365948 332872
4572 332872 298290 453947 526823 530460 494320 443981 450738 368130 362739 561260 546592 541137
4560 541137 567140 394267 540145 582711 364394 347060 395075 351155 487461 670034 577722
4549 577722 564321 699883 438385 507695 455732 659821 628002 375788 301926 277545 635469
4538F35469M911k27438J12395K00196M0088j37959J09460J29826j39304m6885
4528F80759J9435r9701L7808k9028k329Q4125j09022k0870L6488k808K576J5953
4516F13386p4500Q4161k7816O2061P8974j05822k9999Q8202J44608M7615R743
4505H90613O6842J13158R5205R020j42843n1013p3772K17530o868j0697J4583
4494A121758q7712o8990J91746J5088k54490K27530K833p1768Q914J42519j41087
4483A086341J38786Q5893k8725J74380j12611J13887l7064q2876L8875l7362J81978
4472A521502J40103p9885n5003j802J38422o8817o5967K0646N8624J4275J3214
4461A635312n0211n2553K35018k5703J07859j53961k4376J05928Q5548L7580k1064
$$ plain form
4538 635469 640380 412942 525337 725533 765621 627662 737122 866948 727644 680759
4528 680759 700194 600493 638301 609273 606944 691069 582047 561177 597665 594857 597433 613386
4516 613386 538886 623047 595231 657292 736266 630444 600445 688647 833255 880870 890613
4505 890613 957455 1070613 1165818 1174838 1031995 980982 907210 1124740 1117872 1107175 1121758
4494 1121758 1034046 965056 1156802 1171890 917400 1144930 1147763 1075995 1084909 1227428 1086341
4483 1086341 1225127 1311020 1282295 1456675 1344064 1457951 1420887 1338011 1376886 1339524 1521502
4472 1521502 1661605 1581720 1526717 1524915 1663337 1594520 1528553 1549199 1607823 1622098 1635312
4461 1635312 1585101 1532548 1767566 1741863 1849722 1695761 1671385 1777313 1862861 1900441 1879377
4450A879377J87367j90341j68260K28807j13273k03938J99812P101J7639J26211
4440A970502q0815k21555K9031R209M3837K4333r7506K66476L4275j3103p590
4429A957094m4798L13656j1718l00803k8033K11255j02400k38467J19338K44248
4419B119372j6325o9902j84028M5667J86685l33689l7402p0985n9502j5273K8495
4408A593113q3409j16986J26674K3581Q753q0543J99081j78910j07361L5291k17450
4397A201834K72676K08975J54681j31528j80041L3634j08777l1755K22865j50007
4387A492557r3454j16088j08987K3525q2412j48318J15725L45149N3231J08741
4377A589669l10992N128J72646M2550n765L8050K4483J57155J39611M012l085
$$ plain form
4450 1879377 2066744 1876403 1708143 1936950 1823677 1619739 1819551 1826652 1844291 1970502
4440 1970502 1889687 1668132 1697163 1706372 1750209 1774542 1677036 1943512 1977787 1964684 1957094
4429 1957094 1912296 2225952 2214234 1913431 1885398 2096653 1994253 1755786 1875124 2119372
4419 2119372 2103047 2033145 1849117 1894784 2081469 1747780 1710378 1639393 1579891 1564618 1593113
4408 1593113 1509704 1392718 1519392 1542973 1551726 1471183 1670264 1491354 1383993 1419284 1201834
4397 1201834 1474510 1683485 1838166 1706638 1526597 1560231 1451454 1419699 1642564 1492557
4387 1492557 1399103 1283015 1174028 1197553 1115141 966823 1082548 1427697 1480928 1589669
4377 1589669 1278677 1283805 1456451 1499001 1493236 1531286 1555769 1712924 1852535 1856547 1853462
4366A853462O6791k04776j40832q8257J83267R6764j18582J79523R1565N2828
4356A971753P1587J05407J03648O124j39902q2284J17396J5281K17309J36802
4346B523121Q432j30470m4207J66275j69208j01522o7912N7329K41873P9235m5552
4335B517394l0491q0468p3279p6869K1784J21194J36819r9849K3105k41566J58283
4324B376057J86060q3061o8545L60569k0324p3702o7427j05530j80j03567k05617
4313B194733J06653q2956j64817J14211j1574K44945l4638L3595k20986l528n3480
4302B122158J07679Q8556J15691k22256N3989J75524p2263L8442L2658O5328L4301
4291B539807J58584q9926j73410k5085J19866M7008J05863j2991o4823J03724
$$ plain form
4366 1853462 1920253 1715477 1574645 1486388 1669655 1766419 1647837 1827360 1918925 1971753
4356 1971753 2043340 2148747 2252395 2258519 2118617 2036333 2153729 2169010 2386319 2523121
4346 2523121 2531553 2401083 2356876 2523151 2353943 2252421 2184509 2241838 2483711 2562946 2517394
4335 2517394 2486903 2406435 2333156 2256287 2278071 2399265 2536084 2436235 2459340 2217774 2376057
4324 2376057 2562117 2479056 2410511 2771080 2750756 2677054 2609627 2504097 2503917 2400350 2194733
4313 2194733 2301386 2218430 2053613 2167824 2156250 2401195 2366557 2400152 2179166 2175638 2122158
4302 2122158 2229837 2318393 2434084 2211828 2265817 2441341 2369078 2407520 2440178 2505506 2539807
4291 2539807 2698391 2608465 2435055 2409970 2529836 2576844 2682707 2669716 2604893 2708617
4281B708617K82774m5641j10048R3585J46687K20685K83219K17971K20739K90292
4271D308880O89843O42562N05846O36738J080591J607729J676064J470095J96974
4262A2815322j024797j197518j384472j314862j147266p80108o30287l87521l53063
4253D595428k87156K5834j44962j06950k38376j81232K0251L22181k9224j90937
4243C784857l41899l71434j77181M5367j22921q4110q1280O0821j75233N6970
4233B593957q3257j35926O2752k0237p6134K5872J0103J3059K22873k35920R7464
4222B474606J9805l06371J67434J97722k1965j6166j41801J86783J48625m3469
4212B665203k3958k01995j45306K02887k1124J45337J16397p7561l1808J81146
$$ plain form
4281 2708617 2991391 2945750 2835702 2929287 3075974 3296659 3579878 3797849 4018588 4308880
4271 4308880 4998723 5641285 6147131 6783869 7864460 9472189 11148253 12618348 12815322
4262 12815322 11790525 10593007 9208535 7893673 6746407 5966299 5336012 4948491 4595428
4253 4595428 4308272 4334106 4189144 4082194 3843818 3662586 3682837 4005018 3975794 3784857
4243 3784857 3442958 3071524 2894343 2939710 2816789 2732679 2651399 2712220 2536987 2593957
4233 2593957 2510700 2374774 2437526 2417289 2341155 2367027 2377130 2390189 2613062 2377142 2474606
4222 2474606 2494411 2188040 2355474 2553196 2531231 2515065 2373264 2560047 2708672 2665203
4212 2665203 2641245 2439250 2293944 2496831 2475707 2621044 2737441 2659880 2628072 2809218
4202B809218J64627n2436K23025q1818j24967K08463N2838J10277j20407J47820
4192C336640L7873m1025J15503k2942l3298r4461j62524J47707j34891o1181Q9727
4181C177128j46185K21905J6047L2730J4421K0715k1354L185J74271R533m493
4170C497903O1114J51141J22591j03823l9281P3007J35323L0780L04120L58543
4160D591418q8210q0839l50368K8117R1417j40856q1306p9996J96852j25494L0182
4149C990917J30743n7497j42758Q9301K73420M8433K740K27477K27689N7437j63725
4138D684177m6847N4064J03336j25514N3859J38515N2955l6317p4327j20658Q8180
4127D771423J87164K53543K08187J15055P2503p0383Q9698J70708o4279J83129
$$ plain form
4202 2809218 2973845 2921409 3144434 3062616 2937649 3146112 3198950 3309227 3188820 3336640
4192 3336640 3374513 3333488 3448991 3426049 3392751 3298290 3135766 3283473 3148582 3087401 3177128
4181 3177128 3030943 3252848 3268895 3301625 3316046 3336761 3315407 3318592 3492863 3502396 3497903
4170 3497903 3559017 3710158 3832749 3728926 3689645 3762652 3897975 3928755 4232875 4591418
4160 4591418 4503208 4422369 4072001 4100118 4191535 4050679 3969373 3889377 4086229 3960735 3990917
4149 3990917 4121660 4064163 3921405 4010706 4284126 4332559 4335299 4562776 4790465 4847902 4684177
4138 4684177 4637330 4691394 4794730 4669216 4723075 4861590 4914545 4878228 4803901 4683243 4771423
4127 4771423 4958587 5212130 5420317 5535372 5607875 5537492 5627190 5797898 5733619 5916748
4117E916748M73312J9952k09883j5404L71970K81887L06294J66685J94480K15821
4107G721862K69827L49901J27675K64633L65288m0340K07742J71891K74541L80991
4097A0094011L12162M78381N73587M76427P14864O41060P08068M98017L30629
4088A4827206L88515K26567J95226M51034P61192R50721J043215K061900K358427
4079B3264003J679498M84800K28936K35295p9986O3289L23472O24234O36836J79714
4069B7640091q28913j236112j269561p13109k81591N5916J09826j06567o12058
4060B2757922n37579j051610q73929q92028q80596n91890l42379J10806L09540
4051A8008257L28154N77775K76327Q525k24108o45300p65900j045277r69640j206462
$$ plain form
4117 5916748 6390060 6410012 6200129 6184725 6556695 6838582 7144876 7311561 7506041 7721862
4107 7721862 7991689 8341590 8469265 8733898 9099186 9058846 9266588 9438479 9713020 10094011
4097 10094011 10406173 10884554 11458141 11934568 12649432 13290492 13998560 14496577 14827206
4088 14827206 15215721 15442288 15637514 16088548 16849740 17800461 18843676 20905576 23264003
4079 23264003 24943501 25428301 25657237 25892532 25812546 25875835 26199307 26823541 27460377 27640091
4069 27640091 26811178 25575066 24305505 23592396 23310805 23366721 23476547 23369980 22757922
4060 22757922 22220343 21168733 20294804 19402776 18522180 17930290 17587911 17698717 18008257
4051 18008257 18336411 18914186 19190513 19199038 18974930 18329630 17563730 16518453 15548813 14342351
4041A4342351r82505p86846n05383j27295l59348J85332R7843k8330k81919l80443
4031A1173457n49811p44879o63842m24548o05435l12161k40469k01614j22589
4022G308109k86229j83433j92437k4277k64387r7049m67613k71058j46729j62897
4012E212000j81483k07572l50282o9710k53448L3715L0742J4407L1697k31539
4002D028527j8027j190j99828M7034J5873r3594j5516J24251L2954J68412k25554
3991C863342k17971m0301k19182j32118n6003J83181m8047J43600O4341q3150
3981C457692J14433J42009k63716r9956K31323j2805j34978m2635P9172L2656
3971C503195j75418K5651k7463M2787j29897J57754j8800R4052m0797k11697m8847
$$ plain form
4041 14342351 13359846 12573000 12067617 11940322 11580974 11766306 11864149 11835819 11553900 11173457
4031 11173457 10623646 9878767 9214925 8790377 8184942 7872781 7632312 7430698 7308109
4022 7308109 7021880 6838447 6646010 6621733 6357346 6260297 5792684 5521626 5374897 5212000
4012 5212000 5030517 4822945 4472663 4402953 4149505 4183220 4213962 4228369 4260066 4028527
4002 4028527 4010500 4009310 3809482 3856516 3872389 3778795 3763279 3887530 3920484 4088896 3863342
3991 3863342 3645371 3605070 3385888 3253770 3197767 3380948 3332901 3476501 3540842 3457692
3981 3457692 3572125 3714134 3450418 3350462 3581785 3568980 3434002 3391367 3470539 3503195
3971 3503195 3327777 3353428 3325965 3368752 3238855 3396609 3377809 3471861 3431064 3219367 3170520
3960C170520J34632M2020L4468K48473J63499J57143L75855R956l6960k1931j30558
3949D147117m32909m34179Q6729P5515m4744n0083n6873k97905K1950Q5426q8867
3938C011177J48811J47226j5134l81j08473J59273K18532J13184O8910k1905R822
3927C731042J44644K55740O294K5253p7610k47537O327k87005k5175n843m0086
3916C486044j53513m563n2236j94482p2173K62976n7348l5079J37796p6667j10175
3905C130580r14r4360o1909N4188J17210n9441o2375J74351J32002n6150j15116
3894C158066r248K3997j01281L67612J85310l6366j01265j88689J53929J69091
3884C621156M7003o9990J34672P0254J16350l6614l8960J04432J18036J6242L07156
$$ plain form
3960 3170520 3305152 3347172 3381640 3630113 3793612 3950755 4326610 4336566 4299606 4277675 4147117
3949 4147117 3714208 3280029 3366758 3442273 3397529 3347446 3290573 2992668 3014618 3100044 3011177
3938 3011177 3159988 3307214 3292080 3291699 3183226 3342499 3561031 3674215 3743125 3721220 3731042
3927 3731042 3875686 4131426 4137720 4162973 4085363 3837826 3844153 3557148 3531973 3526130 3486044
3916 3486044 3332531 3327968 3275732 3081250 3009077 3272053 3214705 3179626 3317422 3240755 3130580
3905 3130580 3129666 3035306 2973397 3027585 3144795 3085354 3022979 3197330 3329332 3273182 3158066
3894 3158066 3148818 3172815 3071534 3439146 3624456 3588090 3486825 3298136 3452065 3621156
3884 3621156 3668159 3598169 3732841 3803095 3919445 3882831 3843871 3948303 4066339 4082581 4389737
3873D389737J16660M9198k20491L4715J90513j66514k4887m6718J94700J23200
3863D640113j26703k4101J24551J64242M1314J6827m5848r562n8476J76599J80010
3852E078966N2770J06314J2577M1856K80175J90834m0576M5199K77263K27393
3842F272771j8233J19879J63803K57576L36073K66733L759M16984K67254K07491
3832H294090M73488N15732L73309L51018P49453O50488N64700Q33501R63905R66211
3822A4735895J279693J365978J968098K245193K054568K654020K791649K666836
3814C1761930K482097K424148K026088J435931Q61638L64397L65403m15493n17228
3805D0788911q06234n95279k12242q9759k0232L80254J67947J41672m1402l94867
$$ plain form
3873 4389737 4506397 4555595 4335104 4369819 4560332 4393818 4368931 4322213 4516913 4640113
3863 4640113 4513410 4489309 4613860 4778102 4819416 4836243 4790395 4780833 4722357 4898956 5078966
3852 5078966 5131736 5238050 5250627 5292483 5572658 5763492 5722916 5768115 6045378 6272771
3842 6272771 6254538 6374417 6538220 6795796 7131869 7398602 7402361 7819345 8086599 8294090
3832 8294090 8767578 9283310 9656619 10007637 10757090 11407578 11972278 12805779 13769684 14735895
3822 14735895 16015588 17381566 19349664 21594857 23649425 26303445 29095094 31761930
3814 31761930 34244027 36668175 38694263 40130194 40991832 41356229 41721632 41306139 40788911
3805 40788911 39982677 39387398 39175156 39085397 39065165 39445419 39613366 39755038 39713636 39318769
3795C9318769m57382r70477j721329j754180k116876k372113k221331k015493
3787B5689588j874077j753906j676777j570607j315384j066915q23888o07441
3779A5000593o10335n63308m26905m31523l11795l16007K0336j59006m35426l80985
3769A1385639j27645q6336j66378k73691j59383j42587m2983k01896k94847k04046
3759I685847K1872J6899l02792k24570K640Q4877j08867J82841J00207l16940
3749I142014r2850m3717J91852J3983k5185j0496Q538J55967j14525k40414r088
3738H976079j30320M1863L3203l9718j52266J66946p2124Q2638k62964p6832l0855
3727H535650j59943J30562K0656n7756K4306r4639k38797P243m8940k1941n5190
$$ plain form
3795 39318769 38861387 37890910 36169581 34415401 32298525 29926412 27705081 25689588
3787 25689588 23815511 22061605 20384828 18814221 17498837 16431922 15608034 15000593
3779 15000593 14390258 13826950 13400045 12968522 12656727 12340720 12361056 12202050 11766624 11385639
3769 11385639 11257994 11171658 11005280 10731589 10572206 10429619 10386636 10184740 9889893 9685847
3759 9685847 9707719 9724618 9421826 9197256 9199896 9284773 9175906 9358747 9458954 9142014
3749 9142014 9049164 9005447 9197299 9211282 9186097 9175601 9184139 9340106 9225581 8985167 8976079
3738 8976079 8845759 8887622 8920825 8881107 8728841 8895787 8823663 8906301 8643337 8566505 8535650
3727 8535650 8375707 8506269 8526925 8469169 8493475 8398836 8160039 8167282 8118342 8096401 8041211
3716H041211J49678K4373j01044l3545O5266J02743J39871K25130N0312J08881
3706H772876j369m604q1833K55739K37352O8858m3068R0374K07812L76904O4976
3695I944017K90314K82466J95555K13451O8371J10160j22289k05279j13270n5792
3685A0607704O0533J25607q0767J53473j21157J22709J44068J64076K84475K42483
3675A1703204J29786M70739J36954L88181L35605P01548N27488M17156M35169
3666A5245830L29086N72164O61229M14778N47405Q06417Q33052Q13285J029599
3657B1252845J130073J219339J619766J912160J922362K386589L091422L325330
3649C7859886L693013N006381N872387O579428P438324Q399286Q901163Q712560
$$ plain form
3716 8041211 8190889 8215262 8114218 8080673 8145939 8248682 8388553 8613683 8663995 8772876
3706 8772876 8771507 8766903 8685070 8940809 9178161 9247019 9203951 9294325 9502137 9879041 9944017
3695 9944017 10234331 10516797 10712352 10925803 10994174 11104334 10982045 10776766 10663496 10607704
3685 10607704 10668237 10793844 10713077 10866550 10745393 10868102 11012170 11176246 11460721 11703204
3675 11703204 11832990 12303729 12440683 12828864 13164469 13866017 14393505 14810661 15245830
3666 15245830 15574916 16147080 16808309 17223087 17770492 18576909 19409961 20223246 21252845
3657 21252845 22382918 23602257 25222023 27134183 29056545 31443134 34534556 37859886
3649 37859886 41552899 46559280 52431667 59011095 66449419 74848705 83749868 92462428
3641I2462428Q427665P383714N480898L713984J582834q71662k823205n374316
3633A09982340o945894p949065q231972p940250p764680p281021o544464n825734
3625E1499260n153679m438600l526238l132569k730266k353994j908847j635066
3617B6620001j221871j133951q48029m51716n69019l45994o54958l67807j47596
3608B0879060l45892j28837l5082j18914l25423j30672m59729m37698o26904n71744
3598A7698165o33918m43006m81324m37252l33109n08534m65235n89202m54891
3589A3351694l55312l86057m26509p9166o9818j53839j95466k06476j78277n1178
3579A1249596l30487j44330j44498J58698o3756J40662j85023k82987j49862R5700
$$ plain form
3641 92462428 100890093 108273807 113754705 117468689 119051523 118179861 115356656 109982340
3633 109982340 103036446 95087381 86855409 78915159 71150479 63869458 57324994 51499260
3625 51499260 46345581 41906981 38380743 35248174 32517908 30163914 28255067 26620001
3617 26620001 25398130 24264179 23416150 22964434 22395415 22049421 21394463 21026656 20879060
3608 20879060 20533168 20404331 20369249 20250335 19924912 19794240 19334511 18896813 18269909 17698165
3598 17698165 17064247 16621241 16139917 15702665 15369556 14861022 14395787 13806585 13351694
3589 13351694 12996382 12610325 12183816 12104650 12034832 11880993 11685527 11479051 11300774 11249596
3579 11249596 10919109 10774779 10630281 10788979 10725223 10865885 10680862 10397875 10248013 10343713
3569A0343713N1621j12036K12246j56636o4442J78554Q6691o323L5751n2359q9652
3558A0427128n8719k04656k95898j26287M9623k31238k17039j27695m02809j98852
3548H613558P8951j47785k18505j36175j91398m8944l76444k47481j04980j16174
3538G104623k31814Q2241j91776k63643N031k9195m24712P5257r44l2064j63024
3527E929980j83648O0834J56512p0810j12698N0815K29927j43287K03801q362
3517F113064l67030o97J80494Q0085m5332J86079j27959o6415p7883j76028j16397
3506E581981J10570L8997Q352j8645k54307K0980n1625k96055L1972m9965J59931
3495E282186k17821K6672j41097o4958o5700k60918J42326J23948k01661r6870
$$ plain form
3569 10343713 10395334 10283298 10495544 10338908 10274466 10453020 10539711 10533388 10569139 10516780 10427128
3558 10427128 10368409 10163753 9867855 9741568 9791191 9559953 9342914 9215219 8812410 8613558
3548 8613558 8692509 8544724 8326219 8190044 7998646 7949702 7573258 7325777 7220797 7104623
3538 7104623 6872809 6955050 6763274 6499631 6504662 6475467 6050755 6126012 6125068 6093004 5929980
3527 5929980 5746332 5807166 5963678 5892868 5780170 5830985 6060912 5917625 6121426 6113064
3517 6113064 5746034 5745337 5925831 6005916 5960584 6146663 6018704 5952289 5874406 5698378 5581981
3506 5581981 5692551 5731548 5739900 5721255 5466948 5487928 5436303 5140248 5172220 5122255 5282186
3495 5282186 5064365 5091037 4949940 4884982 4819282 4558364 4700690 4824638 4622977 4526107
3485D526107j85431K5149J4288p1855L3547K17571N666j71824J80426j31055m110
3474D438479k9653J39566N4166k64311j91868K12093o174N4229J09764J8556K59847
3463D794694P4129k53626o3825L14423k8200r5224l1941L2734K59805K2098p2782
3452D952285m6898J10115L6706J52473J3473j13933K1931j89138K51180K46048
3442E434242J13062J74659O1290Q538j673p5736J20269Q0990J11835p6746J59759
3431F110489J37538J56743L12209J63052K92911K71440M49887J44380J43260N62129
3421H744038L92833M39831N89726M63343L73220O25079O48478N38080M25460K43749
3411A3483837K08561J2298M08571R7537K44623M20510j9296j01869k6712R2463
$$ plain form
3485 4526107 4340676 4365825 4380113 4308258 4341805 4559376 4565042 4393218 4573644 4442589 4438479
3474 4438479 4408826 4548392 4602558 4338247 4146379 4358472 4352298 4406527 4516291 4534847 4794694
3463 4794694 4868823 4615197 4551372 4865795 4837595 4742371 4710430 4743164 5002969 5025067 4952285
3452 4952285 4905387 5015502 5052208 5204681 5218154 5104221 5126152 4937014 5188194 5434242
3442 5434242 5547304 5721963 5783253 5791791 5790118 5714382 5834651 5915641 6027476 5950730 6110489
3431 6110489 6248027 6404770 6716979 6880031 7172942 7444382 7894269 8038649 8181909 8744038
3421 8744038 9136871 9576702 10166428 10629771 11002991 11628070 12276548 12814628 13240088 13483837
3411 13483837 13692398 13704696 14113267 14210804 14455427 14875937 14856641 14754772 14728060 14820523
3401A4820523O147J12252r5082R9630j46447J9525j31272j17696l17398l40378
3391A3909804k15328j92469k25107o27394l27270k71966k08337l48559J46176
3382A1639550J88986o6199O8962j82820L81831L36469L28319K98586L29200N49312
3372A3872196N25228P07720P59882P95174R93350J209796J490662J631004J635559
3363B3620571J782200J793117J584656J430955J358190J439976J159059J339301
3355C5508025J316587J129955J059654O31521O93672M51454K48400J83287J96379
3346D1418934k88489l42977m53436l08432m43304k56628k2387n74899q53962p96152
3336C7078268j117760j218668j496482j463579j145295j054160j030011q06460
$$ plain form
3401 14820523 14826670 14938922 14843840 14943470 14797023 14816548 14685276 14567580 14250182 13909804
3391 13909804 13694476 13502007 13276900 12649506 12322236 12050270 11841933 11493374 11639550
3382 11639550 11828536 11762337 11831299 11648479 12030310 12366779 12695098 12993684 13322884 13872196
3372 13872196 14397424 15105144 15865026 16660200 17653550 18863346 20354008 21985012 23620571
3363 23620571 25402771 27195888 28780544 30211499 31569689 33009665 34168724 35508025
3355 35508025 36824612 37954567 39014221 39645742 40339414 40790868 41039268 41222555 41418934
3346 41418934 41130445 40787468 40334032 40025600 39582296 39325668 39303281 38728382 37874420 37078268
3336 37078268 35960508 34741840 33245358 31781779 30636484 29582324 28552313 27745853
3328B7745853k35084P8923K26638K19770M26726P87791J160400J023294J381588
3319C2815899J585501J470156J563539J509509J189316J247477J145803P24354
3311D3251554M73793K87709Q5467M0688J97737k9765p1407n7728O3601j27863
3301D4113786n8220l88423m56866q11212j110384j066970j520802j580828j613504
3292C5506577j710580j720027j849092j535091j672882j267439j275724j118684
3284B3357058q32636q74534q54650n39979l85250l96107l71763m70894l24905
3275A8306340l5667l357j52131j30385O1315L46992k04445K3189L30988L08790
3265A8851629J98695K42732M84230N82964L87176M41995P27567P59147O46444
$$ plain form
3328 27745853 27510769 27589692 27816330 28036100 28462826 29250617 30411017 31434311 32815899
3319 32815899 34401400 35871556 37435095 38944604 40133920 41381397 42527200 43251554
3311 43251554 43725347 44013056 44098523 44139211 44336948 44307183 44235776 44178048 44241649 44113786
3301 44113786 44055566 43667143 43210277 42399065 41288681 40221711 38700909 37120081 35506577
3292 35506577 33795997 32075970 30226878 28691787 27018905 25751466 24475742 23357058
3284 23357058 22524422 21649888 20795238 20255259 19870009 19473902 19102139 18631245 18306340
3275 18306340 18270673 18267316 18115185 17984800 18046115 18393107 18188662 18211851 18542839 18851629
3265 18851629 19050324 19293056 19777286 20360250 20747426 21189421 21916988 22676135 23322579
3256B3322579O43274N07344J41448M07804M48742O48113N40296N88781Q12788
3247B8061169J083891O29715L96452K98539q2019j97376o31333j066186j229767
3238B7263085j114323j273985r62720j036761j025534j101088p90749p92745p66008
3229A8399172p87971l78810k67931n57788m97385m57030p16626n27900l44336
3220A3863395k75335k90705k99302j98234l20127k5290l03288k75596q4206M5641
3210A1836953k58244j38422K56370N7707j47538p8752j20894l6011J47330J76035
3200A1694534J74046q9696J47284j23301J52957K89149J77038K97979L64145L39738
3190A3423873N65150J70366P29431P66372Q14038J019809J396187J582624J852361
$$ plain form
3256 23322579 23965853 24473197 24614645 25022449 25471191 26119304 26659600 27248381 28061169
3247 28061169 29145060 29774775 30171227 30469766 30387747 30190371 29559038 28492852 27263085
3238 27263085 26148762 24874777 23912057 22875296 21849762 20748674 19957925 19165180 18399172
3229 18399172 17611201 17232391 16964460 16406672 15909287 15452257 14735631 14207731 13863395
3220 13863395 13588060 13297355 12998053 12799819 12479692 12454402 12151114 11875518 11791312 11836953
3210 11836953 11578709 11440287 11696657 11754364 11606826 11528074 11407180 11371169 11518499 11694534
3200 11694534 11868580 11778884 11926168 11802867 11955824 12244973 12422011 12719990 13084135 13423873
3190 13423873 13989023 14159389 14888820 15655192 16469230 17489039 18885226 20467850 22320211
3181B2320211J725576J617570J697596J193816R85953J119385J450376J876093
3173C3986576K213736K545205J911255J082310Q76672L37208O26940O59815R82098
3164D5221815J367125Q87823M67819K07732k92991r52033j267464j673018j935326
3155D2031482k141167k546086k571078k727677k285401k332951j990902j861095
3147B3575125j628210j634431j284264o18261q39390p26324o77942o51648p15754
3138A4798901m47391l40167n53545n26143n46716m22207n11266l71241l82876
3129A0697349k98657l63978m64555m0619M6987k49384m38447p0201k89020j54112
3119H375363j39751j01442q1490j18059j33238q9055J26276r760M868o6052J34442
$$ plain form
3181 22320211 24045787 25663357 27360953 28554769 29540722 30660107 32110483 33986576
3173 33986576 36200312 38745517 40656772 41739082 42615754 42952962 43579902 44239717 45221815
3164 45221815 46588940 47476763 47944582 48152314 47859323 46907290 45639826 43966808 42031482
3155 42031482 39890315 37344229 34773151 32045474 29760073 27427122 25436220 23575125
3147 23575125 21946915 20312484 19028220 18409959 17570569 16844245 16166303 15514655 14798901
3138 14798901 14351510 14011343 13457798 12931655 12384939 11962732 11451466 11080225 10697349
3129 10697349 10398692 10034714 9570159 9529540 9576527 9327143 8888696 8818495 8529475 8375363
3119 8375363 8235612 8134170 8052680 7934621 7801383 7712328 7838604 7828844 7833712 7767660 7902102
3108G902102P8125P6554L233K22996j92868P8550K40364o7328l10555j90848o5426
3097G774899r7671m69307m09280k58617j70214k25659j6089l4529k66605k93043
3087E533885j41265j84963k09536p0125M6008j27400o3340k28688j43723Q9596
3077D500449O056j25840J29471j35612L025l3828j62974L5613N6150N202q8895
3066D188817o0598J9468l1646l5060l34218M6096R1179k49743J39084l8833R0978
3055C825524J76836J4078p4698j75108J24354j45566j48619K05619q3567n7040
3045C661813J10765N3659j39404j71914j06258K13306J41822n6187k28869P3336
3035C552069j9003J11159P5609J37881k7785o6863j26645J7657j4284J97198O6785
$$ plain form
3108 7902102 7980227 8056781 8060014 8283010 8090142 8168692 8409056 8341728 8031173 7840325 7774899
3097 7774899 7677228 7207921 6798641 6540024 6369810 6144151 6128062 6093533 5826928 5533885
3087 5533885 5392620 5207657 4998121 4927996 4974004 4846604 4783264 4554576 4410853 4500449
3077 4500449 4506505 4380665 4510136 4374524 4377549 4343721 4180747 4216360 4272510 4277712 4188817
3066 4188817 4128219 4147687 4116041 4080981 3746763 3792859 3884038 3634295 3773379 3734546 3825524
3055 3825524 4002360 4016438 3941740 3766632 3890986 3745420 3596801 3802420 3718853 3661813
3045 3661813 3772578 3826237 3686833 3514919 3408661 3621967 3763789 3707602 3478733 3552069
3035 3552069 3533066 3644225 3719834 3857715 3829930 3763067 3636422 3654079 3639795 3836993 3903778
3024C903778q6376j64417O3538m1722J85495j26256N5528J33702K0232K41821
3014D185323o0037M5964n2327J66215Q9043j83086L79338P280J487M1321p5850
3003D544671j22558k3969j72140K23426Q1616j20065J6166o6269Q5004O3733K0979
2992D530594J54265J92898j36823r054p9420J05651K70217J49752L1570J0721
2982E220371J74544K25468R7319j42712O2634K27219Q6191o8481N1472J09968
2972F043993M8461J18087O9749j15132k767R0256J14279J04996P5455L82173M5089
2961F974639K01321J61396R856M10031K17726J56286J33434K00643K32327J71693
2951H869352Q5252K16283K52040o6640N805J72738L95066K86689R5814J48297
$$ plain form
3024 3903778 3817402 3652985 3716523 3674801 3860296 3734040 3789568 3923270 3943502 4185323
3014 4185323 4125286 4171250 4118923 4285138 4374181 4191095 4570433 4577713 4579200 4620521 4544671
3003 4544671 4422113 4398144 4226004 4449430 4531046 4410981 4427147 4360878 4445882 4509615 4530594
2992 4530594 4684859 4877757 4740934 4731880 4652460 4758111 5028328 5178080 5209650 5220371
2982 5220371 5394915 5620383 5717702 5574990 5637624 5864843 5951034 5882553 5934025 6043993
2972 6043993 6092454 6210541 6280290 6165158 6162391 6252647 6366926 6471922 6547377 6929550 6974639
2961 6974639 7175960 7337356 7347212 7757243 7974969 8131255 8264689 8465332 8697659 8869352
2951 8869352 8954604 9170887 9422927 9356287 9362092 9534830 9929896 10216585 10312399 10460696
2941A0460696J33998L18311K24795L48536P2005J30087J53127J54466L14232J18730
2931A2428983M3878K34112L22934L72964M68137J33117L07446K31586L09917M66316
2921A5319390K26726J73577N57243N60143R85172O66392P87449O78208J313540
2912B1267840R74120R38837R46439J153072J483771J423990J229075J445264J402074
2903C2264482J448893J637361J482655J769068J967895K340327K940006K982729
2895D8833416L561256M854319O114088P347656Q420004R456988J0649176J1667516
2887A10904419J2877327J5438154K0103774K6087317L2363279L3262929K2163865
2880B73201064j72558k0737401l0082613l1831695k8893438k4021445j8911769
$$ plain form
2941 10460696 10594694 10913005 11137800 11486336 11558341 11688428 11841555 11996021 12310253 12428983
2931 12428983 12472861 12706973 13029907 13402871 13871008 14004125 14311571 14543157 14853074 15319390
2921 15319390 15546116 15719693 16276936 16837079 17822251 18488643 19276092 19954300 21267840
2912 21267840 22241960 23180797 24127236 25280308 26764079 28188069 29417144 30862408 32264482
2903 32264482 33713375 35350736 36833391 38602459 40570354 42910681 45850687 48833416
2895 48833416 52394672 57248991 63363079 70710735 79130739 88587727 99236903 110904419
2887 110904419 123781746 139219900 159323674 185410991 217774270 251037199 273201064
2880 273201064 273028506 252291105 222208492 190376797 161483359 137461914 118550145
2873A18550145j4536756j0871205q066027o606116n668050m735232l779472k803058
2865F1484229k369408k374252k695223l382897l575765l246907l047817k512655
2857C8279305k172534j772747j418478j359131j253817j140614r06696j011205
2849B7244083q91410q55949j108316j083827j066727r04253r26376n94513p97734
2840A9014978o43806p64570n82712n24250n63398o62781n71930o23826m31419
2831A3646286k61776o29526m37092l50104j81071j10940n34790m81277k82048
2822A0377662n2800j75231k27757k48998k02416l7955m41652n14089j12760j65952
2812H198052l42371j53867j47987j00284o8715j00348k60526k21490q6771l2723
$$ plain form
2873 118550145 104013389 93142184 85076157 78470041 72801991 68066759 64287287 61484229
2865 61484229 59114821 56740569 54045346 50662449 47086684 43839777 40791960 38279305
2857 38279305 36106771 34334024 32915546 31556415 30302598 29161984 28255288 27244083
2849 27244083 26352673 25496724 24388408 23304581 22237854 21333601 20407225 19812712 19014978
2840 19014978 18371172 17606602 17023890 16499640 15936242 15273461 14701531 14077705 13646286
2831 13646286 13384510 12754984 12317892 11967788 11786717 11675777 11140987 10659710 10377662
2822 10377662 10324862 10149631 9921874 9672876 9470460 9432505 8990853 8476764 8364004 8198052
2812 8198052 7855681 7701814 7553827 7453543 7384828 7284480 7023954 6802464 6715693 6682970
2802F682970j75731j31877n4869o8564j51113m34263j15288o1349p9428o1872
2792E348616J17482k34897k20469j38998K03375N0550m6082k20885k66736o2205
2782D529751r0130j61696K4566j43445r1492L2463j47073j05585j56418k63002
2772C427939o5413P7386k05457k6415N0938q0287j64200n7787j61211r0548K4976
2761B729921p5012r0640o9991N8747J0485k8795j67743m5389k28027q6641J00661
2750B107576K5355j2601l2862K4842n8239L4460r3761m4512j20304k8546j094
2739A800314J34130j44845j65366N6344K3872j48081J6354r7054J85368J13599
2729A774635j65317q4168p7304j43588J41323K22273j9244r6590J10597j4061
$$ plain form
2802 6682970 6507239 6375362 6320493 6251929 6100816 5666553 5551265 5489916 5410488 5348616
2792 5348616 5466098 5231201 5010732 4871734 5075109 5125659 5079577 4858692 4591956 4529751
2782 4529751 4439621 4277925 4302491 4159046 4067554 4100017 3952944 3847359 3690941 3427939
2772 3427939 3362526 3439912 3234455 3208040 3258978 3178691 3014491 2956704 2795493 2704945 2729921
2761 2729921 2654909 2564269 2494278 2553025 2563510 2534715 2366972 2321583 2093556 2006915 2107576
2750 2107576 2132931 2120330 2087468 2112310 2054071 2088531 1994770 1950258 1829954 1801408 1800314
2739 1800314 1934444 1789599 1624233 1680577 1704449 1556368 1572722 1475668 1661036 1774635
2729 1774635 1609318 1525150 1447846 1304258 1445581 1667854 1648610 1552020 1662617 1648556
2719A648556p3577j37788j5966r9203k04292j81908O7285M2008M7793j23767P5434
2708A044575L1663m1357J53464o5678J42442K6395p0031l8128M766j90985j14271
2697H82855j7187J03419J0832K8346J3416n9542J08060j53631k27745M5589J31558
2686H65970O5069N8080j32898j27829L3169j41982M7537k4203p1814L8773q2399
2675E27473J43527o4088m8378Q67j00920K7425K45877K3217J2961r86K13885j99713
2663G81147j24641n744J14301p7291l40957q457j25134J90407K07911K1918q5310
2652E48150j13155J85906j01190r7493j50687o564J76306j97229J22344Q9138
2642D55526j24143j16719P8727m921K785P3381K4551q0208J07916L5759p1153
$$ plain form
2719 1648556 1574979 1437191 1421225 1322022 1117730 935822 1003107 1045115 1092908 969141 1044575
2708 1044575 1076238 1034881 1188345 1122667 1265109 1291504 1221473 1183345 1188111 997126 882855
2697 882855 865668 969087 979919 1008265 1021681 962139 1070199 916568 688823 734412 865970
2686 865970 931039 989119 856221 728392 761561 619579 667116 642913 571099 609872 527473
2675 527473 671000 606912 558534 559401 458481 485906 731783 755000 767961 766975 980860 781147
2663 781147 656506 650762 765063 687772 346815 338358 213224 403631 611542 633460 548150
2652 548150 434995 620901 519711 422218 271531 264967 441273 244044 366388 455526
2642 455526 331383 214664 293391 288470 291255 364636 389187 308979 416895 452654 381501
2631C81501R0445J46440j40937l63180m5688M0194J26922K61970K0424l17165
2621B00926r3175K90837P796l4738J4537R1052k280O8904j2059J58278j77446
2610E12632P2877R6867K7629j6687j36868J18958J65409o2236J37058K22426j56415
2599I81650K7146M36616O5725p5568O7290j69448j07232k11174j25114m5683P6648
2588I20856j42604j09660m8803j32519M0622j55368K4641m1828P9821P2662j07287
2577D00533p0203J23395o0925o2395R1727k5228j13271j35833m7758J36625M9657
2566B86324Q553j08494j03046k1178M5463M6328q1330j48378K6412O6495p0584
2555e3435m2914J02294K73276p2087R3988j63651k18446K49419P9336j26448r1860
$$ plain form
2631 381501 471946 618386 477449 114269 68581 108775 235697 497667 518091 200926
2621 200926 107751 398588 406384 371646 386183 477235 474955 543859 531800 690078 512632
2610 512632 585509 682376 710005 693318 556450 675408 840817 778581 915639 1138065 981650
2599 981650 1008796 1445412 1511137 1435569 1502859 1333411 1226179 1015005 889891 844208 920856
2588 920856 778252 668592 619789 487270 527892 372524 397165 355337 435158 507820 400533
2577 400533 330330 453725 392800 330405 422132 396904 283633 147800 100042 236667 286324
2566 286324 294877 186383 83337 62159 107622 153950 72620 -75758 -49346 17149 -53435
2555 -53435 -96349 5945 279221 207134 301122 137471 -80975 168444 247780 121332 29472
2544B9472j33235Q6098M9013L2803n2119N1165J59478j2543j34839Q4109K6214
2533A85616j09212M3161P6933j47122j23340J87211J11523j10564j77272M7650
2523a5416m6875O1636l1868o3782R4490p0464J16916P728J8560L7427p9500R541
2511C8393m9212O8491K14783j26162k02765j11115J42168M7307Q6912p9946n4203
2500b5349J34247j25450j52002O7641R8868J34555j8131k29020J63679p4155J0692
2489a4425L0486J5453J6362n698j500o0459J0851j20558J00577o1211R8448R0740
2477I9066Q0526j01247p3279p9232J81432k5049k8559o9791k1720J38057o3576
2466C6628o2154j58024j00921K39552q2120K7557n952q7438K36894J48484j89589
$$ plain form
2544 29472 -103763 -17665 31348 64151 12032 63197 222675 210132 75293 159402 185616
2533 185616 76404 119565 196498 49376 -73964 113247 224770 114206 -63066 -15416
2523 -15416 -62291 -655 -32523 -96305 -1815 -72279 44637 52365 70925 108352 28852 38393
2511 38393 -10819 57672 272455 146293 -56472 -167587 -25419 21888 108800 28854 -25349
2500 -25349 108898 -16552 -168554 -100913 -2045 132510 114379 -114641 49038 -25117 -14425
2489 -14425 16061 31514 47876 42178 40678 -19781 -8930 -129488 -28911 -90122 8326 99066
2477 99066 179592 78345 5066 -74166 107266 82217 53658 -16133 -37853 100204 36628
2466 36628 -25526 -183550 -284471 -44919 -127039 -99482 -105434 -192872 44022 192506 2917
2455B917j42862J05381J3950J62482j66875l5781Q5065O2267M4406J7205j93453
2444d5298k0053O3898P8234O5556p5295l89920k3933L20501J49542j09529o3963
2433e0260l5131K6634n2119j47626K89263J38003K1271j59252k62498J73129R0817
2422C2231L8833R859o5827m663K40826m6080j01087l3249P606R7538k90775K3525
2410i1263m7866j54549K33648J21939l659j96689n7553P5807J88798n3259l5455
2399b0101M5972o4591J74145r3560r4372p0571j01644R8374J72259M8271n9294
2388C4888R2017P4250P8472j48986j7932L2775k794j45560n4216J93277J9074
2377A55265k8808j21931J6382K27882Q2701J71570L50142j43867j27528r9511
$$ plain form
2455 2917 -139945 -34564 -20614 141868 -25007 -60788 24277 86544 130950 148155 -45298
2444 -45298 -65351 -1453 76781 142337 67042 -322878 -346811 -26310 123232 13703 -50260
2433 -50260 -85391 -58757 -110876 -258502 30761 168764 190035 30783 -231715 -58586 32231
2422 32231 71064 80923 15096 10433 251259 205179 104092 70843 78449 175987 -114788 -91263
2410 -91263 -139129 -293678 -60030 61909 58250 -138439 -195992 -120185 68613 15354 -20101
2399 -20101 25871 -38720 135425 41865 -52507 -123078 -224722 -126348 45911 94182 34888
2388 34888 126905 201155 279627 130641 112709 145484 142690 -2870 -57086 136191 155265
2377 155265 126457 4526 20908 248790 331491 503061 853203 709336 581808 482297
2367D82297j84897J27811k01757j74442p4373L1549K78513n1758j60873o8547
2357C523q904K4474j18048K40542m4884j71492R4542o5339J81701j12365n0888
2346b7138J88880j75395q533P4999L6783r2541j15853J00039L7965m0383o9053
2335i0230J04629r6503M645q1337J42851j76829J66299R0998O0291J90470k23596
2324I1688p1790J7931J25724p674o2674k0844j53594k47012L47758L6375k0018
2313C5870J69804j07215j96380N3678M5548n4601O7837N3825n6932j81456J99980
2302B9958N681P3216q5871l2114m9038J0480k4877n6965k1909R1368m9084K58530
2290A49375l02o8785J81178q0354J53396m2181J1606k30713K2365j8137K8392
$$ plain form
2367 482297 297400 425211 223454 49012 -25361 6188 284701 232943 72070 3523
2357 3523 -5381 19093 -98955 141587 96703 -74789 19753 -45586 136115 23750 -27138
2346 -27138 161742 -13653 -22186 52813 89596 -2945 -118798 -18759 19206 -21177 -90230
2335 -90230 14399 -82104 -77459 -158796 -15945 -192774 -26475 64523 124814 315284 91688
2324 91688 19898 37829 163553 155879 93205 72361 -81233 -328245 19513 55888 35870
2313 35870 205674 98459 -97921 -44243 1305 -53296 14541 68366 11434 -170022 29958
2302 29958 35639 108855 22984 -9130 -58168 -47688 -72565 -129530 -151439 -60071 -109155 149375
2290 149375 149073 80288 261466 181112 334508 292327 303933 73220 95585 77448 105840
2279A05840J71365J2533q7420R6919o6365l02691K7484K83870K366o7857J9791
2268A95835j93025J9531P5669l2353R4333J08843N0192M2309Q239R9961J2996
2257D82530k17900R0740j4722j35404j1318J12515J27576L6920k08835j16777
2247A45325J12581m1537j0873J84709q3799j13969M2097M7842k3574K14045R7827
2236E70674k02921p4149l8663O3733K24768j68667q7604J18556J10633J4465q215
2225E22610j21925R1642k1980J1080j16727J44434j64753j38771J51263J20916
2215D77789K46513k40215Q3731Q793P9291k6746n7085j764J203j6720R820J60785
2203G25395n9981l6912P8917j01243m5929Q5872k0815l7364J41592K9731J74487
$$ plain form
2279 105840 277205 289738 202318 299237 232872 -69819 -42335 241535 243901 176044 195835
2268 195835 2810 22341 98010 65657 159990 268833 319025 361334 369573 469534 482530
2257 482530 264630 355370 340648 205244 193926 306441 434017 470937 262102 145325
2247 145325 257906 216369 205496 390205 306406 192437 234534 282376 258802 472847 570674
2236 570674 367753 293604 254941 318674 543442 374775 287171 405727 516360 530825 522610
2225 522610 400685 492327 470347 481427 364700 509134 344381 205610 356873 477789
2215 477789 724302 484087 567818 576611 655902 629156 572071 570307 571510 554790 564610 725395
2203 725395 665414 628502 707419 606176 560247 646119 625304 587940 729532 759263 933750
2192I33750k10117j86636L2783M16949J23867j02736J33314l1612K33246n9753
2182A283055J15794J36958k15279j5636J61653J02803j49100J23108N5175j94887
2172A403644J12556J46915j27656J27102J86025n9790o8962O5298J37838K138
2162A925108O1775J58217k7841K0040j24464k927N2004L68981j20623N815j42528
2151B173557j86214p4026R6600J92372K29413J71297j39722Q9678L23275J28149
2141C004379J97310K16069K04364L10751N38848L52013J64670J43894K96878L05125
2131E734301K72537K84758N13267J86157L35160N14229O32837L61644O90674Q62401
2121A0387965J050032J282011J032668N55003Q02268J143449J612934K278967
$$ plain form
2192 933750 723633 536997 569780 986729 1110596 1007860 1141174 1109562 1342808 1283055
2182 1283055 1398849 1535807 1320528 1304892 1466545 1569348 1420248 1543356 1598531 1403644
2172 1403644 1516200 1663115 1535459 1662561 1848586 1788796 1719834 1785132 1922970 1925108
2162 1925108 1986883 2145100 2117259 2137299 2012835 2009908 2061912 2430893 2310270 2316085 2173557
2151 2173557 1987343 1913317 2009917 2202289 2431702 2602999 2463277 2552955 2876230 3004379
2141 3004379 3201689 3417758 3622122 3932873 4471721 4823734 4988404 5132298 5429176 5734301
2131 5734301 6006838 6291596 6804863 6991020 7326180 7840409 8473246 8834890 9525564 10387965
2121 10387965 11437997 12720008 13752676 14307679 15109947 16253396 17866330 20145297
2113B0145297K712281L550432M124385N272695O770436R118682J3216567J9218378
2105H4129153K1972156J1342597j3608107j6498631j4494136j4498664j0528843
2098D7815525r014579o164072m510892l388100l022502k070932j542349q41992
2090A7260107r43709p21906j541553j297426j095387q12796q77044r53418p08715
2081H308153m32812j33597l40035m42853k58481k96264k29723k73414k55525n43524
2071E101925j12265k74115r9379J04301j00670k21236k14522k24393l3571q8551
2061C837524j55982K1717k07369j75823k10056r4766j89735k14658n2512J4359
2051B572699q7590j74506l6314K8873j72851l7558n2596q5155K02686j21589J07726
$$ plain form
2113 20145297 22857578 26408010 30532395 35805090 42575526 51694208 64910775 84129153
2105 84129153 106101309 117443906 103835799 87337168 72843032 58344368 47815525
2098 47815525 38800946 32636874 28125982 24737882 21715380 19644448 18102099 17260107
2090 17260107 16316398 15594492 14052939 12755513 11660126 10847330 9970286 9016868 8308153
2081 8308153 7875341 7741744 7401709 6958856 6700375 6404111 6174388 5900974 5645449 5101925
2071 5101925 4989660 4715545 4616166 4720467 4619797 4398561 4184039 3959646 3926075 3837524
2061 3837524 3681542 3703259 3495890 3320067 3110011 3015245 2825510 2610852 2558340 2572699
2051 2572699 2485109 2310603 2274289 2303162 2130311 2092753 2040157 1955002 2157688 2036099 2143825
2040B143825Q9599k85903j31013p0689n8282n069m3568j52797r6225O1163Q8731
2029A539772L1778r6698O1160j56378q7434Q4084J0113j80440k76826O3845J88322
2018A181298o2600j47211N7771O3518j73111r8754R5549q2211J48509o6761R25
2007I16922J79234O7551k33724j50507j8432R8105k9015q7960L2719l05691j18147
1996C51055R5594J06064M1382R4710j12344P2400n7283j18373Q1501Q9577k2955
1985F21328q8948j63925M5514J8140j17349j42259m8240R2648J93849J08415J82253
1974G01426j73686k47857P2538L7437K3119K1878p2819P9758j39983R4009p4240
1963C21580k48121J07033J56591l8793Q3966l9591k34351p8223Q5658K3715K26601
$$ plain form
2040 2143825 2233424 1947521 1816508 1745819 1687537 1682468 1638900 1486103 1389878 1451041 1539772
2029 1539772 1571550 1474852 1536012 1379634 1292200 1376284 1386397 1205957 929131 992976 1181298
2018 1181298 1118698 971487 1029258 1092776 919665 820911 916460 834249 982758 915997 916922
2007 916922 1096156 1163707 929983 779476 761044 859149 830134 742174 774893 469202 351055
1996 351055 446649 552713 594095 688805 576461 648861 591578 473205 554706 644283 621328
1985 621328 532380 368455 413969 432109 314760 172501 124261 216909 410758 519173 701426
1974 701426 527740 279883 352421 389858 412977 434855 362036 441794 301811 395820 321580
1963 321580 73459 180492 337083 298290 382256 342665 108314 30091 115749 139464 366065
1952C66065R9615k93986l9357J16334L3921M5944j38382J06325j6670k9410J10400
1941C60799N1968p169o0291j52721r2331K56850j07517j12088J5069O2164R4337
1930C09070L1210m5755j14004o1830j3398k2297j2358j65219j38108k0033J33155
1919a19567J95282P1130o6143P5192q0985p4934O9250N5499l5046P2378J42280
1908C04336O6370j22460j75766j03021K2090j55663J66817k8608K2909J40084
1898A37088j05758m9523P4379L4285N2393k5510Q5504j45226n8328L03776M9794
1887C52874l28496j9043J46685j10321j30899Q3927J57749j8840k9514K0944J6028
1876A41094P2945k13105J93968K7425k59758O1829K23410r4159r4058p6973k906
$$ plain form
1952 366065 465680 171694 132337 248671 282592 328536 190154 296479 279809 250399 360799
1941 360799 412767 405598 345307 192586 100255 357105 249588 137500 152569 214733 309070
1930 309070 340280 294525 180521 118691 105293 82996 70638 -94581 -232689 -252722 -119567
1919 -119567 75715 146845 80702 155894 74909 -25 69225 124724 89678 162056 304336
1908 304336 370706 248246 72480 -30541 -8451 -164114 2703 -25905 -2996 137088
1898 137088 31330 -18193 56186 90471 142864 117354 202858 57632 -696 303080 352874
1887 352874 24378 5335 152020 41699 -89200 -5273 152476 133636 104122 125066 141094
1876 141094 214039 934 194902 222327 -37431 24398 247808 153649 59591 -17382 -20288
1865b0288l7007J08637j30580j03909J46735m4731P5336J62580L3002J2513m5876
1854A56412o3416r8473l8895K85346j07988j56563M6122j46882J39371j06215
1844i1181k1356K09256P4225K3791j69696J17228M40548J09507j22888R047q8205
1833D90276j33611l9103J31134l18379J54781M2351k18341O8970n2253J27154
1823B52979J43165l83470j25746Q0621J07234J9484q6154l8448O2360K098M176
1812C8299k9353j33729J9073R4191o6143J65925j37826m5921n1996K03193o459
1801D9254p1195K8357N6712M3059J1890J18929j3595j97488j09640J39531k97663
1790b41849J94460J99757N6596j20005k23982K03915K4793j62853j20469N8738
$$ plain form
1865 -20288 -57295 51342 -79238 -183147 -36412 -81143 -5807 156773 189775 202288 156412
1854 156412 92996 -5477 -44372 240974 132986 -23577 22545 -124337 15034 -91181
1844 -91181 -112537 96719 170944 194735 25039 142267 582815 692322 569434 578481 490276
1833 490276 356665 317562 448696 130317 285098 327449 109108 178078 125825 252979
1823 252979 396144 12674 -113072 -32451 74783 94267 8113 -30335 32025 34123 38299
1812 38299 8946 -124783 -105710 -11519 -77662 88263 -49563 -95484 -147480 55713 49254
1801 49254 -21941 6416 63128 106187 118077 237006 223411 25923 -83717 55814 -241849
1790 -241849 -47389 152368 208964 88959 -135023 68892 93685 -69168 -189637 -130899
1780a30899J27102Q67O108J01589o6431J64910j67350l5092M638o6809m1396o6254
1768a69017q4600J54361P2524j0017M0123J2829j37595K38063m0126j02838J30456
1757A04163j23761K6662q4190P2648j18270j53554J24393J69198k45608o3259
1747b91578J41673J2445J93520k3512J46844j43626N4210o3868j97704J28744
1737d2852j96306K94079J15480j38574m7727r634j248o4223j32516J30932P7687
1726a4902l5025m0413q459j01643o361L4862J13854L9656j01660J81250J70448
1715B31607j03178j218k1664N0674J21020K0976j87633j00868p8186J7910M3267
1704g293j64529l8782k961K41499J53500j21883j04092j7918J45243n920N2503
$$ plain form
1780 -130899 -3797 -2930 3178 104767 38336 203246 35896 804 5442 -61367 -102763 -169017
1768 -169017 -253617 -99256 -26732 -36749 3374 16203 -121392 116671 76545 -26293 104163
1757 104163 -19598 7064 -77126 -4478 -122748 -276302 -151909 17289 -228319 -291578
1747 -291578 -149905 -137460 56060 32548 179392 35766 89976 26108 -171596 -42852
1737 -42852 -239158 54921 170401 31827 -15900 -25534 -26782 -91005 -223521 -92589 -14902
1726 -14902 -49927 -90340 -98799 -200442 -206803 -171941 -58087 -18431 -120091 61159 231607
1715 231607 128429 127211 105547 156221 277241 298217 110584 9716 -68470 -50560 -7293
1704 -7293 -171822 -210604 -213565 27934 181434 59551 -44541 -62459 82784 76864 129367
1693A29367j00683k38398J16855N7381n6748P1486M1100L849K8329O5698K6723
1682A44959j30192N0430L3903k01788o1731O7417K00494K2491j97629R4824R9265
1671A22443l19588L9682k26273N6750j2415L82093K6662P3479o7244j74679l0183
1660a29273j6882K37309o6160j40194K17968n5666J0365j75363j91592J21618
1650a87870Q4584J9991l48j0451p2152J24888P5540l19928J2023K35666O9347
1639C1290K6593k00620J32898q5970k76909L3238J7715J11390J42804o5060n4226
1628a86857k6230K20905j8255L6210j42313j05194J11471L1317j36814Q0096m2722
1617a78386J40891J89696K845k62923K0730J5184J42677j31647j21838J27341
$$ plain form
1693 129367 28684 -209714 -92859 -35478 -92226 -20740 20360 24209 52538 118236 144959
1682 144959 14767 65197 99100 -102688 -164419 -97002 103492 125983 -71646 23178 122443
1671 122443 -197145 -157463 -383736 -326986 -339401 42692 69354 142833 75589 -99090 -129273
1660 -129273 -146155 91154 24994 -115200 102768 47102 57467 -117896 -309488 -187870
1650 -187870 -103286 -83295 -83643 -94094 -166246 -41358 34182 -285746 -273723 -38057 31290
1639 31290 57883 -142737 -9839 -95809 -372718 -339480 -321765 -210375 -67571 -132631 -186857
1628 -186857 -213087 7818 -10437 25773 -116540 -221734 -110263 -78946 -215760 -135664 -178386
1617 -178386 -37495 152201 155046 -107877 -87147 -71963 70714 -60933 -182771 -55430
1607e5430K39409j61002r5843L417J96609m4033j67015n132O2911J08391Q7592
1596A69874o9480j07526n3558J9338j24714k0790K8122Q415j77830J22076O0479
1585a45594J784m3503j09940K69702O9587K4636j24731q3465l4359j16960r512
1574c02355K3166m2771K06119J14830j7307q0353m0833M6637J67400J68885j18531
1563A24887j53321K1074J06608j17612p7997j9527m659Q3372l2374j60014r2474
1552c22037J95575m280J50795n9592J41562R7592M9270k04956j17200J62324j12098
1541b3045J47004l3544k52235R8412J2230j45797r8506K30903K43456j67738k41217
1530b30077P45J96816j7770j15659J31386J4215j42035M078J36322Q2106j62401
$$ plain form
1607 -55430 183979 22977 -72866 -69449 127160 83127 -83888 -89020 -26109 82282 169874
1596 169874 100394 -7132 -60690 -41352 -166066 -186856 -158734 -150319 -328149 -206073 -145594
1585 -145594 -143810 -187313 -297253 -27551 42036 66672 -58059 -141524 -175883 -292843 -302355
1574 -302355 -279189 -321960 -115841 -1011 -18318 -98671 -139504 -92867 74533 243418 124887
1563 124887 -28434 -7360 99248 -18364 -96361 -115888 -120547 -37175 -69549 -229563 -322037
1552 -322037 -126462 -130742 20053 -39539 102023 199615 248885 43929 -73271 89053 -23045
1541 -23045 123959 90415 -161820 -63408 -51178 -196975 -295481 -64578 178878 11140 -230077
1530 -230077 -229332 -32516 -50286 -165945 -34559 -20344 -162379 -158301 -21979 60127 -102274
1519a02274R284m2336J13841K13446k78431j34705J00450J24669o7373p8274J00147
1508d1556R8453k7837R0204M256r9555j81962M6081M7933j13975n3900K72844
1497D0986j0102N6010K3771l55753L8214J53432J4756j56421j91296J28744L15790
1486E8131l3220P5633j27358o9199J14164J09488l07973J2665J74118j50n3804
1475d7505j01793K14455j22521Q3637K8393n5789j35598n9248k4800K01158j53890
1464a73501J99267J79295o1938O4596l05331q623j5011j16901J21415J2555j08255
1453b12432j98354J82793J01966K8204k4619O4878O5385K6538j69384O5460P3489
1442C924q0876j2414j28672Q1412J65395N2511N2261M7798p3472j39811j14642
$$ plain form
1519 -102274 -92990 -135326 -21485 191961 -86470 -221175 -120725 3944 -63429 -141703 -41556
1508 -41556 56897 29060 119264 123520 23965 -157997 -111916 -63983 -177958 -231858 40986
1497 40986 30884 86894 110665 -245088 -206874 -53442 -38686 -195107 -386403 -257659 58131
1486 58131 24911 100544 -26814 -96013 18151 127639 -180334 -167669 6449 6299 -47505
1475 -47505 -149298 65157 -57364 26273 54666 -1123 -136721 -195969 -220769 -19611 -173501
1464 -173501 25766 205061 143123 207719 -97612 -106235 -121246 -238147 -116732 -104177 -212432
1453 -212432 -410786 -227993 -126027 -97823 -122442 -57564 7821 34359 -135025 -69565 3924
1442 3924 -76952 -89366 -218038 -136626 28769 81280 133541 181339 107867 -31944 -146586
1431a46586K01174n437l5761Q2016K6442j36186J49707j47686J08065k69418M2339
1420a31331j28620k27035L22691J56090j29343J41875o9075j55626M4961j65358
1410c40771K19675J82640j42508J75662j17205k47639J18377L2416r3376o17m9434
1399b62780J03443P9643j23789m6861J30524J34528k32016l541K50563l7114Q2314
1388G4914j91538n606L00523j90812r8683j94299R3241K29451k52605m6350J73360
1377a08404K2432l4139J49522L252q2953n0839M8156r1278R0652Q5228J7349j1176
1365C7802r5731j59545j16420Q8759J20837L4068P8353J10961l0614k7762J55110
1354A95818j25255j50439Q00k23702L2918J02107P9000r423P9429j9008k6761
$$ plain form
1431 -146586 54588 49151 13390 95406 121848 -14338 135369 -12317 95748 -173670 -131331
1420 -131331 -259951 -486986 -164295 -8205 -137548 4327 -64748 -220374 -175413 -340771
1410 -340771 -121096 61544 -80964 94698 -22507 -270146 -151769 -119353 -212729 -213346 -262780
1399 -262780 -159337 -79694 -203483 -250344 -119820 14708 -217308 -220849 29714 -7400 74914
1388 74914 -116624 -122230 178293 -12519 -111202 -305501 -212260 17191 -235414 -281764 -108404
1377 -108404 -85972 -120111 29411 32663 -50290 -101129 -52973 -144251 -53599 31629 48978 37802
1365 37802 -57929 -217474 -333894 -245135 -124298 -90230 -11877 99084 68470 40708 195818
1354 195818 70563 -79876 -79076 -302778 -269860 -167753 -88753 -98176 -18747 -37755 -64516
1343f4516j21050J24933L7284P7914p5385j3897M8301k2965j02468O9162q5727
1332a28414J26176M8750j29562L3984R8717j56646O8862j15021O6927J06038l54705
1321c34894L2981L04807P6994k74672j64576P2793Q8273J75540J73125r8498j56898
1310a05025j24883L3182K97304k06160R192K19378j16949J38665J52267j8686
1300B78285l9577O1950j25889j53126K6098k04680R6091K60387R3003j18421k24575
1289e0454P1957J53972r4905m0198J06257j78512j44556J30556J71547j62742
1279c7078j0675J43323J17981j85995N4746n8143k3738J31688K4092j30173n005
1268B1023o9458O6700J32273K7868l51606J20684r2351k5757K1589Q4216j08262
$$ plain form
1343 -64516 -185566 -60633 -23349 54565 -20820 -34717 13584 -9381 -111849 -42687 -128414
1332 -128414 -2238 46512 -83050 -49066 49651 -106995 -38133 -153154 -86227 19811 -334894
1321 -334894 -301913 2894 79888 -194784 -359360 -286567 -198294 -22754 150371 51873 -105025
1310 -105025 -229908 -196726 100578 -105582 -96390 122988 6039 144704 296971 278285
1300 278285 238708 300658 174769 21643 47741 -156939 -60848 199539 292542 174121 -50454
1289 -50454 21503 175475 80570 40372 146629 -31883 -176439 -45883 125664 -37078
1279 -37078 -47753 95570 213551 27556 82302 24159 421 132109 156201 26028 21023
1268 21023 -48435 18265 150538 178406 -173200 -52516 -144867 -170624 -149035 -64819 -173081
1257a73081l0296P2230j68589n1383J45742J50048j4686J48520r9159L6187L6785
1246E2318l8264J2934j9603k1352q9938j60144K01692J30344j62698k264r6557
1235a93532n8156j08588k3322K91052R8794L579j74144k53382L26281L6613j74798
1224b29603P8656J85431N2609j02126n2314J2361N9579M0985R6195r2299m7372
1213B102k84308Q8326Q1213J60205r3183q0021J28369R1077m9650p0082p5399
1202a01351P9374M1057J54324j41999J0410M62r8878k0155J03014P1050p4013
1191B3295O0518q7446j69705K08269p5185j62816J73318l4744o1818R4119J52898
1180A20703n0992r219J3317Q1336j41067j9450P9960M1635j2602P3048j43696
$$ plain form
1257 -173081 -203377 -131147 -299736 -351119 -205377 -55329 -70015 78505 -20654 15533 52318
1246 52318 14054 26988 7385 -13967 -103905 -264049 -62357 67987 -94711 -96975 -193532
1235 -193532 -251688 -360276 -383598 -92546 6248 9827 -164317 -417699 -91418 -54805 -229603
1224 -229603 -150947 34484 87093 -15033 -67347 -54986 4593 45578 141773 49474 2102
1213 2102 -282206 -193880 -112667 47538 -45645 -125666 2703 93780 44130 -25952 -101351
1202 -101351 -21977 19080 173404 31405 41815 42277 -56601 -76756 26258 97308 23295
1191 23295 83813 -3633 -173338 34931 -40254 -203070 -29752 -64496 -126314 -32195 120703
1180 120703 69711 60492 73809 155145 14078 -5372 74588 116223 103621 176669 32973
1169C2973j3287r1966k22726M6452J27255J01984l7203l5106j08027o9504j4147
1158b83302R3597J37064K7172l4804J54236M412j61950n2919r9969K12785K01043
1147A97365j49882L0959j50753k9279M5276k5123j52173J25350q5068r9171K24414
1136f8085r026J7736j4329o4140K7104k7583l8265o3913Q7684J60610M2323O8705
1124A18821r8564J10656j67791q4040M3003J01750p0157j13766N7651J54133J41901
1113A93597l9666L7966j71047j19332J14638r3450J7107P9253l5003Q9670Q726
1102H2459j62515P7819Q9958j51824k8630M9346k4356p3353Q1794J89727q5679
1091D4746R7000m9154K3939r5214j4168j27707p0462j3529k2384J58958J901o4907
$$ plain form
1169 32973 19686 -72280 -295006 -248554 -121299 -19315 -56518 -91624 -199651 -269155 -283302
1158 -283302 -189705 -52641 -25469 -60273 93963 98375 -63575 -116494 -216463 -3678 197365
1147 197365 47483 78442 -72311 -101590 -56314 -81437 -233610 -108260 -193328 -292499 -68085
1136 -68085 -77111 -59375 -73704 -137844 -110740 -138323 -176588 -240501 -152817 7793 50116 118821
1124 118821 20257 130913 -36878 -120918 -77915 23835 -46322 -160088 -102437 51696 193597
1113 193597 153931 191897 20850 -98482 16156 -77294 -60187 19066 -15937 73733 82459
1102 82459 -80056 -2237 87721 -64103 -92733 -43387 -67743 -141096 -59302 130425 44746
1091 44746 141746 92592 116531 21317 7149 -120558 -191020 -204549 -226933 -67975 -66074 -130981
1079a30981o4388K53171m8865n8088J40543o3243K1513m5044P9576j58017J41176
1068F7353q1269o5018J71354K4424o7440j04671k3911r9243l2309O8113j2196
1057a54813K03868J49308k9966j3880j5096m2294m6940j46453P414j93954j69770
1046d52576L26670J47501j99466j06801m9644l2041K24164K8038K39575L7344
1036A62764j70626n4582j07297J6474J82109l530j03776k32931L27459K60213
1026B76277l27763k16024J63091P6958P8216o6067J71248K933j75788J40523N7972
1015A81576j48602q3856m8398J29893j82708O7286O0070J32095N2137Q04m2274
1004A18023O1074J3505o5321N5616R0632j12240l9141k4303M3989J32310j1099
$$ plain form
1079 -130981 -195369 57802 8937 -49151 91392 28149 49662 4618 84194 -73823 67353
1068 67353 -13916 -78934 92420 116844 49404 -55267 -79178 -178421 -210730 -142617 -154813
1057 -154813 49055 198363 168397 154517 139421 97127 50187 -96266 -88852 -282806 -452576
1046 -452576 -125906 21595 -177871 -284672 -334316 -366357 -142193 -114155 125420 162764
1036 162764 -7862 -62444 -169741 -153267 28842 25312 -78464 -311395 16064 276277
1026 276277 -51486 -267510 -104419 -27461 50755 -15312 155936 158869 -16919 123604 181576
1015 181576 32974 -50882 -99280 30613 -152095 -84809 -24739 107356 159493 160297 118023
1004 118023 179097 192602 127281 182897 273529 161289 122148 97845 141834 274144 263045
993B63045m12112Q817J4719k5643n1177J13324Q2989M3956N6634j24096Q2442
982E2898q1413J83062l9590j09864j99850R1759J78545o3876j02958Q020O7807
971a5460J63970k28431k1379Q6619k46379K28435J88630j17401l1416J04207n0028
960F1367k28839J01576J29373r4150J5892P3444j38310J32986n9410J11240J3255
949A18424j38618j51301J17220L8210J25349j88244r251n4569J21866j83998j62059
938c66971J90841J37551J4337J00545K7392j56230j68390R9232J57101j04527
928f9119l2429P5920J13980L6530q5278J6295n1887p4887N2252j54259J05493
917f7389R1744r1025q262J60953r7813J28147n4717j0510K387J37766J0165j5736
$$ plain form
993 263045 -149067 -140250 -125531 -151174 -202351 -89027 -6038 37918 94552 -29544 52898
982 52898 -28515 154547 114957 5093 -194757 -102998 75547 11671 -91287 -83267 -15460
971 -15460 148510 -79921 -101300 -14681 -261060 -32625 156005 38604 7188 111395 61367
960 61367 -167472 -65896 63477 -30673 -14781 58663 -79647 53339 -6071 105169 118424
949 118424 -20194 -171495 -54275 -16065 109284 -78960 -88211 -142780 -20914 -204912 -366971
938 -366971 -176130 -38579 -24242 76303 103695 -52535 -220925 -121693 35408 -69119
928 -69119 -101548 -25628 88352 124882 39604 55899 4012 -70875 -18623 -172882 -67389
917 -67389 24355 -66670 -74932 86021 -11792 116355 61638 51128 53515 191281 201446 185710
905A85710k36132k56412L00678J37677o9802k2172O9861j56735J4788j43396J40496
894c5439R7582n9971L4335L0520K8187p359k6271j20777J21488M912m102p9713
882a6608j29103K05295N2472j14980o7665n9185K13745o0741r0504R4907m0444
871a2811p4494K29660j17295n9977j29873j01877J64744J74175N1756j860j01292
860B0856Q3012j71100j4849J97627j72834M5436J39902p1041j15343k5026L3511
849d9849M5821K05793m0497j07940j18491m7247L69K56579j45631j21084K11073
838H8896M3262M0203j58895l8814J33939O2263q4420j94860o747K48750L2838
827A66415o2451l8712Q6149k6823m7351L760Q082n9886Q0925m7226l9766J47798
$$ plain form
905 185710 -50422 -306834 -6156 131521 61719 39547 109408 -47327 -32539 -175935 -35439
894 -35439 62143 2172 36507 67027 95214 87855 61584 -59193 62295 67207 63105 -16608
882 -16608 -145711 59584 112056 -2924 -70589 -129774 83971 23230 -67274 27633 -12811
871 -12811 -87305 142355 25060 -34917 -164790 -266667 -101923 72252 124008 122148 20856
860 20856 103868 -67232 -82081 115546 -57288 -11852 128050 57009 -58334 -83360 -49849
849 -49849 -4028 201765 161268 53328 -65163 -112410 -112041 144538 -1093 -122177 88896
838 88896 132158 172361 13466 -25348 108591 170854 86434 -108426 -115173 133577 166415
827 166415 103964 65252 151401 124578 77227 80987 89069 29183 110108 62882 23116 170914
815A70914L4638k10040n1386J19084p336j75653R2026M4055M4458P6274p6102
804F0932n4811L726q8028L3314Q1784r2883J08120j39586k7949k3257J20868J27047
792A09277k27463N3434r4161N7755k2041J10680M3553r4624K7445k1790l817M3615
780a8137k9230q061k0551J29948J09230K8599n5570l7591n5979J34647m0375p6560
768F0370j4834L5980J29363m2762j02820k6010p2103L346L26926l15871J1196
757g219Q8259L5001n6304O7088M7296r0220J19753j20726j19419o5692K100J73270
745G3187K9858K322o8126j42805J6380k1445j40262k0863J47210j11987J83903
734e2628J11235j03111K89257N2649q9584K05131j24597j57186o790j96419O1864
$$ plain form
815 170914 205552 -4488 -55874 63210 55874 -119779 -27753 16302 60760 137034 60932
804 60932 6121 9847 -78181 -44867 36917 -55966 52154 -87432 -115381 -138638 -17770 109277
792 109277 -118186 -64752 -158913 -101158 -123199 -12519 31034 -63590 -36145 -57935 -61752 -18137
780 -18137 -47367 -55428 -75979 53969 163199 191798 136228 98637 42658 177305 136930 60370
768 60370 45536 81516 210879 168117 65297 39287 -32816 -29470 297456 -18415 -7219
757 -7219 81040 116041 59737 126825 174121 83901 203654 82928 -36491 -102183 -100083 73187
745 73187 103045 105367 37241 -105564 -89184 -110629 -250891 -271754 -124544 -236531 -52628
734 -52628 58607 -44504 244753 297402 207818 412949 288352 131166 124376 -72043 -10179
723a0179J23223J13144p0804n9869j32833J83225K4644j60212J13077k6903m5805
712E0708m2490j07150k53132J19663L5040J26115j0351j5890l2359Q8125J35398
701I3677p4457m0732J36113o5351R1876o5694P1753J08278j87730P4689j43688
690a266L1798j40132n0594K40437J9071l17087M854K54562k18731K8622L30747
679A82281j94565M4224L4194l7174j23978r9877K16924J99681k63549j641q7266
668a30746r715J92514p7076n9645N1255L795m1785n5526O5239J96241m4701Q4895
656A74745j10216j36020p3335J33078k3663r0782R2703K4441K9588P8412j50796
645e1845O9758J2671j87242J38797j02110j35739Q6900R9929m2229J70024j86289
$$ plain form
723 -10179 113044 226188 155384 95515 -37318 145907 170551 10339 123416 96513 50708
712 50708 8218 -98932 -352064 -232401 -197361 -71246 -81597 -97487 -129846 -41721 93677
701 93677 19220 -21512 114601 49250 141126 75432 147185 255463 67733 142422 -1266
690 -1266 30532 -109600 -160194 80243 99314 -217773 -212919 41643 -177088 -148466 182281
679 182281 -12284 31940 66134 28960 -95018 -194895 22029 221710 -41839 -43480 -130746
668 -130746 -140461 52053 -25023 -84668 -33413 -29618 -71403 -126929 -61690 134551 89850 174745
656 174745 64529 -71491 -144826 -11748 -35411 -126193 -33490 -9049 20539 98951 -51845
645 -51845 17913 30584 -156658 -17861 -119971 -255710 -168810 -68881 -111110 58914 -127375
634a27375J84631J15845L0677j04511n347P1272r3118j16930m5033o1556j9143
623a70588J56377o4763k3075K1477R6938R3157j80239j31248J0838p6044K03211
612f3959J51663k3158j17149N9301j73523J53776J58500j1737l4811J15846m4669
601A70080o3474k66153J6677K7205j03874O5229P8833l2184J79755M5686j75289
590e7509n0126m640N6814J72798J5697j92173n7905N4790Q1845j06905J26268
579C8954o9874j09395J06638P1084p4280j27712o7275K38285N2447p7343j04845
568a23316K3889J43811N6801j02867o7760L884j6611Q0502k214j5183q4065J06565
556C436O1825L9033O3906P943m1095k2210l467m5577o5553J13509R3109r8413
$$ plain form
634 -127375 57256 173101 203778 99267 93920 165192 72074 -44856 -89889 -151445 -170588
623 -170588 -14211 -78974 -102049 -80572 16366 109523 -70716 -201964 -191126 -267170 -63959
612 -63959 87704 64546 -52603 6698 -166825 -13049 145451 133714 98903 214749 170080
601 170080 106606 -159547 -142870 -115665 -219539 -154310 -75477 -107661 72094 117780 -57509
590 -57509 -107635 -112275 -55461 117337 133034 -59139 -117044 -62254 19591 -87314 38954
579 38954 -30920 -140315 -33677 37407 -36873 -164585 -231860 6425 58872 -18471 -123316
568 -123316 -99427 44384 101185 -1682 -69442 -65558 -82169 -1667 -3881 -19064 -103129 3436
556 3436 65261 104294 168200 176143 135048 112838 109371 63794 -1759 111750 204859 106446
544A06446k9950p7165k7346J6381R2179j2640k7084J54038K5711J68331k76012
533A12889P6939J85608m05477O3877J15718J1271j48395M8704K28405k87885n1189
522d9535J16642o0311k8959J00211K2440q3391k61870J8992K75758K1952j03840
511c1911j5761L3406Q6687P477k06164N9853R5297J41907o5141J18630p788P3365
499B89857j66449j7521J1196Q040J239j4930n0622P2738R0359o3368k9908k18666
487h8035N2936K01336J82450k30689J8252J00432k3639j15241r2417o086j86336
476a87037K91192Q4426r8445m7552l4229P2160j98176K76841K3405k15591o402
465c9408Q4322R1671N8211j13584j12805J23477j57690Q9425J94396l4553k2786
$$ plain form
544 106446 76496 -669 -28015 -11634 80545 67905 40821 194859 220570 388901 112889
533 112889 189828 375436 -30041 33836 149554 160825 12430 61134 289539 1654 -49535
522 -49535 67107 6796 -22163 78048 100488 17097 -244773 -225781 49977 71929 -31911
511 -31911 -47672 -14266 72421 79898 -126266 -66413 28884 170791 105650 224280 216492 289857
499 289857 123408 105887 117083 125123 126362 111432 60810 133548 223907 160539 130631 -88035
487 -88035 -35099 166237 348687 117998 136250 236682 213043 97802 5385 -701 -187037
476 -187037 104155 188581 90136 42584 8355 80515 -117661 159180 182585 -33006 -39408
465 -39408 44914 136585 194796 81212 -31593 91884 -65806 23619 218015 183462 160676
454A60676j32889j12242P2808o22J22733O3631l4811q7518K528m9629k52674J27380
442a20629J33255j0400O6630k31575n7931J9835J5619P5358O1800n7576l1380
431a36994Q1356K19872J5587L4110j48843p2893L5860Q1771j42262k32724J10347
420a54813O3443M13173k0880l65377o2326J83063O0071k7132p4283k25139J38173
409g2027J52484Q0013J1831j14247J36173j31825k03070J63897J08057J12548
399B43834L7933p1533l1114p2901J40561j01387q1635M4653J28732Q0752k17512
388A00383j74503l2700j33120R0428J82829L2377o5445R7604q4256j09606l1646
377a27655Q8472M7227K46591n5369j41120j81933R9690R9718M721k9847M63j00459
$$ plain form
454 160676 27787 -84455 -11647 -12269 110464 174095 139284 51766 54294 4665 -248009 -120629
442 -120629 12626 2226 68856 -162719 -220650 -200815 -185196 -109838 -48038 -105614 -136994
431 -136994 -55638 164234 179821 213931 65088 -7805 28055 109826 -32436 -265160 -154813
420 -154813 -91370 321803 300923 -64454 -126780 56283 116354 89222 14939 -210200 -72027
409 -72027 80457 160470 172301 58054 194227 62402 -140668 23229 131286 243834
399 243834 281767 210234 179120 106219 246780 145393 63758 108411 237143 317895 100383
388 100383 -74120 -106820 -239940 -149512 33317 65694 249 97853 13597 -96009 -127655
377 -127655 -39183 8044 254635 199266 58146 -123787 -24097 75621 80342 50495 50958 -49501
365d9501J72400P2683j89273J17893N4403M9623J29956j11063K6533p1197k11429
354h972Q4563P2697K720l6213j56566k3567J23371J51716k2970q6727j9407J49413
342B30058N5131j87724R0410l2899J564l3458N5031o0716K8628p2908M7540L5607
330A56264M0764o8091J56660n7836r9260j11570J24435m5158l0133j7548J36348
319A84875J2133J3203k4814j98765k2360J43215J0957m7897k20131J7598J61795
308B9809N1230m1258j24802K38533k1493K4033O4442k4211j03431J8084k34808
297a23872j30272K56493J18363q4396O9494j68701j25866J83388n00j38998J06631
286c8236Q2171n2939K15166J74356j64801j42571J27000l3792k00250N5965L06355
$$ plain form
365 -49501 122899 195582 6309 124202 178605 228228 358184 247121 273654 202457 -8972
354 -8972 75591 148288 151008 114795 -41771 -65338 58033 209749 186779 100052 80645 230058
342 230058 285189 97465 187875 154976 156540 123082 178113 117397 146025 73117 120657 156264
330 156264 197028 128937 285597 227761 128501 16931 141366 96208 66075 48527 184875
319 184875 197008 210211 185397 -13368 -35728 107487 118444 70547 -149584 -131986 29809
308 29809 81039 39781 -85021 153512 132019 156052 220494 196283 92852 110936 -123872
297 -123872 -254144 2349 120712 36316 105810 -62891 -188757 -5369 -5869 -144867 -38236
286 -38236 43935 -9004 206162 380518 215717 73146 200146 166354 -33896 22069 328424
275C28424J75369q8831j45576m9265P5911n4490j77566o1844J77707r1199M0320
264A28960J12292R2559j83531J09258J7924l56627N4369k2748J45154j78019n132
253h5541Q4475j87026J06827l1161j70834J99362J42632o834K21144m2202N2811
242B83653j32873N588l4444j11974J82926J41366n8890j41953R1637m145o5367
231A55524k9959j30476m9445M412P7026O29q5316J23088m3424K74925O6125k0590
219C42519p3772r0670j11090k9219q6547j79390M3527K55211L4937K1108O3497
208A90111p0580M3133j21168p5181J72693J8143n7401o6959K02887J30953K8780
197C95411n2336j88574O3792L2852m0359j48979q2558n0805j16071J2072J25898
$$ plain form
275 328424 503793 414962 269386 220121 296032 241542 63976 2132 179839 88640 128960
264 128960 241252 333811 150280 259538 277462 -79165 -24796 -47544 97610 -80409 -85541
253 -85541 -1066 -188092 -81265 -112426 -283260 -83898 58734 51900 273044 230842 283653
242 283653 150780 156368 121924 9950 192876 334242 275352 133399 225036 220891 155524
231 155524 125565 -4911 -54356 -49944 27082 27711 -57605 65483 22059 296984 363109 342519
219 342519 268747 178077 66987 37768 -48779 -228169 -184642 70569 105506 126614 190111
208 190111 119531 162664 41496 -33685 139008 157151 99750 32791 235678 366631 395411
197 395411 343075 154501 218293 251145 210786 61807 -20751 -71556 -187627 -175555 -49657
186d9657J00921K37646j24608J5453n5791R3283J7786k02039Q4958O9080L4935
175B21967j27393k95806N1525K8908J50252P3199N510P9633k27141J7257J69071
164A46982j81252L3224J46764J18739j83636p6529N5735P2102L5391p2909J61003
153B55614j09927m5442M4063J06725j8847K8981M7894j62725m5994J11246r7876
142A13712j03494m3084O0636J94397q263p9420Q90k11684Q0047J63228n8431K7483
130A36017K1652j276K3090j05545M5619Q7775r7207k32257J18083J34327l7781
119I2497J27500P5986o4491k15454N7138k04689m9085J32924O0864j8280J26078
108A20988K4778o8362R7389l3040J20032M0757j75947r4262r6204J0199M4239
$$ plain form
186 -49657 51264 288910 164302 179755 123964 217247 235033 32994 117952 187032 221967
175 221967 94574 -201232 -149707 -120799 29453 102652 108162 187795 -39346 -22089 146982
164 146982 -34270 -1046 145718 264457 80821 4292 60027 132129 167520 94611 255614
153 255614 145687 100245 144308 251033 232186 261167 309061 146336 100342 211588 113712
142 113712 10218 -32866 27770 222167 213904 134484 135374 -76310 3737 166965 108534 136017
130 136017 157669 156393 179483 73938 119557 207332 110125 -122132 -4049 130278 92497
119 92497 219997 295983 231492 16038 73176 -131513 -180598 -47674 13190 -5090 120988
108 120988 145766 77404 174793 141753 261785 302542 126595 32333 -63871 -53672 -9433
97i433O5607j0162J3668Q9718N9461o6886j18947P0750J9143K7545J16500J2575
85B69539n9607j31792j72106r270K17823o863J10566J87598l8577j12339m0271
74B14701j6750j5476R9095n6349J4037n9298k2718j24592j56915J90814Q8181
63A54730j82810J79638N5108j97800O5284J2704K0458L4145k2913K2406r5853
52D5097J39790j10820J2178J39067r9401j58847r6853Q8588L07297N820o6020
41B05896P7266k196m9850j31032q6769r3193J4296M3810m272J1801p7768J12876
29B0865m85J5313j5523l6335J16097j3767J69794j34765P8808J00336k3940j1281
17B65117n6181m5520j81833J48280k518k9714R6815o5017o8704J39221m4616j10935
$$ plain form
97 -9433 56174 46012 59680 149398 208859 141973 23026 93776 112919 140464 256964 269539
85 269539 209932 78140 -93966 -103236 114587 107724 218290 405888 367311 254972 214701
74 214701 197951 182475 281570 225221 239258 179960 157242 32650 -124265 66549 154730
63 154730 -28080 151558 206666 8866 74150 86854 107312 141457 118544 140950 45097
52 45097 184887 74067 86245 225312 125911 -32936 -129789 -41201 266096 271916 205896
41 205896 283162 280966 231116 100084 13315 -79878 -65582 -21772 -26044 -14243 -92011 20865
29 20865 20380 35693 20170 -16165 99932 86165 255959 121194 200002 300338 276398 265117
17 265117 208936 163416 -18417 129863 127345 97631 194446 129429 60725 199946 155330 44395
5D4395l454o7023N0386K16534J4365
0B55203
$$ plain form
5 44395 40941 -26082 24304 240838 255203
0 255203
$$ Imaginary data points
##PAGE= N=2
##DATA TABLE= (X++(I..I)), XYDATA
16383i86533K686J48982L5791K4935j77071j3589k5811J83185J28148k0962m6564
16372g46803J08895l8938j56840l6284l9011K3621L591J70533J03738q645K6136
16361e90007J5727m4159J17805n624n8576j30035N4271J20517k3377M0790k3709
16350e26377R6078j90864r5179J48838J1527Q817n051k9918p2970j4218K12147
16339d57170j6965R9598J79141j6924j03969j2807o315m7780P6957r5985q3185
16328d85404K0461k6008J87933N8474o8013J88615j88618k7873P778N6180q1559
16317c58034K6254O7717O0370k5718p2163N9705P5457Q71K7519Q9823R0532J8615
16305F0948k8783l5345l6086o5985k4307M0269l8657J75276j4197L486r6384q5114
$$ plain form
16383 -986533 -983847 -834865 -799074 -774139 -951210 -964799 -990610 -807425 -679277 -700239 -746803
16372 -746803 -637908 -676846 -833686 -869970 -908981 -885360 -881769 -711236 -607498 -616143 -590007
16361 -590007 -574280 -618439 -500634 -506258 -564834 -694869 -640598 -520081 -543458 -502668 -526377
16350 -526377 -430299 -621163 -716342 -567504 -555977 -547160 -552211 -582129 -655099 -669317 -457170
16339 -457170 -474135 -374537 -195396 -212320 -316289 -329096 -335411 -383191 -306234 -402219 -485404
16328 -485404 -464943 -490951 -303018 -244544 -312557 -123942 -312560 -340433 -332655 -276475 -358034
16317 -358034 -331780 -264063 -203693 -229411 -301574 -241869 -166412 -165541 -138022 -48199 42333 60948
16305 60948 32165 -3180 -39266 -105251 -129558 -89289 -127946 47330 33133 36619 -59765 -144879
16293a44879J95037J08953j35028r7838L9053R2782J25612K4003j60134n5251
16283g690l2013J21731J75171L2839j99081L1635P3485O3316m4388O9087n5140
16272B28952R1273m7383J07404l1398m2741J97084j44672q8872l755N1148r9902
16261B17138O1570J56412l1151j18790j6369l4816J45019N9769k5417m4764J50758
16250E19359j33104K1921M4477k7888K26021o3939j58867p2038P3922J3555K5413
16239D68832p0822j31934L8980r8066P3978J48716J43716J8593O6571j01031j28175
16228D29358l6525K41116L7267K01505m1544j56845j08278n8099K07926j96133
16218E19748M4721j7929j35796J04150O2471o586k9564J54791K34851j48551j39740
$$ plain form
16293 -144879 50158 159111 24083 -73755 -34702 58080 183692 207695 47561 -7690
16283 -7690 -39703 82028 257199 290038 90957 122592 196077 259393 215005 284092 228952
16272 228952 320225 272842 380246 348848 306107 503191 358519 269647 265892 317040 217138
16261 217138 278708 435120 403969 285179 268810 233994 379013 438782 413365 368601 519359
16250 519359 386255 408176 452653 424765 650786 586847 427980 355942 429864 443419 468832
16239 468832 398010 266076 305056 206990 280968 429684 573400 591993 658564 557533 429358
16228 429358 392833 633949 671216 872721 831177 674332 566054 507955 715881 519748
16218 519748 564469 546540 410744 514894 577365 570779 541215 696006 930857 782306 642566
16207F42566J39379q2648N9568J38412k8827j7980j39172p4107M7592J91008J74161
16196A049952q7274M0530k27383R8035P0026k18356l8414j12537r5691M4500K09090
16185G32478R0107j28030K42251q0462o8697M6262q8044L8650p7006J59266J64833
16174A031608m3916k18052j09706o9226K08166n3666O2733L6409j59339J41612
16164H26623J18176j36727J10141j61994j81161m2987k5918O7194J32686N2101
16154G58134J37752k79894M2724J47493q4234J05574K3803L7994p5733j322j06805
16143G05486m4836J64988j44821j7651K11969r1818n2175m7753K65784J6767k62732
16132G03208j42159J39069Q5041Q3870J6697j66127Q2744j0184J6163j92005K87314
$$ plain form
16207 642566 781945 699297 758865 897277 868450 850470 711298 637191 684783 875791 1049952
16196 1049952 962678 1003208 775825 873860 943886 725530 687116 574579 478888 523388 732478
16185 732478 822585 694555 936806 856344 787647 833909 745865 784515 707509 866775 1031608
16174 1031608 987692 769640 659934 590708 798874 745208 807941 844350 685011 826623
16164 826623 944799 808072 918213 756219 575058 532071 506153 573347 706033 758134
16154 758134 895886 615992 658716 806209 721975 827549 851352 889346 813613 812291 705486
16143 705486 660650 825638 680817 663166 875135 783317 731142 683389 949173 965940 703208
16132 703208 561049 700118 785159 869029 885726 719599 802343 792159 808322 616317 903631
16121I03631r2459j62864k1453J25412J41832l0416j44230K50569K9387l14755
16111F84654j84308Q8513J74680N0303O7423j06471o1376N2597J02769o2045J43761
$$ plain form
16121 903631 811172 648308 626855 752267 894099 863683 719453 970022 999409 684654
16111 684654 500346 588859 763539 813842 881265 774794 713418 766015 868784 806739 950500
$$ [...]
##END NTUPLES=NMR SPECTRUM
##END=
